##TITLE=1H_CA-8600-3
 DMSO, 8 sc, 
 27.5.2019
##JCAMPDX= 6.0         $$ Bruker NMR JCAMP-DX V2.0
##DATA TYPE= NMR FID
##DATA CLASS= NTUPLES
##ORIGIN= UXNMR, Bruker Analytische Messtechnik GmbH
##OWNER= root
$$ XWIN-NMR		Version 3.5
$$ Mon May 27 14:03:18 2019 Russian Standard Time (UT+4h)  she@DPX200
##.OBSERVE FREQUENCY= 200.1315
##.OBSERVE NUCLEUS= ^1H
##.DELAY= (6, 6)
##.ACQUISITION MODE= SIMULTANEOUS
##.ACQUISITION SCHEME= undefined
##.AVERAGES= 9
##.DIGITISER RES= 18
##SPECTROMETER/DATA SYSTEM= spect
##.PULSE SEQUENCE= zg30
##.SOLVENT NAME= DMSO
##.SHIFT REFERENCE= (INTERNAL, DMSO, 0, 15.7039)
##AUDIT TRAIL= $$ (NUMBER, WHEN, WHO, WHERE, WHAT)
$$ ##TITLE= Audit trail, XWIN-NMR		Version 3.5
$$ ##JCAMPDX= 5.01
$$ ##ORIGIN= Bruker BioSpin GmbH
$$ ##OWNER= she
$$ F:/spectra/data/she/nmr/H-F/1/audita.txt
$$ ##AUDIT TRAIL=  $$ (NUMBER, WHEN, WHO, WHERE, WHAT)
(   1,<2019-05-27 14:01:51.21 +0400>,<she>,<DPX200>,
      <created by zg, POWCHK disabled, PULCHK disabled
       terminated by command 'halt'
       configuration hash MD5:
       00 E9 B6 7A A2 85 ED C7 34 08 36 98 17 FE 4E 26
       data hash MD5: 16K
       DC 89 F7 C2 57 11 ED 71 D9 67 1B 4F 26 74 BD 8C>)
$$ ##END=
$$ 
$$ hash MD5
$$ 97 25 9C D0 99 26 BA BD 88 32 83 B4 56 BD E1 54
##$RELAX= 
##$RELAX= 
##$RELAX= 
##$RELAX= 
##$RELAX= 
##$RELAX= 
$$ Bruker specific parameters
$$ --------------------------
##$DU= <F:/spectra>
##$EXPNO= 1
##$NAME= <H-F>
##$PROCNO= 1
##$TYPE= <nmr>
##$USER= <she>
##$AMP= (0..31)
100 100 100 100 100 100 100 100 100 100 100 100 100 100 100 100 100 100 
100 100 100 100 100 100 100 100 100 100 100 100 100 100 
##$AQSEQ= 0
##$AQ_mod= 1
##$AUNM= <au_zg>
##$AUTOPOS= <>
##$BF1= 200.13
##$BF2= 200.13
##$BF3= 200.13
##$BF4= 200.13
##$BF5= 200.13
##$BF6= 200.13
##$BF7= 200.13
##$BF8= 200.13
##$BYTORDA= 1
##$CFDGTYP= 0
##$CFRGTYP= 5
##$CHEMSTR= <none>
##$CNST= (0..31)
1 1 145 1 1 1 1 1 1 1 1 1 1 1 1 1 1 1 1 1 1 1 1 1 1 1 1 1 1 1 1 1 
##$CPDPRG= <>
##$CPDPRG1= <>
##$CPDPRG2= <>
##$CPDPRG3= <>
##$CPDPRG4= <mlev>
##$CPDPRG5= <mlev>
##$CPDPRG6= <mlev>
##$CPDPRG7= <mlev>
##$CPDPRG8= <mlev>
##$CPDPRGB= <>
##$CPDPRGT= <>
##$D= (0..31)
0 1.2 0 0 0 0 0 0 0 0 0 0.03 0 0 0 0 0 0 0 0 0 0 0 0 0 0 0 0 0 0 0 0 
##$DATE= 1558951310
##$DBL= (0..7)
120 120 120 120 120 120 120 120 
##$DBP= (0..7)
150 150 150 150 150 150 150 150 
##$DBP07= 0
##$DBPNAM0= <>
##$DBPNAM1= <>
##$DBPNAM2= <>
##$DBPNAM3= <>
##$DBPNAM4= <>
##$DBPNAM5= <>
##$DBPNAM6= <>
##$DBPNAM7= <>
##$DBPOAL= (0..7)
0.5 0.5 0.5 0.5 0.5 0.5 0.5 0.5 
##$DBPOFFS= (0..7)
0 0 0 0 0 0 0 0 
##$DE= 6
##$DECBNUC= <off>
##$DECIM= 24
##$DECNUC= <off>
##$DECSTAT= 4
##$DIGMOD= 1
##$DIGTYP= 9
##$DL= (0..7)
0 120 120 120 120 120 120 120 
##$DP= (0..7)
150 150 150 150 150 150 150 150 
##$DP07= 0
##$DPNAME0= <>
##$DPNAME1= <>
##$DPNAME2= <>
##$DPNAME3= <>
##$DPNAME4= <>
##$DPNAME5= <>
##$DPNAME6= <>
##$DPNAME7= <>
##$DPOAL= (0..7)
0.5 0.5 0.5 0.5 0.5 0.5 0.5 0.5 
##$DPOFFS= (0..7)
0 0 0 0 0 0 0 0 
##$DQDMODE= 0
##$DR= 18
##$DS= 0
$$ [...]
##$SUBNAM2= <"">
##$SUBNAM3= <"">
##$SUBNAM4= <"">
##$SUBNAM5= <"">
##$SUBNAM6= <"">
##$SUBNAM7= <"">
##$SUBNAM8= <"">
##$SUBNAM9= <"">
##$SW= 24.9337058887773
##$SWIBOX= (0..15)
0 0 2 0 0 0 0 0 0 0 0 0 0 0 0 0 
##$SW_h= 4990.01996007984
##$TD= 16384
##$TD0= 1
##$TE= 0
##$TE2= 300
##$TE3= 300
##$TEG= 300
##$TL= (0..7)
0 120 120 120 120 120 120 120 
##$TP= (0..7)
150 150 150 150 150 150 150 150 
##$TP07= 0
##$TPNAME0= <>
##$TPNAME1= <>
##$TPNAME2= <>
##$TPNAME3= <>
##$TPNAME4= <>
##$TPNAME5= <>
##$TPNAME6= <>
##$TPNAME7= <>
##$TPOAL= (0..7)
0.5 0.5 0.5 0.5 0.5 0.5 0.5 0.5 
##$TPOFFS= (0..7)
0 0 0 0 0 0 0 0 
##$TUNHIN= 0
##$TUNHOUT= 0
##$TUNXOUT= 0
##$USERA1= <user>
##$USERA2= <user>
##$USERA3= <user>
##$USERA4= <user>
##$USERA5= <user>
##$V9= 5
##$VALIST= <valist>
##$VCLIST= <CCCCCCCCCCCCCCC>
##$VD= 0
##$VDLIST= <DDDDDDDDDDDDDDD>
##$VPLIST= <PPPPPPPPPPPPPPP>
##$VTLIST= <TTTTTTTTTTTTTTT>
##$WBST= 1024
##$WBSW= 4
##$XGAIN= (0..3)
0 0 0 0 
##$XL= 0
##$YL= 0
##$YMAX_a= 181917
##$YMIN_a= -257437
##$ZGOPTNS= <>
##$ZL1= 120
##$ZL2= 120
##$ZL3= 120
##$ZL4= 120
##$ABSF1= 10
##$ABSF2= 0
##$ABSG= 5
##$ABSL= 3
##$ALPHA= 0
##$AQORDER= 0
##$ASSFAC= 0
##$ASSFACI= 0
##$ASSFACX= 0
##$ASSWID= 0
##$AUNMP= <proc_1d>
##$AZFE= 0.1
##$AZFW= 0.1
##$BCFW= 1
##$BC_mod= 2
##$BYTORDP= 1
##$COROFFS= 0
##$CY= 11.3945322036743
##$DATMOD= 1
##$DC= 2
##$DFILT= <>
##$DTYPP= 0
##$F1P= 18.9103706918063
##$F2P= -1.10871071338519
##$FCOR= 0.5
##$FTSIZE= 0
##$FT_mod= 4
##$GAMMA= 1
##$GB= 0.15
##$INTBC= 1
##$INTSCL= 1
##$ISEN= 128
##$LB= 0.24
##$LEV0= 0
##$LPBIN= 0
##$MAXI= 10000
##$MC2= 0
##$MEAN= 0
##$ME_mod= 0
##$MI= 1.114404
##$NCOEF= 0
##$NC_proc= 0
##$NLEV= 6
##$NOISF1= 3.799351
##$NOISF2= 2.8
##$NSP= 1
##$NTH_PI= 0
##$NZP= 0
##$OFFSET= 15.70392
##$PC= 1
##$PHC0= -8862.836
##$PHC1= 21.00026
##$PH_mod= 1
##$PKNL= yes
##$PPARMOD= 0
##$PSCAL= 0
##$PSIGN= 0
##$REVERSE= no
##$SF= 200.130013532006
##$SI= 16384
##$SIGF1= 3
##$SIGF2= 2
##$SINO= 400
##$SIOLD= 16384
##$SREGLST= <1H.CDCl3>
##$SSB= 0
##$STSI= 0
##$STSR= 0
##$SW_p= 3612.71676300578
##$SYMM= 0
##$S_DEV= 0
##$TDeff= 0
##$TDoff= 0
##$TI= <>
##$TILT= no
##$TM1= 0
##$TM2= 0
##$TOPLEV= 0
##$USERP1= <user>
##$USERP2= <user>
##$USERP3= <user>
##$USERP4= <user>
##$USERP5= <user>
##$WDW= 1
##$XDIM= 8192
##$YMAX_p= 0
##$YMIN_p= 0
$$ End of Bruker specific parameters
$$ ---------------------------------
##NTUPLES= NMR FID
##VAR_NAME=  TIME,          FID/REAL,        FID/IMAG
##SYMBOL=    X,             R,               I
##VAR_TYPE=  INDEPENDENT,   DEPENDENT,       DEPENDENT
##VAR_FORM=  AFFN,          ASDF,            ASDF
##VAR_DIM=   8192,          8192,            8192
##UNITS=     SECONDS,       ARBITRARY UNITS, ARBITRARY UNITS
##FACTOR=    0.0002004,     1,               1
##FIRST=     0,             0,               0
##LAST=      1.6414764,     0,               0
##MIN=       0,             -257437,         0
##MAX=       1.6414764,     181917,          0
$$ Real data points
##PAGE= N=1
##DATA TABLE= (X++(R..R)), XYDATA
0@%%%%%%%rJ8j8K3l2L6m5N5o4Q1r9J17j36J57j84K16k50K87l28L73m24M84n48
$$ 0 0 0 0 0 0 0 0 -9 9 -9 14 -18 18 -27 28 -36 45 -54 63 -73 84 -100 116 -134 153 -175 198 -226 258 -290
30b90O17o94P79q73R76j089J212j349J497j660J839k035K256k498K765l066L403
$$ -290 327 -367 412 -461 515 -574 638 -711 786 -874 965 -1070 1186 -1312 1453 -1613 1790
47A790l786M224m727N318o022O875p934R293j1114J3691j7653K4608m0425J44416
$$ 1790 -1996 2228 -2499 2819 -3203 3672 -4262 5031 -6083 7608 -10045 14563 -25862 118554
61A18554q52k36634K5306J30197J45346k0430j11659j01782L4273Q0164M4047
$$ 118554 117702 -118932 -93626 36571 181917 161487 49828 -51954 -17681 62483 106530
72A06530l4654m6015k7716K0798K6339L41k5284m131M020K190m162l570j5326
$$ 106530 71876 25861 -1855 18943 45282 45623 20339 16208 20228 22418 18256 14686 -640
85f40m697R355Q242n634r624j7522j0992J7977K9803p378m0091k9792J0358M3612
$$ -640 -5337 4018 12260 6626 -2998 -20520 -31512 -13535 16268 8890 -31201 -60993 -50635 -7023
99g023L3393l1077o6907j7669N6639N4788j1376o4108m7056K7853P5867K5606
$$ -7023 26370 -4707 -71614 -89283 -32644 22144 10768 -53340 -100396 -72543 3324 28930
111B8930n8960o3511P480O1161M4534k0123o4948k8893M6151N8534k02m5224l3330
$$ 28930 -30030 -93541 -86061 -24900 19634 -489 -65437 -94330 -48179 10355 10153 -35071 -68401
124f8401R523M2694K9505k0362l9808m683K8211K3089M551j4296k1850k098K1257
$$ -68401 -58878 -16184 13321 -7041 -46849 -51532 -23321 -232 4319 -9977 -31827 -33925 -12668
137a2668J8252K424q206j8756j3179K0044L6171N069l1325l0906K770L9806L7772
$$ -12668 5584 8008 -198 -18954 -32133 -12089 24082 29151 -2174 -33080 -30310 9496 47268
150D7268j6772n7879k0483M3845N1062j35m9865m6463J5608O5156L0216m4525
$$ 47268 30496 -27383 -47866 -4021 47041 46906 -2959 -49422 -33814 31342 61558 17033
162A7033n8587k872M8177M4463j0128n7887l4624L3505N3643N422m0830l7380
$$ 17033 -41554 -44426 3751 48214 38086 -19801 -54425 -20920 32723 38145 -2685 -40065
174d0065K391L8822K9819j8218m0205r780K1445K0240N352j3055k1868n882J5481
$$ -40065 -37674 1148 30967 12749 -27456 -37236 -15791 4449 9801 -3254 -25122 -31004 -15523
187a5523J4577L601n949j8486j5488J5156L1926O773k5846k9204k049L3708L6734
$$ -15523 -946 2655 -3294 -21780 -37268 -22112 9814 16587 -9259 -38463 -40512 -6804 29930
200B9930j0091m9795k3241L3666M7054Q349l8732m4688O572N7233L4602l1666
$$ 29930 19839 -29956 -53197 -19531 27523 35872 -2860 -47548 -40976 16257 50859 19193
212A9193n1966j0169M0606M6509n34n0267l6520K7214N1797J1794l1714l5631
$$ 19193 -32773 -42942 -2336 44173 43639 -6628 -43148 -15934 35863 47657 15943 -19688
224a9688j395L4961L0793j1915l4348j0514J6588J9958Q549q633k1137p741J3212
$$ -19688 -21083 13878 44671 32756 -1592 -12106 4482 24440 32989 24356 3219 -4522 8690
237H690J4764N867m736j8121j5448J2694K7649O389k1158k5479n038K4621L1939
$$ 8690 23454 29321 24585 6464 -8984 3710 31359 37748 16590 -8889 -13927 10694 42633
250D2633n829m1422k3896K2191L8412J2496k9606m4080l291M7141L4819k2586
$$ 42633 36804 -4618 -28514 -6323 32089 44585 14979 -29101 -32392 14749 49568 26982
262B6982m8621j6860K9354M3364N406m4548l7873J6922M4811J5309k5357l5001
$$ 26982 -21639 -38499 -9145 34219 39625 -4923 -42796 -25874 18937 34246 8889 -26112
274b6112q109K8010L0870o291l1334j5135J1015J8656J2642o598k2205j0044J2363
$$ -26112 -34221 -6211 24659 18368 -12966 -28101 -17086 1570 14212 7614 -14591 -24635 -12272
287a2272J6002N852n197j7253j3406J1650K4498O450j5910k1633p444K0114L0119
$$ -12272 3730 9582 4385 -12868 -26274 -14624 9874 16324 414 -21219 -28663 -8549 21570
300B1570K72l4393k4270J5414L4781J7306k1273m0723q172L9936L5556j3852m1372
$$ 21570 21842 -12551 -36821 -21407 13374 30680 9407 -31316 -39488 448 36004 22152 -19220
313a9220k0054K2235M0842J1408l6289l6259R749L8411J8883j6517l1620j3499
$$ -19220 -39274 -17039 23803 35211 -1078 -37337 -27588 10823 29706 13189 -18431 -31930
325c1930K2327L1041J88k6681j7385N275J8514J5363m015k1790j1407J0237J5605
$$ -31930 -9603 21438 21626 -5055 -22440 -17165 1349 16712 12697 -9093 -20500 -10263 5342
338E342O513l553j6144j3363R225K1789P515j2139j9370j0261J5870K9244L738
$$ 5342 11855 8302 -7842 -21205 -11980 9809 17324 5185 -14185 -24446 -8576 20668 24406
351B4406l0116k5170R986L2081J9308j6190l8684j1535L4211L4230p647l6014
$$ 24406 -5710 -30880 -20894 11187 30495 14305 -24379 -35914 -1703 32527 24880 -11134
363a1134k1952J5038L7330J5344k8017l4755K914L1760K1471q750k8448j7447
$$ -11134 -33086 -18048 19282 34626 6609 -28146 -25232 6528 27999 19249 -9199 -26646
375b6646J6104L0380N463k2304j8826J146J6583J7890j911k0733j2601Q897J4361
$$ -26646 -10542 19838 25301 2997 -15829 -14683 1900 19790 17879 -2854 -15455 -6558 7803
388G803P566k333j4198j3452O834J9412Q514q982j7945j1320J2915K6904N362
$$ 7803 15369 13036 -1162 -14614 -7780 11632 20146 11164 -6781 -18101 -5186 21718 27080
401B7080k5846k2869O318K6990J9120j1441l3621j3395K6728L1363k527k9180
$$ 27080 1234 -21635 -15317 11673 30793 19352 -14269 -27664 -936 30427 27900 -1280
413a280k2316P401L2904J8909k0944l3343l343K6436K3507k722k6049k1429J1814
$$ -1280 -23596 -16195 16709 35618 14674 -18669 -22012 4424 27931 25209 -840 -22269 -10455
426a0455K9825R191j9091k0536k366J5558J8603N18j9686j3323N827J3483R500
$$ -10455 19370 28561 9470 -11066 -13432 2126 20729 21247 1561 -11762 -5935 7548 17048
439A7048q44j4389j4278M689J8918R101p437j7679j2077J0573K4798N897k2191
$$ 17048 16204 1815 -12463 -7774 11144 20245 12808 -4871 -16948 -6375 18423 24320 2129
452B129k0900K128K2207J8715p089k9124j5987J9649K8161K114k2924k3890J228
$$ 2129 -18771 -16643 5564 24279 17190 -11934 -27921 -8272 19889 22003 -921 -24811 -23583
465b3583K7591K1569j4791l1648q328K0255K3337K082k3058k2826P126K6206J1280
$$ -23583 4008 25577 10786 -20862 -29190 -8935 14402 16484 -6574 -29400 -22274 3932 15212
478A5212j4362j9042o418J1660J8682L425j6385j4758K431J2069J1231K045j4430
$$ 15212 850 -18192 -24610 -12950 5732 9157 -7228 -21986 -19555 -7486 3745 5790 -8640
491h640j5593M062J8369J0320o206j6276j1739Q911K3988P118j8144j9625N40
$$ -8640 -24233 -20171 -1802 8518 2312 -13964 -25703 -16792 7196 14314 -3830 -23455 -22915
504b2915J8704J9288k322k5235j6784J5083K6470O922j8008k3068k247K5092K2990
$$ -22915 -4211 15077 12755 -12480 -29264 -14181 12289 19211 1203 -21865 -24112 980 23970
517B3970r516k8056j0367J6038K2425O332j7561k2229K483K3045J3269q479j7430
$$ 23970 14454 -13602 -23969 -7931 14494 20826 3265 -18964 -16481 6564 19833 11354 -6076
530f076q780P623J8583P893j3526j5905j203J1292J3094L472j4016j6288L193
$$ -6076 -14856 -7233 11350 19243 5717 -10188 -11391 -99 12995 16467 2451 -13837 -10644
543a0644J7320R875n429j4652j1915O689K0802Q059j4865j8110k624J4644J8563
$$ -10644 6676 16551 11122 -3530 -15445 -8756 12046 20105 5240 -12870 -15494 -850 17713
556A7713J323k2900j7775J0156K3906R217j4129k2529o143K0795K3159n780k4192
$$ 17713 19036 -3864 -21639 -11483 12423 21640 7511 -15018 -21161 -366 22793 17013 -7179
569g179j2936J1344K0473R387j3440k2430j961K0131J5015l811j5709j2457M609
$$ -7179 -20115 -8771 11702 21089 7649 -14781 -16742 3389 18404 14593 -1116 -13573 -8964
582h964J8591J1021j1144j6485l323J0306J4099M460j2626j5515K024J5009J0309
$$ -8964 9627 20648 9504 -6981 -10304 2 14101 18561 5935 -9580 -7556 7453 17762
595A7762l030j2245j2112M272J8511R557j1101j6962n177J1656J8734L109j9470
$$ 17762 14732 2487 -9625 -5353 13158 22715 11614 -5348 -10525 1131 19865 22974 3504
608C504j8239P260K1350R350j0286k0599p786J5700K1407k575k0174j3477N709
$$ 3504 -14735 -7475 13875 23225 12939 -7660 -15446 254 21661 19086 -1088 -14565 -8856
621h856J7692J1619r520k1380o112J5674J5665m89j4479j4146J024J7728J1315
$$ -8856 8836 20455 10935 -10445 -16557 -883 14782 14293 -186 -14332 -13308 4420 15735
634A5735r075j6152n547P972J3742O089j0956j6339K5J3153J0908o76j1571j3879
$$ 15735 6660 -9492 -15039 -7067 6675 12764 1808 -14531 -14506 -1353 9555 8879 -2692 -16571
648a6571K394J8494J0630r647j6416o257J0666J8029M623j6811j7015N342J8556
$$ -16571 -14177 4317 14947 5300 -11116 -17373 -6707 11322 15945 -866 -17881 -12539 6017
661F017J0674o965j7279r555J2882J9901J735j6184j3290J814J5550J4814n342
$$ 6017 16691 9726 -7553 -17108 -4226 15675 17410 1226 -12064 -10250 5300 20114 14772
674A4772j9941q864J3006J6282L102j1717j4756j568J6317J3028n999j5079o976
$$ 14772 -5169 -14033 -1027 15255 18357 6640 -8116 -9684 6633 19661 13662 -1417 -8393
687h393N297J3162Q238q911j5894l095J1713J1788J083j1508j4602P76J6820J0676
$$ -8393 -3096 10066 18304 9393 -6501 -9596 2117 13905 14988 3480 -11122 -10346 6474 17150
701A7150q140j5663p387Q321J5601O069j5753j6193K589J4663J0780l818j6201
$$ 17150 9010 -6653 -14040 -5719 9882 15951 198 -15995 -13406 1257 12037 8219 -7982
714g982j1748Q533J8698M438j3357j5003j739J3606J5602l014j9010j0189R685
$$ -7982 -19730 -11197 7501 11939 -1418 -16421 -18160 -4554 11048 8034 -10976 -21165 -11480
727a1480J5657N033r046j5119l828J4335J3789l241j2776q309K892J3019J0476
$$ -11480 4177 9210 164 -14955 -18783 -4448 9341 6100 -6676 -14985 -12093 926 11402
740A1402o277j5394m638J0658J2286L475r438j4349J03J6159J1043n282j3115
$$ 11402 5125 -10269 -14907 -4249 8037 11512 2074 -12275 -12172 3987 15030 9748 -3367
753c367p426N704J6095P297j2003j4763J33J2862J1395k46j3924j2601O116J8170
$$ -3367 -10793 -5089 11006 18303 6300 -8463 -8330 4532 15927 15681 1757 -10844 -4728 13442
767A3442O058j0559j4454l669J1690J5190p60j6937j0965O860J3349O275o830
$$ 13442 19500 8941 -5513 -9182 2508 17698 16938 1 -10964 -4104 9245 15520 8690
780H690j4675o168J0858J3530n12j2170j0708j89J1495J1762n513j6441o558Q055
$$ 8690 -5985 -12153 -1295 12235 11723 -447 -11155 -11344 151 11913 6400 -10041 -16599 -8544
794h544J2171M408r840j5281j800J4251J0391m280j2740q788L422J3961Q662j0255
$$ -8544 3627 8035 -1805 -17086 -18886 -4635 5756 1476 -11264 -20052 -16630 -2669 5993 -4262
808d262j4993k160J0279J2114J417j2511j3630L974J6582P562q368j2878n166
$$ -4262 -19255 -21415 -11136 978 2395 -10116 -23746 -19772 -3190 4372 -3996 -16874 -22040
821b2040R424J4968K227j3758j0459L637J2261R016k912j3397q423R410J4834
$$ -22040 -12616 2352 4579 -9179 -19638 -16001 -3740 5276 2364 -11033 -19456 -10046 4788
834D788K631r129j1111j159J2147J3654l465j4424o821P686J2131O030o617j3713
$$ 4788 7419 -1710 -12821 -13980 -1833 11821 8356 -6068 -12889 -5203 6928 12958 6341 -7372
848g372k879J2419J1890j504j0282r499K139J3805R962p529j4318l493Q869J2400
$$ -7372 -10251 2168 14058 12554 2272 -7227 -5088 8717 18679 11150 -3168 -6661 2208 14608
862A4608L280j1501j3546K699J5105P809o216j1882o651O321J4614L329j1798
$$ 14608 17888 6387 -7159 -4460 10645 18454 12238 356 -6295 26 14640 17969 6171
875F171j1253P68J0152J0205j621j3241j0310P133J3910L606q634j1515l299R945
$$ 6171 -5082 -4314 5838 16043 14422 1181 -9129 -1996 11914 15520 6886 -4629 -7928 2017
889B017J2859j979j3248p698L943J0207P416m962j3696n091J0105J1236O57r557
$$ 2017 14876 12897 -351 -8049 -4106 6101 13517 8555 -5141 -10232 -127 11109 11766 2209
903B209j0745l4J2879J0217o233j3738m470P313J1765M131r679j3118J114J2577
$$ 2209 -8536 -8570 4309 14526 8293 -5445 -9915 -2602 9163 13294 3615 -9503 -8389 4188
917D188Q219l556j0854p564M046J4296N435j0089j1563j062R433J0702M43j2557
$$ 4188 12407 8851 -2003 -9567 -5521 8775 14210 4121 -7442 -8504 929 11631 12074 -483
931d83j0358N402J3238N218p312j1107m359Q288J2991O1j1603r087J994J0765
$$ -483 -10841 -5439 7799 13017 5705 -5402 -9761 -1473 11518 11579 -24 -9111 -7117 3648
945C648Q470l507j3733o443Q520J1973J680q651j1127j401J1513J0690m672j2928
$$ 3648 12118 8611 -5122 -11565 -3045 8928 10608 1957 -9170 -10571 942 11632 6960 -5968
959e968n079N145J0521N608q019j2884r66J0429Q799j045r495r287J786J3504
$$ -5968 -11047 -5902 4619 10227 2208 -10676 -11642 -1213 7586 6541 -2954 -12241 -10455 3049
973C049P155q185j1667k714P449J0847K119j1162j1047L860J1837O017m451j0555
$$ 3049 10204 2019 -9648 -12362 -4913 5934 8053 -3109 -14156 -10296 1541 7558 3107 -7448
987g448o316O661J3055J897j0104r140P26Q786R892j738j3347p153P435J1743
$$ -7448 -13764 -7103 5952 7849 -2255 -11395 -10669 -1883 8009 6271 -7076 -14229 -6794 4949
1001D949K966p521j0100k658J0282J1069l035j1282n943L616R937P130n653j2686
$$ 4949 7915 394 -9706 -12364 -2082 8987 5952 -5330 -11273 -7657 2280 9410 3757 -8929
1015h929k689R261R787M07q458j0557J183J3229P751o805j1088l517O523J0399
$$ -8929 -11618 -2357 7430 7837 -621 -11178 -9995 3234 10985 4180 -6908 -10425 -3902 6497
1029F497L827r829j0682K552J0344O320k438r215p743N452J1802M239q967r330
$$ 6497 10324 495 -10187 -7635 2709 9029 6591 -2624 -10367 -4915 6887 11126 2159 -7171
1043g171r52P976J0434k82j2042p762N840J0389M125n302j0006m306Q868J0726
$$ -7171 -8123 -147 10287 10005 -2037 -9799 -3959 6430 10555 5253 -4753 -9059 -191 10535
1057A0535o60r773p177J362R654Q483m710j2637l639Q295R389J854p844j0113
$$ 10535 9875 102 -7075 -5713 3941 12424 7714 -4923 -8562 -267 9122 10976 3132 -6981
1071f981j90J1564Q229n500j0085m174M114J0370M474p929j0634j32Q647P974
$$ -6981 -7171 4393 12622 7122 -2963 -7137 -3023 7347 11821 3892 -6742 -6874 1773 9747
1085I747r12r168q739L751J2268M616p772r500k226O961J0142N16j0674q356M223
$$ 9747 8835 -333 -9072 -5321 6947 11563 3791 -5709 -7935 -974 9168 9684 -990 -9346 -5123
1100e123R342M854l372r749o118P593J0948L32q489p707L0Q891Q680l237j1510
$$ -5123 4219 9073 5701 -4048 -10166 -2573 8375 8707 218 -7489 -7459 1432 10112 6875 -4635
1115d635m858O549R251K692o333j0031j041R937Q390l473q682n682K980R600O408
$$ -4635 -9493 -2944 6307 8999 2666 -7365 -8406 1531 9921 6448 -2234 -7916 -4936 4664 11072
1130A1072o829j1361o55Q388P684O71q723r069K963J1785M795o593q324l158O004
$$ 11072 4243 -7118 -7773 615 8299 8970 247 -8822 -5859 5926 10721 4128 -4196 -7354 -1350
1145a350R372J953r615p926K005Q348N877j871r510o699O138J0534J612p665p960
$$ -1350 8022 9975 360 -7566 -5561 2787 8664 6793 -2717 -9416 -3278 7256 8868 1203 -6757
1160f757j358Q212R244k244j1146n754N136Q726L458n057r996k947R053Q455j601
$$ -6757 -8115 97 9341 7097 -4049 -9803 -4667 4059 7517 2460 -7536 -10483 -1430 7025 5424
1175E424q509o424J040R615O824n651j0934k117P052P876J192p203r351K068R778
$$ 5424 -3085 -9509 -8469 1146 7970 2319 -8615 -10732 -3680 4196 5388 -1815 -11166 -9098 680
1190F80N568m433p565m115L462R583L664p895q400R14P243P121l51r484p046M846
$$ 680 6248 1815 -5750 -9865 -6403 3180 6844 -1051 -9451 -8537 -1294 5827 5476 -4008 -11054 -6208
1206f208J0849K866o629p708j867P072R913p61j0174n853M282P486N426l368j0025
$$ -6208 4641 7507 878 -6830 -8697 -1625 8288 7527 -2647 -8500 -4218 3268 8694 5326 -4699
1221d699l688Q181R091m02p147o844L34R038P824n033j0096k601N719P738K837
$$ -4699 -8387 -206 8885 8483 1336 -5508 -5174 3864 11688 6655 -3441 -6042 -323 7415 10252
1236A0252o241r296M23R074O170l038p446n268K295J0101L852o696q894m23O642
$$ 10252 4011 -5285 -4862 4212 10382 7344 -102 -5370 -3075 7026 10878 4182 -4712 -5135 1507
1251A507P503j30q564p317L682R277K988m840p395l391N592R218J61q388o434
$$ 1507 9010 8880 316 -7001 -3319 5958 8946 4106 -3289 -6680 -1088 8130 8291 -97 -6531
1266f531J438P541N705k064r772m976O854Q652J059p030p461k50Q646P601m276
$$ -6531 -5093 2448 8153 6089 -3683 -8659 -1805 6847 7906 876 -6585 -6835 1811 9412 5136
1281E136r214l072M672P130L727n509r140q10Q587O134j636o659o176J990R476
$$ 5136 -4078 -7150 -2478 4652 8379 2870 -6270 -7080 1507 7641 6005 -654 -6830 -4840 4636
1296D636N192o643q268r19O008O980J368p470q078K695Q739M468l992o858m754
$$ 4636 9828 3185 -5083 -6002 6 6986 8354 884 -7194 -4499 4240 8708 4716 -2142 -6896
1311f896M346R476J651p670o923M92O864O705j701r471n861O299Q305J166n684
$$ -6896 -2550 6926 8577 907 -6016 -5524 1340 8045 6344 -3127 -8988 -2689 5616 6782 1098
1326A098p338j465P414P513k549q510m128K881O828M765m249r821j486P023O396
$$ 1098 -6240 -7705 -291 7222 4673 -3837 -7965 -5084 1744 6509 2260 -7561 -9047 -2024 4372
1341D372n02o390o572P27R106N146n245p747j914M088O984K482o434q066J359
$$ 4372 3870 -2520 -9092 -8365 741 5887 642 -7105 -9019 -4931 2053 4535 -1899 -9965 -8606
1356h606Q127M668j945o839n515L658R307L148p354p106L70O101P233n32r137
$$ -8606 -479 4189 2244 -4595 -10110 -6452 2855 6003 -1351 -8457 -8087 -1986 5247 4715 -4422
1371d422n498N095Q001K503m115o885k882O656Q278j202p394m681J812O969N733
$$ -4422 -9920 -4825 3176 5679 1564 -5321 -8203 -1547 6731 5529 -1865 -6546 -4734 2235 7968
1386G968l585r360k028O745O744k10n236o574L33Q225N729m369o864k787L675
$$ 7968 4383 -4977 -7005 -260 6484 6274 1038 -5536 -5203 3022 8751 4382 -2482 -5269 -1594
1401a594N974L933n459q137l54P421N254j021o343o283K668R312K818o139o849
$$ -1594 4380 8313 2854 -5283 -5637 1784 7038 6017 -326 -6609 -3941 5371 8189 2050 -4799
1416d799j111N447O993N75q546o086L363P406L208k925p460l796N577Q729n78
$$ -4799 -5910 -463 6530 7105 -1441 -7527 -4164 3242 6450 3525 -3935 -7731 -2154 6575 5997
1431E997p450n219Q09O789N883l070q793k994O392N787R60m480o604n41P045N798
$$ 5997 -1453 -6672 -5863 926 6809 3739 -5054 -8048 -1656 4131 5091 611 -5993 -6534 511 6309
1447F309k529o336l356J472P575M340m683q400n77O175N890J1n978o349J968Q713
$$ 6309 3780 -2556 -5912 -4440 3135 7475 2792 -5608 -6185 -10 5880 5891 -87 -6436 -4468 4245
1463D245L646m854o280k013M416O853J741p202o272K121O488M506j690p464m655
$$ 4245 7891 3037 -3243 -5256 -840 6013 7754 552 -5720 -3599 2889 7395 5705 -1759 -6414
1478f414N460Q029P91o336n496k03N935O055j597q304l673M470N910K446l372
$$ -6414 -954 7075 7866 1530 -3966 -4169 1766 7821 6224 -2080 -5753 -1283 4627 7073 3701
1493C701p336j863O553N958j183o416m122J217O645M310m193p725j132N367N280
$$ 3701 -3635 -5498 1055 7013 5830 -586 -4708 -3491 3154 7464 3271 -4454 -5586 -219 5061
1508E061O49n665o774J304Q272M140m340n883k929L133P286K521o695o661J068
$$ 5061 5710 45 -6729 -5425 2847 6987 2647 -3236 -6165 -3032 4254 6775 80 -6581 -5513
1523e513O678M330j318o872n214M440Q133J257n469n356q50M794O792r04p578
$$ -5513 1165 5495 4177 -2695 -7909 -3469 4664 5921 452 -4904 -5754 -960 5832 4928 -2650
1538b650l610L045N662L314k667p214k783O082O765p17n918m227M87O225N375
$$ -2650 -6260 -3215 2447 5761 3094 -4120 -6903 -821 5944 5227 -691 -4918 -4431 1794 7169
1553G169l713p196j763M530M989J980m591o263l88O969M697k504n626l891K573
$$ 7169 3456 -3740 -5503 -973 4016 5996 1405 -4858 -5246 1723 6420 3916 -1710 -5601 -3028
1568c028P426L213n853o840R9N703N050m30o325n724L429P851J558m500n344j913
$$ -3028 4398 7611 1758 -5082 -4983 720 5770 5340 -985 -6709 -3280 4571 6129 1629 -3715 -5628
1584e628M472O910O0p080m536K016N956L437j843p307l247N598O502m52n119m517
$$ -5628 -1156 5754 5814 -1266 -5802 -3786 2170 5607 3764 -3543 -6790 -1192 5310 4858 -261 -4778
1600d778l63N628N315k347o473k677K799N568K964l831p006p60O218N406j817
$$ -4778 -5141 487 5802 3455 -3018 -5695 -2896 2672 5636 1805 -5201 -5961 257 5663 3846
1615C846n550m241J621P440L690n256o862j46N142M558O36n715n446K119O745
$$ 3846 -1704 -5945 -4324 3116 6806 1550 -5312 -5458 -316 4242 4878 -837 -6283 -4164 2581
1630B581L005l471m812l317L385P289R24n974n139J243N316M291j517o920l372
$$ 2581 5586 2115 -2697 -6014 -2629 4660 5584 -390 -5529 -4286 1030 5321 3804 -3116 -6488
1645f488M684O059L25l842n263p82N116O126j513o591l660K673N464L488k946
$$ -6488 -1804 4255 4580 738 -4525 -5307 -191 5935 4422 -2169 -5829 -3156 2308 5796 2850
1660B850p507j752O440N119j066m920m551J374O472M017m150o014j271L795N295
$$ 2850 -4657 -6409 31 5150 4084 -836 -5387 -4013 2459 6476 2326 -3688 -4959 -1164 4131
1675D131J309n006o069J138O847L244k327n193l622L080P165J515n649m948M75
$$ 4131 5440 434 -5635 -4497 2350 5594 3267 -1926 -5548 -2468 4697 6212 563 -4385 -3910
1690c910N084M319r20o307l857L790N564J382k900n061j615M293N935p11o011
$$ -3910 1174 5493 4573 -1734 -5591 -1801 3763 5145 2245 -2816 -4431 -138 5797 5086 -925
1705i25l626J736N127L716k471p061j916N875M720Km582m516m27O525M134l098
$$ -925 -4551 -2815 2312 6028 3557 -3504 -5420 455 5175 5177 595 -3921 -4348 2177 6311 3213
1721C213n660j770K525N511K337m654o627P42N824L973j338n137l763K077P264
$$ 3213 -2447 -4217 -1692 3819 6156 1502 -5125 -4383 1441 5414 4076 -1061 -4824 -2747 4517
1736D517J632n106n026j17M173N064R5n995m453K970N279K259k433n019k949M167
$$ 4517 6149 1043 -3983 -4100 73 5137 5232 -763 -5216 -2246 3033 5292 2859 -2160 -5109 -942
1752i42O323J87n829m030J005M934M087j881o988j970N122M266Q1l271m781r99
$$ -942 5381 5568 -261 -4291 -3286 1648 5735 3854 -3134 -5104 18 4284 4365 1094 -3687 -4686
1768d686N821M791k256n658k755K177N439K789m043o476K74N258M153r40m631
$$ -4686 1135 5926 3670 -1988 -4743 -2566 2873 5662 1619 -4857 -4583 675 4828 3888 -743
1783g43m633J847O384K231l831m842r83L285M949J113n547m858J848N340K582
$$ -743 -5376 -3529 2855 5086 1255 -3587 -4570 -1285 3664 4777 -770 -5628 -3780 1560 4142
1798D142j507n449l497M138O363q2n472l569L32M312M429j617o070k886L787M971
$$ 4142 2635 -2814 -6311 -2173 4190 4108 -1364 -4933 -4601 -289 4140 2523 -3547 -6433 -2646 2325
1814B325J307k700n393j645N446M899j102n999k913J716N152L977l860n949p57
$$ 2325 3632 932 -4461 -6106 -660 4239 3137 -2862 -5775 -4059 1093 5070 1210 -4739 -5496
1829e496N120L658j00l895m351O93N888L160l316m145j991K523N411J939m901
$$ -5496 -376 3282 3182 -713 -5064 -4371 1517 4677 1361 -2784 -4775 -2252 3159 5098 197
1844A97n344J710M710K964j174m681l559L405N432J246m253l582l21L030N098
$$ 197 -5147 -3437 1273 4237 3063 -1618 -5177 -1772 3660 4906 653 -2929 -3250 -220 4878
1859D878l48n646l499K941M536K027j948n644k243N318N196j224m788l228R51
$$ 4878 4530 -1116 -4615 -1674 2862 4889 2941 -2703 -4946 372 5568 4344 -444 -3672 -2721
1874b721M823L647k605o155r14L979L842P73l093n570L03N828L810k525n079k427
$$ -2721 2102 5749 3144 -3011 -3925 54 3896 4669 1576 -3994 -3691 2137 5947 3422 -1657 -4084
1890d084K221N597K117m611n226O62M677L030m31m570l745K002N638K000l620
$$ -4084 -1863 3734 5851 1240 -3986 -3324 1353 4383 3952 -618 -4363 -2361 3277 5277 1657
1905A657m108q79K963M653O54n637l495J666N076K347j943n183k396M235N138
$$ 1657 -2451 -3330 -367 4286 4940 -697 -4192 -2526 2550 4897 2954 -2229 -4625 -390 4748
1920D748p30l826l716J22M637L928j851n479j844K895M026J684k717n324q09N406
$$ 4748 4018 192 -3524 -3402 1235 5163 3312 -2167 -4011 -1116 2910 4594 1877 -3447 -4256 1150
1936A150L745j682m569k783J262N785K558m322n010J91L598L272O11m607m071
$$ 1150 4895 3213 -1356 -4139 -2877 2908 5466 1144 -3866 -3675 -77 3195 3806 -801 -4872
1951d872J490N485J935k888l792k266L013N170P49n244l911J905L879K782j165
$$ -4872 -3382 2103 4038 1150 -2642 -4908 -1895 3275 4024 -1220 -5131 -3226 653 3435 2270
1966B270m968l132L835M800K44l492l065j284L935M592r46n777k239K616M195
$$ 2270 -2698 -5830 -1995 2805 3049 -443 -3508 -4792 -857 3735 2789 -2988 -5227 -2611 1584
1981A584K738l241n999j84M886M167j435l966k777P48M841L071l111m693n94L339
$$ 1584 4322 1081 -4918 -5102 -216 3951 2516 -1450 -4227 -3479 1362 4433 1322 -3371 -3965 -626
1997f26L216J394l610m860J079N121K567j802l867k550K227N612J082m273m135
$$ -626 2590 3984 374 -4486 -3407 1714 4281 2479 -1388 -3938 -1711 3901 4983 710 -3425
2012c425Q60L842K913k56m882l101K828M850J141k662m096j543L635N041n80n473
$$ -3425 -2565 1277 4190 3934 -948 -4049 -1221 3629 4770 2108 -1988 -3531 104 5145 4565 -908
2028i08k469J774M576K493k686n126j407M646L941p55l844k952K61M016L522k412
$$ -908 -3377 -1603 2973 5466 2780 -2346 -3753 893 4834 4079 235 -2717 -2456 1560 5082 2670
2044B670m667j191K737L582J609l449m866M3N166K359j525l716k393J308N276
$$ 2670 -1997 -3188 -451 3131 4740 1291 -3575 -3532 1634 3993 2468 -1248 -3641 -2333 2943
2059B943J518m142l762m2L303L290L35m363l850J882M765J717k061m193k157L219
$$ 2943 4461 319 -3443 -3485 -182 3108 3443 -920 -4770 -2888 1877 3594 1533 -2660 -4817 -1598
2075a598N521m25m777l219J202L882L033j458n202j834L725M157n47k546l701
$$ -1598 3923 3498 -1279 -4498 -3296 586 3619 2161 -3041 -4875 -1150 3007 2460 -86 -3787
2090c787m48M662L736j895m903j374J949L908K010k718m734j16M486K576j056
$$ -3787 -4235 427 4163 2268 -2635 -4009 -2060 1848 3858 1140 -3594 -3710 776 3352 2296
2105B296k927l055J332M575K157k937l841j001K570L894J028l532m468J179M770
$$ 2296 -631 -3686 -2354 2221 4378 1441 -2400 -3401 -831 3063 4091 559 -3909 -2730 2040
2120B040K400j815m246k532L006N459K05m604l125M47L790L039o00m856k676L515
$$ 2040 4440 2625 -1621 -4153 -1147 4312 4517 -87 -3212 -2765 1025 4064 3464 -1392 -4068 -553
2136e53L731P96k938l960o80M401L861j738m336k035J788L873J724k484m656K1
$$ -553 3178 3974 1036 -2924 -3604 797 4658 2920 -1416 -3451 -1663 2210 3934 1450 -3206 -3185
2152c185L432K557m98k576l075J5M619K275k238l681j410K083L857J458l857m342
$$ -3185 247 2804 2306 -270 -3345 -3330 1289 3564 1326 -2355 -3765 -1682 2175 3633 -224 -4566
2168d566Q73M270K678j410l496l027K446M905P09l657l430j13K966M155m2n376
$$ -4566 -3693 577 3255 1845 -1651 -4678 -2232 2673 3382 -275 -3705 -3818 -852 3303 3261 -2115
2184b115k709K559M437J199k310m255j159L966M018j374l616k047J357L239K569
$$ -2115 -4824 -2265 2172 3371 1061 -3194 -4353 -387 3631 2257 -1359 -3406 -2049 1190 3759
2199C759k375l969l92K720K723R94k757l450n21M500L178k044l347j972J645L972
$$ 3759 1384 -2585 -2977 -257 2466 3460 703 -2747 -3268 1232 4410 2366 -981 -2953 -1308 2664
2215B664J721k927m197M05L348K806r1l599l577J487N155J631l138m007n11K800
$$ 2664 4385 1458 -2739 -2334 1014 3820 3729 130 -3447 -1960 3195 4826 1688 -2319 -2830 -30
2231c0M552J86n184k915K006M407J212j928m211j516L985M070j266l562j728M09
$$ -30 4522 4708 -476 -3391 -1385 3022 4234 2306 -1905 -3421 564 4634 3368 -194 -1922 -1513
2247a513K892K576j600l971r27K163K718J132k079l529r87L817L164j353k987
$$ -1513 1379 3955 2355 -1616 -2543 -380 2338 3470 1391 -2138 -3125 692 3856 2503 -484
2262d84k276Q29L745K209k290m045p78K928L206P23l105m411R14M802K403k465
$$ -484 -2760 -1931 1814 4023 1733 -2312 -3090 -162 3044 3767 662 -3749 -2835 1967 4370 1905
2278A905m310j220K594M131P08m465l382J864L357K138j450m286j744L527L656
$$ 1905 -2405 -3625 -1031 3100 3808 -657 -4039 -2175 1182 3320 1870 -2416 -4160 -633 3023
2293C023k31l481k290M13K604L029p59m065j436J867K513J320j807l101j543L633
$$ 3023 2792 -689 -2979 -2566 38 3067 2308 -1757 -3193 -1326 1187 2507 700 -2401 -3944 -311
2309c11K993j002k804k196K56L392K840j835l848j289K293L389J054l126m101
$$ -311 2682 1680 -1124 -3320 -3064 328 3168 1333 -2515 -3804 -1511 1878 2932 -194 -4295
2324d295M61M470L009k432l499k184K544M218P46l762l842J170M011J796o93l576
$$ -4295 -3834 636 3645 1213 -2286 -4470 -1926 2292 3038 -724 -4566 -3396 615 2411 1718 -1858
2340a858k333K784L536J92k545k532l51K861L240p63m131j303J839K584J295j323
$$ -1858 -4191 -1407 2129 2321 -224 -2756 -3107 -246 2994 2231 -1900 -3203 -1364 1220 2515 1192
2356A192l429q35L184K252j74j861k099p77L078L285j245m078j431J776L819J270
$$ 1192 -2237 -3072 112 2364 2190 329 -1770 -2547 531 3816 2571 -1507 -2938 -1162 2657 3927
2372C927k280m588K60M297K642j564l121k550J398N036J488l929l416M44L380
$$ 3927 1647 -2941 -2681 1616 4258 2694 -427 -2977 -1579 3457 4945 1016 -2400 -1956 1424
2387A424K832r40l766k614K666L896M52k870k446p67L107K986p63l835j064J273
$$ 1424 4256 3316 -450 -3064 -398 3498 3950 1080 -1366 -2133 974 3960 3197 -638 -1702 -429
2403d29J959J753q89l040j293K218K254K66j349k679q87K464L448p08l646k149
$$ -429 1530 3283 2394 -646 -1939 279 2533 2799 1450 -1229 -2116 348 3796 3088 -558 -2707
2419b707J286L484K084k178m505n08L849K907n96l344k720R72M304J797l139l708
$$ -2707 -1421 2063 4147 1969 -2536 -3044 805 3712 3116 -228 -2948 -1976 2328 4125 986 -2722
2435b722j22K988L108R3m264l230K663M041N09k364k793n04K413K931o53k843
$$ -2722 -2844 144 3252 3345 -919 -4149 -1486 2555 3064 700 -2093 -2597 -184 2747 2094 -749
2451g49j422J158J504J365j65k823j465J766K299N07q59k975j308K675L322n90
$$ -749 -2171 -1013 491 1856 1691 -1132 -2597 -831 1468 1975 1116 -1859 -3167 -492 2830 2240
2467B240l289j901P51K909K531j578l926j446L312K980R2k846l171M09M473K372
$$ 2240 -1049 -2950 -2199 710 3241 1663 -2263 -3709 -397 2583 2675 -171 -3342 -2933 1540 3912
2483C912k979l830n77K832L543J19m276l022K341L822Q43k206k572q23J914L240
$$ 3912 933 -2897 -3474 -642 2901 3020 -1256 -4278 -1937 1885 2728 522 -2050 -2873 -959 2281
2499B281m07l053r11N82J609K004l44k789j975J740K677L81n80l090j008J969
$$ 2281 1874 -1179 -2090 -1508 101 2105 1761 -1028 -3003 -1263 1414 1795 1215 -1875 -2883 -914
2515i14L220j20k810j486o3J905L432p96m471j582K299L566J085k934l550k73
$$ -914 2306 2186 -624 -2110 -2173 -268 3164 2368 -2103 -3685 -1386 2180 3265 331 -3219 -3492
2531c492M187L525k960l760j027K933L230M01l643l211J547L457J790j424k879
$$ -3492 695 4220 1260 -2500 -3527 -594 2636 3037 -606 -3817 -2270 1187 2977 1553 -1326
2546a326j384J716L478q6k439j701K5J746J619L20k699j635J443J831R59k81k306
$$ -1326 -2710 -994 2484 2398 -41 -1742 -1717 29 1648 1968 -731 -2366 -923 908 1867 1586 -720
2563g20j756J629L108M90k096k439l01J870L574n70l970j589J778L696Q40k345
$$ -720 -2476 -847 2261 2751 655 -1784 -2085 -215 3359 2789 -1181 -2770 -992 2704 3544 1199
2579A199l744j91M460K395j595l720j680K327L564Q37k873l739J510L315J233
$$ 1199 -2545 -2736 1724 4119 2524 -1196 -2876 -549 3015 3852 979 -2760 -1250 2065 3298
2594C298j030k578j725J458L069R80k806j506m78K189J549J91k204j935J079K161
$$ 3298 2268 -310 -2035 -577 2492 3472 666 -840 -1318 871 2420 2611 407 -1528 -449 1712
2610A712O58j04j958k031R21K560Q91j225k721j153K418L018j05l532k406J597
$$ 1712 2370 2266 308 -1723 -802 1758 2649 1424 -1297 -2450 -32 2986 2881 -651 -3057 -1460
2626a460L318J603j860m100q50L730K874j710k858j710J388K977K208l189l500
$$ -1460 1858 3461 1601 -2499 -3349 381 3255 1545 -1313 -3023 -1635 1342 3550 361 -3139
2641c139M51K864K038m46k914k088J332L356P11k441k209L29J324J795N97k357
$$ -3139 -2688 176 2214 1768 -1146 -3234 -1902 1454 2165 -276 -2485 -2156 -832 963 1560 -797
2657g97j640O70J491J224L85k060k258P19K503J434j193k261j700J986L455L22
$$ -797 -2437 -1767 -276 948 1333 -727 -2985 -2266 237 1671 478 -1783 -3483 -1497 1958 2280
2673B280l383k686J399L218J680j283l977j025K898L241j59l388k092Q04L512
$$ 2280 -1103 -3789 -2390 828 2508 1225 -2752 -3777 -879 2362 2203 -1185 -3277 -2473 1039
2688A039K422k882l393k98K739K658m13k310k957K025K783J220k553j354n65J087
$$ 1039 3461 579 -2814 -3112 -373 2285 1872 -438 -3395 -1370 1413 2633 80 -1274 -1839 -752
2704g52J846R54j944j671L77J220J526K73j379k752R57K365J021q48j607j856
$$ -752 1094 2048 104 -1567 -1190 30 1556 1829 450 -2302 -1345 1020 2041 1193 -414 -2270
2720b270J289L470M22k744k249M16K534K381p63l470k116K790L571k14k461l101
$$ -2270 -981 2489 2911 167 -2082 -1666 868 3249 2486 -984 -3100 -310 3261 3047 586 -2515
2736b515N38L465K654k398l823j22K736K341J50k454k893R66L300P74j558j560
$$ -2515 -1977 1488 4142 1744 -2079 -2201 535 2876 3026 572 -2321 -1355 1945 2719 1161 -399
2752c99o63O67J992J058k009j521N8J302J239P81j695k687O94K624R77r47k210
$$ -399 -1062 -395 1597 2655 646 -875 -817 485 1724 2505 810 -1877 -1183 1441 2418 1471 -739
2769g39j125M64L503Q34k284k480K6K026K437j34l599k213K375L398K3k082l036
$$ -739 -1864 -1400 2103 2937 653 -1827 -1801 225 2662 2528 -1071 -3284 -909 2489 2512 430 -2606
2786b606j66L523K423j614l398o82J977K082M53k078k237J36L219R93j045j738
$$ -2606 -2772 751 3174 1560 -1838 -2520 -543 1539 1992 -86 -2323 -2187 1032 2025 980 -758
2802g58j084M49K606Q19j650j881K88J178R62Q09j302k206O03J597J237k57j469
$$ -758 -1842 -1393 1213 2032 382 -1499 -1211 -33 929 1738 436 -1770 -1167 430 1667 1410 -59
2819e9j917P92K365J858k270k042m76J903K484o9k960k136J853L191L44j946k421
$$ -59 -1976 -1184 1181 3039 769 -1273 -1749 154 2638 2569 -391 -2527 -674 2517 2861 915 -1506
2836a506q30K942K857j336l229q87J505K444R45j862k584n70K847J576p15j740
$$ -1506 -2336 606 3463 2127 -1102 -1989 -484 1960 2905 1043 -1541 -2111 736 2312 1597 -143
2852a43r45K31K036J077j841j408l14J044R76R46p26k334QJ540J138K42j212k552
$$ -143 -1088 -857 1179 2256 415 -993 -1307 -263 713 1659 933 -1401 -1393 147 1285 1527 315 -2237
2870b237L90K779J394j413k729n55J700K478K93k880k444J520L310O12j440k983
$$ -2237 -1847 932 2326 913 -1816 -2371 -671 1807 2100 -780 -3224 -1704 1606 2218 778 -2205
2886b205p81K232K872l46l098j354R07K444J410j556k910o6K642J270l93j472
$$ -2205 -2986 -754 2118 1772 -1326 -2680 -1773 671 2081 525 -2385 -2451 191 1461 1068 -404
2902d04j794N67K060J471j300j771k17M08J230J027q46j989K0J402J104M58r75
$$ -404 -2198 -1631 429 1900 600 -1171 -1388 -980 250 1277 431 -1558 -1538 -136 968 1426 451
2919D51k354J81K320J669j385k298o51J029K479J122k735k379R31K612J381j109
$$ 451 -1903 -1722 598 2267 882 -1416 -2067 -1038 1441 2563 -172 -2551 -1620 992 2373 1264
2935A264k113j767J819L064J03k684j557pK799J514j064l285o3K176J454j28j398
$$ 1264 -849 -2616 -797 2267 2370 -314 -1871 -1878 921 2435 1371 -1914 -1977 199 1653 1525 127
2952A27j260P4J874J282j263j429m07M11J422R71l38k389m43J348J457J80j118
$$ 127 -1133 -1059 815 2097 834 -595 -1002 -591 831 1802 1464 -925 -1368 -20 1437 1617 499
2969D99j684j22K693J295j380j570j004L69L156P50k129k600L94K479J703j217
$$ 499 -1185 -1307 1386 2681 1301 -269 -1273 -904 2252 3002 873 -1727 -1333 1146 2849 1632
2985A632k225j977K119L322q1k206k056L93K211J807n16l288q93K167J817l7j425
$$ 1632 -593 -2570 -451 2871 2790 584 -1472 -1079 1132 2939 2423 -865 -1758 409 2226 2189 764
3002G64j453q20K147J671q13j480q32j21J630J347r82j759n76J197J272M65p07
$$ 764 -689 -1509 638 2309 1496 16 -816 -937 693 2040 1058 -701 -1277 -80 1192 1657 950
3019I50k441j6J811J430p33j326j367M21K173J347j587k517K27K016J550k11k184
$$ 950 -1491 -1507 304 1734 1001 -325 -1692 -1271 902 2249 662 -1855 -1628 388 1938 1727 -457
3036d57k275J429L126K19j982j794K11J527J966m79k786p02J421J744J70o55k023
$$ -457 -2732 -1303 1823 2042 60 -1734 -1523 4 1970 1491 -1295 -1997 -576 1168 1338 683 -1340
3053a340q29K206J659l80j431j013L11J231J350p06k126k43R62J254M92n71j771
$$ -1340 -2169 37 1696 1316 -115 -1128 -817 414 1764 1058 -1068 -1311 -349 905 1397 826 -945
3070i45q00K087J664k12j618j408N2K324J878j527k735m49J872J974L03k699j728
$$ -945 -1745 342 2006 1794 176 -1232 -1180 1144 3022 1495 -1240 -1689 183 2157 2460 -239 -1967
3087a967J368K704O15j697j510p41J217K235Nk394j210P67J533J136o09k195p95
$$ -1967 -599 2105 2720 1023 -487 -1228 -11 2224 2229 -165 -1375 -608 925 2061 1452 -743 -1538
3104a538J741J354k97j024j170nJ066J603p36j839o90Q06J106J080o64k201m08
$$ -1538 203 1557 1260 236 -934 -939 127 1730 994 -845 -1535 -729 377 1457 793 -1408 -1816
3121a816J717J328J4j489j563m7K230J510j525j813n66J697J299K35j809k016
$$ -1816 -99 1229 1243 -246 -1809 -1856 374 1884 359 -1454 -2020 -323 976 1211 -598 -2614
3137b614O04K206J117j095j866p02J146K003O67k511j311Q44J593R60o74j969
$$ -2614 -2010 196 1313 218 -1648 -2350 -1204 799 1466 -1045 -2356 -1512 81 1041 367 -1602
3153a602j566K202J539o7p83j328j97J267J418r6j499j137N32J069J389o50k059
$$ -1602 -3168 -966 573 506 -277 -1605 -1802 -535 883 787 -712 -1849 -1317 -248 1141 491 -1568
3170a568p74J552J811J30j245j659LJ882J618j395j797l81J249J636Q02j834j977
$$ -1568 -2342 -790 1021 1151 -94 -1753 -1750 132 1750 355 -1442 -1823 -574 1062 1864 30 -1947
3187a947N24K138P43m03j441j381Q33K656L82j860j750O32J571P72L19k068j360
$$ -1947 -1423 715 1458 1055 -386 -1767 -934 1722 2104 244 -1506 -874 697 1469 1788 -280 -1640
3204a640J752J733m03j023q76p18J261J736j22j741o27J47J318R98l13j876r41
$$ -1640 112 1845 1442 419 -457 -1175 86 1822 1700 -41 -668 -521 797 1795 1482 -394 -1335
3221a335J728J262M9j008j401l67J534J918j134j488n85L63J564J045j099k486
$$ -1335 393 1655 1704 696 -705 -1072 462 2380 1246 -242 -827 -464 1100 2145 1046 -1440
3237a440r6K198J477o72j598j507P41K159O93j495j485K87O06J550j50j766r01
$$ -1440 -1536 662 2139 1467 -131 -1638 -897 1262 1955 460 -1025 -738 -132 1418 1268 -498 -1399
3254a399Q55J358M72p12j231p38Q42J929K47j809m91k62P60J612m02j819r11J255
$$ -1399 -544 814 1286 574 -657 -1395 -553 1376 1623 -186 -677 -939 -179 1433 1031 -788 -1699 -444
3272d44J447L31r22j414m63J762J466m07j475j185M17J872P16p22k321l4J760
$$ -444 1003 1334 412 -1002 -1465 297 1763 1356 -119 -1304 -887 985 1701 979 -1342 -1376 384
3289C84J519m13j569j487M45K076O98j130j444Q8O41J609o8j357j520Q78J166
$$ 384 1903 1490 -79 -1566 -1121 955 1653 523 -921 -833 -192 1417 1349 -8 -1528 -650 516
3306E16J197n30j352j359J172J722L74j755j097M89R99J361m47k208n01J292J134
$$ 516 1713 1183 -169 -1528 -356 1366 1740 -15 -1112 -623 376 1737 1290 -918 -1419 -127 1007
3323A007L77q06j385n56J035J957m43j122j390PJ917J270p97k402j05J398J257
$$ 1007 1384 578 -807 -1363 -328 1629 1186 64 -1326 -1319 598 1868 1071 -1331 -1436 -38 1219
3340A219j0j070j715L14J597J199j229j359j83M77K081k5j234j641M47J577P92
$$ 1219 1209 139 -1576 -1262 335 1534 305 -1054 -1237 -760 1321 1296 62 -1579 -1132 445 1237
3357A237n51j162j306R90J882l4j016j181L54M18J578k7j697j093P99J011J042
$$ 1237 686 -476 -1782 -792 1090 1056 40 -1141 -787 -369 1209 1182 -515 -1608 -809 202 1244
3374A244l23j744j033J380J922k22j436j073M31J611R76o67j790o81J195J364
$$ 1244 921 -823 -1856 -476 1446 1224 -212 -1285 -854 757 1733 1066 -724 -1405 -210 1154
3390A154J79j037j318jJ556J459j238j159q66O59J605P42j336j737M31J067J073
$$ 1154 1333 296 -1022 -1023 533 1992 754 -405 -1271 -612 993 1735 399 -1338 -907 160 1233
3407A233K51j616r48M14J932L10p63j089p39Q59J621K57j459j134M9J273J375
$$ 1233 1484 -132 -1080 -666 1266 1576 813 -276 -1015 -156 1465 1722 263 -871 -822 451 1826
3424A826o93j755m43J085J584k64j291p08k28J137J826r46j365p68R96R61P30
$$ 1826 1133 -622 -1065 20 1604 1340 49 -659 -887 250 2076 1130 -235 -1003 -7 954 1684
3441A684o29j988k03J788J232n86j442o89L48J926N80j006j842PJ419Q64p4j218
$$ 1684 1055 -933 -1136 652 1884 1298 -144 -833 -485 1441 2021 1015 -827 -820 599 1463 1389 171
3459A71j444O78J654K89o65j049p81Q38J790P9j711j147Q24O40J401n46j454j110
$$ 171 -1273 -595 1059 1348 683 -366 -1147 -309 1481 1560 -151 -1298 -474 166 1567 1021 -433 -1543
3477a543J028J815j77p47j157m94J205J296m15j316q83L59J476O19p84j321o65
$$ -1543 -515 1300 1123 376 -781 -1275 -70 1226 811 -505 -1388 -1029 447 1066 282 -1039 -1704
3494a704J607J464q90r44q33K88J308R46r22j558j95P34J205K40q49j262L28J660
$$ -1704 -97 1367 477 -467 -1300 -1012 296 1242 320 -1238 -1433 -699 506 746 -103 -1365 -1037 623
3512F23J66j73j182r05P14J627M50j332j204M02Q30R70n2j377r65O15J569J67
$$ 623 789 616 -566 -1471 -757 870 1320 -12 -1216 -814 16 986 934 -443 -1408 -793 776 943
3530I43m66j397o29J037J894p12r94j070R48R65N41l39j727m85J176J451K6j324
$$ 943 477 -920 -1549 -512 1382 670 -324 -1394 -446 519 1060 721 -1006 -1491 -315 1136 1162 -162
3548a62p00o0J060R71l91j587l82J276O76M51p05j666P4J605J210r02q41n82J66
$$ -162 -862 -922 138 1109 718 -869 -1251 25 701 1152 447 -1219 -1145 460 1670 768 -73 -655 -489
3567d89J258O59j086q00k75P18J176j09o42j337L81J353O27n31j275o21P22J682
$$ -489 769 1428 342 -458 -733 -15 1161 1052 410 -927 -546 807 1434 903 -372 -993 -271 1411
3585A411Lj222r20K56J140Q10P7j800l36O83J326j30p91q64m10J289J442n34j301
$$ 1411 1414 192 -728 -472 668 1478 1555 -245 -581 102 1428 1298 507 -357 -767 522 1964 1430 129
3604A29n17L33J269M14o66j414k49J309J383p85p99p82K73J275O63r34j304k97
$$ 129 -388 -55 1214 1628 962 -452 -701 608 1991 1206 407 -375 -102 1173 1836 902 -402 -699
3622f99Q27R86N30j326j117K07J886K04q3j275q37O27J423K57j275j277O42O12
$$ -699 128 1114 1644 318 -799 -592 1294 1498 1415 140 -697 -70 1353 1610 335 -942 -300 312
3640C12Q82q1j399q64P68J235K33o54j291l42J313J262k55j404q08K43J401Q43
$$ 312 1194 1113 -286 -1150 -382 853 1086 432 -859 -1201 112 1374 1119 -285 -1093 -850 551 1394
3658A394n45j665j01J322O49k58o75j068K31J358P36r56j097l41N41J139O80j443
$$ 1394 849 -816 -917 405 1054 796 121 -947 -716 642 1378 422 -675 -1016 -475 664 1344 -99
3676i9j130j0J679N32j65j140r51P94J579K17j208p88k17R39J119l59j029n29
$$ -99 -1229 -1239 440 972 807 -333 -1284 -490 1089 1306 98 -690 -907 32 1151 792 -237 -766
3694g66L35R65M15m28r82n71Q29J434m68j429o31N47R39Q73o30j301j24O78P79
$$ -766 -431 534 949 521 -461 -1032 -203 1231 763 -666 -1297 -750 189 1062 432 -869 -993 -315 464
3713D64J34n74j186L9Q28J090k16j186p70M93J201P20j201j405L41J543J44k97
$$ 464 598 24 -1162 -1123 -295 795 579 -607 -1377 -884 317 1037 -164 -1569 -1228 315 459 162
3731A62o99j149Q99R75K80p05p15n77R74R66Nj286o24J42J175P10l05j350p63
$$ 162 -537 -1686 -787 188 468 -237 -952 -1529 -555 411 416 -870 -1494 -1352 -177 533 228 -1122 -1885
3750a885J203J351o10r38k08j01Q29R29l29j518n21R18Q94O73m74j502p4J356
$$ -1885 -682 669 59 -879 -1087 -1188 -359 570 241 -1277 -1798 -880 14 687 213 -1289 -1363 -7
3768gJ011j122n22n50P0J526N47r93j264L32R78Q31l5j028p40K36J399O66j009
$$ -7 1004 -118 -640 -1190 -1120 406 953 -40 -1304 -972 6 837 802 -226 -966 -730 669 1335 326
3787C26l82o00M14J229L46j325p45K33J124L82K83j573n33P33J472k56p27p97
$$ 326 -56 -656 -242 987 1333 8 -737 -504 620 1002 1285 -288 -821 -88 1384 1128 401 -396
3805c96L40M48J049j45j399n07Q82O48M85l39j604m2R68J219o84k55r83j00J319
$$ -396 -56 392 1441 1296 -103 -610 272 920 1405 1066 -538 -580 388 1607 923 668 -315 -415 904
3824I04N34n81j179k16P48P47M35j073o46L1J258J78m39r01n94M65J449J26j078
$$ 904 1438 857 -322 -538 210 957 1392 319 -327 -296 962 1140 701 -200 -794 -329 1120 1246 168
3843A68p23M18P51K71L89j259r89R16Q91M9o03o94k36O67J217r3j278m74K90Q97
$$ 168 -555 -137 614 885 1274 15 -974 -58 833 882 279 -415 -651 16 1233 1140 -138 -612 -322 575
3863E75Q37j046q31m35R93J198n80m50q88r9J303N90n69j089m76Q15O34O58m81
$$ 575 1412 366 -465 -900 93 1291 711 261 -627 -726 577 1167 598 -491 -967 -152 482 1140 659
3882F59j274j02J358R65j071n09n24K26J117O44j278n88M11K40O66O1q18j060
$$ 659 -615 -717 641 1606 535 26 -498 -272 845 1489 211 -377 34 274 940 1001 183 -877
3900h77O80J181L51p74p73o49P12J457j86j382m78P26Q49L27k62j148k87R89J05
$$ -877 -197 984 1335 561 -212 -861 -149 1308 1122 -260 -738 -12 837 1164 902 -246 -533 456 561
3919E61L82q19o57K7J061P42o39j070n07O64P16L37j89j126k03R70L71Q3j244
$$ 561 943 124 -533 -506 555 1297 658 -412 -919 -255 461 798 609 -517 -720 250 621 704 -540
3938e40l11L36J017M78q89p54k19M56J134K57r68j118M22J001N07l04q54m72J8
$$ -540 -851 -515 502 980 91 -663 -882 -426 708 965 -3 -1121 -699 302 809 505 -349 -821 -803
3957h03J599j71j076l60J54Q28L56J96j088n75P71L58N85m41j217k09J109O46
$$ -803 796 625 -451 -811 -657 171 527 723 -365 -940 -169 189 774 333 -884 -1093 16 662
3975F62k8j145k19J66R83L75m54j007l31J050Q89j2j133l99l3Q90Q16q69o13q9
$$ 662 634 -511 -730 -564 419 794 340 -667 -998 52 941 929 -204 -603 -636 254 1070 201 -412 -501
3995e01K74J220K23q89j154K57R27L01k84p13k93N17R12j7q65k96K03J52Q71K21
$$ -501 -227 993 1216 327 -827 -570 357 658 374 -339 -632 -115 797 780 -85 -381 -178 -26 845 1066
4015A066j088p30P32O69L09k02j209k24Q35J139q78o95j65J61L83R38l42j137
$$ 1066 -22 -752 -20 649 958 756 -453 -677 158 1297 419 -276 -441 -280 103 1041 699 -438
4033d38j05O93N91j54l77p20j36P73J346o82j323K93J25O86M94q51j070L15R34
$$ -438 -543 150 741 587 210 -510 -646 127 1473 791 -532 -239 -114 572 1066 215 -855 -540 394
4052C94K65J48p68r31O21Q85N56p32r25j14O51R18J65j077q54K73R48l2M7n40
$$ 394 659 807 39 -892 -271 614 1170 438 -487 -601 50 968 1133 56 -798 -525 423 391 438 -102
4072a02n29L28J344k56q77l27K07M14Q00l19j158k12M52R63j75mj237p4O42J061
$$ -102 -631 -303 1041 785 -92 -419 -212 202 1002 683 -475 -687 -235 728 553 549 -688 -762 -120 941
4092I41m03r09j90K51R10L04o51j215M00N75O64J31q31n77L3J056L31m53j021
$$ 941 538 -371 -561 -310 600 904 253 -962 -562 13 677 808 -23 -600 -567 489 820 367 -654
4111f54j20P14N39J23q57p47N91R66k34J71o60p62M59J112Q9o66m50l58L61P16
$$ -654 -774 -60 479 602 -255 -1002 -411 555 321 492 -168 -930 -471 641 730 64 -386 -744 -383 333
4131C33L47r93m83K46J484j74o54n33l65Q42J032m20q57l50K95M96P75l66j495
$$ 333 680 -313 -796 -550 934 760 106 -427 -792 50 1082 662 -195 -545 -250 246 1021 655 -840
4150h40L72N14P06l7n63p99J81J125K9m07o81m77L54J144L27r24p69M73R03K22
$$ -840 -468 46 752 715 152 -647 -466 659 688 281 -400 -877 -523 621 948 24 -745 -272 631 853
4170H53k73o26p81N09J191J11q30l47m74P52O02j98p62m38N89N06M37q3j215k1
$$ 853 580 -46 -827 -318 873 984 154 -193 -667 85 687 489 -273 -711 -122 384 821 738 -477 -498
4190d98O37P32j41p56j76k18Q56N23j00j149j95O85L91J48k04j457M30R98O38
$$ -498 139 871 730 -26 -202 -420 436 959 859 -290 -485 200 591 739 535 -922 -492 506 1144
4209A144q71m45K1j47R38K50l17r54O4P05O02j04n79q74M51R72L3o97l26m92P08
$$ 1144 273 -172 -151 -298 640 890 573 -381 -317 388 990 886 307 -567 -116 856 889 192 -134 -626 82
4230H2Q69k59o11n27J14O99M01j46q23k71N70O93k60k31l42m73P10Q45m96q66
$$ 82 951 692 81 -446 -332 367 768 622 -201 -472 98 791 531 300 -42 -515 195 1040 544 -322
4250c22k47N87M22L42q60m50l98J211N36m44n82k28R5P66M08p07j073O29M75K40
$$ -322 -569 18 440 782 -78 -528 -926 285 821 377 -205 -433 -338 428 836 129 -944 -315 160 400
4270D00L71j004n94P86O32Q7l58n25n13P44O80Q0p66o76L53K31P04j76m47r98
$$ 400 771 -233 -827 -41 591 678 320 -205 -718 26 706 786 20 -656 -303 -72 632 456 9 -989
4290i89R82O00om78o63j68L73J159l70o07j90M4N67M54n38n67p1P52J76o3n04
$$ -989 -7 593 587 109 -554 -722 -349 810 440 -167 -357 -313 254 708 170 -397 -468 284 460 397 -107
4311a07o85N5R19M15j94r04r7N00P32m5p66p34M10N87L56k42n05n55L16J124j0
$$ -107 -792 -737 182 597 403 -501 -598 -98 634 589 -177 -911 -501 86 442 200 -305 -860 -544 580 570
4332E70p33m42K55L03M63O9o92n83N37O85k17k13n32k88R23L12o1j036O2L85K80
$$ 570 -163 -605 -350 -47 416 485 -207 -790 -253 432 215 2 -530 -818 105 417 356 -680 -618 -233 47
4353D7N89k05q72k04Q30K24O5n81o71J60J081J03m84m86n11P78M58M40p77m40
$$ 47 636 431 -441 -645 185 409 474 -107 -778 -618 463 566 82 -404 -915 -137 321 761 -16 -456
4373d56k45P02N35l01l06q57O98N45K58p13k12l51M06J001J25j031n63O77L20
$$ -456 -701 1 536 235 -71 -928 -230 315 573 -140 -352 -703 -297 704 829 -202 -765 -88 232
4392B32K54k33o04m38P83M88m2l43q86O63L11J83J86q67o87J287J85K8l92k54
$$ 232 486 253 -351 -789 -6 482 440 97 -789 -126 185 368 554 -313 -1000 287 472 500 108 -146
4412a46m85O30R85k53p78j65j33R36K46o41o53m7P44M23J49q28q17N11J041L36
$$ -146 -631 -1 984 731 -47 -212 -345 591 837 196 -457 -504 240 663 812 -16 -833 -322 719 1055
4432A055p31n19L84RO01K34n09j011N41Q98j70J44r53p3L04Q28J30q30n81L56
$$ 1055 324 -195 189 198 799 1033 524 -487 54 952 782 926 -27 -100 204 1032 1162 332 -249 107
4452A07K83L21J33p89j87P21L89j39j53o08l26N99M66k27o11r6MP99J81m55n28
$$ 107 390 711 844 55 -132 589 978 839 686 78 -248 351 817 590 -21 -117 -113 686 867 412 -116
4473a16k26R64K01O2q13k85n1Q82K62n66p88M55q7P98n3n36n35O42J57J52J66
$$ -116 -342 622 823 885 72 -213 -264 618 880 314 -474 -19 -106 692 639 103 -432 210 367 519 685
4494F85m99p32L16J056k26n38l23k90P99M00j35j098P3N55K68L67m88m88k11N45
$$ 685 186 -546 -230 826 600 62 -261 -551 248 648 513 -585 -512 43 311 678 190 -298 -509 36
4514C6P49j28m65k94k28L97O00j93q79J20M10M31j58k50l52k77P44N56l80n22
$$ 36 785 657 192 -102 -330 67 667 474 -405 -285 125 556 398 148 -204 -481 263 819 439 -83
4534h3j84L85N26J37l23o80l35J015j75k4l17l94M41K28L41o46k07p4J40J082
$$ -83 -267 118 644 781 458 -222 -557 458 283 259 -58 -452 -11 217 558 -88 -295 -369 -229 853
4554H53k79r12m05Q23l5J76K93o98n73L23J103m08l67kk81M05M86n01k87j43K23
$$ 853 574 -338 -743 80 45 221 514 -184 -757 -434 669 261 -106 -108 -389 16 502 1 -286 -429 -206
4575b06O28K0l11m75j64O36jM3l10k59J21J97Q64l82o25l27R28l9J70n24r24J045
$$ -206 422 442 131 -344 -508 128 127 170 -140 -399 -278 -81 783 401 -224 -551 377 338 508 -16 -940 105
4597A05K55o0j15n80J61P8P24j76m62n01P7J057k2L9n78p11O08N04L8o44j33j18
$$ 105 360 300 185 -395 -234 -156 568 392 -70 -571 -494 563 541 580 2 -709 -101 403 441 -203 -336 -454
4619d54R26L57l00j161J93P42J65j29k3n12k77N79K37Mm84J39k68O23N99n39n56
$$ -454 472 829 529 -632 -439 303 468 339 316 -196 -473 106 343 347 -137 2 -266 357 956 417 -139
4640a39l46M57N07l59K90q29K95N29Q0K59r42j12L43N28J7l85o13J6N43M09j24
$$ -139 -485 -28 479 120 410 -419 -124 405 485 744 -198 -310 33 561 578 193 -420 -404 139 548 424
4661D24p58J0J79R36k11n09P3m29M36L70j9o34k08L38P7J78K14q16k51N79Q87
$$ 424 -334 -324 -145 791 580 71 144 -285 151 521 502 -132 -340 -2 75 253 467 -349 -600 -21 866
4682H66l95k1o35k45O97Q99r33m58L55K15M36Nk22n86K5N35N1k14n46j26L09M06
$$ 866 471 450 -185 -430 267 1166 233 -225 130 345 781 786 564 -22 3 538 589 375 -171 -297 12 418
4704D18K41n25o72K97L85N14n5p62l68M91N77k20k27l69R9N09j12j89j60j39k8
$$ 418 659 134 -538 -241 144 658 603 -159 -527 -36 541 321 94 -275 -176 333 221 32 -128 -267 -295
4725b95P00K48l25m43m25M40L74L9n71j27q9L16Q22l94m97K18l15N42O19n99n67
$$ -295 405 653 328 -115 -540 -100 274 313 -258 -385 -474 -158 664 270 -227 -9 -324 218 837 238 -329
4746c29m26Q52L54m4k51o31n7R47O7k13q32J85K90P01k43n88j72N00J86K99l20
$$ -329 -755 97 451 407 156 -475 -532 415 482 269 -563 -378 -88 613 370 -218 -390 110 296 595 275
4767B75l84j67K09O53n05p4J8j46L63L97k97q75J73K47N33m53J14o37J98O28n5
$$ 275 -109 -276 -67 586 81 7 25 -121 242 639 342 -533 -360 -113 420 -33 81 -556 -358 270 215
4788B15J68m07k65Q5L88M91l77q19m7O07N85m4n87k55k6P02J0k36m73J90L21L98
$$ 215 383 -24 -289 -204 184 675 298 -521 -568 39 624 580 -7 -262 -288 414 424 188 -285 -95 226 624
4810F24L4o10m28J84N11j8n7k30k00O3Q61j25m56j74j37L27L08P5n50l86L05L95
$$ 624 658 48 -380 -196 315 297 240 10 -190 -127 734 609 153 -21 -158 169 477 552 2 -384 -79 316
4832C16J89m07k03M1M21L03j63k79o25LN90M99k4q20k54P44L37l00p4k40j22L53
$$ 316 505 98 -105 -64 357 660 497 218 -407 -404 186 685 661 -159 -413 331 668 368 294 54 -68 285
4854B85L60p44l8K38K0M17L8l42m84K99M76j41Q5n55p1K11N69r9l90k47OJ98o
$$ 285 645 -99 -137 101 121 538 576 234 -250 49 525 384 469 -86 -157 54 623 524 134 -113 -107 91 85
4877H5L21m82j79J08N59p7Mm73k73L17P73l87k43l37k34O35O30m72m53k06O67
$$ 85 406 -76 -255 -147 412 335 339 -134 -407 -90 683 296 53 -284 -518 117 747 275 -178 -384 283
4898B83K16j81J28o28l01O41M07j87k96l70K31K32M90n10n32n3O35K36j79l3p26
$$ 283 499 318 446 -182 -483 158 565 378 82 -288 -57 175 665 155 -377 -430 205 441 262 229 -497
4919d97K63N16R7j79j27j06k17P90q5k65m77K26R8K13r8k01k56j46J155l79m74
$$ -497 -234 282 379 200 73 -33 -250 540 455 190 -287 -61 37 250 152 -49 -305 -451 704 325 -149
4940a49j91K37J92M64j36l41n54M54M12j3k20k94m77O86P72n17l94j86J52M03
$$ -149 -340 -103 89 553 417 76 -478 -24 388 375 155 -139 -616 70 842 325 -69 -255 -103 300
4960C00K65l26k74q6P0J04J15Ll23l0O71k03J46p38K51LM00k3m9n48K98O2M96
$$ 300 565 239 -35 -121 -51 53 168 171 -152 -182 489 286 432 -306 -55 -52 348 325 276 -272 26 88 584
4983E84n3m78n93Q06K15l04j38j06j40L65Q55l46q90J1K83K00K92J8p27j92N24
$$ 584 531 53 -540 266 481 177 39 -67 -207 158 1013 667 -223 -212 71 271 563 581 -146 -338 186
5004A86L29M7n44N6m80Q36N14j038M4J86Q2J46J42m16n68M23N27K33n87o3n00
$$ 186 515 562 18 74 -406 430 944 -94 -50 136 218 364 506 90 -478 -55 472 705 118 55 -445
5025d45K64N74J83j88q38M12J95N70k89l54m99N53L58J20m92k11j29J35O11O7
$$ -445 -181 393 576 388 -450 -38 157 727 438 84 -415 138 496 616 124 -87 -216 -81 530 597
5045E97l91l74J83M71Q0J16q17J87K34M57k26j93m57K12O11J15k82m53J73k45
$$ 597 206 -168 15 486 566 682 -135 52 286 743 517 324 -133 79 690 805 523 70 243 -2
5065bP79j89k71m30K97J99J35J90n68l22N22J21M2l14j45q4L03J26J49n97k58
$$ -2 777 588 317 -113 184 383 518 708 140 -182 340 461 503 189 44 -40 263 389 538 -59 -317
5086c17L3O58Q7p4m67j10L31M11j51n59j32JK44M01oo42l07N55N72n10K20n53
$$ -317 -284 374 461 387 -80 -190 141 552 401 -158 -290 -289 -45 356 350 -292 -599 -44 528 18 238 -315
5108c15J00L17M3k44o2n48L74N98n76J27j50n4L23J97j38l87K25m9P84l15j79
$$ -315 -215 102 145 -99 -161 -709 -335 263 -313 -186 -336 -390 -67 130 -8 -395 -170 -219 565 250 71
5129G1m7l72L37J17o3K10n57R0K88P7J22l28J8j82P71n69L5j73k6O69qj58k19
$$ 71 24 -348 -11 106 43 253 -304 -214 74 151 273 -55 -37 -219 552 -17 18 -155 -181 488 480 322 103
5152A03m73P56N78m12n90m3m4N28L93r4p00k88P58m06N78m77k19q8O60K09n03
$$ 103 -370 386 964 552 -38 -81 -125 403 796 702 2 -286 472 66 644 167 -52 -140 520 729 226
5173B26k62O5k19L84J52j26p8p3k7J91K74l40j27m9M50R1r7l44n78N07M01m20
$$ 226 -36 29 -190 194 346 220 142 69 42 233 507 167 40 -9 441 532 435 91 -487 20 421 1
5195Al40J18n6M38K2M4m80q8K96K90l90M60p24J12K23K52j19o15J92l2N46J38
$$ 1 -339 -221 -277 161 183 227 -253 -341 -45 245 -145 315 -409 -297 -74 178 59 -556 -364 -396 150 288
5217B88p17P3M8L85j99K55k85m7j57J20M96l53j64m3M2N16Q4l48k7m80M62N38
$$ 288 -429 -356 -308 77 -122 133 -152 -199 -356 -236 260 -93 -257 -300 -258 258 342 -6 -33 -513 -51 487
5239D87Nn49J39m97M28K15k54Q4l67M40Q3L24l38m05K64L43J80K0o17k43L35K22
$$ 487 492 -57 82 -415 13 228 -26 58 -309 131 214 538 200 -205 59 402 582 602 -15 -258 77 299
5261B99N1m23K2P7J15K10M9n98k5M43M45k29o23%j83R13l03j37k29k24O42p7j20
$$ 299 350 -73 -51 26 141 351 400 -198 -223 220 665 436 -187 -187 -370 543 240 103 -126 -350 292 215 95
5284I5r2k92L83L1m4J57j1o77K63M49K40l34l46N8M00K02n9m40l17O6L52L30p0
$$ 95 3 -289 94 125 81 238 227 -450 -187 262 502 168 -178 -120 280 482 423 -17 -334 -268 84 414 344
5307C44n98k14N28K57j95k43o4NK86N98l52m78K3K03M1R2o6k49j00M47J18m00
$$ 344 -254 -468 60 317 122 -121 -185 -180 106 704 352 -126 -103 100 141 233 167 -82 -182 265 383 -17
5329a7k19j83O16j00K14k02J08n0k35K47L6M8m39J0N45J74k64l67j74P0O15J59
$$ -17 -236 -419 197 97 311 109 217 167 -68 179 215 263 -176 -166 379 553 289 -78 -252 -182 433 592
5351E92k47n05k34O54O1J87p14o7L48N09O2m67p75L83J24K32k7j3l85K27M06L6
$$ 592 345 -160 -394 260 321 508 -206 -273 75 584 646 179 -596 -213 -89 143 116 103 -282 -55 351 387
5373C87j31o77K47J89L7J28j30j10m4M17P8M1m88J02R9O1K21l25q2l8M74j04m9
$$ 387 256 -421 -174 15 52 180 50 -60 -104 313 391 432 -56 46 145 206 427 102 20 -18 456 352 303
5396C03k27M1n0L27j24j47k60K28J76K70k59k72l85L74L90j68r6m00j4K43N79
$$ 303 76 117 67 394 270 123 -137 91 267 537 278 6 -379 -5 385 217 121 -279 -293 -50 529
5417E29m47k62R7l8M50K9l48j36j82O20k98J53j47r9k01J52L01L48o93J49K94
$$ 529 82 -180 -83 -121 329 358 10 -126 -308 312 14 167 20 -79 -280 -128 173 521 -172 -23 271
5438B71J06q6mm23J05j81M74k9j93k45j76M08K16l1l80k06L49L54j77q0m55L12
$$ 271 377 291 287 -136 -31 -212 262 233 40 -205 -381 27 243 212 -168 -374 -25 329 152 72 -383 -71
5460g1N02j78k38m5k70R8O86J25p76k05M31kq1r5p0Q6J29N40l34j00l6m02K24
$$ -71 431 253 15 -30 -300 -202 484 609 -167 -372 59 57 -24 -119 -189 -103 26 566 232 132 96 -306 -82
5483h2M46j47k26k4K17p3P0k06l51L06N55J51q90M35k4P1n1K87k08k56j98K35
$$ -82 364 217 -9 -33 184 111 181 -25 -376 -70 485 636 -254 181 157 228 177 464 256 0 -198 37
5505C7K95J67l31l60K27P51m40J0o41J64LN40K67q99J75J19M87Jn29k53J99K52
$$ 37 332 499 168 -192 35 786 346 356 -285 -121 -118 422 689 -210 -35 84 571 572 43 -210 -11 241
5527B41K64j42k37Q0k39O03Q9o80rj75J62K98R4nk53j13J85L63l28p5j76J60M83
$$ 241 505 363 126 206 -33 570 659 -21 -30 -205 -43 255 349 344 91 -22 163 526 198 123 -53 107 590
5550E90j22r1m66J85J39l4M35l28o38L23J15N50l97k08k88K43N64n01K83m72J71
$$ 590 468 377 -89 96 235 201 636 308 -330 -7 108 658 261 53 -235 8 572 71 354 -118 53
5571E3K65j76K38l86L6mL26j63l03j21L13N7j28K5R0k56L11r6M41k06k89k09N7
$$ 53 318 142 380 -6 30 26 352 189 -114 -235 78 135 7 32 122 -134 177 81 522 316 27 -182 -125
5594a25N84n83M35l42m93O16L72k73m53j52M70Q3j71J35m41K29N82j15k23l14
$$ -125 459 -124 311 -31 -524 92 464 191 -262 -414 56 139 -32 103 -338 -109 473 358 135 -179
5614a79j78N9L60J02j64k86M59k40J81K16k82m39J88O03r3k71r2k13K88R3J03
$$ -179 -357 -298 62 164 0 -286 173 -67 114 330 48 -391 -203 400 307 36 -56 -269 19 112 215
5635B15m92J50Q4k51Q29p6l81q0L30l79L50j89j23j52L36K85n90p3J57P3N0O20
$$ 215 -277 -127 -43 -294 535 459 78 -2 328 -51 299 110 -13 -165 171 456 -134 -207 -50 23 73 693
5657F93m22o19J45M40R2J5j86l20k7N29R5l22kj64m4O46N6n67m1M4L7K33J89p4
$$ 693 271 -348 -203 237 329 344 158 -162 -189 340 435 113 111 -53 -97 549 605 38 -3 41 78 311 500 426
5681D26n21P5M82j99k16J65j28N1M31k29l38J15o5K93P1L9k94rJ21j2j16k40J25
$$ 426 -95 -20 462 263 47 212 84 135 566 337 -1 114 49 342 413 452 158 149 270 258 142 -98 27
5704B7J34J17K2k03L8K1n9K76k11l4m50M43O8K67l04l32J43ML25n3j90k10M36
$$ 27 161 278 300 97 135 156 97 373 162 128 -322 121 189 456 152 -180 -37 -33 292 239 49 -161 275
5727B75j34J01n5k89K37J27m43L51j97J18j30M2K62j16J69l72j71L02K58k16k12
$$ 275 141 242 187 -102 135 262 -181 170 -27 91 -39 3 265 149 318 -54 -225 77 335 119 -93
5748i3l20N60r7L39m33J30k69M57j81J25l5k66j0K64N20n58k82j97N82J40j79
$$ -93 -413 147 50 389 -44 86 -183 274 93 218 183 -83 -93 171 691 133 -149 -346 236 376 197
5769A97l4n8l2L11J4k1k41Q6m7Q0j17lj2j47N24m82L55m41m8L36L62l77j34k97
$$ 197 163 105 73 384 398 377 136 222 175 255 138 135 123 -24 500 18 373 -68 -116 220 582 205 71 -226
5793b26L59N2J52j56l85nM82o7j47j12J28l35J82K93j62k23R7k23N70j24n60K32
$$ -226 133 185 337 181 -204 -209 273 206 59 -53 75 -260 -78 215 53 -170 -73 -296 274 150 -410 -178
5815a78P9K61M7l33j33k7P5j4M56l53L1J80k21M86k42j30Q7m14M42j97j08J9r8
$$ -178 -99 162 209 -124 -257 -284 -209 -223 233 -120 -89 91 -130 356 114 -16 71 -343 99 -98 -206 -187 -285
5838b85O9N87k19K3j19j74K5K34j78k82K98L67k70N50l02m49k9L25L50k92k37
$$ -285 -216 371 152 175 56 -118 -93 141 -37 -319 -21 346 76 626 324 -125 -154 171 521 229 -8
5859hK9L61r2J19j76m01J81k7O97o38r9K83K68k07N5p6o05L82J87J83J14m80m6
$$ -8 21 382 290 409 233 -168 13 -14 683 45 -54 229 497 290 345 269 -336 46 233 416 530 50 4
5882DJ14L21l37J28J2q3N7j16J77j89J42O5j83J26pl96l6L69K62l24N5J0j01L38
$$ 4 118 439 102 230 242 159 216 100 277 88 230 295 112 238 231 -165 -201 168 430 106 161 171 70 408
5906D08k75K21m77O7j98L54J06l15K68m49L58K08j83j15m3j57L81K38n98j85Q9
$$ 408 133 354 -123 -56 -254 100 206 -109 159 -290 68 276 93 -22 -65 -222 159 397 -201 -386 -297
5927b97L80n5R1M0o98L21M15J45k81l69K59K72j79N43n82q6k16M92J01mk64J80
$$ -297 83 28 119 159 -539 -218 197 342 61 -308 -49 223 44 587 5 -81 -297 195 296 292 28 208
5949B08j63K18O5l04R1m07P8O36k54L5l63M0K75L38k97m89j79N34K27O4l5n94
$$ 208 45 263 328 24 115 -292 -214 422 168 203 -160 -120 155 493 196 -293 -472 62 289 353 318 -276
5971b76N33O4K1Jl51n4j44N17R1l00k72R7M18Om70J89k40L22J77J69l70j05j91
$$ -276 257 321 342 343 -8 -62 -206 311 402 102 -170 -73 345 351 -119 70 -170 152 329 498 128 23 -168
5994a68K61M65m69P4k76J51L59m01J03K2L5J43J81k40j89M7j99M32m7L3l58l28
$$ -168 93 558 89 163 -113 38 397 -4 99 121 156 299 480 240 51 98 -101 331 284 317 -41 -369
6016c69O40L6Pj90l42K03q7o5M3O01l60m3o3M5O1J45l11QK69rm66P2J14J27L44
$$ -369 271 307 314 124 -218 -15 -102 -167 -124 477 117 74 11 56 117 262 -49 -41 228 219 -247 -175 -61 66 410
6041D10k12k17j01kK10K95j96k94L77l8j21K14m33p7j52N39rj3j80L44k10M19
$$ 410 198 -19 -120 -122 88 383 187 -107 270 232 111 325 -108 -185 -337 202 193 180 0 344 134 553
6063E53k02r5k26K56l00O7J90Nk18K99n5j93J38k95L81k1K69j55o91L71oJ47R0
$$ 553 351 256 30 286 -14 53 243 248 30 329 274 81 219 -76 305 284 553 398 -293 78 72 219 309
6086C09k43L6P9K25j60j33J37j58o9n2L80rm43l26O94J76j72k74P7j18m1L17J8
$$ 309 66 102 181 406 246 113 250 92 23 -29 351 342 -101 -427 267 443 271 -3 74 -44 -85 232 250
6109B50l16K42q9K13j78p5O2l53M90k90J31Km04M65L30n77L33l50J47l2K28J97
$$ 250 -66 176 87 300 122 47 109 -244 246 -44 87 89 -315 150 480 -97 236 -114 33 1 229 426
6131D26n54J45q0L21J60k32l44K3M19P2k47J51j67l66O07J07n97M5J1K26qRj39
$$ 426 -128 17 -63 258 418 186 -158 -135 284 356 109 260 93 -273 334 441 -156 -111 -100 126 118 127 -12
6154a2m07N04M3O0o0j98J2R0J20J54k25q8K8J88k7n2m36L37K11j27n7L5m25L31
$$ -12 -419 85 128 188 128 -70 -58 32 152 306 81 -7 21 209 182 130 -306 31 242 115 58 93 -332 -1
6178ao2L89j06r8J06K8J32k38%l26J83N6o9K98k43k54J87L53J82k56l83L33O3
$$ -1 -63 326 220 122 228 256 388 150 150 -176 7 63 -6 292 49 -205 -18 335 517 261 -122 211 274
6201B74K25o05L38n09N76J59o0j90j84j07j8K05L26l43N3J05p4J58j6k74pK66
$$ 274 499 -106 232 -277 299 458 398 208 24 -83 -101 104 430 87 140 245 171 329 313 39 32 298
6223B98L05l49p0m10L1L61J41j87r8q9K47K76j88p5m73K98J20O6J69l46q3K02
$$ 298 603 254 184 -226 -195 166 307 120 22 -67 180 456 268 193 -280 18 138 204 373 27 -56 146
6245A46k2L14n35n9L63k12K19Q5l63l12M11L60J94m39J25k99J56r8M9Nl53L71
$$ 146 124 438 -97 -156 207 -5 214 299 -64 -376 35 395 589 150 275 -24 132 34 83 88 -265 106
6267A06j18J86M69m11k18M9L05o07K46r6k8J51K97k48K9j51O7p1J43L6n34M78
$$ 106 -12 174 643 232 14 63 368 -239 7 -89 -117 34 331 83 112 -39 28 -43 100 136 -398 80
6289H0p7J25k13J91j98r2M5K91k15J07k86M33k23J52J02n02j3M81R2m6l26n0J19
$$ 80 3 128 -85 106 -92 -184 -139 152 -63 44 -242 191 -32 120 222 -280 -293 188 280 234 -92 -142 -23
6312b3L48n3k22J42l28L63l7M1m04J66%J47j97K45n1m42O03k92L63m44O1k89M04
$$ -23 325 272 50 192 -136 227 190 231 -173 -7 -7 140 -57 188 137 -305 298 6 369 -75 -14 -303 101
6335A01J97r2l02j16L13J62k20Q2J17l72K65j08L15j48m90M21M10j99j34l19J26
$$ 101 298 206 -96 -212 101 263 43 125 242 -130 135 27 342 194 -296 125 535 336 202 -117 9
6356IL98l8N1k67m26N28K00k9n00K41j93L84l38M23l70J36j64K73l17J16L17p84
$$ 9 407 369 420 153 -273 255 455 426 -74 167 -26 358 20 443 73 209 45 318 1 117 434 -350
6378c50L32L88j17l78L01J33J16J80m97L2Q2Q2L7O7k44l58J81J83o6L26n16L21
$$ -350 -18 370 253 -125 176 309 425 605 108 140 222 304 341 408 164 -194 -13 170 104 430 -86 235
6400B35k89K61m9j10J79n40L92J17j91K8P7j49L23l77K32k81J07M6j52N53n50
$$ 235 -54 207 158 48 227 -313 79 196 5 33 110 -39 284 -93 139 -142 -35 11 -141 412 -138
6421a38J88J3K19J05j86l09l4K82P0l47K12k2J44l15J06K6k36J04J68J37j98K05
$$ -138 50 63 282 387 201 -108 -142 140 210 -137 75 53 197 -118 -12 14 -222 -118 50 187 -11 194
6443A94j99J54K5J05J23o67Q0J44J38K85m68J49l4Q5l0J90l27J06O2K87j61N0
$$ 194 -5 149 174 279 402 -265 -185 -41 97 382 -86 63 29 114 84 274 -53 53 115 402 241 291
6465B91j93m39M08K84k36k65K70k19L22j08O3k73j28L15j86N06o13L60N9j45K22
$$ 291 98 -341 67 351 115 -150 120 -99 223 115 178 -95 -223 92 -94 412 -201 159 218 73 295
6486B95k2k23j19K62p6N0j26K93n03J26P0r8J62N7l00K49q8M02o70M40j28N1k38
$$ 295 273 50 -69 193 117 167 41 334 -169 -43 27 -71 91 148 -152 97 9 411 -259 181 53 104 -134
6509a34L03j47J96J45j21k62J7mo6J78J05P8m63J03K76j36j51J20r4j4K89J07
$$ -134 169 22 218 363 242 -20 -3 -7 -73 105 210 288 -175 -72 204 68 -83 37 -57 -71 218 325
6531C25P6j48l91J77K55J15m17J75l19K90N1J31j23r1K45k46L71l21k03L98n3
$$ 325 401 253 -138 39 294 409 -8 167 -152 138 189 320 197 106 351 105 476 155 -48 350 297
6552B97j16q9k32O7M87j95L49j0n97J68K69pl23j24J8j49N66k04J23k50J22K25
$$ 297 181 92 -140 -73 414 219 568 558 -39 129 398 391 68 -56 -38 -187 379 175 298 48 170 395
6574C95p0j05j10l87J43L34L92l38k70m8m5M10r6j28j27R7K63J73l63R5o52O30
$$ 395 325 220 110 -277 -134 200 592 254 -16 -64 -109 301 205 77 -50 47 310 483 120 215 -437 193
6596A93J75j62k11j51M71m30L14r4p9J95j50J67J25k09k2O1K56j54k18L54j49
$$ 193 368 206 -5 -156 315 -115 199 105 26 221 71 238 363 154 132 193 449 295 77 431 282
6617B82m63M21j34L3l81J56J48J09j1J19m95K85MK35k65Q3J99j94k52L22l08J61
$$ 282 -181 240 106 139 -242 -86 62 171 160 279 -216 69 73 308 43 126 325 131 -121 201 -107 54
6639E4J28j81J07K8j70j80L56m9j8j29L54m40J77L1l06jJK47p8K67l32q4J53K97
$$ 54 182 1 108 136 -34 -214 142 93 75 -54 300 -140 37 68 -238 -239 -238 9 -69 198 -134 -218 -65 232
6663B32k3rq5j75J53K9O6l25Q5j21N18J6j88j73l01K37N20l01K24l68J20j47J54
$$ 232 209 200 115 -60 93 122 188 -137 -52 -173 345 361 173 0 -301 -64 456 155 379 11 131 -16 138
6686A38k14J55j01q2n2L07lj25o5QL82k76K31l43N9M24k17P4l59k5J61l05K70
$$ 138 -76 79 -22 -104 -156 151 148 23 -42 -34 348 72 303 -40 19 443 226 300 -59 -84 77 -228 42
6709D2j78J81mK18P6r2j22k61O07l77K29m01O0K0K19k6K68m88K58l23L38j01J29
$$ 42 -136 45 41 259 335 243 121 -140 467 90 319 -82 -22 -2 217 191 459 -29 229 -94 244 143 272
6732B72p9j98j38J47J22J15K35o12Q5J16J14j36j63J22L77j80J45j65k30n4L97
$$ 272 193 -5 -143 4 126 241 476 -136 -51 65 179 43 -120 2 379 199 344 179 -51 -105 292
6753B92nk95K65Kq2L33k48J68k59j96N34l18k80K20k63K09M9Mk42R7o4J07L84
$$ 292 287 -8 257 259 177 510 262 430 171 -25 509 191 -89 131 -132 77 126 130 -112 -15 -79 28 412
6776D12l33r4J77q0k47K01Q7k6l27O44J45r31M25jm9j04N12n38LN9M24j62l75
$$ 412 79 -15 162 82 -165 36 123 97 -230 414 559 -372 53 52 3 -101 411 -127 -124 -65 359 197 -178
6799a78L00J8j19R0K4jn9j82K61R4K14k94j76j55J27K69r4k00q0M15j2j81r8m8
$$ -178 122 140 21 111 135 134 75 -107 154 248 462 168 -8 -163 -36 233 139 -61 -141 274 262 81 -17 -65
6823f5J39k43J79K45k39J70j37m49N41K24m99L23k35j24K56R6o7j9O6J51o3k78
$$ -65 74 -169 10 255 16 186 49 -400 141 365 -134 189 -46 -170 86 182 115 96 162 313 250 -28
6845b8K96l09K57m4k11J13k34L01O3k72J79J1qK7K05l69L73l39K05K89m41m2j06
$$ -28 268 -41 216 172 -39 74 -160 141 204 -68 111 122 114 141 346 -23 350 11 216 505 64 22 -84
6868h4J95K48k05l0j11o0J80j37J40K7pj5Q4o34O61m60L87q2J34J10m32J93k76
$$ -84 111 359 154 124 13 -47 133 -4 136 163 156 141 225 -409 252 -208 179 97 231 341 -91 102 -174
6891a74L29Q9k62l0K28k9J64Nl86J41M3J58R1r4l34qJ58K40n08J01O2q1M96j01
$$ -174 155 244 -18 -48 180 151 315 320 -66 75 118 276 367 273 -61 -69 89 329 -179 -78 -16 -97 399 298
6915B98j24K3Q0l3j82M5j84L70l73N47j79q4l84K64K60P8k04k30l77K29J07K31
$$ 298 174 197 277 244 62 107 -77 293 -80 467 288 204 -180 84 344 422 218 -12 -389 -160 -53 178
6937A78j12J25P9n2j91j62J79k80K50q9J77J13r8k58j8M65m04K07k0k20L03L33
$$ 178 66 191 270 218 27 -135 44 -236 14 -75 102 215 117 -141 -159 306 -98 109 89 -131 172 505
6959E05m61l8j55M00k78Ql1O1J44j07N35j9m55o4j28m5K49n4l17J30L34j40R7
$$ 505 44 6 -149 251 -27 -19 -50 11 155 48 583 564 109 45 -83 -128 121 67 -250 -120 214 74 171
6982A71j43n7m4K8L14R0k34k06M9L57m02OL05j9j68J29j75J32r0J41O5m9pl07
$$ 171 28 -29 -73 -45 269 359 125 -81 -32 325 -77 -71 234 215 47 176 1 133 43 184 249 200 193 -114
7006a14J54j86J02J85p7J77l2j62J35J67l86M14n56L24j88L53k97q5K10l6J58
$$ -114 40 -146 -44 141 64 241 209 47 182 349 -37 377 -179 145 -43 310 13 -72 138 102 260
7027B60m79K12k01kK46M2qk89N15R2k44k0P5j9K67j55j14n5j90K75l39L49n1j11
$$ 260 -219 -7 -208 -210 36 78 70 -219 296 388 144 124 199 180 447 292 178 123 -67 208 -131 218 167 56
7051E6j75L87J52k52j7pj96P1K97j76j25j02j8L09Ml42J86j65K9J01L6k94P3L22
$$ 56 -119 268 420 168 151 144 -52 19 316 140 15 -87 -105 204 208 -134 52 -113 -84 17 53 -241 -168 154
7075A54J69j06j6j12J18q3j06K13l72P3L35k29J70M8m17K23Q2O2j5Jl2N7j63L74
$$ 154 323 217 201 89 207 124 18 231 -141 -68 267 38 208 256 -161 62 144 206 191 192 160 217 54 428
7099D28j64l83L81qk34m9J53k41L33j16K30j66N6m40k0K60M16o05j5K61j93M21
$$ 428 264 -119 262 254 20 -29 124 -117 216 100 330 164 220 -220 -240 20 436 -169 -184 77 -116 305
7121C05l16J75m26L80k2k86K46J43l5k10k09L21j89M0k2k2L34j93l14K96P8L8
$$ 305 -11 164 -262 118 96 -190 56 199 164 -46 -255 66 -123 -83 -105 -127 207 14 -300 -4 74 112
7143A12kj20N5k0p7N30j56k14J10N9l32M92l92N8k2J29l48O7L46k87O8O5j8o9
$$ 112 110 -10 45 25 -52 478 322 108 218 277 -55 437 45 103 81 210 -138 -71 275 -12 56 121 103 34
7167C4q4K37n2K88k30K5J51k15J06Q9Qkl93r9L75j23j17l9L14k73Q5J56m73K87
$$ 34 -50 187 135 423 193 218 369 154 260 349 357 355 -38 -137 238 115 -2 -41 273 0 85 241 -232 55
7191E5K57l02k96P08l45k3K32R5k64j46k25M49j78N3j04J11j08j21O96m13j41
$$ 55 312 10 -286 422 77 54 286 381 117 -29 -254 195 17 70 -34 77 -31 -152 544 131 -10
7212a0N24n57kL71J06n69L25Q7K18o60J82r0K63J15k37K66N5m69J09J77k11K37
$$ -10 514 -43 -45 326 432 -137 188 275 493 -167 15 -75 188 303 66 332 387 -82 27 204 -7 230
7234B30k39Q8R9l0P7J02l30J49K26m3k03j16K06R9o9k21K80m01PL53l11M76n85
$$ 230 -9 79 178 148 225 327 -3 146 372 329 126 10 216 315 246 25 305 -96 -89 264 -47 429 -156
7257a56J59M23l85j81J90l84M89J00k38L4j27L80k81O1N57k04l45j15N65o41j8
$$ -156 3 426 41 -140 50 -334 155 255 17 51 -76 304 23 84 641 437 92 -23 542 -99 -117
7278a17K44k5k10L21k51k1R5K20k90k70K62J13m4M0N08o51M3j50O6K35M23k95
$$ -117 127 102 -108 213 -38 -59 36 256 -34 -304 -42 71 27 67 575 -76 -33 -183 -117 118 541 246
7300B46k60j51l8N00q4k75n6J42L8M35k40l17J6J02j18K01n1L63k69M6j98j04
$$ 246 -14 -165 -203 297 213 -62 -118 24 62 497 257 -60 -44 58 -60 141 90 453 184 230 32 -72
7322g2R2j23j04P0M45l25N36n51L7M42o02J66K19j21L36o08L34k6l75K34K62j25
$$ -72 20 -103 -207 -137 308 -17 519 -32 5 447 -155 11 230 109 445 -163 171 145 -230 4 266 141
7344A41j0m9qJ7p8L9N1j4J23k41J14l18K44L11m83N39m30K60J00j14r4L75m11
$$ 141 131 82 74 91 13 52 103 89 212 -29 85 -233 11 322 -161 378 -52 208 308 194 100 475 64
7367F4l1J34K7L29n18r6K83O4k94R5K64l12j47K34L27J1j27k10j45M13Q4l2k24
$$ 64 33 167 194 523 5 -91 192 256 -38 57 321 9 -138 96 423 434 307 97 -48 365 449 417 193
7390A93l04L45K1K8j03l3j14J21J89k86K8K13l47J89L1L04l87k3J71l33L1J28
$$ 193 -111 234 255 283 180 147 33 154 343 57 85 298 -49 140 171 475 88 65 236 -97 -66 62
7412F2o1L76j92J33k06k34J80M30l32j43L11n26L69l19L13k78K82k37J78J99j87
$$ 62 1 377 185 318 112 -122 58 488 156 13 324 -202 167 -152 161 -117 165 -72 106 305 118
7433A18M6K21l67L60k52p7J39p9J15p6l0J53l13j53L72N9l99L92k80oK54o8j6
$$ 118 164 385 18 378 126 49 188 109 224 148 118 271 -42 -195 177 236 -163 229 -51 -57 197 129 113
7456A13k04L58j68K36j99l42J86MP3J33j90K34j67K20k0k64r6k25O87k20J0k21
$$ 113 -91 267 99 335 136 -206 -20 -16 57 190 0 234 67 287 267 3 -93 -318 369 149 159 -62
7478f2Km6J76J13r5jm77K71Q8M26j18k71M40j97j97j09K82k34J58j83K16k57L43
$$ -62 -60 -106 70 183 88 87 -390 -119 -31 395 277 6 446 249 52 -57 225 -9 149 -34 182 -75 268
7501B68k64J34k94N48k22j91l34M28J88j07R5j49j19k10N64j48j11O3j2R0J37
$$ 268 4 138 -156 392 170 -21 -355 73 261 154 249 100 -19 -229 335 187 76 139 127 217 354
7522C54l59M4J99J30n46kJ15J84j62%L74k63j00J63Q3l32R2M5L08l15j29L22p4
$$ 354 -5 39 238 368 -178 -180 -65 119 -43 -43 331 68 -32 131 214 -118 -26 19 327 12 -117 205 131
7545A31k3k42K14L25K13p64M10q3j52M20j91k8m81L25Q0K06j04k99J55k3N5k87
$$ 131 108 -134 80 405 618 -146 264 181 29 449 258 230 -251 74 154 360 256 -43 112 89 144 -143
7567a43K81M7j3R2R3l31p0pK0Q5R3j64k84J18M89j43j02j0K18l61J94P1m94L52
$$ -143 138 185 172 264 357 26 -44 -51 -31 54 147 -17 -301 -183 306 163 61 51 269 -92 102 173 -321 31
7591C1q9j44K35o7M6k05M21j24K22k17kj01M56K8m74N3L00j70j79j37L20q9k38
$$ 31 -58 -202 33 -34 12 -193 228 104 326 109 107 6 462 490 16 69 369 199 20 -117 203 114 -124
7614a24K73J66j3l91J64k3m8K12k43P9J21j46J57k1l5j48J34n3R1k85M48j51J67
$$ -124 149 315 302 -89 75 52 4 216 -27 52 173 27 184 163 128 -20 114 61 152 -133 315 164 331
7637C31m2j91Q5k9N9O9l35L32j89p2Q5o7nJ8K48k13J85q2J16l21LN4j15M84l13
$$ 331 289 98 183 154 213 282 -53 279 90 18 103 36 31 49 297 84 269 187 303 -18 -15 39 -76 408 95
7662I5m18M05j98L02j17m0NJ26j12J53r7m97L67M44j59J81l95l60M16J51k13K43
$$ 95 -323 82 -116 186 69 29 34 160 48 201 104 -393 -26 418 259 440 45 -315 101 252 39 282
7684B82j4Q2J3l8k31l7O7P5r9L6j51J26j18J89k0j28L24m6P5j24M2k19r4q2n6
$$ 282 268 350 363 325 94 57 124 199 100 136 -15 111 -7 182 162 34 358 312 387 263 305 86 -8 -90 -146
7709a46M57k85J61j21J53k00L98l41k36L14k89M02K43n02P9R4J75l29N3l74L33
$$ -146 311 26 187 66 219 19 417 76 -160 154 -135 267 510 8 87 181 356 27 80 -294 39
7730C9oL24j29m45O4K64k37L22p5k64J61q9K51l8J58j02n6j11K01j64k7L6r8J32
$$ 39 33 357 228 -217 -153 111 -126 196 121 -143 18 -71 180 142 300 198 142 31 232 68 41 77 -21 111
7754A11j09M63k36j65K4K37k95j12ML9j18J7K30k01q3J18J61j91J71K15K18o16
$$ 111 2 465 229 64 88 325 30 -82 -78 -39 -157 -140 90 -111 -194 -76 85 -106 65 280 498 -118
7776a18J57K59k57n9j7K56n42L39L55k88J52q9J5J3q5K00q7K0n2K2L3k60M46l25
$$ -118 39 298 41 -18 -35 221 -321 18 373 85 237 148 163 176 91 291 204 224 172 194 227 -33 413 88
7800H8R9j06l55M29J29l58K61n7j95J42j05j36L33n6j24j6K55k20N2q0J01Q9K78
$$ 88 187 81 -274 155 284 -74 187 130 -65 77 -28 -164 169 113 -11 -27 228 8 60 -20 81 170 448
7823D48n87M28j43l59K82J1K33k39l0JK10j98j5Q9l0J71j87j12K48k56J88K81
$$ 448 -139 289 146 -213 69 80 313 74 44 45 255 57 42 131 101 272 85 -27 221 -35 153 434
7845D34n17K77k7k09K1k32M89j59k4m0N6L2J27K7p7L1J54k29k1k0j31K44R1k17
$$ 434 -83 194 167 -42 -21 -253 236 77 53 13 69 101 228 255 178 209 363 134 113 93 -38 206 297 80
7869H0N4k81M54j86p0M47m31K12l24L70k14k90K46j80L63k43r6k05K82K09J64
$$ 80 134 -147 307 121 51 498 67 279 -45 325 111 -179 67 -113 250 7 -89 -294 -12 197 361
7890C61j80j00j28K16J75p0j85J57k60P1K68m64N9J23m6J06j78K8l7Q6O4K73l39
$$ 361 181 81 -47 169 344 274 89 246 -14 57 325 -139 -80 43 -3 103 -75 -47 -84 2 66 339 0
7913@N7J95k37J82p8R8k40j02N51P0o68O9K26M4K72n84J56k24J70K05m7J3L10
$$ 0 57 252 15 197 119 217 -23 -125 426 496 -172 -103 123 167 439 -145 11 -213 -43 162 115 128 438
7936D38l97L7J73l19J79J6J07o6J46J55m56K27j09J27m2l06K04l30M67j57K4n09
$$ 438 41 78 251 -68 111 127 234 168 314 469 13 240 131 258 216 -90 114 -216 251 94 118 -391
7958c91N78kk2j2Q2m28K88J27J17j18j73j6J21K12j07j11n1k5J03K43j23k31r4
$$ -391 187 185 163 151 233 -195 93 220 337 219 46 30 151 363 256 145 94 69 172 415 292 61 -33
7981c3K33m2j40P8N1l70L32J10l26R9J51j70l37M27J23k70P07k26k97O5J12j42
$$ -33 200 158 18 96 147 -223 109 219 -107 -8 143 -27 -364 63 186 -84 623 397 100 165 277 135
8003A35J21N0k21J23r0l7K8O4m0k55J61K34k31n4N8k00J23O9L40k45j15k42J78
$$ 135 256 306 85 208 118 81 109 173 133 -122 39 273 42 -12 46 -154 -31 38 378 133 18 -224 -46
8026d6m0J56L14k75j99J05L31Lj98k5k05N56k80K0K06m66j66M76J14m79K2j04
$$ -46 -86 70 384 109 -90 15 346 349 151 126 -79 477 197 217 423 -43 -209 267 381 -98 -76 -180
8048a80L40q9j13L53k67J25J13j18j64O4Q0r8J33m65L39R1j9j07Q1N1lj87L01
$$ -180 160 71 -42 311 44 169 282 164 0 64 144 46 179 -286 53 144 125 18 99 150 147 -40 261
8071B61L3m43J18M05m47K65J86R0l06k57J81o8K98l68J11J04k63L31j0j27k21
$$ 261 294 -149 -31 374 -73 192 378 468 162 -95 86 18 316 -52 59 163 -100 231 221 94 -127
8092a27K21p4K88j79j51o0J60M2k3q4J50k66J49N0M7k43L39j19%k75J15J10k36
$$ -127 94 20 308 129 -22 -82 78 120 97 13 163 -103 46 96 143 -100 239 120 120 -155 -40 70 -166
8115a66K10PJ77o0l27K82j33J27o5J58k40J93j30K99k38m6K17r8J29k72N8n12
$$ -166 44 51 228 168 -159 123 -10 117 52 210 -30 163 33 332 94 48 265 167 296 24 82 -430
8137d30O14J2j38P1K1n8j13K13k69J01j90K31K82j45p2j97M4J68p9L5K65l53O2
$$ -430 184 196 58 129 150 92 -21 192 -77 24 -166 65 347 202 130 -67 -23 145 66 101 366 13 75
8160G5J96j17Q6k5n23K34L91m00qr3O04l9k12j79J15j43N0P0J63j81m2kJ11Q1
$$ 75 271 154 240 215 -308 -74 317 -83 -91 -184 420 381 169 -10 105 -38 12 82 245 64 22 20 131 212
8184B12j55r2kK21O2j53J23
$$ 212 57 -35 -37 184 246 93 216
8191B16
$$ Imaginary data points
##PAGE= N=2
##DATA TABLE= (X++(I..I)), XYDATA
0@%%%%%%%%%Rj8J8j8K1l0L6m5N4o3P2q1R9j17J34j52J71j95K22k51K84l18L61
$$ 0 0 0 0 0 0 0 0 0 0 9 -9 9 -9 12 -18 18 -27 27 -36 36 -45 54 -63 71 -81 90 -105 117 -134 150 -168 193
32A93m06M52n06N65o29P00p75Q57r51J054j166J290j430J587j762J961k192K459
$$ 193 -213 239 -267 298 -331 369 -406 451 -500 554 -612 678 -752 835 -927 1034 -1158 1301
50A301k772L147l607M185m935N955p436R788j4114K4721r7847j75823J22652J75566
$$ 1301 -1471 1676 -1931 2254 -2681 3274 -4162 5626 -8488 16233 -81614 -257437 -134785 40781
64D0781Q8937q8045j36601n8432Q0127R8560J5838o2198m9021l357L7349K9678
$$ 40781 129718 41673 -94928 -153360 -73233 25327 41165 -21033 -70054 -73411 -36062 -6384
76f384n797k7303k176J3492M762n149j441o598J642J3559Q508r953r436o040J394
$$ -6384 -12181 -39484 -41660 -28168 -23406 -28555 -29996 -36594 -34952 -21393 -12885 -22838 -32274 -38314 -36920
91c6920J9758K1516j5867l7579j1014K9724M0627J0930m1752n4111Q382O7646
$$ -36920 -17162 4354 -11513 -49092 -60106 -30382 10245 21175 -20577 -74688 -66306 1340
103A340L8474l6826o4572j9374N0426O7486j332p3415m8791L5735O8802K0532
$$ 1340 39814 2988 -61584 -80958 -30532 36954 35622 -37793 -86584 -50849 17953 38485
115C8485m3942n9808m666O0403M8545k3252n6505j9319K9551M3290J1988l3637
$$ 38485 -5457 -65265 -69931 -9528 39017 15765 -40740 -60059 -30508 12782 24770 -8867
127h867l7006Q231L7648J7135j1333k0550j4663P425K5648J3223r912j4613j1604
$$ -8867 -45873 -37642 6 17141 5808 -14742 -29405 -21980 3668 16891 6979 -7634 -19238
140a9238j87K3632K7758q574l6721j7837K0641L9809J9256l0824n1068P8N6022
$$ -19238 -19425 4207 31965 23391 -13330 -31167 -10526 29283 48539 17715 -33353 -33275 22747
153B2747L9507k3663n4515k3855L6284O1319Q444n9501m7233K2428N8408K6225
$$ 22747 62254 38591 -15924 -39779 -3495 57824 66268 6767 -40466 -18038 40370 66595
165F6595l1217n5734j3727M9591M8480j5155n1081k4433K2287M2234J5949l1663
$$ 66595 35378 -20356 -34083 15508 63988 48833 -2248 -26681 -4394 37840 53789 22126
177B2126l9239L223L3361J6991q261k0022j6316K832K0674J1806p276j3105j3360
$$ 22126 -17113 -13890 19471 36462 28201 8179 -8137 -5305 15369 27175 19899 6794 -6566
190f566n176J9087K4941o325l2632j9546J3351L3794K0264k5264m7715o985M6002
$$ -6566 -11742 7345 32286 25961 -6671 -26217 -12866 20928 41192 15928 -31787 -38772 7230
203G230L6980j4450m7121k8729K4823N5070J5029m8172m7575J1643N0613L0444
$$ 7230 44210 29760 -17361 -46090 -21267 33803 48832 660 -46915 -35272 15341 45785
215D5785k1441n2733j9698M1754M7960o812m5168k5975J5909L8288J9065k4594
$$ 45785 24344 -28389 -48087 -6333 41627 34815 -10353 -36328 -20419 17869 36934 12340
227A2340l5839M36K7773J7888l219j5824j6853O51J9253J3491l449j1714j3847
$$ 12340 -23499 -23063 4710 22598 19379 3555 -13298 -12647 6606 20097 16648 4934 -8913
240h913m671J7527K3600m034k7051j7125R233K7609J9764j7663m0253r366L4877
$$ -8913 -13584 3943 27543 23509 -3542 -20667 -11434 16175 35939 18276 -21977 -31343 3534
253C534L3526o160l8042l0691J4802M9065J9492l7744m5376J867M1997L2862j3867
$$ 3534 37060 30900 -7142 -37833 -23031 26034 45526 7782 -37594 -35727 6270 39132 25265
266B5265m8193k4359L2785M4276m32l8643k8039P847L4152K1952j9150l4445n745
$$ 25265 -22928 -47287 -14502 29774 29342 -9301 -37340 -29493 4659 26611 7461 -26984 -32729
279c2729K2319J8960J473j4742j9546k582J9039J4555k969j2318j3388m029J6978
$$ -32729 -10410 8550 10023 -4719 -24265 -26847 -7808 6747 3778 -8540 -21928 -25957 -8979
292h979K0676l188k2906j4976N741K3291K0471j1240l5007j2513K8026L2680Q89
$$ -8979 11697 8509 -14397 -29373 -23632 -341 20130 8890 -26117 -38630 -10604 22076 22965
305B2965l0817l1253Q459M4315K4336k9068m1728k815L5113L4144n482m1548k5649
$$ 22965 -7852 -39105 -30646 13669 38005 8937 -32791 -35606 -493 33651 28169 -13379 -39028
318c9028K4891M1063N737k9103k7447J354K9513K5355j1723l1418r761J7028K0701
$$ -39028 -14137 26926 32663 3560 -23887 -22533 6980 32335 20612 -10806 -20567 -3539 17162
331A7162O173j2193k0483m491J7749J5695j513j1039j3181m833J3881J9311o11
$$ 17162 23335 11142 -9341 -13832 3917 19612 18099 7060 -6121 -10954 2927 22238 21627
344B1627j9311j4922J515J9758K1119o991l2579j5107K2062L0316M956k6182l2114
$$ 21627 2316 -12606 -11091 8667 29786 22795 -9784 -24891 -2829 27487 32443 6261 -25853
357b5853L092L9621K4604k2833l8499p684K7996L2005O6l5726k7137J6200L6100
$$ -25853 -22761 16860 41464 18631 -19868 -27552 444 32449 32515 -3211 -30348 -14148 21952
370B1952J0740k2152k7223n364K3960K6560n564k8533j3987J2150J9779R807j0260
$$ 21952 32692 10540 -16683 -22047 1913 28473 22909 -5624 -19611 -7461 12318 22125 11865
383A1865k1824o080J5761J5389k34r966j2942n813J2357J8089N59j6639j4686
$$ 11865 -9959 -16039 -278 15111 14877 4911 -8031 -13844 -1487 16602 17161 522 -14164
396a4164p27J6867K0669m881k9168j5323J7913K6921O736k1340k8733j428L3048
$$ -14164 -14891 1976 22645 17764 -11404 -26727 -8814 18107 24843 3503 -25230 -26658 6390
409F390K4197j6103l3524j1499K0243L0210O224k9326k8864Q711L2445J5203j5865
$$ 6390 30587 14484 -19040 -30539 -10296 19914 26138 -3188 -32052 -23341 9104 24307 8442
422H442k7232j0800K0107K8750j302k6445j6476Q310J9537J2299q184k1122q229
$$ 8442 -18790 -29590 -9483 19267 17965 -8480 -24956 -16646 2891 15190 7006 -14116 -22345
435b2345J3964J5729K305q500j3333p744J1616J8421K450j4987j4901j888J5983
$$ -22345 -8381 7348 9653 1153 -12180 -19924 -8308 10113 12563 -2424 -17325 -19213 -3230
448c230K0323k804k5974j4641J3816K4378Q497j5899k6546m575K7295K3963r450
$$ -3230 17093 14289 -11685 -26326 -12510 11868 20365 4466 -22080 -26655 640 24603 15153
461A5153k8323j4386J3367K8401J1261k3323k9224L354K8396J7326r921k5190
$$ 15153 -13170 -27556 -14189 14212 25473 2150 -27074 -23720 4676 22002 12081 -13109
473a3109j4163J6004K7266K346k2386j6591L525J7174J3745m517j9044j1122J0215
$$ -13109 -27272 -11268 15998 18344 -4042 -20633 -17108 66 13811 9294 -9750 -20872 -10657
486a0657J5279M945n714j4659r795J0872J8527L358j3712j4628l105J4524J9550
$$ -10657 4622 9567 3853 -10806 -20601 -9729 8798 12156 -1556 -16184 -19289 -4765 14785
499A4785j333k2655j4686J0447K1208J1114j1601k4533p340K2787K3958m783k3752
$$ 14785 13452 -9203 -23889 -13442 7766 18880 7279 -17254 -24594 -1807 22151 17368 -6384
512f384j6149Q971K6621J4165j8134k7331k12K4568J8811m807k1768j5833J1711
$$ -6384 -22533 -13562 13059 27224 9090 -18241 -18453 6115 24926 20119 -1649 -17482 -5771
525e771K5856O216j6728j6336o02J4115J5826P84j7522j3144O919J5492Q759m594
$$ -5771 20085 26301 9573 -6763 -7365 6750 22576 23360 5838 -7306 -387 15105 23864 19270
539A9270j5289j0654R994J8477M050j2695j3905m020J2250J7900k45j9739j4386
$$ 19270 3981 -6673 3321 21798 25848 13153 -752 -4772 7478 25378 25133 5394 -8992
552h992O513J7867J1275q363k3041j0396J7726K2267j247k1658j7676M000K3077
$$ -8992 -2479 15388 26663 18300 -4741 -15137 2589 24856 23609 1951 -15725 -11725 11352
565A1352J5401j5202k6625m378J8741J7579q12j9575j8137N853K2610R401j3115
$$ 11352 26753 11551 -15074 -19452 -711 16868 16056 -3519 -21656 -15803 6807 16208 3093
578C093j7955n151J0712J7344L097j7104j5285M076J4934R527l037j4879j1505
$$ 3093 -14862 -20013 -9301 8043 11140 -5964 -21249 -17173 -2239 7288 4251 -10628 -22133
591b2133Q167J7363M871j0292j2762m608R869J7476K722j6129j4218M065J5879
$$ -22133 -13966 3397 8268 -2024 -14786 -19394 -9525 7951 10673 -5456 -19674 -15609 270
604B70J3517m424k0456j0780J4696K2044J864j6451j6276J403K0518J6732r632
$$ 270 13787 9363 -11093 -21873 -7177 14867 16731 280 -15996 -14593 5925 22657 13025
617A3025k2542o115J4950J7518L803j4699j8313K158K0528J1858q039j6529p827
$$ 13025 -9517 -15632 -682 16836 20639 5940 -12373 -10215 10313 22171 14132 -2397 -10224
630a0224P844J8276O156j4756j5887J552J3139J0963j287j4253j2202M955J6417
$$ -10224 -2380 15896 22052 7296 -8591 -7039 6100 17063 15776 1523 -10679 -5724 10693
643A0693N858p970j3534p816Q177J6778M217j5769j5968J655J4346J3355m024
$$ 10693 16551 8581 -4953 -12769 -4592 12186 16403 634 -15334 -13679 667 14022 9998
656I998j9960j2138J1856J9669K326j4705j6105j808J6602J5837o380j9901q703
$$ 9998 -9962 -22100 -10244 9425 11751 -2954 -19059 -20867 -4265 11572 5192 -14709 -23412
669b3412R609J5754O830j1428j8726k208J8036J3829m775j5361j0388N891J7826
$$ -23412 -13803 1951 8781 -2647 -21373 -23581 -5545 8284 3509 -11852 -22240 -16349 1477
682A477P853j1984j4730q20J1634J2140J996j2381j2816M119J5231Q614n458j2221
$$ 1477 9330 -2654 -17384 -18204 -6570 5570 7566 -4815 -17631 -13512 1719 10333 4875 -7346
696g346q606P521J8026N730j3426j4001R81J2965J3606j372j7138j1679R810J7386
$$ -7346 -15952 -8431 9595 15325 1899 -12102 -11121 1844 15450 14078 -3060 -14739 -4929 12457
710A2457N527j0123j5276l999J3877J6639k140j7920j0547O383J5715R386r214
$$ 12457 17984 7861 -7415 -11414 2463 19102 16962 -958 -11505 -5122 10593 19979 10765
723A0765j8950m418J5772J3536k419j3895j1448K425J6258R364r908j5176l502
$$ 10765 -8185 -12603 3169 16705 14286 391 -11057 -8632 7626 16990 7082 -8094 -11596
736a1596Q466J1696L654j0729j5099O41J4004R141m068j2926r974N268J6336N723
$$ -11596 -3130 8566 12220 1491 -13608 -12967 1037 10178 6110 -6816 -16790 -11522 4814 10537
750A0537j1719j3905j488J0548J2848M18j4653j2962O334J5368O298p063j4184
$$ 10537 -1182 -15087 -16575 -6027 6821 7239 -7414 -20376 -14042 1326 7624 561 -13623
763a3623o820J1418J6770k25j5222j1706M340J4673J0059o388j7436n251J2875
$$ -13623 -20443 -9025 7745 7520 -7702 -19408 -15068 -395 9664 3276 -14160 -19411 -6536
776f536J3799J3j0738j1847N46J4714J1259o222j3958n370O763J3032O867j0013
$$ -6536 7263 7276 -3462 -15309 -14763 -49 11210 4988 -8970 -14340 -7577 5455 12322 2309
790B309j4839m46J3741J0453j890j1820j0656M231J6107P230j0167j2295k575
$$ 2309 -12530 -12976 765 11218 9328 -2492 -13148 -8917 7190 14420 4253 -8042 -10617
803a0617R148J2918K510j3345j2595M122J4259Q147n382j3711p667R285J6222
$$ -10617 -1469 11449 13959 614 -11981 -7859 6400 14547 9165 -4546 -12213 -2928 13294
816A3294J721j3496j0951J895J2060J1078m001j5707o950R365J2867K991q263
$$ 13294 15015 1519 -9432 -7537 4523 15601 11600 -4107 -11057 -1692 11175 14166 5903
829E903j2402l056J2509J3014l681j3730p120M883J2667Q175q207j5190j910J2134
$$ 5903 -6499 -9555 2954 15968 12287 -1443 -8563 -3680 8987 17162 8955 -6235 -8145 3989
843C989J0531m08j0594j0422J971J4678P888p446j2084m492P326J2290N220j1878
$$ 3989 14520 14112 3518 -6904 -4933 9745 17633 10187 -1897 -6389 937 13227 18447 6569
857F569j3571K217J3193Q938l365j3022r088P571J5283L520j1597j1173q42J0178
$$ 6569 -7002 -4785 8408 17346 13981 959 -8129 -558 14725 18245 6648 -4525 -5367 4811
871D811J1787j772j4432q667O981J1798N170o634j3507m797J1012J3105k218j2631
$$ 4811 16598 14826 394 -8273 -1292 10506 15676 9042 -4465 -9262 1750 14855 12637 6
885Fq771L058J1714Q435p120j4641l739R908R792J405r078j1685k51J3162Q502
$$ 6 -8765 -5707 6007 14442 7322 -7319 -11058 -1150 8642 10047 969 -10716 -10967 2195 10697
900A0697n453j1641o532M889J3215N314j0708j3438J78J1916Q676j372j2200r643
$$ 10697 5244 -6397 -12929 -8040 5175 10489 -219 -13657 -13479 -1563 7113 5741 -6459 -16102
914a6102N562J4353M177r100j0730k580Q678J1715O72j2523r844M812J1861O385
$$ -16102 -10540 3813 7990 -1110 -11840 -14420 -5742 5973 6645 -5878 -15722 -10910 951 7336
928G336m616j2932o314J0301J2974j03j0899q631J216J1059R674m502j3602m968
$$ 7336 2720 -10212 -16526 -6225 6749 6646 -4253 -12884 -11668 -609 9065 4563 -9039 -14007
942a4007P960J0682L592p310j2312j878J2186J0592l674j1288o763L924J2784
$$ -14007 -6047 4635 8227 917 -11395 -13273 -1087 9505 5831 -5457 -12220 -8296 4488
955D488O774r283j2594m24R601R244L35j0209r893L084J3281N531o262j0345m507
$$ 4488 11262 1979 -10615 -11039 -1438 7806 8141 -2068 -11961 -8877 4404 9935 3673 -6672 -11179
970a1179O546J2573K341j1304j0574L084J0972P171k848j2441p285Q756J2503
$$ -11179 -4633 7940 10281 -1023 -11597 -8513 2459 9630 6782 -5659 -12944 -4188 8315
983H315J159r182q845q65R286J0721k483j2564o152N820J0106N519o200j2405
$$ 8315 9474 292 -8553 -9418 -132 10589 8106 -4458 -10610 -4790 5316 10835 4635 -7770
997g770l232J1707J0197k131j0321q051L064J1646P641p381j1797k298Q319R115
$$ -7770 -11002 705 10902 8771 -1550 -9601 -6537 5109 12750 5369 -6428 -8726 -407 8708
1011H708K061q629j0965J655J2197P046m939j0472n583N543J2598L700j0951j0102
$$ 8708 10769 2140 -8825 -7170 5027 12073 7134 -3338 -8921 -3378 9220 12920 1969 -8133
1025h133J605R711P769j623j1264p643O204J1746K556o813r112l076Q368J0550
$$ -8133 -6528 3183 10952 9329 -1935 -9578 -3374 8372 10928 4115 -4997 -8073 295 10845
1039A0845n24j1867p082M347R410O325n004j1945l833R534R983r16q649p997N49
$$ 10845 10321 -1546 -8628 -4281 5129 11454 6450 -5495 -9328 206 10189 9273 624 -7373 -6824
1054f824J0338Q487n436j1235l523N669R732M029p632j2159M99J1437P652l472
$$ -6824 3514 12001 6565 -4670 -8193 -2524 7208 11237 3605 -8554 -8055 3382 11034 7562
1068G562r952p120M807J1964M617q943j0370L27P864Q353M14j0278q594M269J0802
$$ 7562 -2390 -9510 -4703 7261 11878 2935 -7435 -7108 756 9109 9523 -755 -9349 -5080 5722
1083E722M474n724r166m625P179J1542M12j0602p911K851Q922O928l865j1308
$$ 5722 10196 4472 -4694 -9319 -2140 9402 9814 -788 -8699 -5848 3074 10002 6137 -5171
1097e171m737P622R721K12p035q403j142R214Q775l403j0514n099M238R579M664
$$ -5171 -9908 -2286 7435 7647 612 -7791 -8933 281 9056 5653 -4861 -9960 -5722 3857 8521
1112H521o454j1727r13J0268P348k472q257p162K528J1045M774o670r792j234
$$ 8521 2067 -9660 -10573 -305 7043 4571 -3686 -10848 -8320 2725 7499 829 -8963 -10197
1126a0197O306Q480J819r318r198L162J0361N471m347r370n083O724J1310J118
$$ -10197 -3891 4589 6408 -2910 -12108 -8946 1415 6886 2539 -6831 -11914 -5190 6120 7238
1140G238r897p321J942Q053P021k117j0346n298O395Q976K360n479q534k600R307
$$ 7238 -2659 -9980 -8038 15 7036 4919 -5427 -10725 -4330 4646 7006 1527 -7007 -9607 -300
1155c00R489k318j0105n181L352R299N861n583j1449j833R408Q105j022p677p386
$$ -300 9189 6871 -3234 -8415 -5063 4236 10097 4514 -6935 -8768 640 8745 7723 46 -7340
1170g340J228J0430O292n844r130k733N620Q813K726r005r356J851J0019N664
$$ -7340 -6112 4318 10610 4766 -4364 -7097 -1477 7336 10062 1057 -8299 -6448 3571 9235
1184I235l491q494n763M993J0541J907q244p401J59O520P514m28r516p038M788
$$ 9235 5744 -2750 -8513 -3520 7021 8928 684 -6717 -6558 -38 7476 7048 -2468 -9506 -4718
1199d718R213K880m276r050l797Q243R635j455r039n875J952Q553O284l985j0847
$$ -4718 4495 7375 3099 -5951 -9748 -1505 8130 6675 -2364 -8239 -6287 2266 8550 4565 -6282
1214f282k350P157P723R24o117q402O8R677P275m341q943l803M775Q927L746p743
$$ -6282 -8632 -1475 6248 7172 1055 -7347 -7279 2398 9673 5332 -3611 -7414 -2639 6288 10034 2291
1230B291r410J199R100N749j781p676o084L800J0034L172o684p205j471O051Q003
$$ 2291 -7119 -5920 3180 8929 7148 -528 -6612 -2812 7222 10394 3710 -3495 -4966 1085 9088
1245I088J113r291p657M327Q146M196l573q843m124O904R039l92q166n689N51
$$ 9088 10201 910 -6747 -2420 5726 9922 6349 -2494 -6618 286 9325 8933 767 -4922 -4371
1260d371P185O872l005j0126m118N904P306K487n674r554j275R234P249l442q851
$$ -4371 2814 9686 6681 -3445 -7563 -1659 5647 8134 2460 -7094 -8369 865 8114 4672 -4179
1275d179m728L370Q929M030o911r608L1P815N536r62p049p144K427R667L799n618
$$ -4179 -8907 -5537 3392 7422 511 -9097 -9066 -1251 4285 3323 -3726 -10870 -8443 1224 5023 -595
1291e95p479k662N132Q686J761q998p464L047P559M722k477q156m744O015Q693
$$ -595 -8074 -10736 -5604 3082 4843 -4155 -11619 -8572 -1013 3709 1232 -6924 -11668 -5653 3040
1306C040N66n775o197p14O306Q214j125r653m896M568Q072L758m695q783k182
$$ 3040 3606 -2169 -8366 -9080 -2774 5440 4315 -5338 -10234 -5666 2406 6164 1469 -7314 -9496
1321i496R147P574k257p790m440J771Q498N485n451q927p33O369O477R23o001
$$ -9496 -349 7225 4968 -2822 -7262 -5491 3007 8492 3041 -5886 -6619 -250 6227 7150 1149
1336A149p766J301R303M894m548p109k838L505Q731K403p663p680K131O670M920
$$ 1149 -6617 -5316 3987 8881 4333 -2776 -5614 -2109 6622 9025 1362 -6318 -4187 2483 7403
1351G403j220p863n391M218Q820J400n712o395j782N801Q249n37q921o217M095
$$ 7403 6183 -1680 -7071 -2853 5967 7367 1655 -4740 -6522 -721 7528 6991 -1930 -8147 -4052
1366d052P202M024l943q714k834P544P521j544o761n037P22P356N993m301q392
$$ -4052 3150 7174 3231 -5483 -8317 -773 6748 5204 -1557 -6594 -5872 1484 7477 3176 -5216
1381e216k104N198O647K318o054q203Q34Q609N318l322o843l820L218Q409L031
$$ -5216 -7320 -2122 4525 6843 789 -7414 -6580 2029 7347 4025 -2818 -6638 -3420 4989 8020
1396H020o789o855J057N930M985J33o722o409L219Q665L083m774o622k641N361
$$ 8020 1231 -5624 -4567 1363 6348 6481 -241 -6650 -3431 5234 8317 3543 -3079 -5720 -359
1411c59Q529L55q532n465K878O649M717k701q622l526O074P732j03n821n828m89
$$ -359 8170 8525 -7 -5472 -2594 4055 8772 6071 -2551 -6077 -3 7729 7626 1805 -4023 -4512
1427d512P220O785l231q743l227M431O842K516n083q407k84Q116M824k607o017
$$ -4512 2708 9493 6262 -2481 -5708 -1277 5565 8081 2998 -5409 -5693 2423 7247 4640 -1377
1442a377m417K022P765L525n287o933r44M930N536J290o693o845K221Q061L376
$$ -1377 -5794 -3772 3993 7518 2231 -4702 -5646 -716 4820 6110 -583 -7428 -5207 2854 6230
1457F230l175o866l689M582P968J050p133n876J675N790N290j445p777m900N549
$$ 6230 3055 -3811 -7500 -2918 5050 6100 -1033 -6909 -5234 556 5846 4401 -3376 -8276 -2727
1472b727P164R81m769o127r78O546O612j772p972l572L495O397L296m275p631
$$ -2727 4437 5418 649 -5478 -6456 90 6702 4930 -3042 -6614 -3119 3278 6574 2299 -5332
1487e332r83P088M933r60n453m516O98P409M556m307p432j178M301O203K025o280
$$ -5332 -6315 773 5706 4746 -707 -5223 -4525 2884 7440 3133 -4299 -5477 -1176 5027 7052 772
1503G72p089J784P290L817k613o423l742L650P633J744o157n897K88N330N758
$$ 772 -6317 -4533 2757 6574 3961 -2462 -6204 -2554 5079 6823 666 -5231 -4943 387 6145
1518F145p40p867m810M277O969K134m554o383k284O329P246j481p588l888K382
$$ 6145 5405 -2462 -7272 -2995 3974 6108 1554 -4829 -7113 -784 6462 4981 -2607 -6495 -4113
1533d113O130L892l386p526j756N848N303j04m695n717r4P590N091l980o479k536
$$ -4113 2017 5909 2523 -5003 -6759 -911 4392 4288 -407 -6124 -6218 1372 6463 2483 -3996 -6532
1549f532L950N686K917n778p108J412O703L598j612n149m827K750P653K716n252
$$ -6532 -2582 3104 6021 243 -6865 -5453 1250 4848 3236 -1913 -6740 -3990 3663 6379 1127
1564A127n653r36M225O391M26p115n794L633P174K470l344o677k740N995O860
$$ 1127 -4526 -5462 -1237 5154 5580 -1535 -7329 -3696 3478 5948 2604 -4073 -6813 -818 6042
1579F042q24o358m135J402N568M529k177p639k636N145N575J040m131o265r26
$$ 6042 5218 -1140 -5275 -3873 1695 6224 4047 -3592 -6228 -1083 4492 5532 1401 -4864 -5790
1594e790P067N628l325o452k390K940N285L382m843o612j97N661M428m53m513
$$ -5790 1277 6905 3580 -2872 -5262 -2322 2963 6345 1502 -5110 -5307 354 4782 4329 -184
1609a84n912J721P120L373m260n814j883M190O225R35o283o125K710O471K860
$$ -184 -6096 -4375 2745 6118 1858 -3956 -5839 -1649 4576 5511 -772 -6897 -4187 2284 5144
1624E144k301n776l327M238O737L60n277m564J91M906N564j254p326l803M335
$$ 5144 2843 -2933 -6260 -2022 4715 5075 -202 -4766 -4575 331 5895 4641 -2685 -6488 -2153
1639b153N991J573l904o095j265O592N672k682n633k779J411N979L746m131o526
$$ -2153 3838 5411 1507 -4588 -5853 739 6411 3729 -1904 -4683 -3272 2707 6453 2322 -4204
1654d204q33M912M594N52m827n602J126P330L675l824o138j751L913O097J317
$$ -4204 -5037 -125 4469 5021 194 -5408 -4282 3048 6723 2899 -3239 -4990 -1077 5020 6337
1669F337o211n122J903M711L693j029n686m002L031O691J641m721n120p19M597
$$ 6337 126 -4996 -3093 1618 5311 4282 -1404 -5406 -2375 4316 5957 1236 -3884 -4603 -6
1684fO206j274o836l879L928N354J943k848o002j970N724N342j223m965l959J239
$$ -6 6200 4926 -1910 -5789 -1861 3493 5436 2588 -3414 -5384 340 5682 4459 -506 -4465 -3226
1700c226N275M288k877o502j750M144M661J490m273o430N46O632M101l191m947
$$ -3226 2049 6337 3460 -3042 -4792 -648 4013 5503 1230 -5200 -4654 1978 6079 2888 -2059
1715b059k804K414O047K543n210n762O37M874L832r6n801m379K588O652K094m683
$$ -2059 -4863 -2449 3598 6141 931 -4831 -4194 680 4512 4416 -1385 -5764 -3176 3476 5570 887
1731H87m799q96L967N705l62o425l836K951M869K315j687o309k304M194N840m87
$$ 887 -3912 -4808 -841 4864 4502 -1923 -5759 -2808 2061 4376 2689 -3620 -5924 -1730 4110 3623
1747C623m706l612m08N549M846k589o591k302L817M913J905m010n953m53O317
$$ 3623 -1083 -4695 -5103 446 5292 2703 -3888 -6190 -2373 2540 4445 435 -5518 -5971 346
1762C46M163k324m348l203J446N748L061m492n167m18M319M183N52n167n020K296
$$ 346 4509 2185 -2163 -5366 -3920 1828 4889 397 -4770 -5188 -869 3314 3866 -1301 -6321 -4025
1778d025O338K098l161m811k245L627N824N32n408l922J643M282L651j354n834
$$ -4025 2313 4411 1250 -3561 -5806 -2179 3645 4177 -1231 -5153 -3510 772 4423 3069 -2765
1793b765l135L653O127N47l897m940o58N234N197k027o132k386L339M386K440
$$ -2765 -5900 -2247 3880 4427 530 -4410 -5068 166 5363 3336 -2796 -5182 -1843 2543 4983
$$ [...]
8191B15
##END NTUPLES=NMR FID
##END=
