##TITLE=1H_CA-8600-3-7
 DMSO, 8 sc, 
 5.6.2019
##JCAMPDX= 6.0         $$ Bruker NMR JCAMP-DX V2.0
##DATA TYPE= NMR FID
##DATA CLASS= NTUPLES
##ORIGIN= UXNMR, Bruker Analytische Messtechnik GmbH
##OWNER= root
$$ XWIN-NMR		Version 3.5
$$ Wed Jun  5 15:23:49 2019 Russian Standard Time (UT+4h)  she@DPX200
##.OBSERVE FREQUENCY= 200.13155
##.OBSERVE NUCLEUS= ^1H
##.DELAY= (6, 6)
##.ACQUISITION MODE= SIMULTANEOUS
##.ACQUISITION SCHEME= undefined
##.AVERAGES= 8
##.DIGITISER RES= 18
##SPECTROMETER/DATA SYSTEM= spect
##.PULSE SEQUENCE= zg30
##.SOLVENT NAME= DMSO
##.SHIFT REFERENCE= (INTERNAL, DMSO, 0, 15.7039)
##AUDIT TRAIL= $$ (NUMBER, WHEN, WHO, WHERE, WHAT)
$$ ##TITLE= Audit trail, XWIN-NMR		Version 3.5
$$ ##JCAMPDX= 5.01
$$ ##ORIGIN= Bruker BioSpin GmbH
$$ ##OWNER= she
$$ F:/spectra/data/she/nmr/H-F/1/audita.txt
$$ ##AUDIT TRAIL=  $$ (NUMBER, WHEN, WHO, WHERE, WHAT)
(   1,<2019-06-05 15:22:33.57 +0400>,<she>,<DPX200>,
      <created by zg, POWCHK disabled, PULCHK disabled
       configuration hash MD5:
       00 E9 B6 7A A2 85 ED C7 34 08 36 98 17 FE 4E 26
       data hash MD5: 16K
       62 9B 99 81 4E 9D 3A 05 4C 4C 5D 0A 12 9C 9F 5E>)
$$ ##END=
$$ 
$$ hash MD5
$$ 4E 1B 1C 9D 09 89 BC 19 C3 BF 51 38 6E DF 14 2C
##$RELAX= 
##$RELAX= 
##$RELAX= 
##$RELAX= 
##$RELAX= 
##$RELAX= 
$$ Bruker specific parameters
$$ --------------------------
##$DU= <F:/spectra>
##$EXPNO= 1
##$NAME= <H-F>
##$PROCNO= 1
##$TYPE= <nmr>
##$USER= <she>
##$AMP= (0..31)
100 100 100 100 100 100 100 100 100 100 100 100 100 100 100 100 100 100 
100 100 100 100 100 100 100 100 100 100 100 100 100 100 
##$AQSEQ= 0
##$AQ_mod= 1
##$AUNM= <au_zg>
##$AUTOPOS= <>
##$BF1= 200.13
##$BF2= 200.13
##$BF3= 200.13
##$BF4= 200.13
##$BF5= 200.13
##$BF6= 200.13
##$BF7= 200.13
##$BF8= 200.13
##$BYTORDA= 1
##$CFDGTYP= 0
##$CFRGTYP= 5
##$CHEMSTR= <none>
##$CNST= (0..31)
1 1 145 1 1 1 1 1 1 1 1 1 1 1 1 1 1 1 1 1 1 1 1 1 1 1 1 1 1 1 1 1 
##$CPDPRG= <>
##$CPDPRG1= <>
##$CPDPRG2= <>
##$CPDPRG3= <>
##$CPDPRG4= <mlev>
##$CPDPRG5= <mlev>
##$CPDPRG6= <mlev>
##$CPDPRG7= <mlev>
##$CPDPRG8= <mlev>
##$CPDPRGB= <>
##$CPDPRGT= <>
##$D= (0..31)
0 1.2 0 0 0 0 0 0 0 0 0 0.03 0 0 0 0 0 0 0 0 0 0 0 0 0 0 0 0 0 0 0 0 
##$DATE= 1559733752
##$DBL= (0..7)
120 120 120 120 120 120 120 120 
##$DBP= (0..7)
150 150 150 150 150 150 150 150 
##$DBP07= 0
##$DBPNAM0= <>
##$DBPNAM1= <>
##$DBPNAM2= <>
##$DBPNAM3= <>
##$DBPNAM4= <>
##$DBPNAM5= <>
##$DBPNAM6= <>
##$DBPNAM7= <>
##$DBPOAL= (0..7)
0.5 0.5 0.5 0.5 0.5 0.5 0.5 0.5 
##$DBPOFFS= (0..7)
0 0 0 0 0 0 0 0 
##$DE= 6
##$DECBNUC= <off>
##$DECIM= 24
##$DECNUC= <off>
##$DECSTAT= 4
##$DIGMOD= 1
##$DIGTYP= 9
##$DL= (0..7)
0 120 120 120 120 120 120 120 
##$DP= (0..7)
150 150 150 150 150 150 150 150 
##$DP07= 0
##$DPNAME0= <>
##$DPNAME1= <>
##$DPNAME2= <>
##$DPNAME3= <>
##$DPNAME4= <>
##$DPNAME5= <>
##$DPNAME6= <>
##$DPNAME7= <>
##$DPOAL= (0..7)
0.5 0.5 0.5 0.5 0.5 0.5 0.5 0.5 
##$DPOFFS= (0..7)
0 0 0 0 0 0 0 0 
##$DQDMODE= 0
##$DR= 18
##$DS= 0
##$DSLIST= <SSSSSSSSSSSSSSS>
##$DSPFIRM= 0
$$ [...]
##$SUBNAM2= <"">
##$SUBNAM3= <"">
##$SUBNAM4= <"">
##$SUBNAM5= <"">
##$SUBNAM6= <"">
##$SUBNAM7= <"">
##$SUBNAM8= <"">
##$SUBNAM9= <"">
##$SW= 24.9336996594482
##$SWIBOX= (0..15)
0 0 2 0 0 0 0 0 0 0 0 0 0 0 0 0 
##$SW_h= 4990.01996007984
##$TD= 16384
##$TD0= 1
##$TE= 0
##$TE2= 300
##$TE3= 300
##$TEG= 300
##$TL= (0..7)
0 120 120 120 120 120 120 120 
##$TP= (0..7)
150 150 150 150 150 150 150 150 
##$TP07= 0
##$TPNAME0= <>
##$TPNAME1= <>
##$TPNAME2= <>
##$TPNAME3= <>
##$TPNAME4= <>
##$TPNAME5= <>
##$TPNAME6= <>
##$TPNAME7= <>
##$TPOAL= (0..7)
0.5 0.5 0.5 0.5 0.5 0.5 0.5 0.5 
##$TPOFFS= (0..7)
0 0 0 0 0 0 0 0 
##$TUNHIN= 0
##$TUNHOUT= 0
##$TUNXOUT= 0
##$USERA1= <user>
##$USERA2= <user>
##$USERA3= <user>
##$USERA4= <user>
##$USERA5= <user>
##$V9= 5
##$VALIST= <valist>
##$VCLIST= <CCCCCCCCCCCCCCC>
##$VD= 0
##$VDLIST= <DDDDDDDDDDDDDDD>
##$VPLIST= <PPPPPPPPPPPPPPP>
##$VTLIST= <TTTTTTTTTTTTTTT>
##$WBST= 1024
##$WBSW= 4
##$XGAIN= (0..3)
0 0 0 0 
##$XL= 0
##$YL= 0
##$YMAX_a= 58552
##$YMIN_a= -126507
##$ZGOPTNS= <>
##$ZL1= 120
##$ZL2= 120
##$ZL3= 120
##$ZL4= 120
##$ABSF1= 10
##$ABSF2= 0
##$ABSG= 5
##$ABSL= 3
##$ALPHA= 0
##$AQORDER= 0
##$ASSFAC= 0
##$ASSFACI= 0
##$ASSFACX= 0
##$ASSWID= 0
##$AUNMP= <proc_1d>
##$AZFE= 0.1
##$AZFW= 0.1
##$BCFW= 1
##$BC_mod= 2
##$BYTORDP= 1
##$COROFFS= 0
##$CY= 11.3945322036743
##$DATMOD= 1
##$DC= 2
##$DFILT= <>
##$DTYPP= 0
##$F1P= 18.9103706918063
##$F2P= -1.10871071338519
##$FCOR= 0.5
##$FTSIZE= 0
##$FT_mod= 4
##$GAMMA= 1
##$GB= 0.15
##$INTBC= 1
##$INTSCL= 1
##$ISEN= 128
##$LB= 0.24
##$LEV0= 0
##$LPBIN= 0
##$MAXI= 10000
##$MC2= 0
##$MEAN= 0
##$ME_mod= 0
##$MI= 1.114404
##$NCOEF= 0
##$NC_proc= 0
##$NLEV= 6
##$NOISF1= 3.799351
##$NOISF2= 2.8
##$NSP= 1
##$NTH_PI= 0
##$NZP= 0
##$OFFSET= 15.70392
##$PC= 1
##$PHC0= -8665.63
##$PHC1= 23.40018
##$PH_mod= 1
##$PKNL= yes
##$PPARMOD= 0
##$PSCAL= 0
##$PSIGN= 0
##$REVERSE= no
##$SF= 200.130013532006
##$SI= 16384
##$SIGF1= 3
##$SIGF2= 2
##$SINO= 400
##$SIOLD= 16384
##$SREGLST= <1H.CDCl3>
##$SSB= 0
##$STSI= 0
##$STSR= 0
##$SW_p= 3612.71676300578
##$SYMM= 0
##$S_DEV= 0
##$TDeff= 0
##$TDoff= 0
##$TI= <>
##$TILT= no
##$TM1= 0
##$TM2= 0
##$TOPLEV= 0
##$USERP1= <user>
##$USERP2= <user>
##$USERP3= <user>
##$USERP4= <user>
##$USERP5= <user>
##$WDW= 1
##$XDIM= 8192
##$YMAX_p= 0
##$YMIN_p= 0
$$ End of Bruker specific parameters
$$ ---------------------------------
##NTUPLES= NMR FID
##VAR_NAME=  TIME,          FID/REAL,        FID/IMAG
##SYMBOL=    X,             R,               I
##VAR_TYPE=  INDEPENDENT,   DEPENDENT,       DEPENDENT
##VAR_FORM=  AFFN,          ASDF,            ASDF
##VAR_DIM=   8192,          8192,            8192
##UNITS=     SECONDS,       ARBITRARY UNITS, ARBITRARY UNITS
##FACTOR=    0.0002004,     1,               1
##FIRST=     0,             0,               0
##LAST=      1.6414764,     0,               0
##MIN=       0,             -126507,         0
##MAX=       1.6414764,     58552,           0
$$ Real data points
##PAGE= N=1
##DATA TABLE= (X++(R..R)), XYDATA
0 0 0 0 0 0 0 0 0 0 0 8 -8 8 -8 8 -16 16 -24 24 -32 32 -40 48 -56 64 -72 80 -93 104 -120 136 -152 171
32 171 -192 215 -239 267 -296 329 -365 404 -448 496 -548 608 -673 747 -832 926 -1034 1160
50 1160 -1308 1491 -1708 1986 -2349 2848 -3581 4763 -6998 12781 -61050 -126507 -51075 -11501
64 -11501 27671 28407 19037 -18046 -55405 -89116 -88685 -65530 -26963 973 20157 23876 17988 -3604
78 -3604 -28096 -45131 -39738 -21552 -672 13410 24450 29639 26996 12605 -3923 -11624 -5500
91 -5500 4833 12581 17936 25093 30543 28562 17494 6669 4463 9036 11816 11189 12755 18871 23578
106 23578 21040 12645 7390 8949 11397 8873 4750 6213 12437 16114 12917 7656 7884 11879 11997
121 11997 6629 2800 5643 11431 13309 10363 8939 12935 16849 14461 8442 6488 10220 13992 13197
136 13197 10555 12354 17843 19499 14460 9010 9122 12233 12556 9036 7591 11559 16223 14643 8443
151 8443 4715 6080 7323 4336 5 201 5206 7891 3951 -1561 -2575 -469 -1072 -5961 -9423 -6825
167 -6825 -1579 -1093 -5573 -8560 -6749 -4592 -7018 -11787 -12854 -8186 -4055 -5364 -8730 -8407 -5080 -4263
183 -4263 -7668 -11076 -9486 -4683 -2900 -5508 -6996 -4202 -1117 -2379 -6768 -8438 -5103 -1683 -3042
198 -3042 -6347 -5844 -2026 -616 -4053 -8226 -8178 -4621 -3534 -6953 -9593 -7382 -3904 -4474 -8904 -11477
214 -11477 -9651 -6863 -8053 -11972 -12461 -8732 -6339 -8565 -12119 -12229 -8926 -7359 -10119 -12670 -10606
229 -10606 -6279 -5148 -7770 -9478 -7172 -3494 -3364 -6185 -6606 -2831 657 304 -1731 -1264 2242 4607
245 4607 3103 872 2563 6570 8067 6124 4922 7064 10444 10535 7453 6214 9216 12244 11205 8265
261 8265 7940 10967 13127 10975 7446 7571 10676 11705 9055 6306 7214 10011 10282 6919 4330 5833
277 5833 8167 7245 3996 2749 4650 6637 5111 1759 1126 3535 4516 2214 -438 -2 2536 3073
293 3073 425 -1848 -624 1819 1297 -1630 -2844 -975 1138 172 -2685 -3163 -757 682 -1290 -3723
309 -3723 -3338 -825 68 -2037 -4193 -3142 -501 -559 -3183 -4610 -3049 -722 -1099 -3733 -4591 -2448 -418
326 -418 -1834 -4241 -4276 -2014 -683 -2146 -4332 -3731 -1005 -437 -2532 -4011 -2718 -557 -414 -2578 -3633
343 -3633 -1663 466 -293 -2507 -2643 -547 852 -245 -2202 -1766 677 1636 -242 -1610 -392 1677
359 1677 1871 -46 -1220 519 2731 2020 -79 -459 1642 3075 2022 -80 -129 2215 3392 1740
375 1740 -159 563 2630 3135 1376 -138 794 2803 2664 697 -183 1173 2594 1937 106 -460 1128
392 1128 2215 899 -956 -557 1044 1340 -159 -1679 -1079 678 588 -1476 -2527 -1333 56 -509 -2379
409 -2379 -3080 -1712 -525 -1651 -3489 -3403 -1763 -1209 -2544 -4075 -3723 -1994 -1686 -3486 -4593 -3441 -1961
426 -1961 -2188 -3837 -4588 -3285 -1771 -2383 -4118 -4285 -2755 -1553 -2470 -3857 -3662 -2024 -1212 -2305 -3579
443 -3579 -2695 -1125 -909 -2001 -2614 -1623 -195 -193 -1510 -1609 -171 899 254 -692 -385 1152 2038 1116 101
462 101 913 2514 2853 1775 1178 2037 3602 3715 2443 1955 3347 4509 4114 2899 2788 4087 5107
479 5107 4414 3139 3305 4745 5254 4182 3302 3664 4890 5085 3916 3008 3892 4874 4535 3335 2923 3729
497 3729 4491 3885 2783 2655 3725 4055 3242 2295 2614 3527 3718 2708 1916 2547 3597 3337 2165 1795
515 1795 2571 3392 2950 1753 1525 2533 3106 2341 1233 1338 2220 2470 1496 382 671 1550 1307 117
533 117 -669 -423 157 -320 -1672 -2479 -1961 -1626 -2472 -3890 -4273 -3882 -3843 -4822 -6120 -6448 -5903 -6077 -7188
552 -7188 -8162 -8181 -7776 -8086 -9054 -9706 -9252 -8800 -9289 -10050 -10161 -9368 -8990 -9351 -9964 -9614 -8441 -7892 -8385 -8615
572 -8615 -7809 -6467 -5930 -6251 -6296 -5157 -3780 -3384 -3676 -3276 -2051 -909 -520 -690 -352 918 1975 1984 1909
591 1909 2599 3588 4190 4093 3915 4421 5406 5597 5104 5057 5728 6127 6083 5529 5377 5976 6338 5811 5153 5141 5595
612 5595 5621 5115 4592 4589 5047 4982 4265 3933 4293 4638 4412 3853 3512 4040 4458 4182 3517 3628 4254 4445 4107
633 4107 3693 3798 4480 4755 4206 3792 4098 4635 4603 4086 3706 4013 4358 4175 3497 3238 3426 3503 2993 2489 2102
654 2102 2187 2127 1406 706 600 612 113 -567 -1097 -1302 -1265 -1771 -2580 -2915 -2812 -2855 -3360 -3921 -4060 -3920 -3774 -4346
676 -4346 -4800 -4532 -4072 -4126 -4518 -4669 -4308 -3743 -3581 -4007 -3986 -3380 -2833 -2781 -2901 -2792 -2406 -1757 -1761 -2037 -1809 -1332
698 -1332 -1164 -1229 -1329 -1226 -942 -868 -1252 -1445 -1223 -1225 -1536 -1897 -2166 -2119 -2260 -2542 -3133 -3480 -3264 -3523 -4072 -4470
720 -4470 -4584 -4573 -4691 -5149 -5519 -5421 -5239 -5449 -5684 -5707 -5420 -5210 -5145 -5247 -5038 -4439 -3966 -3905 -3704 -3152 -2452 -1833
742 -1833 -1461 -1240 -526 407 961 1310 1850 2546 3296 3880 4249 4595 5286 5992 6245 6551 6909 7317 7627 7860
762 7860 7876 8128 8449 8389 8265 8230 8332 8210 8063 7611 7328 7339 7187 6543 6097 5796 5588 5265 4677 4107 3747
783 3747 3554 3190 2499 2064 1865 1596 1242 778 245 174 64 -279 -641 -876 -950 -1004 -1185 -1446 -1568 -1533 -1484 -1702
805 -1702 -1852 -1693 -1791 -1792 -1821 -1963 -1979 -1829 -1980 -2026 -1997 -1994 -2085 -2160 -2256 -2348 -2270 -2334 -2621 -2835 -2633 -2722 -2840 -3097 -3186 -3258
831 -3258 -3209 -3327 -3583 -3624 -3485 -3524 -3605 -3665 -3726 -3627 -3437 -3572 -3576 -3466 -3276 -3179 -3037 -2920 -2792 -2530 -2366 -2272 -2100 -1766
855 -1766 -1547 -1372 -1107 -893 -710 -367 -196 40 310 602 623 825 1131 1236 1387 1483 1485 1666 1882 1910 1830 1847
877 1847 1937 2037 1990 1875 1763 1748 1877 1809 1576 1449 1424 1384 1363 1148 936 975 940 806 707 637 490 470 368 334
901 334 250 334 180 204 260 249 132 226 243 210 375 414 263 370 524 554 552 486 624 641 779 757 716 758 879 823
927 823 760 770 785 838 891 746 614 777 784 688 595 546 428 532 489 253 187 186 197 103 109 -109 -143 -79 -140 -293 -205 -335
955 -335 -442 -443 -387 -466 -469 -499 -545 -449 -388 -419 -560 -485 -417 -381 -379 -508 -500 -377 -283 -299 -342 -339 -278 -154 -105 -221 -278 -54 -36
984 -36 -104 -126 -106 19 117 54 -43 -34 109 138 45 108 38 24 143 194 30 161 175 163 180 220 189 180 188 208 160 337 186
1013 186 126 158 237 218 142 204 35 96 217 107 80 64 98 55 7 -101 -178 -22 -70 -180 -234 -188 -266 -206 -363 -476
1039 -476 -410 -349 -407 -573 -554 -564 -633 -600 -665 -746 -711 -636 -731 -753 -696 -760 -730 -749 -811 -805 -740 -840 -900 -710 -776 -880 -815 -875
1067 -875 -799 -761 -726 -862 -876 -708 -659 -706 -754 -746 -658 -534 -501 -688 -630 -520 -403 -419 -439 -450 -386 -197 -208 -240 -192 -112 -107
1094 -107 107 29 34 110 249 268 286 394 414 442 587 645 672 768 839 849 913 1062 1061 1031 1221 1198 1287 1355 1265 1415 1513
1121 1513 1497 1504 1519 1530 1543 1660 1682 1652 1647 1761 1707 1614 1668 1652 1615 1683 1542 1510 1512 1568 1523 1443 1304 1220 1250 1196 1098 927
1149 927 911 851 749 719 532 418 398 202 273 55 27 -185 -225 -246 -409 -512 -639 -774 -817 -896 -993 -1138 -1223 -1222 -1329
1174 -1329 -1338 -1483 -1537 -1571 -1465 -1606 -1694 -1694 -1652 -1663 -1657 -1748 -1765 -1719 -1556 -1604 -1603 -1581 -1549 -1474 -1270 -1344 -1374 -1296 -1152 -1115 -1027 -946
1202 -946 -1013 -892 -789 -757 -795 -740 -719 -757 -639 -719 -772 -664 -560 -668 -712 -695 -733 -686 -724 -807 -808 -785 -880 -913 -823 -888 -913
1229 -913 -867 -888 -905 -819 -844 -821 -776 -696 -697 -600 -466 -434 -326 -162 -63 -30 112 307 417 518 648 808 1035 1196 1309
1254 1309 1314 1584 1783 1884 1999 2132 2185 2360 2533 2589 2592 2659 2766 2828 2900 2807 2778 2820 2791 2785 2712 2623 2516 2463 2398 2219
1280 2219 2127 2027 1813 1719 1673 1441 1257 1176 1016 818 786 566 307 275 159 1 -125 -295 -366 -440 -464 -693 -764
1303 -764 -780 -830 -901 -975 -1105 -1104 -1055 -1049 -1200 -1193 -1185 -1214 -1231 -1259 -1297 -1301 -1204 -1263 -1363 -1355 -1323 -1389 -1331 -1421 -1475 -1485 -1465 -1521 -1531 -1559 -1565 -1614
1335 -1614 -1569 -1593 -1675 -1656 -1684 -1729 -1661 -1581 -1662 -1666 -1650 -1633 -1531 -1474 -1437 -1462 -1259 -1230 -1155 -1078 -993 -830 -739 -572 -547 -406 -287
1362 -287 -62 -10 78 279 397 537 588 594 773 938 1080 1018 1118 1210 1251 1324 1322 1284 1371 1427 1311 1367 1334 1229 1201 1134
1388 1134 1087 1076 949 904 740 706 614 588 414 399 279 343 239 91 -24 -25 0 8 -62 -244 -185 -99 -87 -123 -149 -122
1414 -122 -52 98 115 58 153 222 315 344 446 440 614 669 666 755 782 867 901 876 897 926 988 1021 973 964 979 944 821 862 743
1443 743 669 712 660 495 467 429 282 183 209 50 -17 -183 -235 -311 -319 -411 -624 -605 -604 -698 -712 -830 -923 -972 -817 -916 -984
1470 -984 -963 -1014 -953 -887 -947 -1006 -876 -902 -909 -888 -851 -840 -703 -715 -766 -683 -606 -601 -574 -514 -496 -479 -503 -443 -383 -385 -340 -365 -355 -309
1500 -309 -283 -292 -287 -325 -278 -187 -208 -298 -286 -144 -209 -148 -145 -148 -21 -25 -72 -154 -121 -48 -2 115 -14 13 190 193 195 200 273 298 376
1531 376 382 385 399 452 548 512 558 556 542 591 621 631 645 666 582 608 655 567 604 552 536 503 498 459 372 416 419 360 326 264 281 209
1563 209 121 108 67 71 59 44 -12 -88 -77 -126 15 -156 -171 -165 -145 -101 -136 -250 -241 -169 -119 -233 -201 -246 -221 -183 -143 -198 -212
1592 -212 -168 -162 -140 -172 -188 -146 -126 -92 -171 -112 -177 -222 -42 -68 -94 -148 -130 -93 -29 -80 -129 -159 -48 -25 0 -64 -83 -40 48
1621 48 4 30 3 17 28 29 125 26 69 163 132 26 109 142 171 134 162 159 135 251 207 177 194 178 206 228 162 75 107 228
1651 228 164 72 138 105 76 103 -31 -1 87 -7 -11 16 -13 -110 -52 -70 -128 -105 -78 -107 -204 -137 -173 -142 -147 -247 -257 -132 -192
1680 -192 -274 -254 -197 -117 -194 -217 -246 -223 -143 -213 -291 -175 -220 -112 -187 -184 -201 -174 -168 -164 -165 -228 -163 -160 -51 -147 -174 -67 -79 -52
1710 -52 -82 -69 -57 -130 -34 -87 -78 3 -46 -34 4 52 -8 37 28 -9 54 122 -25 -4 60 56 76 80 153 131 149 75 87 208 168
1741 168 141 219 113 148 168 213 199 27 179 182 218 159 156 100 206 179 119 101 151 114 174 155 146 91 132 167 39 111 109
1770 109 79 60 67 -5 56 82 14 21 111 107 8 -21 59 69 113 21 -31 -17 120 6 32 -38 21 18 94 23 -35 -27 21 -10 -39
1801 -39 5 -17 34 46 -19 5 26 -15 -3 -69 -78 -56 -3 -2 -47 -47 -40 -110 -67 -103 -94 -100 -78 -140 -103 -79 -139 -127 -138 -177 -195 -171 -183
1834 -183 -260 -170 8 -149 -184 -161 -130 -151 -111 -216 -163 -129 -121 -168 -213 -124 -144 -100 -110 -149 -148 -89 -70 -40 -36 -104 -44 -60 -75 -58
1864 -58 -30 14 -75 23 -28 -79 -88 -33 11 -40 78 41 -56 10 63 32 14 25 6 93 112 58 16 57 72 91 60 68 32 127 163
1895 163 27 69 108 171 129 151 137 119 121 163 23 155 131 101 150 150 91 188 182 85 141 152 104 69 58 65 18 54 94 58
1925 58 17 90 22 -37 -75 -14 37 10 -35 -75 -26 -31 -40 -150 -67 -55 -56 -81 -177 -184 -56 -79 -77 -101 -183 -45 18 -78 -156 -98 -75
1956 -75 -30 -50 -18 -60 -13 13 -42 -69 19 -22 -1 38 39 39 28 122 87 91 78 73 102 40 148 114 128 62 31 82 78 41 -16 -31
1988 -31 -59 6 -13 -53 -37 -12 -39 -47 -137 -28 -76 -81 -69 -182 -70 -52 0 -103 -118 -94 -121 -89 -85 -105 21 -51 -14 -30 -44
2017 -44 -37 -14 11 26 46 14 -11 2 64 46 42 40 13 30 61 10 -50 -48 22 80 6 -12 -34 -2 35 15 -23 -50 19 -63 -72 -106 -77
2050 -77 -54 -55 -110 -125 -103 -20 -92 -100 -106 -136 -107 -41 -31 -20 -12 -87 -9 82 -5 29 82 33 -4 42 82 103 117 148 185 143 212 142
2082 142 75 221 167 165 215 146 230 164 117 115 148 180 128 49 56 12 122 113 -13 -56 23 -25 -87 -76 -117 -112 -129 -91 -145 -80 -102
2113 -102 -133 -183 -128 -172 -142 -154 -185 -188 -109 -77 -165 -184 -97 -118 -43 -57 -113 -52 84 -14 -11 -14 33 46 20 50 71 131 188 84
2143 84 94 151 125 157 94 81 103 177 154 82 50 85 88 3 68 -4 20 92 1 9 -93 -4 48 -27 -51 -41 -28 11 -81 -131 -16
2174 -16 1 -45 -85 -154 -55 18 -36 -117 -46 11 18 -11 -48 -100 -23 106 -26 -39 21 99 19 15 31 42 129 103 27 74 60 82
2204 82 88 38 12 71 115 21 -31 -17 34 -3 -28 -11 45 55 106 -49 -14 47 88 -5 -4 -80 -53 10 -96 -142 -78 -19 -7 -55
2234 -55 -151 -61 11 31 -140 -104 -94 -17 -91 -126 -110 -59 38 -22 -81 -102 -45 27 -25 -104 -97 -18 -15 -72 -96 -55 -34 -24 -6 -134
2264 -134 -48 74 -9 -49 -75 -13 -24 -5 -94 -93 -46 32 32 -62 6 81 -32 -41 -67 17 99 23 -66 -101 -22 77 -10 -89 -62 100
2294 100 63 8 -24 -66 53 91 -44 -86 -53 3 -29 -59 -71 -33 84 5 18 -68 42 100 51 -66 35 129 82 -48
2320 -48 22 102 94 155 112 6 106 186 155 125 106 162 182 181 71 103 226 229 152 99 193 273 280 153 82 161 267 245 74
2349 74 97 148 235 185 96 44 169 224 79 -10 87 117 145 66 -3 -85 91 62 -112 -156 -80 -49 -29 -77 -176 -109 -92 -84 -156
2378 -156 -239 -100 -43 -199 -290 -249 -39 -110 -222 -243 -169 -110 -158 -223 -291 -209 -40 -119 -206 -304 -164 -127 -185 -308 -228 -179
2404 -179 -9 -182 -249 -190 -101 -39 -267 -258 -207 -121 -92 -229 -192 -81 -86 -114 -212 -186 -79 45 -104 -196 -91 -35 33 -43
2430 -43 -182 -78 28 7 -102 -113 35 143 50 3 -30 116 213 59 -54 -15 175 141 52 2 103 180 235 83
2454 83 18 189 232 237 108 129 276 322 221 63 209 262 299 232 117 211 254 342 209 172 225 280 225 177 103 269
2480 269 279 214 108 128 280 303 139 77 109 164 273 49 -10 161 238 206 64 -51 81 229 96 -45 -42 43
2504 43 95 62 -115 -69 19 99 -78 -150 -64 117 81 -93 -95 -13 0 46 -100 -161 -66 -31 -44 -188 -184 -86 -70 -167 -265 -243
2532 -243 -52 -135 -247 -297 -291 -172 -226 -357 -418 -269 -189 -301 -504 -452 -350 -277 -426 -533 -477 -362 -360 -487 -501 -470 -353
2557 -353 -328 -402 -501 -424 -231 -290 -323 -445 -206 -112 -186 -209 -264 -6 142 12 -33 16 220 228 124 122 274 463 402 285
2583 285 285 426 532 448 310 437 484 616 473 350 432 513 532 396 252 324 423 453 157 112 256 320 244 80
2607 80 8 114 106 0 -174 -164 -20 20 -84 -255 -170 -52 -108 -264 -341 -227 -39 -120 -212 -273 -96 -23 -67 -213 -117
2632 -117 31 85 42 -66 -19 117 160 73 53 200 247 257 177 131 227 331 366 138 152 301 333 286 97 129 165 248
2658 248 167 39 10 185 99 -64 -124 -81 94 -82 -302 -250 -116 -27 -152 -301 -332 -221 -97 -232 -358 -334 -203
2681 -203 -236 -326 -384 -246 -96 -117 -194 -190 -113 -121 -129 -120 -177 -56 19 -19 -184 -132 30 68 -92 -91 -86 40 116 -71 -98 -31 183
2710 183 -12 -112 -179 -58 18 -41 -228 -251 -100 -117 -201 -305 -229 -171 -104 -194 -359 -281 -138 -132 -249 -221 -211 -98 -93 -236
2736 -236 -199 3 31 44 -81 -23 167 241 96 54 164 284 334 290 229 289 434 412 330 248 370 503 349 272 320
2761 320 419 470 304 273 270 448 331 226 120 187 270 277 51 -63 24 114 8 -132 -175 -72 -21 -179 -272 -274 -96
2786 -96 -106 -274 -336 -225 -195 -136 -264 -322 -252 -106 -166 -242 -238 -212 -90 -95 -227 -169 -54 -1 -90 -125 -67 93 130 16 -57
2813 -57 75 140 107 23 -6 93 218 150 49 36 142 216 56 5 93 108 151 63 -76 -2 118 127 -18 -93 -36 115
2839 115 2 -87 -146 13 21 -62 -114 -127 53 1 -63 -125 -105 38 95 22 -120 -10 51 116 -26 -43 -28 143 61 -77
2865 -77 -29 84 124 49 -43 -18 49 84 22 -72 -87 40 80 -15 -77 -48 59 78 -50 -114 -27 -41 -78 -150 -134 -58 -39 -154
2893 -154 -228 -68 -41 -110 -192 -196 -130 -1 -105 -107 -215 -149 -81 -184 -173 -233 -162 -80 -135 -217 -214 -81 -85 -218 -253 -178 -61 -54
2921 -54 -168 -176 -116 -41 -126 -141 -97 -41 56 -53 -68 -69 73 42 60 -3 76 187 179 111 75 137 215 221 139 185 261 299 281 171
2951 171 190 315 339 253 272 282 305 331 200 235 183 274 292 196 144 216 262 235 20 30 120 147 106 56 51 40 100 -1
2979 -1 -102 -94 22 -46 -159 -166 -93 -20 -133 -143 -174 -136 -98 -85 -160 -131 -125 -115 -173 -168 -151 -75 -17 -98 -207 -7 -2 2 -95 -53 14
3010 14 97 70 -55 26 2 120 89 -35 9 67 116 55 -92 58 73 40 -1 -48 -30 47 53 -65 -118 -32 -29 -91 -140 -190
3038 -190 -108 -104 -79 -168 -181 -93 -186 -177 -266 -167 -140 -135 -211 -196 -146 -26 -136 -214 -217 -102 -75 -125 -187 -144 -73 -21 17 -106 -63 -19
3068 -19 -5 -63 -159 -27 26 87 -1 -84 1 58 80 18 -1 56 73 23 10 28 94 155 106 -7 34 85 103 77 97 120 126 177
3098 177 104 65 168 97 163 67 90 218 173 136 109 118 234 156 186 177 136 90 249 143 92 254 133 142 87 128 145 171
3126 171 108 24 112 152 156 124 31 84 69 105 56 32 54 81 42 17 48 10 27 19 -18 -9 17 22 -34 -111 -92 -53 -61 -32 -17 -49
3158 -49 -90 -107 -118 -137 -98 -93 -52 -174 -141 -47 -138 -105 -117 -143 -204 -93 -167 -116 -100 -105 -77 -119 -183 -39 15 -52 -64 -119 -88 -104
3188 -104 -61 -43 -53 -27 -48 -78 -121 -23 -3 -26 6 -14 6 14 -11 -5 -37 48 43 -77 -42 -69 -32 -74 -116 -76 -99 -54 -92 -96 -162
3219 -162 -121 -62 -104 -116 -152 -101 -96 -106 -191 -118 -49 -110 -116 -131 -125 -64 -94 -64 -86 -74 -21 100 8 34 74 103 164 136 163 210 183
3250 183 251 302 245 326 282 281 316 334 368 378 296 378 364 327 320 320 347 301 334 218 226 188 176 209 122 92 35 34 69 -11 -84 -100
3282 -100 -162 -89 -144 -181 -193 -219 -259 -271 -312 -278 -223 -295 -364 -309 -270 -207 -250 -300 -272 -245 -169 -206 -237 -124 -123 -73 -92 -77 -15 -42
3312 -42 -7 -21 43 84 44 65 97 42 100 224 186 112 143 128 174 105 168 116 141 140 92 85 97 65 58 55 18 14 -29 -15 -68 -15
3344 -15 -35 -36 -66 -138 -140 -137 -52 -118 -106 -162 -88 -84 -118 -105 -113 -64 -54 -73 -73 9 -3 5 -69 -53 -20 -8 39 41 43 0 -17 43 36 64 36
3379 36 -1 60 -24 29 117 -38 17 -33 -15 15 -67 -52 -25 -66 -29 -94 -100 -106 -49 -128 -116 -146 -99 -97 -173 -84 -137 -69 -105 -58 -93
3410 -93 39 -47 -37 -52 -19 19 29 71 56 104 155 85 72 92 130 131 98 177 63 131 176 174 101 158 136 245 213 128 180 128
3440 128 242 99 95 160 137 128 93 42 70 60 88 -21 9 -18 28 -46 -46 -56 -50 -63 -85 -98 -74 -98 -121 -83 -144 -99 -102 -144 -106
3471 -106 -110 -42 -79 -75 -104 -134 -14 16 -51 -163 -71 22 -72 -4 -51 -2 -15 15 34 -51 21 0 -24 -84 -42 -98 -5 -96 25
3500 25 -53 -18 -19 -52 -27 -36 -45 30 -73 -77 -57 -14 -95 -93 -51 -29 -37 -4 -30 -26 49 5 14 -67 4 -7 17 13 13 75 45 20 47 -71
3534 -71 19 74 60 3 2 44 97 41 -25 -52 43 85 -11 -11 43 -57 37 32 -11 28 -31 -3 15 29 -43 -8 -45 -26 28 46 -36
3565 -36 22 -28 19 -30 35 2 -29 -60 -65 -28 -42 -76 39 47 25 -11 -85 -9 -44 -23 -23 -96 -38 -53 -46 -44 -85 -111 -107 -29 -63 -6 -20
3598 -20 -26 -68 -68 20 -42 33 13 14 23 -44 2 82 73 52 35 118 85 80 105 122 146 183 177 171 150 165 164 156 143 193 174 146 138 163 215 152
3634 152 153 127 196 65 143 130 34 100 30 18 14 4 -36 -71 -79 -99 -120 -124 -96 -220 -150 -171 -228 -166 -133 -229 -216 -202 -168 -219 -217
3665 -217 -202 -209 -212 -182 -202 -194 -121 -197 -208 -136 -125 -139 -104 -38 -72 -70 -39 19 17 4 22 9 120 99 95 33 63 121 71 101 138 105
3697 105 71 100 151 91 49 109 99 19 106 23 79 56 61 34 -27 43 6 5 42 -5 -23 -27 -30 -116 -59 -56 -27 -59 -33 -47 -14 -21 -64
3730 -64 54 35 -78 -26 -44 -9 -6 55 -2 -37 -7 19 -25 13 83 29 -21 3 24 41 8 47 15 -29 53 0 -11 9 -30 -90
3760 -90 -1 33 43 57 40 -4 -60 -11 38 -117 41 6 -24 -30 -7 26 -19 93 7 45 -1 41 -19 37 68 10 33 -14 52
3789 52 59 38 37 42 55 -64 22 -13 42 22 1 46 52 -46 -18 11 70 28 21 16 77 -6 -31 6 -23 13 12 -24 9 -25 32 -13 -22 -26
3823 -26 -110 -43 -53 -21 -57 -10 -32 -80 13 9 -63 -40 -22 -81 3 -80 -47 -88 -80 -36 -70 8 -53 -37 16 -7 -4 21 52 34 -12 9
3855 9 -57 -12 48 -33 46 25 -24 1 21 48 37 39 51 -17 35 8 52 48 -17 76 14 42 0 4 29 5 67 -54 49 78 25
3886 25 76 -44 8 -48 -33 23 8 -63 -84 -45 -143 -38 -55 -26 -40 -10 -74 -115 -46 -55 18 -66 39 -54 -4 2 -46 -43 -47 3 -15
3917 -15 22 62 56 44 88 112 64 55 68 129 68 162 128 105 68 160 90 112 113 153 149 137 187 40 33 104 126 103 25 86 71 14
3949 14 24 19 -34 -11 -2 -75 -74 -16 -17 -97 -62 -120 -173 -125 -147 -101 -158 -108 -140 -208 -145 -102 -113 -173 -106 -86 -82 -119 -116 -58 -73 -80 -57 15
3983 15 -60 -21 -10 -30 31 6 -8 56 70 62 54 72 39 30 108 80 33 36 17 4 69 37 62 34 61 59 97 -31 -10 11 11 -83 19
4016 19 -44 29 -25 -59 31 12 -53 -23 -59 -56 -41 -124 -62 -94 -65 -10 -29 -47 12 29 -36 48 18 61 71 49 16 -21 15 36 47
4047 47 10 92 39 3 118 15 61 90 74 -1 51 1 18 41 0 -22 11 -36 -2 -9 -97 32 -22 2 -85 -35 -45 -26 -36
4076 -36 -10 -39 -20 -40 9 9 -83 -44 -21 -8 -15 -29 -64 -59 13 41 5 15 70 25 -12 -47 7 55 67 34 73 20 40 67 94 80
4108 80 62 10 19 -9 72 37 15 43 98 48 86 -3 58 24 -30 -15 -25 10 -10 14 -13 27 8 -5 30 2 28 27 11 -42 36
4139 36 12 23 6 -29 -15 34 25 -68 -9 24 2 -12 -27 -36 14 -91 10 9 -89 -59 -44 -5 5 -5 -77 -74 -135 -79 -53 -58 -83 -104
4171 -104 -22 -82 16 -15 -46 -93 -78 -72 -55 -45 31 -18 -31 -48 -60 -5 -2 -24 2 76 16 -37 -5 33 3 129 41 91 2 86
4201 86 56 38 87 26 108 40 79 43 18 39 25 24 36 2 58 71 39 -22 25 45 81 15 20 -1 30 76 31 -1 -54 37 20
4232 20 -3 -57 -13 -11 -2 -19 -101 16 -77 -68 -78 42 -9 -42 -22 -13 -41 -47 -34 -36 -67 -54 1 -28 -71 -55 -50 -57 -115 -84 -77 -80 -22 -38
4266 -38 -44 -118 -106 1 -18 -43 -41 -10 -86 -24 -75 -28 0 -54 7 -94 -9 -35 20 25 40 87 41 48 51 47 22 77 97 62 58 56 26
4299 26 82 85 63 81 57 72 62 107 69 55 31 94 91 16 49 81 19 69 47 -19 1 -57 2 -37 -30 -58 -55 -111 -80 -105 -93 -99 -137
4332 -137 -123 -168 -74 -116 -144 -116 -164 -80 -111 -63 -121 -134 -108 -125 -74 -22 -64 -72 -48 -35 -16 -62 14 -40 27 40 -8 85 24 -2
4362 -2 23 19 18 39 65 17 80 95 92 95 46 62 46 28 49 47 41 51 38 15 17 -1 33 54 5 -32 -77 -7 -7 -37 48 -56 6 -34
4396 -34 -59 1 -24 27 -20 -55 -43 -59 -80 33 -18 -13 -39 -34 32 -76 35 76 51 -28 11 -15 -25 -56 -73 -32 -4 -14 15 -8
4426 -8 -15 31 66 0 -4 -68 20 15 43 19 -1 4 -22 23 55 28 -13 0 29 41 31 -6 7 31 24 -16 -20 -26 -68 8 74 7 -54 -8
4460 -8 23 -14 -3 47 -26 -28 69 21 -7 -56 -79 -37 -83 -20 64 59 103 20 31 10 -41 -27 -10 -8 29 9 -14 -31 -22 -9 10 -61 -86
4493 -86 27 58 -7 -75 28 18 -23 -22 -92 -51 -10 -37 -25 -73 18 -21 -46 -11 42 -15 -4 -51 -11 6 -63 21 11 -38 -26 -3
4523 -3 -9 79 26 68 -25 -7 -25 9 9 24 18 7 28 -83 34 -24 -1 47 -14 -58 10 13 11 -2 -7 -53 -17 -11 27 130 17 13 -61
4556 -61 55 54 32 -50 41 32 -35 -30 -47 31 -66 47 4 -40 -6 -14 -30 -2 25 -32 22 -26 33 5 16 27 17 23 -60 13 -34 -1
4588 -1 45 -38 -45 21 -8 9 50 23 46 -27 8 52 12 -27 19 21 35 75 -1 67 41 25 -13 28 98 32 21 62 -27 51 -33 -23
4620 -23 57 -12 32 51 -1 -26 7 -38 44 16 -13 -6 -30 -39 -30 -29 -62 -4 23 19 -27 8 -2 -49 -26 12 -38 4 -15 -54 -35 -37 -77
4653 -77 15 -50 24 -33 -49 -9 -85 -45 -26 -18 -26 40 5 56 -112 29 48 -23 36 0 13 6 15 33 -5 -7 7 57 -6 18 2 23
4685 23 -32 -72 -21 -27 -9 -40 5 -33 -25 18 12 -55 25 52 -4 18 -38 16 -18 52 -15 2 22 12 -2 -5 -1 47 -3 -10 30 -39 49
4718 49 36 -13 -46 -11 18 -52 32 -15 -53 -36 -22 20 58 -33 -49 18 -2 -32 39 2 8 48 32 -56 -8 0 -1 -17 -22 -33 -44 -30
4750 -30 55 12 -3 -18 -82 2 -58 -68 -19 -27 -55 -32 6 -20 -7 -21 -61 3 9 7 -22 -117 -25 25 -57 -39 4 8 -29 31 -41 -48 -42
4783 -42 5 9 31 -51 33 -20 52 69 -23 -45 42 12 -8 -27 -30 -27 3 -49 -41 27 36 -11 37 58 -19 -83 24 40 52 -21 -5 63
4815 63 10 -5 30 32 9 -9 34 -52 -26 7 -26 -3 -54 12 -9 -38 -35 -59 -50 7 -7 -65 -56 -59 -89 -4 -58 -48 -56 -46 -19 -66 13
4848 13 -43 0 35 -2 3 -16 -35 26 -93 -7 -26 -21 35 -18 18 -8 -23 27 58 84 -8 65 31 37 104 70 19 23 63 69 49 54 26
4881 26 30 7 -1 28 -19 21 35 33 -2 9 -52 0 -6 16 -22 7 25 -13 -44 -2 -28 -49 -34 -22 0 -11 10 22 -12 -29 -22 -74 -28
4914 -28 -9 -9 -37 -22 -33 -99 2 30 13 -50 -13 81 45 -47 -5 -18 -77 -54 -6 -49 -19 -35 -49 -63 -46 35 86 -52 2 1
4944 1 46 0 8 51 5 24 16 -34 -6 -35 -69 -1 -10 11 -21 43 -35 -62 -25 -15 2 31 8 55 -23 9 -34 46 49 -3 78 21 -41
4977 -41 96 5 96 -20 2 96 62 26 -24 -3 23 -15 13 53 -43 -32 14 -38 15 -21 -15 -54 -7 4 -3 -104 -25 -18 -75 36
5007 36 10 -33 -47 -105 -128 -67 -22 -54 -54 -65 18 -4 36 -69 24 -30 -58 -27 -6 -60 -46 -14 -36 26 24 -67 0 60 25 51 20
5038 20 6 -8 -7 34 83 67 56 4 91 -77 15 -67 -6 -17 -6 7 -7 34 27 -21 9 35 29 19 -131 -7 -11 23 -18 15 -22
5069 -22 10 -50 -20 43 -42 -28 -27 -13 -38 -98 1 -36 -11 -6 -6 -7 93 2 -35 -40 27 -23 -35 -34 -67 13 -11 -27 25 -9 -31 -16 -36
5102 -36 -101 57 -64 -29 -23 49 10 -17 -35 51 -21 40 -24 80 -82 -22 26 13 -6 5 -12 20 16 30 -70 -46 -15 17 -20
5131 -20 -40 25 -15 -3 -69 -41 -7 80 -45 -17 13 10 -7 -7 -4 12 3 38 9 51 6 22 -20 50 -53 -3 -3 6 44 -63 -35 -9
5163 -9 48 -19 19 27 9 -16 32 -23 -54 -58 -56 1 31 -12 -22 -1 15 -54 -2 -48 14 2 -57 -32 13 -69 -69 -9 -53 -6 -23 5 -16
5196 -16 -25 5 -24 4 47 11 22 -5 -31 -25 7 -14 -27 -22 -13 -78 7 24 0 17 -21 -1 6 -47 14 -22 22 0 6 -33 37 -31 70
5229 70 -40 -30 -25 -77 -1 23 65 -15 -26 24 11 -5 -18 -18 5 -3 -19 -15 29 48 -85 11 95 -31 -45 6 30 37 57 -8 60
5260 60 7 8 7 -10 -23 60 9 14 -5 3 8 -10 12 -34 22 -14 25 -54 -24 25 -41 8 -1 -23 -11 -2 -50 38 -54 -48 64 -20 -40 -38
5294 -38 31 27 -16 5 -5 -39 -52 41 25 -3 14 43 -55 24 7 23 5 -22 -31 -2 -15 -11 -1 -47 -33 -44 -45 -37 -16 -10 -3 -36 47 34
5328 34 -46 -45 -42 -6 9 -30 -37 8 6 6 17 3 -20 -4 -39 -41 32 5 -4 -15 -9 47 -6 17 16 -18 -56 28 -17 -27 2 -14 19 -86
5362 -86 21 -25 60 -46 41 75 68 -11 50 48 5 -9 -7 -7 -19 -45 -46 -3 40 51 -2 -10 9 -19 8 -62 10 3 62 26 23 -25 5
5395 5 5 -25 -30 18 45 1 69 -18 2 14 0 -22 10 31 91 -17 -18 55 -16 -13 -15 -24 -22 33 -8 -7 8 -25 -9 54 -70 -17 82 24
5429 24 -30 -51 -20 -3 -14 -8 -56 -29 18 45 2 -11 -49 -63 -2 22 15 3 15 44 -45 -9 -82 34 22 -12 -24 33 -4 -11 -5 -1
5461 -1 107 45 -16 77 30 -21 -41 -47 -55 -34 21 77 22 -39 9 -62 -18 -42 89 31 -40 1 -20 26 -47 -49 -36 -5 38 6 3 -20
5493 -20 -100 -36 -39 -5 -36 -23 -25 -69 -5 -55 26 -53 -41 -41 -18 -62 8 -35 1 -43 33 1 5 21 66 -107 -28 23 -48 34 -23 51
5525 51 -29 -4 -22 -9 -68 -33 30 -7 24 -8 -52 -29 -26 24 -79 -30 26 47 9 -54 12 95 -25 1 -18 53 39 14 -62 24
5555 24 31 -8 -3 44 30 -7 14 3 25 -27 17 -41 12 -13 -17 32 -4 17 -74 -38 -75 -36 -16 -26 -15 -1 49 -10 23 -60 19 -46
5587 -46 3 -24 -21 36 5 -34 -15 35 -31 -5 26 28 -1 -14 54 49 -9 29 -23 19 24 -7 24 -37 -4 67 -12 38 -35 -56 -25 -18 8
5620 8 27 22 -52 -18 -36 29 -13 -4 18 -10 11 -16 -24 -43 -44 -23 0 -23 35 -41 -14 2 12 -64 -38 -9 14 -11 -30 -42 -1 19 -19
5653 -19 50 -53 17 -45 3 28 -6 -39 -70 3 81 15 -13 -42 7 -14 64 -15 24 -45 34 -12 0 -31 -16 -32 -2 -19 6 12
5683 12 -64 5 4 -34 -20 10 1 -6 9 23 -24 11 41 -10 -2 -49 -10 -48 -45 -82 16 23 -4 -8 16 -10 -37 -15 -5 -11 31 38 13 -15 28
5718 28 -48 0 27 8 -7 -48 1 11 2 -104 12 95 18 25 -47 -54 -11 2 45 -13 39 -13 36 4 59 7 -57 32 28 49 -4
5749 -4 -20 2 -16 -14 -31 43 62 29 -6 -38 29 -10 -2 -24 -56 37 0 -57 33 -16 -30 43 12 -41 23 45 19 39 42 -12 -44 40
5781 40 7 49 -35 1 -9 -12 19 -14 20 -9 -74 -11 11 -24 43 22 -6 10 -28 24 -2 49 3 2 -19 9 -41 -5 -10 27 -13 -5
5813 -5 -18 55 50 26 5 -6 25 9 -8 32 29 -13 -15 -26 -5 -65 -2 -45 34 34 14 32 -53 35 -41 -21 5 12 -37 45 71 -25 7
5846 7 43 -86 -45 -14 12 -31 -12 -38 11 4 -62 10 17 -4 -23 -2 18 -3 4 40 -18 -57 20 5 37 -16 13 57 -21 9 22 34
5878 34 25 -34 18 23 -18 -9 43 64 11 9 -43 4 31 -23 18 -92 -47 -9 22 26 -82 16 -12 -21 -16 15 -101 -56 11 90 35 -27
5910 -27 -9 -43 43 -19 2 19 -44 -12 93 -16 -23 35 -38 -70 -15 4 -40 -46 67 -22 31 39 -25 -1 6 35 -10 10 28 12 -20
5941 -20 -38 67 -42 -13 8 -19 -20 33 -16 -42 37 16 20 -6 30 -7 16 30 3 -31 -30 31 -27 -3 -40 -46 -4 13 -53 18 45
5972 45 13 12 0 3 12 30 -42 13 29 -22 -17 -37 6 -44 -18 -18 22 52 30 35 14 -16 -10 -7 26 5 -25 2 -43 33 -71 -67 -9 3
6006 3 10 -92 30 32 2 20 -10 -48 -10 0 0 22 12 9 19 -53 -46 -34 19 1 -24 -19 14 9 16 -6 14 -17 22 7 2 13 -15 -52
6040 -52 2 -12 -45 63 -25 -25 46 23 54 -12 47 -60 68 -26 -43 -11 -62 -12 1 78 -35 -1 30 12 -1 -54 -89 1 -51
6069 -51 0 -18 -40 30 -78 19 39 20 0 17 21 -15 32 8 -2 8 21 16 0 -5 -8 -3 -4 -37 -25 11 -95 -33 41 -5 10 -10
6101 -10 -16 35 9 67 17 -12 0 -29 -13 -58 -52 17 23 38 -45 13 27 23 12 -13 -49 -55 -52 -54 -11 -1 20 24 -34 -59 -13 -1 2 -38 -4
6136 -4 -12 -3 -36 -40 -6 2 18 13 -37 12 89 -26 4 -36 44 -35 11 37 8 3 -10 -27 -17 3 -15 7 28 2 6 -12 58 19 2 3
6170 3 -23 -12 -8 -28 19 18 35 -32 8 -50 13 -14 -32 -10 11 57 -8 8 22 -7 46 37 27 24 -79 18 48 -32 18 19 13 1 -19
6203 -19 4 3 16 11 -33 9 6 1 8 -3 -11 4 51 -43 -50 8 6 -6 -26 -20 -6 27 43 12 39 -26 -67 31 -13 -21 23 33 -57 35 -44
6238 -44 -77 17 -38 36 62 18 -65 25 -20 -27 -19 88 -10 13 -6 -45 -46 -44 -14 38 4 -9 -16 -7 27 20 0 3 -43 14 -42 8 3 64
6272 64 1 -126 28 33 30 -2 11 20 66 -12 33 3 -14 -47 -37 -20 -14 45 12 5 -22 -10 55 -19 63 -15 4 -37 21 -44 5 -17
6304 -17 9 -24 -9 9 -32 33 43 -65 -6 19 -24 -49 -8 -83 -6 -2 -52 6 -7 7 -28 1 33 13 -55 -4 -26 -4 -8 10 -28
6335 -28 4 -15 1 -12 15 1 -3 -2 -19 -14 -52 -23 -1 37 -9 19 -2 4 58 30 -31 -13 -21 13 5 -35 3 -75 2 -80 -24 -5 18
6368 18 -56 -6 -63 20 20 42 29 1 65 3 -41 -94 9 16 1 -27 -56 15 -53 -46 -6 -20 7 29 18 68 -8 -50 -5 -50 -7
6399 -7 -100 24 -44 -31 73 -42 13 -23 11 -15 -2 -17 46 48 -19 31 -59 -4 21 -23 33 -63 -44 23 -6 -7 22 -26 40 0
6429 0 19 1 46 34 -21 22 -54 34 -26 -38 -25 -50 -7 48 -45 -2 -21 -3 -19 -6 53 -4 -28 72 58 -13 -21 -23 -45 -45 -18 14
6461 14 -23 55 35 102 -16 22 0 10 -48 -28 18 25 40 28 -41 -12 34 -44 -54 -7 5 -73 14 -34 -33 19 -19 -40 26 -32 -6
6492 -6 -32 47 49 17 -54 -23 -31 41 -2 -2 -43 10 9 20 30 6 -9 -66 -44 9 -7 -22 -40 39 -25 -56 33 -40 42 -15 13 3 -4
6525 -4 -22 48 -27 -67 47 -38 14 39 16 9 49 -22 -78 -2 35 25 -3 31 28 -33 34 -14 -13 -6 -7 -9 -11 24 17 34 -4 -49 29 -3
6559 -3 -9 -10 42 -29 -31 64 -18 59 -36 -28 -4 14 -28 -9 -65 6 35 21 7 -17 -47 -44 -16 12 -14 34 -14 26 -10 26 61 -47 22
6592 22 -26 31 -57 -28 -23 39 -103 -18 -53 -9 41 -33 2 2 16 3 44 29 5 -72 -13 -49 11 -27 18 -35 -55 -20 -48 29 31
6623 31 29 46 -56 5 2 -39 -22 -1 34 20 -55 32 -30 -9 -31 -50 -16 -37 10 -6 28 -28 -42 -16 -2 19 6 50 34 55 4
6654 4 -8 18 -28 5 29 31 33 -29 -9 -65 -21 -18 -46 29 -19 7 18 -44 2 36 28 -13 34 6 -19 5 32 5 -35 -55 26 27 1
6687 1 44 28 -32 -26 -29 7 -1 16 49 15 -11 -23 16 -15 -27 -30 -10 2 -7 -5 39 67 20 26 31 -5 42 -3 79 23 25 6 12 11 -32 -61
6723 -61 49 35 21 8 27 42 9 13 0 80 -40 -21 -7 30 -38 -5 -32 -16 19 -10 11 44 -35 12 34 -3 49 22 14 -4
6753 -4 -39 -21 -35 32 -13 -22 28 -50 -58 -10 15 26 8 -1 -22 -65 -25 -12 -23 39 5 32 -36 13 -10 6 0 -38 25 19 -78 -6 38
6786 38 47 -44 -4 -2 59 -37 -45 -67 -8 -43 -29 -1 -28 35 42 5 -17 -10 20 -37 16 -19 -5 -30 -13 -28 -23 -6 60 -27 -71 21 10
6819 10 16 8 -13 15 -26 1 23 -72 -5 -43 39 90 21 -18 22 -48 -23 15 -2 -3 17 -31 -54 34 -48 11 -9 21 28 -55 -94 2
6851 2 13 -5 -47 -1 -10 89 17 -21 2 26 -16 -15 33 -26 -70 -72 -30 14 -42 -16 17 6 -24 -45 6 34 -13 -24 -27 24 29 20 7 -14
6885 -14 -4 -30 2 50 12 18 -80 35 59 13 -15 8 56 13 9 -54 8 -4 9 39 -8 1 -20 -13 31 -17 9 -28 -57 -66 21 53
6917 53 -2 -29 22 -2 -16 60 -74 -53 -43 14 -34 -25 68 -19 -15 9 -15 37 -4 60 -17 -56 -83 -32 -42 -44 -35 20 -9 -50 -35 -37
6949 -37 10 56 -11 34 -23 -89 -32 -2 -49 -25 12 -17 -38 -11 -34 -1 9 27 10 -40 15 -4 34 15 21 -24 -50 34 -30 -24 0
6980 0 -5 -47 -6 -35 43 -42 -44 66 49 -23 -22 6 -27 20 15 -13 12 28 -4 -5 36 36 19 1 -9 28 20 9 21 -18 14 29 -8 16
7014 16 -54 -3 -25 29 36 12 -2 -17 -11 -9 28 -27 -34 -25 -10 -34 28 32 45 9 -21 12 0 12 -20 -7 -10 0 -16 -36 12 -7 47 -111
7048 -111 -55 18 63 26 9 29 24 -8 11 0 -10 -65 4 4 -45 -61 28 -14 -28 -12 -23 34 8 26 14 -4 23 -13 20 -31 -21
7079 -21 45 -28 45 19 14 47 4 49 44 24 26 53 -19 -25 2 44 -20 2 -26 -22 2 42 23 -10 28 11 14 12 -15 -6 -4 -19 85 -25
7113 -25 -16 -49 -34 -58 -48 6 0 -30 27 -10 13 -1 18 -8 48 -17 12 63 28 -55 -40 23 9 -19 -16 -1 -4 43 -20 28 26 -19 -9
7146 -9 4 63 33 -17 54 -38 -38 -15 -3 -39 28 -5 2 22 43 57 -27 -18 -5 -74 -32 37 12 -5 -34 -43 -27 13 18 33 -41 14 3
7179 3 -42 76 12 -55 -2 3 -32 -8 -25 -10 -33 -46 -17 21 1 -2 -20 -11 22 -100 41 21 -41 86 -94 10 -2 -44 23
7208 23 -33 -34 -42 -15 44 69 59 -17 7 45 42 -34 2 -6 3 47 -5 -50 19 -18 -8 -27 -61 15 -38 31 -23 13 -12 -72 -18 45 15
7241 15 -30 -25 -13 2 -34 -57 2 43 11 -8 -28 -13 -17 -22 -48 52 -12 0 11 45 -84 -27 1 21 44 3 -11 9 -27 28 -5
7272 -5 -39 -2 51 -11 42 7 10 -11 -45 -43 -23 23 -24 -24 9 17 5 -24 -4 -21 58 80 12 3 -46 -37 11 -7 -38 -31 -53 -1 10 28
7306 28 -2 33 -31 -20 9 -29 -11 -11 -14 -9 17 4 -76 -34 46 -41 41 14 -25 13 5 2 -8 0 -58 35 73 -27 18 43 -14 -28 33
7339 33 5 24 35 5 -26 -20 14 30 -29 31 -47 -58 21 25 -18 4 -23 0 35 16 3 -17 -27 30 -32 7 10 -8 -2 52 -27 -40
7371 -40 -29 -47 -24 -1 71 -80 -15 21 -27 -19 -5 12 23 9 -49 -20 -118 42 -35 -26 18 11 9 15 29 -1 9 -15 -23 86 -30
7402 -30 -40 -15 -23 0 4 -26 59 -13 -36 26 94 37 45 -8 -28 23 -5 24 2 -43 -53 -2 25 -10 -42 23 -54 19 -20 -20 1 -27
7434 -27 -64 2 -24 7 -90 54 -63 -34 34 -17 -11 -26 -38 -4 -26 -39 -82 30 49 -79 -52 -67 -42 44 -4 14 -13 19 -50
7463 -50 -69 -21 -53 15 18 10 49 42 -13 -51 -42 25 -22 10 13 17 -41 20 20 -16 46 -34 53 -12 15 -9 9 41 29 6 -27 2 18 -25
7497 -25 -52 7 -6 24 55 -9 -28 -39 -28 52 -33 19 8 49 -43 28 42 45 -30 0 63 6 2 7 -34 -9 18 20 1 -58 -45 -8
7529 -8 36 -34 -28 -28 -7 20 -39 43 -19 -39 -15 -1 -62 2 -38 -14 18 4 -24 -51 -17 -36 54 -23 7 -43 16 -41 -36 12 2 -11
7561 -11 -40 12 -8 -42 -35 31 45 -18 -31 35 52 49 41 -4 -19 -6 26 -30 43 6 -19 -68 14 8 21 -14 14 21 -27 -32 43 18 -33
7594 -33 -76 -23 -43 -9 -48 -19 -5 -6 -7 9 41 -31 -63 -23 28 -22 -8 -13 25 -3 52 -72 -16 -3 29 3 -11 -62 12 -2 -37
7625 -37 7 6 34 -48 20 31 -24 -74 -21 50 3 15 -20 -8 27 -9 -4 30 13 -9 58 -56 -4 -2 -7 24 -18 73 8 -18 -37 -33
7657 -33 -19 9 -25 17 -5 39 44 0 28 -28 -2 -4 -6 -5 13 -22 -46 73 -5 11 44 22 22 11 0 45 8 41 -12 6 -21 10
7689 10 -48 -12 16 -35 -21 -35 37 -10 14 5 -22 7 11 13 25 -9 -15 15 69 90 -15 -5 -64 -63 49 2 -17 -23 -51 -16 -36 11
7721 11 10 31 -10 -38 -58 -54 -57 71 56 52 -6 -44 -15 57 -1 -15 -8 -23 -17 30 -17 -26 27 5 -5 -9 -1 -8 15 7 34 -5 -27 22 35
7756 35 51 16 -22 -49 -43 13 -59 -61 -62 -25 -17 3 -46 18 -41 -42 -15 37 -11 70 16 -7 23 -17 54 -23 15 -24 27 -4 -15 -9 9
7789 9 -5 -47 2 52 -58 5 -14 85 22 -35 33 -16 -9 -20 -39 -3 20 -41 -36 33 -3 17 -44 58 10 44 -60 -66 -16 28 21
7820 21 -11 8 65 6 29 16 72 26 -17 -37 -15 14 -1 8 33 -8 -4 -10 -47 4 10 -42 -4 40 -13 41 32 15 27 -8 12 -26 -47
7853 -47 -3 7 0 -35 9 7 11 -28 28 -64 -39 48 21 -22 -8 37 0 54 -55 -10 32 -65 42 -5 31 8 21 -40 -6 36 -39
7884 -39 -12 -58 -11 32 -38 5 9 -73 2 -16 -11 -4 -23 -45 -12 -36 45 -26 -16 34 12 -8 -61 -26 -20 -5 -28 4 -27 69 -42 -54
7916 -54 9 22 -33 -26 -1 -41 -41 12 -30 17 53 23 -76 -9 39 -16 -34 -2 22 22 -6 -39 -50 -23 -93 -31 0 1 45 3 23 55
7948 55 -29 -30 40 -30 28 -10 -15 -28 -17 12 -14 -40 1 -30 -22 36 48 22 62 25 -5 -9 45 -54 51 -57 10 -4 -44 8 -2
7979 -2 -11 -7 18 -32 -35 30 -18 17 26 -21 50 29 19 -22 -32 -50 -52 -10 -32 6 55 6 15 -10 25 -35 -26 -15 59 21 45 4 -4 23 -57
8014 -57 -32 13 -7 37 30 -4 61 40 1 58 17 -11 -26 -9 -9 -60 0 -32 -19 -6 41 31 -27 12 -9 -7 -18 -86 60 6 -64
8045 -64 -59 -7 -34 -35 19 -17 -9 -61 -41 -74 21 14 33 -8 -6 -1 10 21 4 -1 -30 -16 -16 -15 52 3 10 -36 -35 5 -23 -44 -74 -49 -5 24
8081 24 -14 25 -18 -14 -29 -68 16 -35 46 -2 -18 3 14 -8 -44 84 -13 -61 -74 50 -11 -42 -57 14 -51 31 -30 37 16 -5
8111 -5 -10 12 16 -27 -23 -26 76 30 -30 -48 17 -24 21 27 30 -34 15 6 -30 -38 -4 8 26 -23 -8 32 2 5 25 10 63 23 0 -52 -22
8146 -22 34 19 19 -14 -5 -44 64 23 9 52 -57 34 -6 -23 -54 9 -85 -65 60 48 -10 -38 41 23 35 5 -65 0 -37 38
8176 38 -47 -9 -43 48 30 -47 28 -17 -32 23 21 35 -4 -39 32
8191C2
$$ Imaginary data points
##PAGE= N=2
##DATA TABLE= (X++(I..I)), XYDATA
0 0 0 0 0 0 0 0 0 0 0 0 0 0 0 0 0 0 0 0 5 -6 8 -8 8 -8 8 -9 14 -15 16 -17 21 -22 25 -30 31 -37 39 -44 49 -54 60
41 60 -67 73 -81 90 -100 111 -124 140 -156 178 -201 232 -272 325 -401 513 -703 1089 -2169 11500
61 11500 53141 58552 43564 18474 -1197 -14987 -18442 -8683 16375 43663 56928 48926 30443
74 30443 13026 2763 -2370 -640 11004 30903 45696 44447 29454 13042 1915 -4178 -7483
87 -7483 -4589 7399 22857 28959 20583 5537 -5890 -12225 -16975 -19779 -15514 -2944 9069 9887
101 9887 107 -10414 -16295 -20026 -24557 -26220 -19665 -6619 2093 133 -7494 -12419 -13991 -17033 -21716
116 -21716 -22172 -13560 -1615 3440 -26 -4333 -4729 -5109 -9183 -14198 -13099 -4453 4118 5369 1932
131 1932 852 2376 1010 -4903 -9536 -6962 399 4462 2391 398 2329 4029 494 -6186 -9030
146 -9030 -5167 -65 40 -2682 -2006 1979 2969 -1796 -7301 -7371 -2710 -179 -2403 -3936 -319 4501
162 4501 4232 -652 -3820 -1282 3016 2854 -221 419 5884 9832 7915 3686 3116 6743 8863 6180
178 6180 3345 5841 10876 12250 8936 5966 7224 9906 8916 4564 2961 6523 9611 8029 4074
193 4074 3088 5585 6544 2679 -1806 -1274 2487 3317 -156 -3156 -1886 1085 221 -4605 -7402 -4823
209 -4823 -1605 -2546 -6018 -6679 -3470 -975 -3261 -7259 -7237 -3403 -1463 -3694 -5863 -3948 116 1266
225 1266 -2035 -4228 -1790 1925 1907 -982 -1483 1840 5219 4492 1131 584 3842 5824 3872 1344
241 1344 2317 5473 6768 4219 1614 2837 5517 4901 1532 30 2196 4578 3366 -185 -1283 1336
257 1336 2729 46 -3487 -3420 -477 547 -2147 -5211 -4344 -1361 -1299 -4800 -7191 -5424 -2627 -2885 -5999
274 -5999 -7305 -4856 -2370 -3841 -6823 -7053 -4450 -2584 -4130 -6512 -5788 -2561 -1503 -3899 -5740 -4194
290 -4194 -1377 -1072 -3453 -4554 -2218 561 -228 -2753 -3058 -516 1355 95 -2174 -1811 1185 2430
306 2430 321 -1612 -340 2280 2596 302 -1179 624 3369 2915 249 -476 1747 3707 2677 162
322 162 -61 2523 4215 2440 196 885 3449 4109 2090 292 1455 4010 4049 1600 653 2456 4317
339 4317 3663 1348 832 2865 4423 3042 871 1268 3401 4156 2438 652 1306 3511 3670 1487 240
356 240 1764 3443 2873 726 -24 1734 3290 2022 -298 -106 1952 2824 1092 -865 -397 1768 2258
373 2258 81 -1606 -490 1478 1362 -711 -1963 -610 1200 495 -1719 -2145 -494 634 -467 -2208
389 -2208 -2199 -605 239 -1271 -2888 -2144 -398 -413 -2130 -3069 -1956 -410 -796 -2721 -3239 -1619 -313 -1287
407 -1287 -3028 -2986 -1320 -204 -1612 -3131 -2577 -682 -388 -1894 -2910 -1903 -213 -209 -1952 -2736 -1130
424 -1130 385 -321 -1893 -2156 -547 790 -160 -1857 -1606 224 1033 -209 -1383 -838 781 1332 -102
441 -102 -1078 -131 1315 1152 -232 -700 474 1685 1094 -286 -299 1126 1820 701 -289 185 1425 1757
459 1757 448 -543 334 1728 1417 22 -520 444 1560 1043 -404 -840 609 1435 394 -916 -799
476 -799 520 1097 -43 -1272 -792 609 735 -571 -1331 -591 515 453 -735 -1287 -251 752 321 -783
494 -783 -778 209 959 430 -584 -264 1056 1367 499 -86 603 1632 1700 765 351 1294 2232 1886 800 724
514 724 1724 2413 1738 595 620 1803 2160 1052 88 418 1332 1338 194 -713 -282 625 158 -1171 -1659
533 -1659 -1030 -575 -1122 -2281 -2660 -1875 -1422 -2374 -3408 -3230 -2447 -2245 -2918 -3726 -3428 -2368 -2282 -3042 -3274
552 -3274 -2537 -1738 -1730 -2250 -2178 -1234 -307 -547 -869 -352 726 1309 1056 869 1493 2804 3084 2454 2476 3379 4344
573 4344 4346 3666 3551 4451 5311 4996 3957 3988 4761 5104 4421 3636 3493 3931 4136 3150 2387 2340 2599 2223 1289
594 1289 529 570 752 158 -845 -1400 -1212 -1215 -1870 -2718 -3016 -2690 -2653 -3373 -4008 -3917 -3483 -3623 -4118 -4418 -4125
615 -4125 -3534 -3536 -4091 -4186 -3486 -2972 -3157 -3429 -3269 -2514 -1956 -2254 -2544 -2107 -1254 -1066 -1342 -1627 -1161 -441 -275
636 -275 -787 -1018 -515 18 -120 -647 -729 -377 5 -165 -842 -777 -406 -225 -637 -980 -920 -549 -374 -822 -1070
657 -1070 -746 -308 -452 -673 -660 -233 207 186 -87 236 948 1199 1082 1119 1543 2193 2527 2365 2371 2925 3544 3692
679 3692 3457 3566 4021 4558 4561 4117 4046 4606 4870 4478 4024 3915 4092 4114 3691 3182 2907 2934 2733 1966 1554 1218
701 1218 1108 738 39 -551 -678 -834 -1432 -2037 -2296 -2439 -2582 -3141 -3535 -3593 -3425 -3546 -3965 -4114 -3808 -3663
721 -3663 -3637 -3736 -3711 -3272 -2700 -2701 -2632 -2203 -1689 -1212 -924 -819 -327 450 836 927 1118 1663 2174 2560 2569 2647 2982
744 2982 3508 3608 3396 3352 3555 3676 3549 3257 2960 2983 2934 2577 2137 1852 1673 1247 864 432 68 -166 -583
765 -583 -1256 -1526 -1685 -2033 -2555 -2952 -3198 -3210 -3384 -3909 -4236 -4217 -4098 -4257 -4472 -4611 -4529 -4162 -4149 -4355 -4194 -3895
787 -3895 -3621 -3451 -3371 -3131 -2762 -2363 -2113 -2095 -1674 -1277 -1007 -740 -543 -323 58 401 453 556 885 1039 1187
808 1187 1213 1302 1415 1575 1614 1549 1669 1761 1633 1626 1620 1672 1662 1695 1443 1469 1674 1565 1379 1408 1456 1445 1506 1537 1333 1412
834 1412 1665 1616 1565 1575 1678 1803 1996 2012 1860 2073 2252 2287 2257 2299 2338 2452 2524 2452 2351 2485 2479 2391 2364 2278 2148
859 2148 2060 1940 1771 1658 1562 1289 1059 1010 780 494 333 85 -80 -184 -519 -858 -1063 -1119 -1253 -1517 -1788
880 -1788 -2012 -2058 -2024 -2191 -2419 -2528 -2506 -2478 -2574 -2632 -2812 -2654 -2623 -2568 -2546 -2447 -2388 -2365 -2173 -2079 -2023 -1866 -1721 -1691 -1446
905 -1446 -1259 -1285 -1104 -995 -765 -639 -602 -504 -414 -169 -112 -103 -69 20 80 182 176 142 251 334 201 252 256 240 319 310 215
932 215 104 184 326 156 147 107 140 223 231 85 53 222 250 189 175 111 152 341 352 204 332 345 377 394 432 482 465
959 465 537 523 639 760 637 569 582 750 708 717 720 687 793 884 686 649 675 666 647 645 611 542 650 660 544 427 469 444
987 444 495 454 324 288 349 287 245 158 194 197 138 138 122 127 95 46 4 49 30 21 13 -15 -51 73 -50 -155 -92 -20 -60 -161
1017 -161 -150 -195 -81 -60 -161 -254 -204 -102 -99 -139 -297 -308 -187 -177 -274 -287 -189 -181 -149 -187 -283 -271 -157 -195 -276 -254 -230 -153
1045 -153 -182 -186 -211 -248 -91 -160 -224 -143 -174 -206 -142 -83 -126 -94 -83 -239 -89 -39 -204 -218 -146 -61 -131 -73 -223 -181 -85 -46
1073 -46 -125 -227 -167 -88 -29 -80 -217 -113 10 -35 -79 -40 -121 -88 58 10 -168 -17 1 11 -5 1 11 48 85 64 56 134
1101 134 122 78 66 83 55 69 85 28 107 173 111 15 127 87 29 122 25 -44 72 140 -67 -3 39 18 -39 -97 -71 -169
1129 -169 19 -36 -154 -116 -135 -138 -100 -190 -300 -201 -170 -140 -246 -263 -264 -212 -151 -252 -446 -367 -309 -308 -282 -347 -394 -275 -284 -288 -280
1158 -280 -217 -307 -267 -111 -160 -202 -165 -62 -56 53 143 64 156 255 296 274 335 437 473 621 712 568 678 792 837 930
1184 930 890 786 948 1080 950 957 996 1030 1095 1085 1025 914 978 1007 877 839 801 642 617 633 409 280 304 193 127
1209 127 40 -103 -268 -233 -218 -478 -520 -570 -662 -704 -734 -809 -868 -862 -960 -962 -841 -844 -1002 -854 -799 -849 -767 -683 -628 -546 -465 -450
1237 -450 -386 -309 -200 -115 -15 124 82 219 374 388 390 399 465 517 600 564 545 582 611 518 520 435 347 425 396 241 84 165
1265 165 70 -56 -99 -281 -405 -429 -553 -642 -814 -836 -954 -897 -1013 -1133 -1194 -1231 -1251 -1243 -1276 -1342 -1330 -1294 -1204 -1217 -1120 -1077
1291 -1077 -1154 -998 -878 -796 -788 -646 -621 -470 -309 -324 -250 -117 28 150 177 268 366 492 599 541 594 741 862 855
1315 855 807 807 832 995 937 860 908 909 905 863 852 827 838 823 835 722 806 738 739 765 790 772 706 764 735 803 774 808 788 787 849
1346 849 835 928 892 864 1000 1031 955 951 967 1012 966 951 930 846 1096 931 786 675 606 669 667 433 290 199 207 128 -80
1373 -80 -159 -389 -395 -403 -573 -719 -872 -975 -1073 -1221 -1336 -1434 -1542 -1560 -1589 -1671 -1638 -1792 -1764 -1759 -1714 -1820 -1776 -1768 -1720 -1567 -1513
1400 -1513 -1529 -1407 -1349 -1238 -992 -974 -921 -850 -610 -434 -492 -340 -133 -20 109 114 220 337 476 491 508 630 615
1423 615 693 724 707 722 799 760 768 665 689 691 663 594 495 493 487 434 328 338 190 212 142 79 39 27 -6 -88 -72 -55 -35 -245
1453 -245 -166 -227 -74 -81 -35 -172 -150 -104 42 16 38 12 180 251 209 248 260 324 433 436 383 432 497 528 512 551 564 571 605
1482 605 642 512 524 575 550 461 483 492 410 389 413 300 327 239 254 206 201 171 94 77 59 26 17 14 -172 -25 1 15 -88
1511 -88 -111 -58 -42 -46 -130 -125 -65 2 -27 -108 -111 -159 -40 11 -153 -64 -27 -34 -96 -71 -49 -204 -52 -129 -168 -123 -161 -192 -201 -158 -280
1542 -280 -261 -269 -333 -302 -376 -292 -441 -381 -346 -379 -411 -430 -475 -408 -449 -458 -500 -449 -453 -464 -404 -491 -430 -403 -343 -406 -388 -322 -288 -270 -229
1573 -229 -246 -215 -192 -84 -56 -52 -66 -73 51 40 32 26 69 86 143 234 141 195 235 255 210 265 201 278 286 406 226 324 291 271
1603 271 309 340 292 277 256 269 266 365 311 240 353 342 280 248 232 307 245 277 224 220 227 226 207 200 236 128 251 178 126 83 113
1634 113 107 90 68 -11 48 102 127 -87 -24 17 -29 -60 -33 -80 -74 -104 -89 -56 -109 -136 -116 -82 -202 -186 -167 -180 -177 -230 -181 -239
1664 -239 -203 -128 -161 -167 -127 -145 -154 -101 -98 -57 -117 -35 -100 -14 -33 5 -89 -23 47 -3 -58 -51 54 62 11 -43 -8 99 74 -1 19
1695 19 23 44 122 17 40 105 13 45 147 12 53 85 170 40 103 67 7 59 74 42 101 115 47 46 131 107 18 45 69
1724 69 103 52 57 24 10 37 30 13 -32 -19 -48 -29 -48 -91 -149 2 -82 -105 -74 -55 -108 -103 -135 -227 -98 -138 -174 -120 -187 -235 -108
1755 -108 -124 -93 -234 -153 -189 -225 -159 -140 -187 -86 -124 -116 -71 -114 -132 -20 -37 -68 -36 -33 -60 -34 3 -1 5 20 88 101 134 80
1785 80 25 118 202 103 30 132 97 108 152 146 74 90 153 112 139 124 60 112 146 142 47 94 106 113 86 21 103 106 137 63 103 139
1817 139 16 4 90 70 72 68 64 56 73 54 45 -20 101 27 71 49 73 37 188 17 4 37 94 64 63 -8 -54 83 66 87
1847 87 -31 2 95 32 51 -84 -63 54 -10 9 26 -17 -52 -21 -60 -90 -55 7 -53 -49 -49 -141 -104 -59 -143 -128 -83 -59 -160
1876 -160 -132 0 -94 -115 -80 -117 -89 -68 -81 -144 -101 15 -49 -102 -106 -5 -76 -33 -70 -85 -57 -47 -30 -30 -68 -97 29 -14 -101
1905 -101 -38 -17 -82 -26 -6 -92 -56 25 -50 -6 -7 -61 -101 -71 -95 -39 -19 -83 -64 -52 5 -47 -38 -25 -65 -38 -31 -58 -8 10 23
1936 23 56 50 16 8 92 22 43 38 155 168 104 173 90 129 106 186 146 168 214 146 155 210 176 198 244 225 114 177 206 86 180
1967 180 140 155 165 94 41 65 76 32 6 24 12 12 -6 18 -126 32 -65 -169 -99 -63 -77 -115 -142 -153 -181 -122 -107 -152 -127
1996 -127 -119 -77 -50 -68 -225 -102 -36 -67 -108 -28 -56 -114 42 2 -55 60 -31 -18 54 48 -24 55 29 56 47 8 -38 -61 41
2025 41 48 -26 -103 -33 -13 -52 -47 -102 -96 -43 21 -24 -121 -78 -63 19 -75 -78 -92 -12 -42 80 5 -44 40 28 -5 5 82 160 43
2056 43 -8 75 107 107 100 96 98 182 140 226 135 184 148 229 85 114 173 209 163 45 169 123 180 43 69 78 107 16 18 2 27
2087 27 25 -21 -113 -157 -77 -69 -117 -159 -130 -164 -87 -92 -242 -255 -168 -166 -161 -205 -192 -154 -144 -153 -176 -148 -108 -68 -100 -89 26 17 -71 -23 23
2120 23 52 48 8 11 112 193 128 97 17 188 214 143 88 102 175 192 190 64 42 70 183 7 14 41 118 72 58 -70 -80
2149 -80 116 53 -95 -57 -42 -34 -85 -121 -138 -90 -41 -62 -118 -61 -40 -51 -116 -90 -150 -6 -10 -83 -46 38 75 57 24 68 18 59
2179 59 61 -70 17 135 130 113 88 24 159 171 17 -10 118 118 33 32 57 110 121 56 -66 -14 61 81 55 -73 -48 37 64
2208 64 -26 -112 -68 31 25 -83 -89 -29 37 -55 -84 -108 32 -75 -87 -115 -79 6 -51 -55 -123 -49 61 -63 8 -105 -23 38 40
2237 40 -97 -20 -27 44 -8 -64 14 64 35 28 -37 23 128 99 -79 -29 112 30 73 -14 -83 90 77 19 -33 -59 -39 103
2265 103 31 -7 -57 28 43 -52 -78 23 56 73 36 -48 70 109 10 -28 18 40 14 24 -103 -55 36 89 -32 -118 -66 53
2293 53 67 -112 -170 -51 80 8 -62 -62 -64 54 22 -88 -49 -17 86 -14 -98 -77 45 79 13 12 7 90 56 -58 -62 43
2321 43 83 34 -69 -47 83 142 48 -49 -58 76 50 -6 -81 -17 146 104 -25 -23 45 75 6 -123 -100 -11 91 -58 -136
2348 -136 -126 -29 47 -25 -109 -128 -36 38 -76 -174 -55 -64 -26 -156 -186 -102 -37 -35 -165 -142 -7 -25 -40 -104 -87 -41 32 -67
2376 -67 -129 -69 82 -10 -41 -34 39 140 60 -71 -36 56 155 58 10 11 157 247 92 -28 36 223 190 95 -28 81 233
2403 233 251 48 14 156 200 145 17 -9 129 175 160 19 56 156 153 42 -18 129 147 162 60 -43 125 160 72
2428 72 17 -1 34 75 57 -45 -30 55 90 35 -92 -49 59 116 -45 -105 -63 57 66 -63 -118 -58 190 40 -218 -81
2454 -81 -16 58 -50 -106 -116 7 -19 -98 -132 -126 -19 -4 -123 -190 -182 27 -55 -215 -214 -99 -61 -157 -271 -111 -109 -101 -61 -305
2482 -305 -205 -84 -108 -179 -216 -161 -66 -107 -119 -186 -88 -34 -30 -169 -138 7 15 -86 -149 -127 57 118 -39 -108 -4 131
2508 131 123 -17 -91 74 152 91 17 -75 105 146 149 -31 -3 152 125 118 -37 29 111 173 82 -85 9 170 68 -22 -77
2535 -77 51 152 48 -54 -40 57 146 6 -64 -14 100 136 68 -52 43 238 213 75 -5 174 254 303 136 101 271
2560 271 481 302 137 174 384 424 334 176 288 433 456 314 220 313 430 356 193 187 229 315 335 79 -8 130
2584 130 103 24 -115 -100 -36 -83 -207 -300 -278 -209 -244 -401 -517 -409 -359 -443 -577 -621 -420 -464 -486 -663 -690 -516 -392
2609 -392 -471 -624 -515 -393 -361 -388 -430 -382 -149 -204 -294 -312 -179 -74 -96 -121 -86 74 116 127 25 93 280 308 229
2634 229 165 300 313 322 238 131 313 319 309 161 160 222 343 220 102 99 215 260 70 -80 11 168 130 -102 -110 -74
2660 -74 72 79 -140 -169 -85 26 6 -134 -153 66 50 -32 -70 -76 69 216 27 -66 73 268 168 113 72 160 285
2685 285 263 114 69 262 364 177 81 76 248 271 128 53 43 235 191 21 -38 -4 89 25 -82 -154 -50 39 -50
2710 -50 -261 -201 -48 -8 -138 -235 -230 -53 -18 -178 -227 -195 -36 -82 -163 -201 -67 65 18 -56 -58 45 145 57 52 5 195
2737 195 248 140 38 123 249 220 55 72 162 239 161 92 90 128 132 84 -28 -106 63 82 -78 -188 -180 -72 -28 -253
2763 -253 -384 -261 -148 -204 -326 -395 -323 -202 -351 -399 -415 -326 -175 -321 -376 -396 -138 -201 -209 -315 -278 -44 -98 -204
2787 -204 -226 -19 56 62 -32 25 47 227 157 4 106 216 219 125 144 162 320 298 244 143 229 317 241 273 187 241 328
2814 328 258 89 117 206 191 196 103 44 159 214 111 -45 41 207 90 59 -39 -30 93 76 -40 -84 20 103 4 -63
2840 -63 -54 50 143 18 -141 -15 136 72 -9 -66 -14 81 167 -28 -31 80 161 65 -44 -18 -8 95 -44 -127 -56 31
2866 31 48 -25 -89 -159 -17 -17 -109 -142 -51 -38 -72 -119 -113 -105 -29 -23 -131 -173 -113 -25 -124 -183 -171 -44 -48 -57 -177 -91 -6 -11 -153
2897 -153 -117 -40 38 67 -135 -131 10 77 2 -136 -23 88 160 6 -47 -52 65 155 -30 33 102 179 193 85 32 185
2923 185 225 171 31 87 146 192 115 69 104 186 192 124 148 169 199 250 154 43 144 192 99 26 42 187 173 71 -25 -2
2951 -2 114 90 11 -68 -97 -2 -61 -185 -197 -126 -164 -136 -279 -290 -152 -189 -178 -289 -317 -215 -166 -284 -340 -328 -265 -167 -322
2978 -322 -278 -268 -173 -194 -230 -228 -147 -46 -76 -85 -187 -61 -23 -23 -2 14 79 81 48 60 35 184 247 80 51 227 189 140 149
3007 149 125 203 247 233 155 184 229 221 195 117 142 122 194 74 51 -1 164 111 22 84 -3 132 40 42 -13 58 145 61 33
3036 33 -17 46 61 -39 -60 -13 82 84 21 17 45 88 67 12 112 110 182 115 52 72 93 111 103 11 120 114 138 19 78 49 121
3067 121 127 29 -21 60 107 79 8 -26 -18 35 -5 -88 -107 -19 6 -93 -101 -147 -33 -41 -150 -174 -145 -8 -74 -153 -133 -104 -43 -92
3097 -92 -106 -139 -90 -38 -131 -164 -131 -110 -60 -168 -158 -74 -70 -153 -153 -117 -156 -89 -158 -161 -149 -81 -97 -64 -131 -164 -93 -119 -83 -175 -169 -27
3129 -27 -50 -89 -181 -39 -60 -38 -92 -67 -40 11 -59 -32 -55 -24 11 -4 -5 -23 74 45 25 39 -4 60 98 24 47 82 100 74
3159 74 27 10 133 187 121 174 87 200 247 142 129 158 215 203 188 144 212 316 199 171 219 209 226 215 237 98 226
3186 226 242 132 92 114 202 240 136 90 21 182 135 107 59 -2 39 72 3 0 0 16 -43 -95 -38 -77 -41 -148 -78 -154 -62
3215 -62 -70 -154 -121 -96 -65 -78 -83 -146 -89 -31 -36 -149 -78 -49 -13 12 -35 0 11 -14 41 -17 58 104 -12 80 88 81 95 100 67 -13
3247 -13 48 21 51 56 32 -23 39 44 -156 25 -46 -147 -156 -158 -165 -143 -133 -190 -246 -172 -297 -292 -275 -295 -295 -262 -283 -344 -273 -301 -229 -338
3279 -338 -315 -353 -271 -215 -273 -206 -191 -152 -138 -125 -114 11 -18 3 26 87 152 129 174 224 255 230 285 294 282 344 361 362 428 387
3309 387 412 368 351 335 327 338 318 362 330 316 340 263 199 175 254 197 155 139 106 39 118 40 32 29 90 19 -57 0 -61 -118 -55
3340 -55 -65 -15 -29 -44 -64 -90 -84 -18 -111 28 -25 -92 -43 13 64 -46 33 41 -15 86 -53 -62 -1 -43 2 -52 16 21 -49 -101
3370 -101 -22 -51 -85 -104 -75 -110 -141 -117 -79 -75 -169 -146 -109 -111 -167 -110 -183 -202 -210 -125 -206 -152 -109 -108 -156 -186 -125 -78 -115 -92 -46 -3
3402 -3 -52 -40 38 17 52 72 46 91 107 93 142 109 98 155 153 165 148 222 123 109 100 95 166 59 94 68 27 17 57 29 56 11
3434 11 7 50 -26 -48 -96 -20 -87 -78 -68 -37 -68 -35 -106 -181 -125 -117 -46 -122 -99 -43 -75 -81 -47 -73 2 -13 -57 -69 -9 -7 -60 -48 -2
3467 -2 60 23 49 4 87 17 50 4 47 -43 72 89 -13 -4 72 69 52 51 51 69 -30 39 -11 19 86 4 56 57 64 -64 20 64
3499 64 10 42 28 12 -11 34 22 38 89 2 33 65 16 69 72 74 23 82 106 51 136 76 48 84 79 56 35 53 29 55 39 -13
3531 -13 45 3 95 41 30 8 9 26 29 -27 8 -2 -20 -36 -14 -18 -66 -29 -33 7 -13 -51 -27 4 -33 -32 -119 -26 -80 -42 -34 -16 -143
3564 -143 -39 10 -105 -42 -64 -12 -73 -80 7 -74 -76 -64 -43 -51 5 -40 -14 -9 -67 17 -16 29 -38 -18 -34 -6 44 -11 31 31 9
3595 9 -14 3 -8 57 67 19 80 81 131 73 130 74 112 133 114 119 100 89 79 96 58 98 86 63 58 81 88 26 13 -28 -38 21 -17
3628 -17 6 -28 -95 -67 -111 -61 -28 -75 -165 -114 -55 -133 -115 -111 -170 -167 -158 -176 -149 -192 -133 -171 -176 -133 -162 -154 -94 -92 -83 39 17 -48 12
3661 12 28 99 82 121 53 167 152 129 148 142 235 230 208 234 232 178 267 189 179 204 234 293 194 178 153 229 190 92 119 111 131 133
3693 133 48 140 93 15 14 -8 31 -3 56 -13 -50 -75 -81 -47 7 -39 -77 -86 -31 -149 -125 -81 -85 -42 -90 -100 -114 -61 -99 -118 -65
3724 -65 -104 -36 -24 -92 -92 -124 -29 -81 -135 67 -9 -58 -46 -66 -112 -72 -48 -8 -17 -38 -61 -87 -57 -44 -107 -49 -91 -85 -57 -19 -70
3755 -70 -80 -34 -61 -41 -22 -49 -58 -53 -31 -72 -54 17 -51 -39 -26 -44 41 -10 90 31 -1 34 19 5 -12 77 24 24 40 25 -3
3786 -3 15 -3 83 44 84 67 73 10 44 67 99 38 82 104 52 23 41 44 83 91 40 84 83 62 88 57 60 62 52 53 74 73 59 77 23
3821 23 35 -26 72 29 76 -17 43 22 34 72 -63 62 77 119 -39 34 36 12 95 46 85 46 25 27 123 24 -34 86 4
3850 4 46 -37 24 -4 10 -40 -19 -48 -7 -27 -86 4 -37 -54 -142 -14 -55 -92 -37 -5 -65 -111 -18 -35 -77 -12 -35 -45 -121 -89
3880 -89 -91 -72 -60 -136 -96 -114 -72 -97 -62 -49 -72 -60 -53 -97 -111 -44 -88 -101 -83 -110 -41 -61 -21 10 3 0 69 6 57 44 69 40
3912 40 122 115 68 56 113 72 67 77 92 113 49 108 47 40 103 42 63 77 65 32 32 12 37 8 -71 10 5 22 -24 -23 -19 -97 -83 -37
3946 -37 -79 -59 -109 29 -80 -109 -96 -79 -32 -50 -92 -68 -29 -80 -49 -69 50 32 -78 -4 19 -10 40 34 27 90 100 144 133
3975 133 58 97 143 104 91 130 134 156 92 156 184 35 89 115 42 46 107 115 90 11 50 33 42 -24 5 19 12 -50 -1 7 -30 -45
4007 -45 -67 49 -24 -56 5 -79 -30 30 -26 -102 -38 -3 -60 -42 -96 -18 -46 -34 -38 -35 12 -3 -1 -6 -14 23 14 30 63 2 -37 -39 -33 -4
4041 -4 18 -24 -6 7 65 -9 14 10 -18 -30 -44 -25 -21 -11 -33 24 -25 -69 -61 -92 -27 -29 -81 -38 -26 -44 -36 -70 -66 1 22 34 24 -1
4075 -1 69 -39 -33 10 9 53 71 66 35 15 56 -12 100 119 40 22 53 82 85 57 28 26 -1 52 90 82 42 110 -20 94 29 45
4107 45 -1 21 76 16 56 -22 12 -21 -30 -7 -55 63 -15 -9 1 -70 -73 -19 29 3 -9 -3 -14 -14 -12 36 14 -33 1 9 6 -7 -8 -18
4141 -18 -36 -5 -10 13 -28 -34 -1 15 -23 8 -5 -12 14 -7 -34 39 25 -25 13 -2 24 -52 12 23 43 28 5 71 34 29 31 13 42
4174 42 24 -12 101 110 -7 74 16 32 30 54 65 51 68 40 97 48 93 -5 23 39 82 43 83 41 15 29 66 71 -27 -13 13
4205 13 -31 -43 23 30 -69 -30 -92 -89 -39 -28 -78 -23 21 -80 -82 -54 -98 -76 -83 -78 -39 -23 -42 -83 -86 -65 -24 -70 -27 -42 -70 -54 -46
4238 -46 12 -105 -53 1 -7 -18 10 14 -11 -44 -8 37 -62 -30 -9 -28 -27 29 -9 -10 1 -41 45 12 6 27 81 20 89 4 82 41
4270 41 61 15 114 64 62 92 72 55 37 135 23 60 -21 23 69 28 123 86 64 134 89 45 9 88 60 45 89 -8 135 13
4300 13 24 7 31 15 -13 37 -78 -57 -70 4 -49 -107 -81 -76 -92 -74 -54 -89 -78 -115 -77 -96 -89 -83 -123 -104 -68 -51 -121 18 -52
4331 -52 -105 -26 -110 -95 -19 -17 -52 40 -10 -24 39 -5 55 62 13 82 61 46 56 80 76 52 119 71 29 30 43 77 18 92 63 43
4363 43 -35 71 61 -14 92 -13 19 0 -62 20 -27 92 -40 -25 -17 -7 14 -49 -19 -44 -42 2 -36 -42 -14 -44 -2 -33 -86
4392 -86 -79 -13 -71 -81 -22 -66 -3 1 -54 25 69 -3 -1 79 -22 -11 -23 20 88 3 14 20 29 -38 14 -45 0 -2 -36 29 -25 32 0
4425 0 62 24 44 39 -57 9 7 16 5 36 5 23 24 -18 2 -11 53 -80 -48 39 32 36 19 23 16 83 -4 19 -19 0 -34 29 67 44
4459 44 66 74 1 25 81 7 40 42 -12 47 -43 20 -25 1 -66 -7 33 50 8 -38 -7 5 -13 -19 -6 -17 -24 -13 -21 -68 17 -13 35
4492 35 -30 9 -38 -21 30 -32 1 51 -12 -3 54 -29 23 -7 18 -7 -43 48 8 87 30 -36 -17 40 22 37 -31 74 -13 41
4522 41 23 1 38 1 17 -1 17 -29 -10 -10 99 87 98 21 13 -42 29 17 13 -13 47 35 -24 5 -27 27 -16 -70 10 -20 29
4553 29 48 7 11 8 -42 30 -30 10 22 -16 36 -37 -20 18 -35 19 26 34 -30 -16 24 -14 44 7 7 -7 -22 -9 -1 76 19 -76 72
4586 72 3 52 61 25 6 24 42 27 -13 58 28 36 -22 -14 -45 92 22 -31 80 -9 -19 16 44 17 21 43 2 -41 -26 -17 -13 21
4618 21 -25 -127 -25 27 -45 68 -8 13 58 -20 -30 59 42 49 61 55 -6 -5 22 1 50 -7 -20 -8 -40 -13 -5 29 4 -42 49
4649 49 -29 14 13 97 34 49 57 62 0 -17 71 -10 27 92 -5 -9 43 5 4 7 47 63 -7 -8 -5 -31 29 -32 11 -63 25 42 44 -3 -30
4684 -30 4 -69 33 63 28 62 30 35 36 -29 -66 -66 41 -32 -9 -51 -7 -83 0 -2 30 -39 -4 34 85 21 41 27 -16 9 -3
4715 -3 24 19 -16 -9 -27 9 -78 4 -31 -47 -21 -13 -16 -31 53 -22 -52 -54 -11 23 -1 -43 34 7 31 -26 -42 -26 -17 -6 3 42 67 -32
4749 -32 79 -20 25 -1 5 56 20 20 26 25 -16 46 52 36 -36 89 29 63 40 25 -3 10 6 63 24 51 -62 66 25 -31 68
4780 68 -6 89 -20 37 -51 12 41 47 -18 -4 -14 -5 -4 9 -50 -10 -39 24 4 57 52 30 -12 -32 44 -13 -12 -11 20 -60 -32 -6 3
4813 3 -5 -64 -22 -21 -11 -23 29 -79 9 -34 -13 31 -33 45 -27 -65 -78 -16 -2 -49 -13 -43 16 17 -24 0 -23 -45 9 5 60 63 39
4846 39 -33 -4 61 11 35 33 62 -1 34 59 -28 78 -27 67 43 65 51 -5 37 14 55 -8 -30 27 48 -33 38 70 58 -6
4876 -6 -11 33 -1 13 57 -67 -4 -3 47 -8 -51 -3 0 -6 -37 -39 33 21 -30 32 -56 -25 16 16 -44 -26 -24 10 42 -25 -32 21 -15 53
4910 53 82 -14 25 -86 -57 -54 -12 36 2 45 23 -6 7 22 16 35 18 -26 58 30 31 -1 24 56 -19 -11 25 -29 35 52 28 -22
4942 -22 32 67 -22 44 68 -32 3 37 73 -40 4 14 35 46 70 -6 59 20 -4 19 5 10 -29 14 17 -5 54 71 20 30
4972 30 2 9 -32 45 70 2 -29 14 -34 -6 -26 -20 -64 -57 -51 -92 -30 -32 1 -13 -9 -12 -99 30 -41 35 19 -20 -20 -58 18 3 5 -39
5006 -39 50 -18 62 41 54 12 29 72 43 8 37 57 -18 -13 41 25 47 106 37 106 0 29 60 37 65 96 31 44 75 54
5036 54 31 26 -18 -1 4 23 17 9 61 -15 41 -24 9 41 -6 -48 34 10 14 -12 -6 30 -7 25 20 -15 17 -44 24 57 -47 0 38
5069 38 31 -31 0 -6 -2 -26 -21 27 6 -13 1 -9 -26 51 4 -36 -12 -79 3 -3 -11 -36 -39 -33 -10 -4 -7 -34 23 9 -13 4 -11 -16 0 -43
5105 -43 -14 -5 -6 -52 48 61 42 -34 -41 -13 -16 20 -36 -15 13 14 35 36 19 -10 36 20 36 46 -26 -22 -4 5 9 24 36 13 22 41 43
5140 43 10 -42 43 47 8 14 -28 -15 23 9 -7 -43 -16 16 4 -35 46 -3 -10 4 -79 -15 -10 -21 22 -6 10 5 51 7 -22 -44 20
5173 20 -29 6 -11 -5 21 -34 38 -20 -34 -7 47 11 10 10 87 -58 -1 -34 22 15 20 -8 3 48 44 52 20 78 -30 26 4 -46 30
5206 30 6 -2 73 -29 45 6 -4 -58 52 20 25 -3 -58 -21 -44 58 -7 15 1 -10 -58 31 -25 96 33 12 -51 -48 5 -53
5236 -53 -44 -7 -8 -33 40 -53 67 -33 -4 32 -25 68 -27 4 -4 53 51 -24 -35 -50 14 -3 -16 -11 -34 4 9 26 0 5 30 -38 82
5269 82 14 22 29 -20 14 38 -11 19 4 -55 -28 -18 -22 40 -30 -25 20 37 18 -33 53 -22 5 -31 -47 -57 2 49 -49 -24 29 -15
5301 -15 10 13 20 38 44 -1 -49 74 35 39 -12 7 27 45 -51 -15 26 65 -19 41 13 36 3 -35 25 -20 66 -4 50 -30 35 -37
5333 -37 -17 -30 -9 64 -41 -37 68 -4 10 -25 -83 -18 -32 4 -8 -67 25 58 -5 -22 10 26 -77 19 -18 23 -13 -8 46 73
5363 73 21 -71 66 -2 34 -13 -39 -29 104 43 59 17 -7 18 45 -4 42 2 -24 -72 -31 15 -39 4 -53 -63 -38 57 -13
5392 -13 -71 -11 41 -25 4 -3 -18 -1 -91 25 36 69 33 41 -33 6 25 -17 -37 37 1 -8 -15 -30 -8 27 37 33 38 11 21 -4 -19
5425 -19 32 81 -7 49 -56 -43 15 95 -6 84 -31 -24 -2 25 48 -31 35 50 -15 14 98 -41 -18 56 -8 -24 82 48
5453 48 -22 -20 -9 19 -26 -5 -12 36 -44 13 -55 -14 -23 17 39 -53 -5 -30 20 36 -60 -28 6 -27 -44 -51 29 -7 14 -23 3 -60
5485 -60 -1 -4 -42 16 0 -5 -3 -31 -15 -5 39 -66 73 20 -5 -31 29 -44 2 46 27 -59 43 14 -28 -13 23 -17 -64 -17
5515 -17 32 15 -39 3 -23 27 38 16 -23 63 -11 -24 14 -24 34 4 -26 11 -63 62 23 19 -97 -29 -14 30 14 28 28 14
5545 14 -20 11 6 -35 35 17 -5 -68 2 61 23 48 -15 83 -29 -6 34 -4 -33 6 -54 11 -28 5 33 55 -36 9 -16 -25 22
5576 22 -3 57 62 2 35 34 2 21 -7 -8 -21 -12 -20 51 38 -26 21 -52 -7 -54 5 56 22 -38 -17 30 -58 25 -17 -25 -47 3 6 -33
5610 -33 -56 -18 5 53 75 29 -18 19 55 -7 49 34 -32 2 63 19 -59 -16 -9 51 38 25 -28 3 61 -31 8 3 21 -10 20
5641 20 -3 16 31 -10 18 19 -50 -33 -14 78 37 -26 14 -12 55 54 21 36 -1 -26 -50 -16 24 -50 24 -32 43 5 0 24 -45 -46
5673 -46 -25 6 -27 46 -4 62 -3 14 11 15 48 83 37 15 18 30 -35 83 19 7 27 32 -34 -14 45 14 27 -59 -3 -3 -58 -40
5705 -40 23 7 -16 -45 24 37 86 -23 13 44 -4 1 -55 23 -3 -17 38 51 29 -26 5 40 -19 -1 57 19 14 -27 -28 52 39
5736 39 3 -47 -3 3 41 5 52 51 42 27 14 27 -3 28 9 28 -36 2 5 -7 19 -2 -36 -10 29 -26 -21 -3 9 2 46 -35 -27 47
5770 47 -39 69 -46 40 -74 -82 -74 -6 -18 11 48 -42 54 -30 23 -10 59 -1 21 15 43 13 -64 -3 -41 62 -5 51 36 -3
5800 -3 51 -6 13 -7 7 -33 3 20 19 -8 -33 -12 -32 -17 -16 14 -35 -16 -14 -9 92 -54 75 10 -35 41 -72 -10 -42 22 22
5831 22 -19 22 39 26 -33 4 88 82 64 0 67 25 -14 -38 11 19 -2 34 -24 -21 -17 -34 -11 -11 26 -4 -31 -13 -26 57 19 39 0
5864 0 35 8 46 38 5 5 59 12 -38 -7 28 29 -33 12 -47 8 29 48 72 -30 10 30 -26 -20 -22 -17 19 -72 18 61 58 -11 -43 19
5898 19 -1 7 -2 -20 93 59 61 -52 -5 -25 -23 -20 -17 12 -2 14 -16 -32 55 8 -20 -27 7 -5 -3 52 20 -44 30 71 -28 26 12
5931 12 -29 50 -56 36 52 60 -10 -39 52 46 39 30 15 63 33 61 29 -48 0 -67 -19 7 5 -51 1 -30 -21 -17 -3 8 0 51 54 41
5965 41 28 11 25 5 -10 53 27 29 -23 4 73 43 44 2 19 14 24 -36 8 -21 -12 10 -17 34 37 -19 44 -1 -1 39 1 -2 23 48
5999 48 -44 30 -19 4 -5 28 -16 24 16 20 16 -18 -10 27 -24 -1 -33 11 -64 34 -26 36 -19 9 -38 32 38 45 -17 8 -1 -4 -24 -32 6
6034 6 -99 11 -8 29 23 -33 18 77 11 50 -73 -23 25 20 89 -8 3 -8 -12 18 43 31 42 42 -20 -39 -15 41 -40 27 5
6065 5 20 35 49 -26 -8 19 58 -7 23 85 69 -45 -1 -32 14 8 38 -33 23 -18 -12 36 22 -5 5 -7 31 31 8 32 -41 -43
6097 -43 44 41 -5 -23 -1 -5 3 -9 36 8 9 -8 -12 29 -11 19 15 13 -23 4 31 -5 -63 -8 -50 -35 -47 63 31 67 -31 77 -16
6130 -16 -59 -14 -7 18 -40 51 -22 26 5 11 -28 -55 18 -36 50 -5 -28 -31 19 -13 34 43 -22 19 28 57 -90 -5 20 11 -9 31 41
6163 41 3 -32 21 42 4 28 -41 38 11 26 45 -30 -9 -2 92 -46 9 43 -37 -27 34 9 -27 5 4 49 -36 -3 -32 -38 -25
6194 -25 -18 -38 -8 60 -48 73 -22 6 -41 -34 -33 -11 11 44 56 -32 -36 34 23 -23 21 -27 -4 -5 31 -3 26 -6 34 10 40 -7
6226 -7 28 -31 15 -31 35 -15 22 -34 41 42 17 5 27 -22 -4 9 30 -32 19 -14 7 -23 -12 14 -23 -5 -8 -45 19 46 -16 42
6258 42 1 -13 57 66 -1 -50 -21 48 -25 -62 55 43 22 9 9 26 9 -12 30 24 -5 9 -23 0 4 -22 -63 34 12 -17 -1 33
6290 33 -1 -9 49 -5 60 -10 -14 13 -5 -6 -7 -7 -14 6 29 21 -2 -28 42 25 15 7 34 -26 35 -6 47 25 -27 30 19 70 -11 9
6324 9 55 -4 -17 52 69 40 4 -1 3 56 42 -10 11 48 -19 47 43 21 -70 4 6 2 5 -72 24 -38 49 -3 -24 11 56 -33 5 38
6358 38 -47 5 -13 11 18 8 18 -20 -4 17 -54 -13 46 -11 15 44 -13 57 12 -24 4 -17 52 -44 -21 34 -26 -54 -23 -42 66
6389 66 -1 56 70 5 9 -7 -52 62 9 26 69 -12 1 24 0 -6 22 -12 -76 -21 -15 8 18 26 9 -9 43 15 61 -34 -10 -13
6421 -13 29 56 -22 -2 21 15 7 -6 47 -26 44 62 29 0 39 -10 47 11 11 30 -13 6 -1 -2 -36 -45 5 48 -70 -23 78 -22
6453 -22 14 -2 24 13 24 26 -33 78 -43 -28 32 7 -2 27 2 -14 -16 50 -20 3 14 0 -57 22 -19 26 -16 30 8 13 -22
6484 -22 36 -51 12 -23 -69 -4 -12 -23 27 14 19 82 -55 26 -4 17 27 -13 -30 3 84 24 -63 -14 43 -28 -45 2 -41 -39 -15
6515 -15 -32 -30 19 17 21 69 -32 -9 20 16 -2 0 -26 21 26 18 31 -16 -10 -47 -19 -17 5 -26 -5 11 -31 -8 27 -2 -40 -3 -32 53
6549 53 -26 -39 -13 15 59 8 66 24 -10 0 -30 -25 72 8 1 -18 2 14 38 62 21 -19 46 60 15 26 -2 -35 26 -48 -41 -21
6581 -21 46 -52 -19 37 55 -11 13 13 82 7 22 -24 33 -18 8 -12 -16 -11 -37 14 -18 -18 58 -4 -12 84 -37 -45 -45 -9 27 -17 -9 31
6615 31 14 -32 50 -1 34 30 -27 27 -8 75 39 3 -18 -10 53 24 34 54 32 15 56 -18 25 -3 -24 3 8 -1 -16 -1 -21 33
6647 33 53 -20 -8 47 -20 5 -12 30 -22 -44 13 -44 0 17 45 20 25 -13 57 0 -25 8 45 10 25 14 3 18 60 -25 46
6678 46 58 19 63 21 -9 -32 -43 49 -11 12 -17 -3 -18 32 33 51 42 18 15 -25 26 21 27 -6 -19 -30 14 60 14 25 28 -1 -17
6711 -17 33 3 -31 -87 -37 1 29 -38 26 24 25 42 0 14 -37 -27 32 59 22 -1 18 2 81 28 4 23 -34 -13 -40 -9 27
6742 27 63 -55 28 -3 -38 39 -1 7 38 6 60 10 20 -40 6 32 -3 24 12 17 67 41 8 -2 60 12 9 7 -5 -14 -46 45
6774 45 -7 34 43 11 15 -3 17 14 19 -31 39 -28 49 -25 20 -5 -10 17 13 6 23 13 -12 57 47 -16 -34 45 -14 -1 9 -20 -6 10
6808 10 11 13 -8 -11 30 19 34 32 14 -50 -26 -44 4 7 -2 -37 40 -27 -41 28 -17 5 -22 -34 40 44 12 -8 -2 3 26 -12 -46 5 21
6843 21 -17 17 46 -18 19 2 -23 -8 -3 46 -44 6 -11 43 42 -1 -59 -54 -6 22 -35 11 17 -3 74 -2 30 -30 9 19 39 9
6875 9 -50 4 -16 9 75 34 -2 26 39 -55 21 -3 -5 -22 -11 52 26 7 8 -1 43 33 55 45 -43 11 5 -1 -1 22 24 -14 -7 6 32
6910 32 34 8 38 16 -37 83 26 40 34 48 7 -17 -45 15 12 -69 -2 60 -51 39 34 22 122 63 25 54 43 13 41 -6 64
6941 64 -21 44 -79 8 21 92 5 28 37 19 -31 -33 57 -18 32 -51 -34 1 48 -36 -15 26 -8 56 45 -55 -10 -17 25 -11 27
6972 27 -1 -66 -23 -20 7 52 22 41 1 -25 -29 30 -36 22 42 -2 25 22 10 40 29 13 20 32 -4 56 -17 -11 -14 61 -7 17 -25
7005 -25 -21 52 -4 0 30 59 -24 -46 -70 -19 4 2 -36 23 -30 -53 -5 46 5 34 -12 20 -26 -19 30 -49 -38 -22 -6 15 55 25
7037 25 -42 45 -5 90 21 12 51 -59 -14 12 -41 48 59 73 45 48 34 4 24 38 15 35 67 31 29 38 32 -21 19 -2 -7 1 45
7070 45 0 -36 16 91 -36 25 -3 -10 2 6 35 -1 40 11 47 60 5 -21 30 19 25 -9 22 -2 -22 33 -13 28 -21 10 38
7101 38 -6 15 67 63 -53 81 24 14 -16 16 7 -7 -36 -45 29 -31 9 59 -3 -15 12 -9 31 0 -75 -19 4 -42 27 -35 33
7132 33 -26 52 -29 -17 7 70 -35 30 62 -37 54 -12 56 7 -4 -25 -10 21 -30 -82 -42 -69 8 15 3 -25 17 -35 -35 -21 94
7163 94 -1 31 78 37 -15 51 -59 37 -30 -52 37 -27 23 5 -30 2 38 -14 7 26 -44 46 29 -87 37 3 43 -31 78
7192 78 52 22 6 34 -26 -14 -8 -19 -1 37 46 0 70 6 14 -2 31 49 4 18 30 -3 -25 -15 14 -32 24 24 -41 62 19 -73
7224 -73 7 -14 -25 -7 4 26 60 48 -16 46 16 42 0 17 -60 -17 66 10 41 6 34 9 25 43 68 22 -13 34 20 47
7254 47 16 23 -37 -55 36 12 22 50 20 28 -22 12 25 20 -32 4 -40 29 -24 26 4 -39 -2 33 24 -6 -13 -8 0 -21 39 -26 -13 -26
7288 -26 29 41 -67 29 -34 -51 28 -3 -4 38 31 71 -33 74 29 7 -28 26 15 50 3 -26 -6 -57 49 -13 -18 -48 -37 7
7318 7 12 63 31 18 3 78 -6 39 -26 14 61 22 55 14 -36 -48 -40 8 2 41 -38 -5 62 16 22 -19 47 -9 8 17 -65 -20 43
7351 43 -27 -14 23 -34 -38 -9 38 24 -6 -4 12 -11 14 16 -7 47 72 -29 34 -5 22 2 -5 -8 -35 -12 70 -27 -21 -35 79 -12
7383 -12 26 30 9 45 -3 37 -17 -14 -31 -21 72 -6 -42 5 29 36 36 50 12 -56 18 14 33 42 4 -1 3 27 67 20 75 -28 27 18
7417 18 18 72 50 64 -28 32 7 -2 46 19 0 11 -90 -4 35 -91 -7 6 28 -2 14 11 11 -15 15 3 36 10 22 -7 0 34
7449 34 91 52 -5 14 -24 -2 55 9 36 8 8 27 13 -7 18 9 -41 -2 -6 -25 54 42 12 55 40 -30 8 5 40 18 -75 115
7481 115 28 24 27 34 -9 -4 36 -13 -34 7 9 -5 36 26 40 41 7 59 -34 -16 -13 -25 18 54 -55 27 -36 -30 -10 -4 20 8 -12 -14
7515 -14 4 5 -63 14 -29 2 -20 25 -21 23 -14 32 -31 62 33 -14 57 -9 8 31 38 41 17 5 46 1 -25 -19 21 -39 67 79
7547 79 -33 -35 30 25 8 39 19 56 69 42 -3 75 -21 -1 27 36 46 25 36 37 61 11 -4 -9 -28 -14 -2 71 50 -9 -26 19
7579 19 29 31 34 8 72 24 83 -38 19 31 -33 19 -39 36 -11 0 41 15 14 25 64 34 15 -2 9 -9 55 -23 14 -84 16
7610 16 64 -16 52 -13 -11 -31 14 -38 -39 -44 -27 16 6 -11 -13 -17 43 11 7 -39 43 -9 34 51 -52 39 22 18 -22 -14 -24 -44 49 -61
7644 -61 33 2 -3 44 -5 -10 60 -28 16 -49 -39 -59 -3 -40 -43 -63 -2 23 18 7 -9 31 -4 1 0 6 -13 20 11 29 12 24 -36 -41 -19
7679 -19 27 10 -30 24 53 -13 81 25 -41 -27 -23 -6 2 -7 -10 116 -8 53 -28 22 -2 -2 57 14 55 -9 25 -7 -18 25 -15 9
7711 9 63 5 65 11 8 33 -3 23 -3 10 22 49 16 -1 -8 27 7 38 12 -15 -23 15 25 32 65 -44 -2 15 45 5 -8 10
7743 10 16 48 24 29 -20 38 16 42 18 25 11 -18 19 50 -73 16 -21 25 -26 8 3 1 36 5 -6 -65 -33 13 -14 -14 6 20 -20
7776 -20 18 18 8 72 32 -8 26 62 -74 -3 -9 -4 9 30 -2 -23 -47 -15 12 -25 -41 24 -47 -28 -1 12 -4 -31 7 -104 15
7807 15 -3 -15 -29 -44 29 -20 26 9 -15 -31 -57 59 -11 -37 -48 87 -13 13 30 -6 -30 -32 -69 -26 8 -15 -60 -102 -15
7836 -15 5 -44 33 -25 -11 16 10 107 47 36 73 -25 21 7 29 39 17 14 -2 -3 61 -10 8 33 -39 26 1 41 -31 -19 -22 67
7868 67 -6 3 96 -14 -17 39 -36 -61 22 50 -11 -35 45 -7 -51 -15 -47 -11 -25 54 -12 19 16 -40 -59 -12 -64 9 -25 -36 13
7899 13 10 2 11 4 -22 24 0 43 10 52 -21 30 -10 -16 19 60 28 15 -8 -5 16 1 22 -13 10 22 0 -5 10 -12 41 -28 20 91
7933 91 -17 65 -8 56 8 -20 39 -9 73 0 31 -13 66 -58 -31 -26 -66 -43 -38 -18 -51 73 -28 28 65 -37 -11 -6 57
7962 57 24 -32 0 -61 39 14 16 -42 -30 -21 -13 -20 3 4 -26 41 -7 68 -20 -10 -47 -15 -29 -11 -52 -49 1 -11 -41 39 7 -39 14
7995 14 12 30 -20 60 -14 -22 34 8 27 48 -36 4 13 -87 17 -30 32 -46 -22 -11 -48 5 -25 -57 26 -41 -26 5 2 16 -17
8026 -17 2 61 25 26 10 1 -50 2 -21 26 18 38 12 10 -1 -28 -30 48 86 18 -49 49 -46 -22 26 -19 64 20 35 19 32 -8 17
8059 17 60 -40 9 2 -54 -7 50 -28 12 79 -29 19 -5 -49 39 -24 1 -3 -28 -20 -58 -23 111 72 7 3 -57 -35 4 -12 -34
8090 -34 -36 45 -38 -19 -2 -35 39 -11 47 42 -44 -60 -41 2 -58 33 -25 11 -11 19 4 -47 77 19 -52 -46 -14 -24 -36 -79 19
8121 19 55 63 -47 -42 63 21 -39 41 -38 30 -58 31 3 7 -4 -7 0 24 27 -12 1 23 -33 -30 -9 48 8 -21 -51 34 -26 -32 -11
8154 -11 -30 8 8 -6 -45 16 -11 45 -9 -11 0 51 40 -38 -16 2 -23 -66 -6 -19 26 11 -40 -3 24 55 30 -26 -6 -20 13
8185 13 -46 26 -13 19 46 4
8191D
##END NTUPLES=NMR FID
##END=
