##TITLE=1H_CA-8590
 DMSO, 8 sc, 
 8.5.2019
##JCAMPDX= 6.0         $$ Bruker NMR JCAMP-DX V2.0
##DATA TYPE= NMR FID
##DATA CLASS= NTUPLES
##ORIGIN= UXNMR, Bruker Analytische Messtechnik GmbH
##OWNER= root
$$ XWIN-NMR		Version 3.5
$$ Wed May  8 12:19:22 2019 Russian Standard Time (UT+4h)  she@DPX200
##.OBSERVE FREQUENCY= 200.1315
##.OBSERVE NUCLEUS= ^1H
##.DELAY= (6, 6)
##.ACQUISITION MODE= SIMULTANEOUS
##.ACQUISITION SCHEME= undefined
##.AVERAGES= 8
##.DIGITISER RES= 18
##SPECTROMETER/DATA SYSTEM= spect
##.PULSE SEQUENCE= zg30
##.SOLVENT NAME= DMSO
##.SHIFT REFERENCE= (INTERNAL, DMSO, 0, 15.7039)
##AUDIT TRAIL= $$ (NUMBER, WHEN, WHO, WHERE, WHAT)
$$ ##TITLE= Audit trail, XWIN-NMR		Version 3.5
$$ ##JCAMPDX= 5.01
$$ ##ORIGIN= Bruker BioSpin GmbH
$$ ##OWNER= she
$$ F:/spectra/data/she/nmr/H-F/1/audita.txt
$$ ##AUDIT TRAIL=  $$ (NUMBER, WHEN, WHO, WHERE, WHAT)
(   1,<2019-05-08 12:18:08.46 +0400>,<she>,<DPX200>,
      <created by zg, POWCHK disabled, PULCHK disabled
       configuration hash MD5:
       00 E9 B6 7A A2 85 ED C7 34 08 36 98 17 FE 4E 26
       data hash MD5: 16K
       2F 00 1A 28 03 81 E3 4A E7 5A 69 CB 06 40 0D F9>)
$$ ##END=
$$ 
$$ hash MD5
$$ 92 6A 6D AA 30 C2 FA 09 6C 97 34 A5 58 1C 2B 56
##$RELAX= 
##$RELAX= 
##$RELAX= 
##$RELAX= 
##$RELAX= 
##$RELAX= 
$$ Bruker specific parameters
$$ --------------------------
##$DU= <F:/spectra>
##$EXPNO= 1
##$NAME= <H-F>
##$PROCNO= 1
##$TYPE= <nmr>
##$USER= <she>
##$AMP= (0..31)
100 100 100 100 100 100 100 100 100 100 100 100 100 100 100 100 100 100 
100 100 100 100 100 100 100 100 100 100 100 100 100 100 
##$AQSEQ= 0
##$AQ_mod= 1
##$AUNM= <au_zg>
##$AUTOPOS= <>
##$BF1= 200.13
##$BF2= 200.13
##$BF3= 200.13
##$BF4= 200.13
##$BF5= 200.13
##$BF6= 200.13
##$BF7= 200.13
##$BF8= 200.13
##$BYTORDA= 1
##$CFDGTYP= 0
##$CFRGTYP= 5
##$CHEMSTR= <none>
##$CNST= (0..31)
1 1 145 1 1 1 1 1 1 1 1 1 1 1 1 1 1 1 1 1 1 1 1 1 1 1 1 1 1 1 1 1 
##$CPDPRG= <>
##$CPDPRG1= <>
##$CPDPRG2= <>
##$CPDPRG3= <>
##$CPDPRG4= <mlev>
##$CPDPRG5= <mlev>
##$CPDPRG6= <mlev>
##$CPDPRG7= <mlev>
##$CPDPRG8= <mlev>
##$CPDPRGB= <>
##$CPDPRGT= <>
##$D= (0..31)
0 1.2 0 0 0 0 0 0 0 0 0 0.03 0 0 0 0 0 0 0 0 0 0 0 0 0 0 0 0 0 0 0 0 
##$DATE= 1557303487
##$DBL= (0..7)
120 120 120 120 120 120 120 120 
##$DBP= (0..7)
150 150 150 150 150 150 150 150 
##$DBP07= 0
##$DBPNAM0= <>
##$DBPNAM1= <>
##$DBPNAM2= <>
##$DBPNAM3= <>
##$DBPNAM4= <>
##$DBPNAM5= <>
##$DBPNAM6= <>
##$DBPNAM7= <>
##$DBPOAL= (0..7)
0.5 0.5 0.5 0.5 0.5 0.5 0.5 0.5 
##$DBPOFFS= (0..7)
0 0 0 0 0 0 0 0 
##$DE= 6
##$DECBNUC= <off>
##$DECIM= 24
##$DECNUC= <off>
##$DECSTAT= 4
##$DIGMOD= 1
##$DIGTYP= 9
##$DL= (0..7)
0 120 120 120 120 120 120 120 
##$DP= (0..7)
150 150 150 150 150 150 150 150 
##$DP07= 0
##$DPNAME0= <>
##$DPNAME1= <>
##$DPNAME2= <>
##$DPNAME3= <>
##$DPNAME4= <>
##$DPNAME5= <>
##$DPNAME6= <>
##$DPNAME7= <>
##$DPOAL= (0..7)
0.5 0.5 0.5 0.5 0.5 0.5 0.5 0.5 
##$DPOFFS= (0..7)
0 0 0 0 0 0 0 0 
##$DQDMODE= 0
##$DR= 18
##$DS= 0
##$DSLIST= <SSSSSSSSSSSSSSS>
##$DSPFIRM= 0
$$ [...]
##$SUBNAM2= <"">
##$SUBNAM3= <"">
##$SUBNAM4= <"">
##$SUBNAM5= <"">
##$SUBNAM6= <"">
##$SUBNAM7= <"">
##$SUBNAM8= <"">
##$SUBNAM9= <"">
##$SW= 24.9337058887773
##$SWIBOX= (0..15)
0 0 2 0 0 0 0 0 0 0 0 0 0 0 0 0 
##$SW_h= 4990.01996007984
##$TD= 16384
##$TD0= 1
##$TE= 0
##$TE2= 300
##$TE3= 300
##$TEG= 300
##$TL= (0..7)
0 120 120 120 120 120 120 120 
##$TP= (0..7)
150 150 150 150 150 150 150 150 
##$TP07= 0
##$TPNAME0= <>
##$TPNAME1= <>
##$TPNAME2= <>
##$TPNAME3= <>
##$TPNAME4= <>
##$TPNAME5= <>
##$TPNAME6= <>
##$TPNAME7= <>
##$TPOAL= (0..7)
0.5 0.5 0.5 0.5 0.5 0.5 0.5 0.5 
##$TPOFFS= (0..7)
0 0 0 0 0 0 0 0 
##$TUNHIN= 0
##$TUNHOUT= 0
##$TUNXOUT= 0
##$USERA1= <user>
##$USERA2= <user>
##$USERA3= <user>
##$USERA4= <user>
##$USERA5= <user>
##$V9= 5
##$VALIST= <valist>
##$VCLIST= <CCCCCCCCCCCCCCC>
##$VD= 0
##$VDLIST= <DDDDDDDDDDDDDDD>
##$VPLIST= <PPPPPPPPPPPPPPP>
##$VTLIST= <TTTTTTTTTTTTTTT>
##$WBST= 1024
##$WBSW= 4
##$XGAIN= (0..3)
0 0 0 0 
##$XL= 0
##$YL= 0
##$YMAX_a= 376340
##$YMIN_a= -430326
##$ZGOPTNS= <>
##$ZL1= 120
##$ZL2= 120
##$ZL3= 120
##$ZL4= 120
##$ABSF1= 10
##$ABSF2= 0
##$ABSG= 5
##$ABSL= 3
##$ALPHA= 0
##$AQORDER= 0
##$ASSFAC= 0
##$ASSFACI= 0
##$ASSFACX= 0
##$ASSWID= 0
##$AUNMP= <proc_1d>
##$AZFE= 0.1
##$AZFW= 0.1
##$BCFW= 1
##$BC_mod= 2
##$BYTORDP= 1
##$COROFFS= 0
##$CY= 11.3945322036743
##$DATMOD= 1
##$DC= 2
##$DFILT= <>
##$DTYPP= 0
##$F1P= 18.9103706918063
##$F2P= -1.10871071338519
##$FCOR= 0.5
##$FTSIZE= 0
##$FT_mod= 4
##$GAMMA= 1
##$GB= 0.15
##$INTBC= 1
##$INTSCL= 1
##$ISEN= 128
##$LB= 0.24
##$LEV0= 0
##$LPBIN= 0
##$MAXI= 10000
##$MC2= 0
##$MEAN= 0
##$ME_mod= 0
##$MI= 1.114404
##$NCOEF= 0
##$NC_proc= 0
##$NLEV= 6
##$NOISF1= 3.799351
##$NOISF2= 2.8
##$NSP= 1
##$NTH_PI= 0
##$NZP= 0
##$OFFSET= 15.70392
##$PC= 1
##$PHC0= -8859.118
##$PHC1= 15.80026
##$PH_mod= 1
##$PKNL= yes
##$PPARMOD= 0
##$PSCAL= 0
##$PSIGN= 0
##$REVERSE= no
##$SF= 200.130013532006
##$SI= 16384
##$SIGF1= 3
##$SIGF2= 2
##$SINO= 400
##$SIOLD= 16384
##$SREGLST= <1H.CDCl3>
##$SSB= 0
##$STSI= 0
##$STSR= 0
##$SW_p= 3612.71676300578
##$SYMM= 0
##$S_DEV= 0
##$TDeff= 0
##$TDoff= 0
##$TI= <>
##$TILT= no
##$TM1= 0
##$TM2= 0
##$TOPLEV= 0
##$USERP1= <user>
##$USERP2= <user>
##$USERP3= <user>
##$USERP4= <user>
##$USERP5= <user>
##$WDW= 1
##$XDIM= 8192
##$YMAX_p= 0
##$YMIN_p= 0
$$ End of Bruker specific parameters
$$ ---------------------------------
##NTUPLES= NMR FID
##VAR_NAME=  TIME,          FID/REAL,        FID/IMAG
##SYMBOL=    X,             R,               I
##VAR_TYPE=  INDEPENDENT,   DEPENDENT,       DEPENDENT
##VAR_FORM=  AFFN,          ASDF,            ASDF
##VAR_DIM=   8192,          8192,            8192
##UNITS=     SECONDS,       ARBITRARY UNITS, ARBITRARY UNITS
##FACTOR=    0.0002004,     1,               1
##FIRST=     0,             0,               0
##LAST=      1.6414764,     0,               0
##MIN=       0,             -430326,         0
##MAX=       1.6414764,     376340,          0
$$ Real data points
##PAGE= N=1
##DATA TABLE= (X++(R..R)), XYDATA
$$ [...]
1858a06j87NL90J17J70l68l08K23L1j58L73p4k84J41K4K24j92j45L9M1l28K33
1880a39K31o3j54p5K36k7J29j42K38k28l64O03K01j03l22R6r0k67L44N52o64k02
1902b10l00K64M48K48k56n37l03L80L99L49k42o42jQ2L93M50m54j25n28O59j67
1923i3L08J23j18l22j69L00M9K31l74l67K58R7O37n94J1j76q6J81L02j85L95o13
1945b05q3L53j86L05q9k56k9j13K40L55k32j69j51Q4M30j35J54R1m87j08J64J40
1967G3L00j33k70k79M61l9j02k47l7j2R3R0K73J52j02k24l38N50J41l56L9qk37
1990b12K23PN64n58O9n52M32N82l25l08l82N1L60pL80J45m53o54P96j58L30J25
2012D55m83k28l40N41NJ99l18k13o5N24j19K60j52l65K17K13J21O4k65j64q8L84
$$ plain form
1858 -106 -293 -288 102 219 389 21 -287 -64 -33 -191 182 108 -176 -35 -11 213 21 -124 -85 -44 -372 -139
1880 -139 92 29 -125 -200 36 9 138 -4 234 6 -358 245 446 343 21 117 27 -240 104 656 -8 -210
1902 -210 -510 -246 202 450 194 -343 -646 -266 133 482 240 -402 -403 -321 72 522 68 -57 -585 74 -93
1923 -93 215 338 220 -102 -271 29 78 309 -65 -432 -174 -77 560 -34 -23 -199 -285 -104 198 13 408 -205
1945 -205 -288 65 -121 184 95 -161 -190 -303 -63 292 60 -109 -260 -176 254 119 273 364 -123 -231 -67 73
1967 73 373 240 -30 -309 152 113 11 -236 -273 -285 -192 -102 171 323 221 -3 -341 209 350 -6 33 25 -212
1990 -212 11 18 582 24 93 -459 -27 555 230 -78 -460 -409 -49 -56 324 469 16 -638 158 0 330 455
2012 455 -28 -256 -596 -55 -50 149 -169 -382 -447 77 -42 218 66 -299 -82 131 252 316 51 -113 -201 183
2034A83N3M1n49K30J6M8K34J08n25m4N1K86q3K67K8j94l34P5K51N7O9m38k12K35
2058a47J43P6K41l23j02j19L79%m6Nk48m6J13K24r6L11k70o8j70n1K14K27p8m3
2082A26k44J03k1J49j97j09L3K97K7J38n5m66Q1P7j98K81K57m07J19p2K9L95m08
2105f5j63QM9%O22k73%M8l70L91n0j69j60L42n38L94K90l01o6l9j07J64K67p9
2129A95l33o2K5K08p2K68j11o1j0j34P1J27k54p6K4K15k83M85m5l85L26j69N9
2152HM36k54j39k32J27k3K99k23N5q8J61l88O06k31J04m68QL52n3N6R2j84P2k38
2176a45p2K91j01k8N1j27K08j01J76j10J7J47m10J37K25P2l96N9P4J15k20J69
2198C1K20m11J44j21L60m00J97k2k45K32j8R3j88k53K11m1M55k08J55k76r3K97
$$ plain form
2034 183 236 277 -272 -42 -26 22 256 364 -161 -205 -154 132 49 316 344 150 -184 -109 142 199 268 -170 -382 -147
2058 -147 -4 72 313 -10 -112 -231 148 148 102 107 -141 -187 -74 150 54 365 95 27 -143 -194 20 247 169 126
2082 126 -118 -15 -36 113 -84 -193 -160 137 164 302 247 -219 -138 -61 -259 22 279 -128 -9 -81 -52 343 -65
2105 -65 -228 -220 -171 -171 451 178 178 226 -144 247 197 28 -132 210 -328 66 356 55 -11 -50 -157 7 274 195
2129 195 -138 -200 -175 33 -39 229 118 57 47 -87 -16 111 -143 -219 -195 20 -263 222 177 -208 118 -51 8
2152 8 444 190 51 -181 -54 -77 222 -1 54 -34 127 -261 345 114 218 -250 -242 110 57 113 205 21 93 -145
2176 -145 -217 74 -27 -55 -4 -131 77 -24 152 42 59 206 -204 -67 158 230 -166 -107 -33 82 -138 31
2198 31 251 -160 -16 -137 223 -177 20 -2 -247 -15 -33 60 -128 -381 -170 -211 244 36 191 -85 -178 119
2220A19q5J23o2j52J25l53M35L0n7l01p2J42j47M17j48r6L4j57J78J92J35l42
2242d2K7L11j40n0k37K03n6l8K10q0Q6j15j9N1l01L64m46J81J63j71O3J50j79
2265f5k30M35j98J02K9l31M13j6J1p6j79K21J39l52O1l09J25M18j35R8l98j15
2287c52J62L40j85J04j58q8K58k64J70kK75j10k0K4Lj89k44K24K08k19K11J24
2309B72j76k18k95M15K90k57J14j63J30j25N23k23l72K20m95M25l2j10K9RL1r3
2331a01M55m05N1J01l51J27J42j72O9J44P0q3m17K27j3j29J30m8l3L85J16m94
2353b29k2J67J48P4l01J95K4N2j94O1L4k18K02j3m7K90k46P4L6j11j60J52L49
2376C17n9m64k20N27j16L6P4lP2m91K38K37j05J64n73R0K35j60M02k71j39K53
$$ plain form
2220 119 34 157 95 -57 68 -285 150 180 123 -178 -250 -108 -255 162 14 -82 -48 -205 -27 165 300 -42
2242 -42 -15 296 156 106 -131 72 16 -22 188 108 194 79 60 111 -190 174 -272 -91 72 -99 -36 114 -65
2265 -65 -295 140 -58 44 73 -258 155 139 150 74 -105 116 255 -97 -36 -345 -220 198 63 161 -237 -352
2287 -352 -190 150 -35 69 -89 -177 81 -183 -13 -15 260 150 130 154 157 -32 -276 -52 156 -63 148 272
2309 272 96 -122 -417 -2 288 31 145 -18 112 -13 510 287 -85 135 -360 65 33 -77 -48 -39 -8 -101
2331 -101 354 -51 0 101 -250 -123 19 -153 -84 60 130 47 -370 -143 -156 -285 -155 -203 -236 149 265 -229
2353 -229 -251 -84 64 138 -163 32 56 108 -86 -25 9 -209 -7 -20 -67 223 -23 51 87 -24 -184 -32 317
2376 317 258 -206 -426 101 -15 21 95 92 164 -327 -89 148 43 207 -366 -276 -41 -201 201 -70 -209 44
2398D4L2J56k73J91J76l13p4M2K79o41J27N62n38M01m30L29n2k75L89j67l3o4
2420a32L49k09k98q4M20K20j88l57J17J64j41L28j16np7L1J40J78k39k77J55q2
2442a03K69j35lJ92j21j19M4K0k86K82m3J87P3j88J28k64j04K00ROn9j31J64k67
2466b49K88j20j39K61l03M04p3k05L93j86n1J5j10K5J86k03J25n1j27Q5O1J22
2488A48l17K99p8k41K77k56K94k34j56L44j72q2K19j00M2Q0j09J38J70k73J34
2509A27k22l11M12N9j13kr5J41npK51m28K02j8L75l65j96L49l10J82p3j89L54
2532A18k66P0L16r0n7M4j16K87n03L60k22K83O2m54N55m13m7Ko8J55n0j29k3J01
2556h5p2K40Kl37j2K43K15r0K26k63l3M7m03M75r8K4o2r1J10J69k74Qj06K79j53
$$ plain form
2398 44 76 232 -41 150 326 13 -61 -19 260 -381 -254 308 -230 171 -259 70 18 -257 132 -35 -68 -132
2420 -132 217 8 -290 -374 46 266 78 -279 -162 2 -139 189 73 68 -9 22 162 340 101 -176 -21 -103
2442 -103 166 31 28 220 99 -20 24 44 -242 40 -3 184 257 69 197 -67 -171 29 38 44 -15 -146 18 -249
2466 -249 39 -81 -220 41 -262 142 69 -136 257 71 20 35 -75 -50 136 -67 58 7 -120 -35 26 148
2488 148 -169 130 52 -189 88 -168 126 -108 -264 80 -92 -174 45 -55 -13 67 -42 96 266 -7 127
2509 127 -95 -406 6 65 -48 -50 -145 -4 -9 -16 235 -193 9 -9 366 1 -195 154 -156 26 -47 -236 118
2532 118 -148 -78 238 148 91 135 19 306 -197 163 -59 224 286 -168 387 -26 -73 -71 -139 16 -34 -163 -186 -85
2556 -85 -157 83 85 -252 -264 -21 194 104 330 67 34 81 -322 153 55 79 17 -74 36 205 -69 -61 -167 112 -41
2581d1O7o6K4P6K21j94M1O8n05N39j54J42m35M32r3j70J12o8O4k41j58M5L96O2
2605A64%m7k44N3k41J80R3j9kn2Q1O8n3J36j21r4L24k41j66L09l40K07j61L78
2629B12r8k32K4J95jk78M97l47Q6j73J17j05L29k62j50K47k54K74j14J63j03j42
2651a15K23l26J23j08K63q0J91j91rK53O8l78R3j15j44L65j03oj75J82j92o9K13
2674c7o2K13J26k46M0O1k0l22J73J50O6k38j19L52j28k09L99k18j25K17k6O4j3
2697I8k92N7kL83q8j94j83J25J14q4O8J02j36Q1j18r2J61K42k34j65p1J29L4M9
2721a6P9q1l50J76L88k17O9o7M6Q9L52n09k02L01k72J45q9L70k62L06j16K23j65
2744A98k71k54K53KJ70J80j58J90k48k41K12p0J76j0j31J83P5n33K87o1N7%J59
$$ plain form
2581 -41 26 -40 -16 60 281 87 128 196 -309 230 76 218 -217 215 122 -48 64 -4 60 -181 -339 -294 102 164
2605 164 164 117 -127 -74 -315 -135 -42 -61 -63 -115 -34 34 -19 117 -4 -98 226 -15 -181 128 -212 -5 -166 212
2629 212 114 -118 -94 101 100 -178 319 -28 58 -115 2 -103 226 -36 -186 61 -193 81 -33 130 27 -115
2651 -115 108 -218 -95 -203 60 -20 171 -20 -29 224 292 -86 7 -108 -252 113 10 4 -171 11 -181 -250 -37
2674 -37 -99 114 240 -6 34 95 75 -247 -74 76 142 -96 -215 137 9 -200 199 -19 -144 73 47 111 98
2697 98 -194 -137 -139 244 156 -38 -221 -96 18 -66 2 104 -32 49 -69 -161 0 242 8 -157 -228 -99 -65 -16
2721 -16 63 -18 -368 -192 196 -21 48 -19 27 116 468 -41 -243 58 -214 -69 -158 212 -50 256 140 363 198
2744 198 -73 -327 -74 -72 98 278 120 310 62 -179 33 -37 139 129 -2 181 256 -277 10 -51 6 6 165
2767A65m5m33p7N33j58J51l05P2O6J07j16r2J21n1pJ09N6j97J59M0o1q3J11J52
2791B17L2l97j13q5M17j91K67l44J12K0L34l98R7o1L01n18L71JR6n1l63M54j72
2814B6n2q1J38k39K85j43L2J49j84J35j65K02j17L4j5R3m0J31j92j12p1K56K39
2837C09k64J81n06M01L9k74j68M15n5mk61j47O29l26l1k54M07k26K61M2l33K16
2859E1K7r6p6j37J57R4k80L40m2k3r7q0M54l15pj48J27j14J37O2Q0k75J68k1L89
2884C75m64M41m41J5j00K13Lj85O1O2j90K87J66j73k57K9j62L82J37k31q3j83
2906b98N19m40N63l56L4l01P7J95k6Mj2N3k33O9J16OJ1J9R1j70J56k50R2J10m19
2931c90L87j01J85k17L69k71p9j3mJ58k94J95N8K90l02J36k68L01j14j12j15J00
$$ plain form
2767 165 120 -313 -390 143 -15 136 -169 -97 -31 76 -40 -132 -11 -62 -69 40 96 -101 58 98 37 -46 65 217
2791 217 249 -148 -261 -346 71 -120 147 -197 -85 -65 269 -129 -32 -93 208 -310 61 62 158 107 -256 198 26
2814 26 -26 -107 31 -208 77 -66 -34 115 -69 66 -99 103 -14 20 5 98 58 189 -3 -115 -186 70 309
2837 309 45 226 -280 121 160 -114 -282 133 78 74 -187 -334 295 -31 -62 -316 91 -135 126 168 -165 51
2859 51 78 -18 -94 -231 -74 20 -260 80 38 15 -82 -162 292 -23 -30 -178 -51 -165 -28 34 114 -161 7 -14 375
2884 375 -89 352 -89 -74 -174 39 42 -143 -82 -20 -210 77 243 70 -187 -158 -320 62 199 -32 -115 -298
2906 -298 221 -219 344 -12 22 -279 -202 -7 -33 -29 -41 12 -221 -152 -36 -30 -19 0 91 -79 77 -173 -81 29 -390
2931 -390 -3 -104 81 -136 233 -38 -117 -130 -134 24 -270 -75 -17 273 -29 107 -161 140 26 -86 -201 -101
2953a01j59J62P9j6L80m03K98k56J83k77Oj17L27J0m86K66K72L9j32P5q7j34m4
2976a15M9J78lj83Q1m2M7N2l31L27J72j62k47L40j22j25pP7J14j14R8J35p2j5
3000A32l00K9K54j76J74j85K71j71J95j01L4j22j5L6l45K0L30j77K5L20j61J48
3022B15k82L74k49N2J00l27K57J5j75l4K51j08m5j96j50Q4J89j14L66m7k96K09
3044H9M0l82Q4O8o2L29k20J17l5l55M63j27p5R7L5j62oJ41k6l44N38q1m0k39J76
3069B3k17J94J4k71J82L9R4m7O0j18J6j17L30m66K98J15O1j65k2O1k21J63j13
3092a07r7K81l45K30J22j2R4Nk64K4Q6R0j30r0J85K29m9jk51k19K41m0K7M64l78
3117I5q9l8L99j86m40K84J58j8k63j66N5K16Q2j00R1q3Qj54ro5J15L63o14K91
$$ plain form
2953 -101 -260 -98 -19 -35 345 -58 240 -16 167 -110 -104 -221 106 116 -370 -104 168 207 75 150 63 -71 -115
2976 -115 -66 112 109 -74 7 -35 12 64 -267 60 232 70 -177 163 41 -84 -91 -14 100 -14 84 219 147 132
3000 132 -168 -139 115 -61 113 -72 199 28 223 122 156 34 19 55 -290 -270 60 -117 -92 228 67 215
3022 215 -67 307 58 110 210 -117 140 155 -20 -54 197 89 44 -152 -302 -218 -29 -143 223 176 -120 89
3044 89 129 -253 -169 -101 -163 166 -54 63 28 -327 136 9 -66 31 66 -96 -102 39 13 -331 207 126 86 -153 23
3069 23 -194 0 14 -257 -75 -36 58 11 71 -47 -31 -148 182 -284 14 129 190 25 3 64 -157 6 -107
3092 -107 -204 77 -268 -38 84 72 166 171 -93 -69 17 107 -23 -113 72 301 252 251 0 -219 22 -18 9 473 95
3117 95 6 -32 367 181 -259 25 183 165 -98 -264 -209 7 89 -11 80 -3 5 -149 -158 -223 -108 255 -359 -68
3141f8n4J57R1k31K1k3L22l0k0j47jj06J36Q7l16N3k39J21K21J55N1l04k56M70
3165I0j15j3k29P1K21k1LM8k6l29L73k08K33P8k26J83M7j24Q5j89O7q0N2r7K00
3190I4j1j31K07j8k71L7j6R3K14l46K36j34J96m9Q2l51K21Nj86L08K5j52k12L57
3214A98m16N59m79K95q6o9R8k28L30q9k45K52k15M65m85K9J53l31N82k69K35n44
3236b60Q0J88r6K14j11J5k53K03q3l9m1J28N3L36o57K16J59r0j60L15p5j83K77
3259A36k0P1k65o8L06j97j01J78l2K63N8k68O6n8Q1j98j0n0M2P2O9k62K41k40
3283a86M7J45l19K48J93J08l21J32l27J05L86L0l61p7O15o46l08O25l64M96l19
3304i8L34l51J37L31k42l09K39j70m6J00p5J66Q8l9j88J40p8J82j83M70m09L7
$$ plain form
3141 -68 -122 35 126 -105 -84 -107 215 185 165 18 17 -89 47 134 -182 -129 -368 -247 -26 129 180 -124 -380 90
3165 90 -25 -38 -267 -196 25 4 7 55 29 -300 73 -135 98 176 -50 133 180 56 141 -48 19 -61 -9 -106 94
3190 94 83 -48 159 141 -130 -93 -109 -16 198 -148 88 -46 150 101 183 -168 53 58 -128 180 205 53 -159 198
3214 198 -218 341 -138 157 71 2 100 -128 202 113 -132 120 -95 370 -115 -86 67 -264 318 49 284 -260
3236 -260 -180 8 -88 126 15 30 -223 -20 -103 -142 -183 -55 -2 334 -323 -107 52 -38 -198 117 42 -141 136
3259 136 116 187 -78 -146 160 -37 -138 40 8 271 329 61 127 69 150 -48 -58 -108 -66 6 75 -187 54 -186
3283 -186 -139 6 -313 -65 128 236 -85 47 -280 -175 211 241 -120 -197 418 -228 -536 89 -275 221 -98
3304 -98 236 -115 22 353 111 -198 41 -129 -175 -75 -150 16 104 65 -123 17 -61 121 -62 408 -1 36
3326C6J41J74m69J22K11j80o4K30l02J25J57J6l41K10pl8k13J76N70m78j70K75
3348A81j1R1k18j26j07M09o0K44l19J7m27M01J23l07Q7P1j12J39mk12P3j36J50
3371e3J9r7J99l78L12k53R9r0K09J06M3n0j18Q2m9k92K08o2J73r0J34j31L92k34
3395G9n52M76r2r0J61R1j14J95O0k58J18J06l51K78k14q6L93j89k02p1K08N2l3
3418c5J57j91j19O9J55j33J14J79k10J87m4k94M7L11k40L7k7K48j92p1m9K19l36
3441b18L19k87K07L0jl4R5P0J06j85k94K83l29J46k70N45M7j94J5J52P5k83j85
3464a90j99N56q7Rj20j6j60K87j64no3J24j06K73j10K51l09R0j22N4Q0m9j8J22
3488A28N5j25k79J43J71j14J55J39m26k2L01K03n03j5K57k9k71K41j99K16k49
$$ plain form
3326 36 177 351 -118 4 215 35 -29 201 -101 24 181 197 -144 66 59 21 -192 -16 554 76 -94 181
3348 181 170 261 43 -83 -190 219 159 403 84 101 -326 75 198 -109 -22 49 -63 76 72 -140 -67 -203 -53
3371 -53 -34 -131 68 -310 2 -251 -152 -242 -33 73 116 66 -52 30 -19 -311 -103 -165 8 -82 52 -79 313 79
3395 79 -473 3 -89 -179 -18 73 -41 154 214 -44 74 180 -171 107 -107 -193 200 11 -191 -262 -54 -2 -35
3418 -35 122 -69 -188 -119 36 -97 17 196 -14 173 129 -165 -118 193 -47 -10 -37 211 19 -52 -101 118 -218
3441 -218 101 -186 21 51 50 16 111 181 287 102 -192 91 -238 -92 -362 183 230 36 51 203 278 -5 -190
3464 -190 -389 167 80 89 -31 -47 -207 80 -84 -89 -152 -28 -134 139 29 280 -29 61 -61 -7 73 24 6 128
3488 128 183 58 -221 -78 93 -21 134 273 -153 -175 126 329 -174 -189 68 39 -232 9 -190 26 -223
3509b23J33L12j37l54M93k29j39J45j64M09k13k65J01M12pl12K23l30K24j26P
3530d0N1R3l0K07k36J62n42K32K2j91M17j82m9K64n9j52j71O6M45l65K15jl34
3553a78r3M52rm69J86K49k61J97J28j34k89L83k84j3J15j60K01j6P1Q1q8j90l0
3576a51L8P3K18K5l13J36N3j96P0k85J09K08J15Q7j38j12j57J76k2rK79j77O9
3599I6L7P4j66j62M5j97M21r1N0j29K48M1m58J74J77Q7l09L03l18J77m6J5j81
3622a12J90J8m9j32L35k7l34K10r5M6l23M08l08J94j01O7J69k50k40M17K09k87
3644Er7l6k8r6M59r4p3j76j15j9M0Q0L0L45l61J83r1J26j75k07K24j13J52L54
3668C17m8Q4l92l7N4k85J56J79k85L63j02J33k08o5K38m0j12r6J03N9j01L8J34
$$ plain form
3509 -223 -90 222 85 -269 224 -5 -144 1 -163 246 33 -232 -131 281 274 -38 185 -145 79 -47 -40
3530 -40 11 104 74 281 45 207 -335 -103 -81 -272 145 -37 -86 178 119 -33 -204 -138 307 -58 157 156 -178
3553 -178 -271 181 172 -297 -111 138 -123 74 202 68 -221 162 -122 -135 -20 -180 21 5 76 157 69 -121 -151
3576 -151 -113 -40 178 203 -110 26 79 -117 -47 -332 -223 -15 100 187 49 -63 -220 -44 -66 -75 204 27 96
3599 96 133 207 41 -121 -76 -273 148 57 107 -22 226 267 -191 -17 160 247 -62 241 -77 100 54 69 -112
3622 -112 78 96 47 -85 250 223 -111 99 4 50 -273 135 -173 21 -80 -13 156 -94 -334 83 292 5
3644 5 -92 -128 -156 -252 207 113 40 -136 -251 -270 -230 -150 -120 225 -136 47 -44 82 -93 -300 -76 -189 -37 317
3668 317 269 353 -39 -76 -22 -307 -151 28 -257 106 4 137 -71 -136 102 62 -50 -146 -43 16 -85 -47 87
3691H7L87m40l50L69j01L1k53L78j6K33q0M4k67l1Q9k21J66K90o2r2m53L00l04
3714b96QR5L75j18j28m7R1m0J4J9p6L52n20K06j05K03l2m5m7R2k80M32m07K64
3738A0K06j25nl4j03R3p6l17M47j99J0L24j58k4J16j48KkJ54k03N17n20K5J74
3762A64m3O4k64J52q9p6J52j74K82l4l09K33KQk53Rp7K40L01n13L82j59J03m5
3786E6j41k22M94m05L46r8P1j59L39n21K73J28m22J24Q8jJ7K93l46Kk29L62k19
3809a70K26J88j63J06Ok53J42l01J46J0J58J53k98J00j95Mp3K26r3J08j88N93
3831D32m02j91M26j67Pj57j22n1J34K28j63R0j0k13L07j35l0j67K77J1k89m7J40
3854i2L71l09m70J54L35K06k32l2oK82j42j72K8O6j03J15j1l52L19M6l1r5K67
$$ plain form
3691 87 474 34 -316 53 -48 -17 -270 108 92 325 245 289 22 -9 80 -141 25 315 253 161 -292 8 -296
3714 -296 -288 -193 182 64 -64 -111 -20 -60 -46 -27 -103 249 -271 -65 -170 33 1 -44 -91 1 -279 153 -254 10
3738 10 216 91 86 52 -51 42 -34 -351 96 -103 -93 231 73 49 165 17 19 17 171 -32 485 -35 -10 164
3762 164 121 185 -79 73 -16 -92 60 -114 168 134 -175 58 60 68 -185 -176 -253 -13 288 -225 157 -2 101 56
3786 56 -85 -307 187 -218 128 30 101 -58 281 -240 33 161 -261 -137 -49 -50 -33 260 -86 -84 -313 49 -170
3809 -170 56 244 81 187 193 -60 82 -219 -73 -63 95 248 -50 50 -145 -141 -214 12 -81 27 -161 432
3831 432 30 -161 265 98 105 -52 -174 -225 -91 137 -26 64 54 -159 148 13 -17 -184 93 104 -185 -232 -92
3854 -92 279 -30 -500 -346 -11 195 -37 -69 -75 207 65 -107 -79 -13 -116 -1 -12 -364 -45 1 -30 -125 142
3877A42k2l09J04K5J07j28J59l95P23l76j13L22k72n2J84j22M6k70N37n4k09K48
3899B75l51J59n9q7R5m9j26K31k81M16l0k52qJ3K19O6k93k94L98l02r4N63J04
3922C13l63K49j75L1J98pj32j34k24K25k33J76j11p9J08L97l48J96l41K08j96
3943b42N1K81p0j56J71p8j38K1M38k89K91n40J51m8l4L87k91J55r2J26j43K09
3965A60k5k68Q5p3J66r9r7M21j64p6q3R1j86J04j20L78j15O8k10L84j29J49n63
3988b02L45j67n1L13j81r5k2L5J37m6j06M32n06J50k03J6J45k16Q6J40K55l6l52
4011a29K05L77m44l93L33j14Q3k3m5L62p7m29j21M30P6J03o8q1L8j61J81l27M34
4034B10j50l68K75P8J66k5k08r5k58L40R5J2k28J80P9J14q8k05L06k60p0Q6J1
$$ plain form
3877 142 120 -189 -85 -60 47 -81 78 -317 406 30 -83 239 -33 -85 99 -23 23 -247 290 236 27 275
3899 275 -76 83 24 -63 32 -17 -143 88 -193 223 193 -59 -67 -54 165 231 -62 -356 42 -260 -354 209 313
3922 313 -50 199 24 55 253 246 114 -20 -244 -19 -252 -76 -187 -266 -158 239 -109 87 -254 -46 -242
3943 -242 -191 90 20 -136 35 -43 -181 -160 278 -11 280 -260 -109 -157 -191 196 -95 60 -32 94 -49 160
3965 160 135 -133 -48 -121 45 -54 -151 270 106 30 -53 38 -148 -44 -164 214 99 167 -43 341 212 361 -202
3988 -202 143 -24 -75 238 57 -38 -60 -25 112 66 -40 392 -114 36 -167 -151 -6 -222 -136 4 259 223 -129
4011 -129 76 453 9 -384 -51 -165 -82 -105 -150 212 135 -294 -415 15 91 194 126 45 83 -78 103 -224 210
4034 210 60 -308 -33 45 211 186 -22 -117 -375 -35 60 72 -156 24 103 217 129 -76 230 -30 -100 -14 -3
4057ck53M26l57N14n19J04K10p9r2N4J65j61L37j45j06j68J45J36m10K41j26L3
4079e4L52m53K0J58J11N7q8k4Q4k29J45r5q9j51J58J66r8lj74J86o8M2k55J58
4103a44MM3K58J21l29k3K6R5j8NK75k07K28m06K02j30R0j43O6j09K95k22l6Q5
4127B6J7K01k88L30k28L3J37l73j57L57l23K71m20K61L6N69n62J78N5j87K00Q8
4149B21m9k27k2K12r1j01j10J82R9j39J52k21J17M9k05NMj25N46k61n0J59R1r6
4173A40m4j37J21k61M98k65j57J31k38J98j64J28J04m1j80K40J46l6j48j22K28
4194A41P0j55K94m92L4L73k29o4k0N9j50M42l52M15n22j50J18L85j96j91Q3l8
4216a45K52j69M39k76j18j30L3L69k5J4jj92L25k76o4N0Kl0o6j72K32J38k97M04
$$ plain form
4057 -3 -256 170 -187 327 -192 -88 122 43 -49 5 170 9 346 201 95 -73 72 208 -202 39 -87 -54
4079 -54 298 -155 -135 23 134 191 103 79 163 -66 79 -16 -105 -256 -98 68 -30 -33 -207 -21 -89 -47 -302 -144
4103 -144 -140 -97 161 282 -47 -70 -44 51 33 38 313 106 334 -72 130 0 90 -53 13 -96 199 -23 -59 26
4127 26 43 244 -44 286 58 91 228 -145 -302 55 -268 3 -417 -156 -120 449 -113 65 120 -67 133 221
4149 221 172 -55 -77 135 44 -57 -167 15 114 -25 127 -94 23 72 -133 -128 -124 -249 297 36 -14 145 236 140
4173 140 96 -41 80 -181 317 52 -105 26 -212 -14 -178 -50 54 13 -167 73 219 183 35 -87 141
4194 141 211 56 350 -142 -108 265 36 -28 -48 11 -139 303 -49 366 -156 -306 -188 197 1 -190 -107 -145
4216 -145 107 -62 377 101 -17 -147 -114 255 230 244 243 51 376 100 36 86 88 58 -8 -180 52 190 -107 297
4240B97k10N4J54m48J17J61O0qm93K40K47m43M79j41K16l28m7j46L17K5q9j42
4262a28K68j52k4J05m6j20L7M21m79K26j81j05M6K16J7R4J83o18J86r3K96k2q2
4285D5p0Jn7J2J18K16J5j66Q5j3m35k56O85l2K7l6j87%p1j32J01J30R5j13N6J06
4311A24l67N78O8m79K8J39q5J42Nl73L97M2k17k29J19J63j41l6K75J44m19J86
4333F4L4j69j20M3j20M46j56O9l68K78R5j31J03k67M46m8m35L24j25J35m5J91
4355B44k17m17M84J30M6k17K1J91m39K25k34O1P4J91O6o5Pm44K15Pn9N27l38o6
4379go6K52j66OK21m20M05k58O0p1P0J66k55J26k31m6M12k02J56l03J08P7j15
4402h1j29k9L35J36p3P7p7m20j23N79l7k56O1J89l09k20L01O0r9j77K89j94j3
$$ plain form
4240 297 87 141 295 -153 -36 125 185 177 -316 -76 171 -272 207 66 282 -46 -93 -239 78 103 14 -128
4262 -128 140 -12 -36 69 23 -97 -60 361 -118 108 -73 -178 -132 84 101 195 378 -240 -54 -147 149 127 45
4285 45 -25 -24 -81 -69 49 265 280 114 199 186 -249 -505 180 148 175 139 -48 -48 -119 -251 -150 -20 75 -38 18 124
4311 124 -243 335 403 -76 -48 91 6 148 153 -220 177 219 2 -227 -108 55 -86 -122 153 297 -122 64
4333 64 98 -71 -191 -148 -268 178 22 91 -277 1 96 -35 68 -199 247 199 -236 88 -37 98 53 244
4355 244 27 -390 94 224 270 53 74 265 -174 51 -183 -122 -48 143 209 144 151 -293 -78 -71 -130 397 59 -7
4379 -7 -73 179 13 19 240 -180 225 -33 27 -44 26 192 -63 63 -168 -214 198 -4 152 -151 -43 34 -81
4402 -81 -210 -239 96 232 159 236 159 -261 -384 195 158 -98 -37 152 -157 -377 -76 -16 -115 -292 -3 -197 -210
4425b10J19L88m29O4r8j42K87J46p1j88K18K6m9Q9l51K85l71J98M0J05r1J8p9
4448i6rM4j67M48j10k24J77l67L51o9o5M4JO2Ok58L42J27m13m2L9L76L1J00p4
4473B54n19L52pR9p6p7k1J03j21j84J38K07j91j01K09m2j90J54J8K0J13r5K46
4496B89m77K44l20N03k34J3q3j16L61j11l3j55J57n1l33L57N6Nk8j10O6Q4j18
4519c4Q9l9L36l24Q9j77K4L08k82J91m14M2L83k75K90k04N7k9J41lk20J8k56L55
4543F6k84K20o6L39p7l05j3N7J38J08J01m51J64M5q7j92J98k96m4O59M0m35J71
4566E6j21J60j92J45O4qj82J51j37j56L29J62l37K5o6K01l44L18N9l21L13l76
4588b57J14K05j3j33K71j13j0J30J15k15j34K11k42j85j13L97j41J68l24K82o3
$$ plain form
4425 -210 -91 297 -132 -68 -166 -308 -21 125 54 -134 84 110 61 150 -201 84 -287 -89 -49 56 -35 -17 -96
4448 -96 -105 -61 -228 220 110 -114 63 -304 47 -22 -87 -43 -42 20 26 -232 110 237 -176 -218 -179 197 228 328 254
4473 254 -265 87 80 179 103 26 5 108 -13 -197 -59 148 -43 -144 65 23 -167 -13 5 25 138 43 289
4496 289 -188 56 -264 239 5 18 -65 -181 180 69 36 -119 38 -13 -346 11 67 72 44 -66 0 84 -34
4519 -34 55 16 352 28 117 -60 -36 272 -10 181 -233 -191 192 -83 207 3 60 31 172 169 -51 -33 -289 66
4543 66 -218 2 -64 275 198 -107 -120 -63 75 183 284 -167 -3 42 -45 -237 -39 -335 -379 280 320 -115 56
4566 56 -65 95 -97 48 112 104 -78 73 -64 -220 109 271 -66 -41 -107 94 -250 68 127 -194 119 -257
4588 -257 -143 62 49 -84 187 74 64 194 309 94 -40 171 -71 -256 -369 28 -113 55 -269 13 -50
4609e0j88K31J4K93k60k48K68j47m2J61K43m51K74k85L59l00K27j77j88K91m2
4630a7j34J29k10K09k81L98j20p3J63l45L50J8J4J69n0k22N4j89K63j38J4J58
4652A60k58J61J82j69M2k79K56J95k98K82l90j39K32Q9j56j9lJ4J28J8J27J2q1
4675A06J88m56j2j3J45N3j07O1J18J30o2j27k02K06J7r5QJ25L3j86P0k05M29m2
4699A82k32K6j13K95j62j92M76n40M81o5k28J85O0l57J8K98k87K69j22p1J80J00
4721B01l89K15j3Jj1k70K69Q3j50j06j25N00K8j13o7R9j05%n0j93L47N9r2l92
4745b74K33o3k0J35p8J81K3k37K90Q0j59Nj41n3j81L07q6N2L54l88n8j24M06k84
4769h0j49N56l29m4J78j02q4k29J07j28M48j29J39m62K65r7J37M3K82l42J74k87
$$ plain form
4609 -50 -238 -7 7 300 40 -208 60 -87 -129 32 275 -176 98 -187 172 -128 99 -78 -266 25 -17
4630 -17 -151 -22 -232 -23 -304 94 -26 -99 64 -281 69 87 101 270 220 -2 52 -137 126 -12 2 160
4652 160 -98 63 245 76 118 -161 95 290 -8 274 -116 -255 -23 66 -90 -109 -112 -98 30 48 175 187 106
4675 106 294 -162 -174 -187 -42 11 -96 -35 83 213 151 24 -178 28 45 -50 -42 83 116 -70 0 -205 224 182
4699 182 -50 -24 -137 158 -4 -196 280 -260 221 156 -72 113 173 -184 -166 132 -155 114 -8 -79 101 201
4721 201 -188 27 14 15 4 -266 3 86 -64 -170 -295 205 233 120 53 152 47 47 -3 -196 151 210 118 -274
4745 -274 -41 -104 -124 11 -67 114 137 -100 190 270 111 116 -25 -78 -259 48 -38 14 368 -20 -78 -202 204 -80
4769 -80 -229 327 -2 -46 132 30 -54 -283 -176 -304 144 15 154 -308 -43 -140 -3 40 322 -20 154 -133
4791a33K52K09l52JJ72j63J29l01J31j23J25L8O6J38r9k63O4P4j86J65J58k93
4813a91R6p2R8R9k9m2J81O4L7l58j34M19J2k72J28j12rK40j58jk6j26M5J76l41
4838b76J23j72N62l84J88O8k76k05M48k36M55l7k30K9N9j80L53j61k93L6K01k42
4860a70K20k70K30L8N4j75j23L41l36j66J36K33j20L25q0k57n7J79o2j84O3J49
4882c2K7J2Q6K9l18J33K14j1n5j82o6M47l64N9pJ27np0J77k91M03k72M7J6k60
4907a56J60k7j5J5J55j53LJ23j67K76j45k88J28J32K98m37K4J44k14j0K23K42
4929C11k74k02J63n5P5J24J18q1k26k42M22k02K10l20L52l06K99k85k2J42j87
4950a86L80Lj31L9j39M6P5j01K70j46o7On6j11P8J26r4j46K77k48o2J09M9J61
$$ plain form
4791 -133 119 328 -24 -23 149 -14 115 -186 -55 -178 -53 -15 51 189 90 -173 -109 -35 -221 -56 102 -191
4813 -191 -95 -167 -69 30 1 -41 140 204 241 -117 -251 168 180 -92 36 -76 -85 155 -3 -4 -30 -156 -111 65 -276
4838 -276 -153 -325 237 -147 41 109 -167 -372 76 -160 295 258 28 57 116 -64 289 128 -165 -129 72 -170
4860 -170 50 -220 10 48 102 -73 -196 145 -191 -357 -221 12 -108 217 137 -120 -177 2 -60 -244 -181 -32
4882 -32 -5 7 93 122 -196 -63 151 140 85 -97 -163 284 -80 -21 -28 99 94 24 201 -90 313 41 88 104 -156
4907 -156 4 -23 -38 -23 132 -21 -18 105 -62 214 69 -219 -91 41 339 -98 -74 70 -144 -154 69 311
4929 311 37 -165 -2 -57 18 142 260 179 -47 -289 133 -69 141 -179 173 -133 166 -119 -141 1 -186
4950 -186 194 197 66 105 -34 12 87 -14 256 110 43 49 -7 -118 -40 86 -8 -154 123 -125 -187 -78 -29 132
4974A32p2k31J59q9k83M19Pp9L1j3j26j7J20K09k21J52k74J20O0m1K8J20N7n07
4998c39L81k03L45k91J42l8L48l59j44J76Rm4M3l9J59k48O4j43m7K08r5L17l13
5021a11J60p1O4j37J03j33L80l97Q4J37o7Q0j65N2K81m38J90N61n80N8k41K86
5043I6oJ43j00K9j26N2j0k7K3j43K20j76J7J32k83L8K42k54J02o2J64k10J41M8
5067E0K10r0k85O0k2O5j50M54p3j53o8K84k55j4k94M57j64L4q5n9L27k08J4K60
5091B95k18L4j11J55Lp5J42l25N0K79k2M4j11M2k65L20k77J24K46m17QR4M3K7
5115H5o8k4M6M7o9m9K41r9J98l27J09N0q3j14J26j24L2P7j68M09j88J10l95K12
5139C4j01L0QK07j60j29K60o0r5K21j49j21L2J9l74M48j36K24j63J18j15j74L67
$$ plain form
4974 132 60 -171 -12 -101 -384 35 42 -37 -6 -19 -145 -162 -42 167 -54 98 -176 -56 4 -37 -9 111 168 -339
4998 -339 42 -161 184 -107 35 -3 345 -14 -158 18 27 -17 26 -13 146 -102 -38 -181 -228 -20 -115 202 -111
5021 -111 49 -22 42 -95 8 -125 255 -142 -58 79 12 92 -73 -21 260 -178 12 573 -7 51 -190 96
5043 96 90 233 133 162 36 88 78 51 74 -69 151 -25 -8 124 -159 -121 121 -133 -31 -93 71 -139 2 50
5067 50 260 170 -115 -55 -77 -12 -162 292 219 66 -2 282 27 13 -281 176 12 46 -39 -98 229 21 35 295
5091 295 77 111 0 155 158 83 225 -100 -50 229 207 251 140 182 -83 237 -40 84 330 -87 -79 15 58 85
5115 85 17 -7 39 86 17 -32 209 110 308 -19 90 140 57 -57 69 -55 -23 54 -114 295 107 217 -178 34
5139 34 -67 -37 -29 178 18 -111 149 89 -6 215 66 -55 -23 -4 -378 70 -66 158 -5 113 -2 -176 191
5162A91k35N9n4OJ53m30J61K00r6O0K30q6m74K22K3o8J0o8K57k49L89Rl71j16
5186b77L56J7L31q27N18m61M95r2J90k98P5J08%k23j08M08j61l9k36K85jj45P1
5209a4j3K73o42M99K01l09J01J0j16MK94p3o7k04J84K6k10l6K11j50j88K36l41
5232c24L62j94K02J88j61K02k95l0j90J71K34l70M34P4k30p0K20L21o67L1L00
5253B08j40q5l45K42m3K53j53k25K56O5J1l72L97rq9M6J07J1j96N3nJ03N3k00
5277e7K10j50J47r9k06J17K85l08J97l35R4K99k67L04m79P1K19j26K26j8k05K75
5299A94k05J14m73M95j43R4k01j53L32l62M48j46J5PK27m37L35p7l42L89R4j90
5321A5J09J05J09l26j24k02M93j43l7K42j99J9k84k66P39l16N26k93J49k97j04
$$ plain form
5162 191 -44 15 -39 -33 120 -310 -149 51 -45 15 245 159 -315 -93 -70 -138 -128 -196 61 -188 201 210 -161 -277
5186 -277 79 96 427 -400 118 -343 152 60 250 -48 27 135 135 -88 -196 212 51 12 -224 61 60 -85 -14
5209 -14 -27 246 -396 103 304 -5 96 106 -10 -6 288 215 148 -56 128 154 -56 -92 119 -31 -219 17 -324
5232 -324 38 -156 46 234 73 275 -20 -50 -240 -69 165 -205 229 303 73 3 223 544 -123 -92 208
5253 208 68 -17 -362 -120 -163 90 -63 -288 -32 33 44 -328 69 60 -29 17 124 135 -61 -8 -13 90 143 -57
5277 -57 153 3 150 51 -155 -38 247 -61 136 -199 -105 194 -73 231 -248 -177 42 -84 142 124 -81 194
5299 194 -11 103 -370 125 -18 76 -125 -278 54 -308 140 -6 9 16 243 -194 141 64 -278 111 205 15
5321 15 124 229 338 12 -112 -314 179 36 -1 241 42 61 -223 -489 250 -66 460 167 316 19 -85
5342h5r4K52m2l05L03j51J62J35k63K89k42K6R1n6q1N9j13M3J20q3J03r0O2M6
5366H6k89J9J84k32K21J25k68O1J04K69Jk61j65J24M0m5P2M1l4qj6j13KL46m06
5391a42K00k20K20k30J25J20J01k34K27j12k31K09k13K76j50k22L60J0r4m50J47
5412c03J32%L49j60n8R2k76RN1K02p5j8K08j57j17J29l35J79M28q8j89p8R8k6
5436cK81m43N55k84j36n0N3mk13O6K59L0N9mj8l81K77K3j62L08l08j26lr5J79
5461a40K25J12q7k15o5J93j5n7M3o2j14M48k15n3m1r4R6rj10K43l43O8K68j50
5485g4J07q9o5J04R4k94L66k40K90k43J44m5j48K39J12R1n85L25k21K70Pj83J92
5508A54j60M7J66p2j55p2K2j01M84j57k94K55J6l71M12j75j64K53k89L44l0n1
$$ plain form
5342 -85 -179 73 31 -274 29 -122 40 175 -88 201 -41 -15 76 20 -61 -2 -115 -72 48 -35 68 -22 40 86
5366 86 -203 -184 0 -232 -11 114 -154 -93 11 280 281 20 -145 -21 19 -26 46 87 53 45 29 -84 -82 264 -142
5391 -142 58 -162 58 -172 -47 73 174 -60 167 55 -176 33 -180 96 -54 -276 84 94 0 -450 -303
5412 -303 -171 -171 178 18 -40 52 -224 -215 -164 38 -37 -55 153 -4 -121 8 -327 -148 280 192 3 -75 23 -3
5436 -3 278 -165 390 106 -30 -80 -27 -31 -244 -178 81 111 170 166 148 -233 44 67 -95 213 -95 -221 -224 -319 -140
5461 -140 85 197 110 -105 -170 23 8 -49 -6 -68 -182 266 51 -2 -43 -137 -41 -50 -160 83 -260 -192 76 -74
5485 -74 33 -56 -121 -17 77 -217 149 -91 199 -44 100 55 -93 146 258 349 -236 89 -132 138 145 -38 154
5508 154 -6 41 207 135 -20 -92 -70 -171 313 156 -138 117 133 -238 174 -1 -165 88 -201 143 113 62
5530F2k03J58P1K51l54l12L76k00K69J19k94j68J9l3K25k3J86j50Q6l4k85M42
5552B08k47j33K46q2l12J04O3L76j28j00j17J24L1j31l3M28j04o3J3j42K90j91
5574A00K36l92K87J15o06K79J08l26L45l16L5j09K44l25M72k08j12K83k54o5J7
5595a92O6L22k02k09J06K73k73J25j90J68r8J65J70p9N9N0m15J21J62l51J92K42
5617B12j44N7j96M8L44k97K0j45l1L53k67J05j49j6q9L32q3LK07k99K00K9m04
5640b10J82J64k98J98m5j30J9J05k07j09P7J23l8j6J95J33K5J59q01L00L7L71
5662B34l99J07n2j0P4K0L1n8N4j05m3l6L00p5n2l1J98k35n9rJ41k77K06K40j13
5687E1J94j47q4K75k0k49l7J46j74L71l15j48K77q5J63j58p7j43q2M28o3j50R9
$$ plain form
5530 62 -141 17 88 339 -15 -327 49 -151 118 237 -57 -225 -206 -239 -14 -37 149 -1 85 51 -234 208
5552 208 -39 -172 74 -8 -320 -216 -153 223 95 -5 -122 2 33 -98 -131 297 193 130 143 1 291 100
5574 100 336 -56 231 346 -260 19 127 -199 146 -170 -135 -244 0 -325 147 -61 -173 110 -144 -209 -192
5595 -192 -126 196 -6 -215 -109 164 -109 16 -174 -6 -104 61 231 152 211 261 -154 -33 129 -222 -30 212
5617 212 68 125 -71 -23 321 24 44 -101 -132 221 -46 59 -90 -106 -195 137 54 57 264 -35 165 194 -210
5640 -210 -28 136 -162 36 -9 -139 -120 -15 -222 -331 -254 -131 -169 -185 10 143 168 327 -474 -174 -137 234
5662 234 -165 -58 -110 -120 -46 -26 5 -53 1 -104 -147 -183 117 42 -10 -41 157 -78 -137 -146 -5 -282 -76 164 51
5687 51 245 98 14 289 269 20 -17 129 -45 326 11 -137 140 55 218 60 -17 -160 -242 186 123 -27 72
5710G2k53l0K09k18J49m8L26o9Q2J00l80K4j6Ql1J16L8J38k84R8m4J38j57K45
5734B13m03L15r7j8Q9O6p1l17K79qj5j91J28J54J40k62K89n27J28J98lJ08k25
5757c0rk02M97k98R3J31j36k90L04O9l93j22L70o1J67l5Q4k68J05j6Qk1R5p4k0
5782e2O6n9j42R6K60j83j9L12j80k94M23n3k27n0J35j1J91l34J25L45k14k24J47
5805E8l5k20j21J72K75o2l1l7m9oJ3J63k51K28N7l12J4J10J82j83K16j25L8N4
5829A48m72M99j56L1J28k92L32k88p9L91m42M89l04m10M79k10J10J21j51Q6J97
5850B07k54k42j7N0L37M3p4j44j59j1L09J13n7j32J93r6j14m4L07j06l34K75J68
5873B18r2j9j59K49o1n6R5k13J61j55L18j66j05L2o6j02M19k66R8lk10j51M5L54
$$ plain form
5710 72 -181 -211 -2 -220 -71 -119 207 138 220 320 -60 -36 -52 -44 -75 41 79 217 -67 31 -13 125 -32 213
5734 213 -190 125 28 10 99 165 94 -223 56 48 33 -158 -30 124 264 2 291 -236 -108 90 87 195 -30
5757 -30 -39 -241 256 -42 51 182 46 -244 60 129 -264 -386 -16 -77 90 55 139 -129 -24 -40 -32 -53 42 -32 -52
5782 -52 14 -45 -187 -91 169 -14 -33 279 99 -195 228 175 -52 -102 33 22 213 -121 4 349 135 -89 58
5805 58 23 -197 -318 -146 129 67 36 -1 -50 -56 -43 120 -131 97 154 -158 -144 -34 148 -35 181 56 94 148
5829 148 -324 175 19 50 178 -114 218 -70 -149 242 -200 289 -15 -425 54 -156 -46 75 -76 10 207
5850 207 -47 -289 -306 -256 81 124 50 -94 -253 -264 45 158 101 -31 162 66 -48 -92 215 109 -225 50 218
5873 218 126 107 -52 197 136 80 175 -38 123 -32 286 120 15 47 -19 -121 298 32 130 127 -83 -234 -189 165
5897A65p8q8k16J88j17L8k2K60l27R1K48L3j05j21J2J07j71k60K81k69M75j04
5919B0j73J53J83r0k44L49l00J13n8L3j76J75j44N2L64o10j9N47ok16P5J59j90
5942cL93n84O4K58J09p03M87K11l09J02K20k21j63O6J78j62J85l03M03k30o8O3
5964gL47l10ML9k37K85k17J02K29l91J09K11L7j97j69O9K07j33JJ34L1j14Om8
5988a2m5N9M8j32J44L79n43J00m4K29R4k90j09p4K92o1k26L24o9l43k7J4L32J00
6012A40j41K21Rj82j64J88j24L8K69l84K07J20o4l11J81n5j59K35O0j7Qj14o4
6035a03N9M4K66k36k01J41j21K66j29p6j6J19Nl01L50k43L03m82J34L79k30j30
6057b02K98O6Q3l22J18PJ8j24N6J43n8p9p5J0p7P2J69k19M07k87j4j1j28j6K16
$$ plain form
5897 165 87 -1 -217 -29 -146 -108 -130 130 -197 -106 142 175 70 -51 -39 68 -103 -363 -82 -351 124 20
5919 20 -153 0 183 93 -151 198 -102 11 -47 -14 -190 -15 -159 -107 257 -353 -372 175 169 -47 28 187 -3
5942 -3 390 -194 -130 128 237 -466 21 232 -77 25 245 24 -139 -73 105 -57 128 -175 228 -2 -70 -7
5964 -7 340 30 34 73 -164 121 -96 6 235 -156 -47 164 201 4 -165 -96 111 -22 -21 113 144 30 36 -12
5988 -12 -57 2 50 -82 62 441 -102 -2 -46 183 277 -13 -122 -196 96 35 -191 133 64 -279 -306 -292 40 140
6012 140 -1 220 229 47 -117 71 -53 -15 254 -130 77 197 133 -178 3 -52 -211 24 84 67 75 -39 -103
6035 -103 -44 0 266 30 -171 -30 -151 115 -14 -90 -106 13 18 -283 67 -176 127 -355 -221 158 -72 -202
6057 -202 96 162 245 -77 41 48 66 -58 -2 141 83 4 -71 -61 -138 -66 103 -116 291 4 -10 -21 -149 -165 51
6082E1j4J43m08K16K09p7j01j62J60J06k37L9K69p5j72p0L74m00M2K33R7l57n6
6105a90K54q4J58k06j43M6J10o4K85l27J39J09j76J35K0p3k11N58m65M86m74L25
6127B12k21k09J70P2qK03j11m92L97l77M38L5P0n4l01L12j06jK85l09O1J31j01
6150I6l15L8M1P5N8Q0k81K61P4k2r2k49K76k54M44p24P45k00J84j33k0qj73P1
6174b8o6J90j05j48L07l81M82J2l50q0L72k93K58j72j00K43k20K58k78L68m30
6195a61J00R2j9l0L6K78m61jL13o3k94J50m2l7J33L09n35K17o9J40N3m6r1J74
6219A46R6k15m2J65j28j13L44n6l38Q4J17j57L22j48q3p3J9J34j10M2L58l43r8
6242g7jJ74r6K40j77m4J24k02K66m69K60n2Q7j32J73m57N81r0j1k19j0M2K07m6
$$ plain form
6082 51 37 180 -228 -12 197 120 19 -143 17 123 -114 -75 194 119 -53 -123 251 -149 -107 126 223 -134 -190
6105 -190 64 -20 138 -68 -211 -165 -55 -119 166 -161 -22 87 -89 46 66 -7 -218 340 -125 361 -113 212
6127 212 -9 -218 -48 24 16 219 108 -384 13 -364 74 109 179 125 -176 136 30 29 314 5 66 197 96
6150 96 -219 -181 -140 -65 -7 73 -208 53 127 105 13 -236 40 -214 230 -494 251 51 235 102 82 74 -99 -28
6174 -28 -94 96 -9 -157 150 -231 251 263 -87 -167 205 -88 170 -2 -102 141 -79 179 -99 269 -161
6195 -161 -61 31 12 -18 18 296 -165 -166 147 84 -210 -60 -102 -139 -6 303 -232 -15 -84 56 109 63 -28 146
6219 146 242 27 -15 150 22 -91 253 197 -141 -57 60 -97 225 77 -6 -79 -60 74 -36 6 364 21 -77
6242 -77 -78 96 0 240 63 19 143 -59 207 -262 -2 -54 33 -99 74 -383 198 108 97 -122 -132 -90 117 71
6266G1m6L52j27m95M8M56k81J01k72L87m6l47m4L57j89K4J16P0k19j90K99L76
6288D01j39k83m00L49j1J12l2%n7K81j07l25J47O9K53m11J6l4o4M18J0kk19j18
6312a46n2L02m4k28J12j3K65j71j85K11k3N1J07m30J37j35K47L1J07k72J33r1
6334h7M2l0J48J65q4N0j30R6j08j29M34j60m16Q0j3K52o0J97m61L24r9P8j06j90
6358b07M17l98NJ69J13J84r4k05J93m3k95K56k6l7l7m2m2J81k17L23r5l2K7m07
6382c09P98n60N8K12j85J03j37j37J10J51j31l8J37k06P5O6m86O32l18J37l08
6403c36K78K6k0k8j04L23k13J37j21J75pj80K09K64l07q7k7K22j15J15l9LJ8J66
6427C52l51j19K90p9r4j96O7J87R3m2k94K93Kl50M80j99j87J55J82k84L39l89
$$ plain form
6266 71 25 377 250 -245 -197 259 -22 79 -193 194 148 -199 -243 114 -75 -51 65 135 -84 -274 25 401
6288 401 262 -21 -421 -72 -83 29 -3 -3 -60 221 114 -211 -64 5 258 -153 -137 -171 -235 183 193 191 -28 -146
6312 -146 -198 104 60 -168 -56 -69 196 25 -160 51 28 79 186 -244 -107 -242 5 36 143 -129 4 -87
6334 -87 -45 -75 73 238 154 204 74 170 62 -67 367 207 -209 -129 -142 110 50 247 -214 110 11 89 -17 -207
6358 -207 210 -188 -183 -14 99 283 189 -16 177 134 -161 95 69 32 -5 -47 -89 92 -125 198 103 71 98 -309
6382 -309 489 -71 -13 199 14 117 -20 -157 -47 104 -27 -65 72 -134 -59 7 -479 153 -165 -28 -336
6403 -336 -58 -32 -52 -80 -184 139 -74 63 -58 117 110 -70 139 403 96 9 -18 204 89 204 165 168 186 352
6427 352 1 -118 172 93 -1 -197 -130 57 150 108 -186 107 109 -241 239 40 -147 8 190 -94 245 -144
6449a44J70o6k6j63J9J59PJ7K0j21Lj61k07L15q4L12j97L61j92J99k02j56K45
6472A08Lk8J17q9k16N0J30j10l1K03j9k51J92o5m4p8J08J3L1P9J4j14J1J32k95
6497a49K38J1k59L40j63J42k27pK49K70m77n2L35N0m91O0j74M15j30n7k70J44
6519b02K53k6K21k66J48J10j0l20J25Q0l14L76j08J73k32j12P2J94p7k24K07j05
6541c7l6K57l41N9L57m55K59j36M01l12r1J86K5n7m5k44K73j7N6l06N4Q0P8n7
6565d9J30J9j73k37j31N17j2M3k04O6j24l0K72j58N6K63k9m39K1K0K18j37J2K62
6589A76l75K65M09l38o9M6k0m83L30J49K2j55K53l70R7o2m1J61n21N52j89M0K37
6612A14j10L63k58J5M8k89J37o7L7M7k38j86M42Om3o5K47l65M78n67J50K33P7
$$ plain form
6449 -144 26 -40 -66 -229 -210 -51 -44 -27 -7 -128 -125 -286 -493 -178 -262 50 -147 214 22 221 19 -137 108
6472 108 111 83 200 111 -105 -55 75 -35 -66 137 118 -133 59 -6 -50 -128 -20 -7 24 103 117 3 14 146 -149
6497 -149 89 100 -159 181 18 160 -67 -74 175 445 -32 -84 251 301 -190 -130 -304 111 -19 -76 -346 -202
6519 -202 51 25 246 -20 128 238 228 -92 33 113 -201 175 67 240 8 -104 -32 162 85 -139 68 -37
6541 -37 -73 184 -157 -98 259 -196 63 -73 328 16 -75 111 136 79 34 -210 63 46 102 -204 -150 -70 8 -49
6565 -49 81 100 -73 -310 -441 76 64 107 -97 -31 -155 -185 87 -71 -15 248 219 -220 -199 -179 39 -98 -86 176
6589 176 -199 66 475 137 68 114 94 -389 -59 90 112 -43 210 -160 -63 -125 -166 -5 -526 26 -163 -123 114
6612 114 4 367 109 124 172 -117 20 -47 -10 37 -201 -387 55 61 18 -47 200 -165 313 -254 -104 129 206
6635B06l05K13r4J38Q1q3M2m49J88Q9m1M2L7O2j97L66l14k2%J84j98K6J67m4j93
6660i9J18K64l33K46l66K64k90M46J18o30Q3j61L04P3m2J0L2r3l03N56j20k3L7
6683I1k2j36j83J57MJ63j94L9l8L48r4O5l30K33k63L88k96O7NM8M9j11K45j51
6707H4J61k57R1m4k51J64J53j17j81K13J61j42m1L2J13o6J05l85K60j2J23m16
6729b52J3L64j54K44l08J71j38J06J05j65N0k59L45k08j75J29J68K7j23L3j6j21
6751a64K42r4J02j3N0r4K70n30K20L2K65k99j3K3j6K15l88J17J84k68j04j5K20
6774e8j04J91J05L0j62J59K0r3r7R8j23J44l9j15n4J43j09J36P9m25N50k45J16
6797A47LJ33j3l2k49J18j81P5j29k41K47K60j74j42L59l04K09o8J58J11k09j52
$$ plain form
6635 206 -99 114 20 158 239 156 198 -251 -63 26 -15 27 64 126 -71 295 -19 -41 -41 143 -55 -29 138 94 -99
6660 -99 19 283 -50 196 -170 94 -196 250 368 -262 -179 -340 -36 37 -5 5 37 -56 -359 197 77 54 91
6683 91 69 -67 -250 -93 -89 74 -120 -81 -119 229 135 200 -130 103 -160 228 -68 -1 4 52 101 -10 235 84
6707 84 245 -12 79 35 -216 -52 101 -16 -197 16 177 35 -6 26 139 73 178 -207 53 41 164 -252
6729 -252 -239 125 -29 215 -93 78 -60 46 151 -14 36 -223 122 -86 -261 -132 36 63 -60 -27 -43 -164
6751 -164 78 -16 86 73 123 29 299 -231 -11 21 286 -13 -26 -3 -19 196 -192 -75 109 -159 -263 -278 -58
6774 -58 -162 29 134 164 2 161 181 88 -9 89 -34 110 71 -44 -98 45 -64 72 151 -274 276 31 147
6797 147 150 283 270 238 -11 107 -74 1 -128 -369 -122 138 -36 -178 181 -123 86 18 176 287 78 -74
6819g4J04k2L4j71O1J45K9j38J32l1N9l01K9J32M7k50J9N64m13j33L54J28j12
6842A92k85o2L8l0P4J30j3k1q7L8j5P0R3j39j12J09L8R5l60K30J31l4Jo1O2J42
6868B24k92N0R8j68J18r2L27J99l97p0m0k0K92j65k18J80j15R7L31o33L73k0j88
6891a29J77l1q7k00J98K62n62L72q0j04P6K8J20l2j20J48P6K15l61K98l18J32
6913G8j53J57j30K7J4j73M01p6p7j82J21K9o0n5R6k74K06j93J37J6O7J12Q1j1
6937A58j87J69k11n6m4r3M9J92N2l61N05l91Q9J38j17J04k15J6L08LJ15l12k48
6960c37M35j12M53o0m05j10j10J51K02k59R9j25M7l05K46K33k3K30j62j56J96
6981A28n4j75L3K93l69j15N87m84J07M33j68l7q4j24K1k41M10j35K77o51J79J04
$$ plain form
6819 -74 30 8 42 -129 -68 77 106 -32 100 69 128 -173 -144 -12 35 -215 -196 368 -45 -178 176 304 192
6842 192 -93 -155 -117 -147 -73 57 44 23 -64 -26 -41 29 122 -17 -129 -20 18 113 -247 -17 114 80 81 20 82 224
6868 224 -68 -18 80 -88 30 -62 265 464 67 -3 -43 -63 229 64 -154 26 -89 8 339 -294 79 59 -129
6891 -129 48 17 -70 -270 -72 190 -372 0 -80 -184 -108 -80 40 8 -112 36 112 327 -34 264 -54 78
6913 78 -75 82 -48 -21 -7 -180 221 145 68 -114 7 36 -24 -79 17 -257 -51 -244 -107 -91 -24 88 169 158
6937 158 -29 140 -71 -127 -171 -264 -215 -23 29 -332 173 -218 -129 9 -108 -4 -219 -203 105 108 223 -89 -337
6960 -337 98 -14 439 379 -26 -136 -246 -95 107 -152 -53 -178 -131 -436 -190 43 20 250 88 -68 128
6981 128 74 -101 -68 225 -144 -259 328 -156 -49 384 216 179 95 -29 -8 -249 161 26 303 -348 -169 -65
7003f5M4M7NL4k28O5L64O3l81j63M36j40k75N8K32O2m47J77J17K7j77J33j27J35
7027dO7J58l57J90j49J48j77J25O6K00l59J2p3J86l0J58r1m53N35l59J82J49j57
7050c3M56m19p8M10j92j71L31M1m00K11n20M91K5l37K58P1L9k53P3K86l68O7L74
7073C62m56L55l79L91m4r2k90K22k45M6M45r6k08j35L64r6r2m5k8m8J71k12L43
7096B33j03J58j10r5r0j31n7M9L04k35k95L53L7N3l45J4J68k21M61l37J62rK25
7119A89j79n2J24J8l97R5L45l76P5Q6J15j41J30j29p3K07j07R6L95j88k39R9j64
7142g1J09pJ56j21j3J20k31qJ29P0okk25N17n78J98J60j6k17l21K38K58p3m77
7166d11K51K51j62J2J94k72j68M57j37L03n24J79Rk59K89k08R6K17J8N2l58K41
$$ plain form
7003 -65 -21 26 31 65 -163 -98 266 329 -52 -215 221 81 -194 -136 96 158 -289 -112 5 32 -145 -12 -139 -4
7027 -4 63 221 -136 54 -95 53 -124 1 67 267 -92 -80 -153 33 3 161 70 -383 152 -207 -25 124 -33
7050 -33 423 4 -74 336 144 -27 304 345 -55 156 -364 127 152 -185 73 144 183 -70 3 289 -79 -12 362
7073 362 -94 261 -118 273 229 137 -153 69 -176 -130 315 219 11 -124 240 144 52 7 -21 -69 102 -110 233
7096 233 130 288 178 83 -7 -138 -195 -146 158 -77 -372 -19 18 71 -274 -260 -92 -313 148 -189 -27 -36 189
7119 189 10 -42 82 100 -297 -202 143 -233 -158 -72 43 -98 32 -97 -170 37 -70 26 421 233 -6 93 -71
7142 -71 38 31 187 66 53 173 -58 -66 63 133 127 125 -100 417 -161 37 197 181 -36 -357 -119 139 66 -411
7166 -411 -160 91 -71 -59 135 -137 -305 152 15 318 -206 -27 -18 -277 12 -196 -100 117 135 187 -171 70
7188G0J52l50J55J52l6m9j60o0N51m89p1J56J11j54K43q6J4P0k57M5j53J06Mk46
7212b82K16l0J96k90R6N8ro8l7N67j93K44l54l4rj05K93k31j67oJ4J05K20o41
7236d47L97K47n65J24M4K67J32l39J10l04L34Q8j28r9P6J15J15m35M98n67J91
7257a46J87j84L31q7n4j17M47l84k39L02k31K38J2j27NN2j95K40o9J80p8l45J45
7280a17l6L45k00o3J65j47J19m8j45L68J18p69N33l38L17M7q6j30j06K47l88K37
7302g7L68k91K63k72Q4k02J64%J09o8J54l67K43j37K32k61R8p2j22L56l85J26
7324e7N3n3M8J01K42k83n9j78K38r2P9k49M03K7j46j46j41K77K81j04j82J72k0
7347B11j05n4q5r3K47j71J00j33L89o5R6n52J39OJ03Q1k40J46J38j86J00m27M66
$$ plain form
7188 70 222 -128 27 179 143 94 -66 -126 425 -64 -135 21 132 -22 221 135 149 219 -38 7 -146 -40 -36 -282
7212 -282 -66 -96 100 -190 -94 -36 -45 -113 -150 417 224 468 114 80 71 -34 259 28 -139 -145 -131 -26 194 -447
7236 -447 -50 197 -368 -244 -200 67 199 -140 -30 -334 0 88 -40 -139 -63 52 167 -268 230 -337 -146
7257 -146 41 -143 188 101 47 -70 377 -7 -246 56 -175 63 75 -52 -47 5 -190 50 -19 161 83 -262 -117
7280 -117 -153 192 -8 -71 94 -53 66 18 -127 241 359 -410 123 -215 102 149 63 -67 -173 74 -314 -77
7302 -77 291 0 263 -9 75 -127 37 37 146 78 232 -135 108 -29 203 -58 40 -32 -154 202 -183 -57
7324 -57 -4 -57 -9 92 334 51 -8 -186 52 -40 39 -210 193 220 74 -72 -213 64 345 241 59 231 211
7347 211 106 52 -33 -126 121 -50 50 -83 306 241 337 -215 -76 -70 33 114 -126 20 158 -28 72 -355 111
7370A11l0j86J26N6N8K6j85o1M1J80n5Oj79k19K28k50M31j06j38L58n02M78j9
7393A69j17j47K42m66K34J47n2J45N8l27p3M58m12K69j53J08l02L97n8p5J57k33
7415c1o1K02k3j18J14j35J91NK2m0k4l08K41k27J53K15j06j09j20n5J77J61j07
7438A7j94L34r7k83J95J35j53j48J28J5j33P1K80n4k48p1L05k31J49J6K46k23
7460E6j69J2R0k03K7N17n10K36R0q2J13K3m06L63j57M3j12%M1L28K79m65m80L99
7484C3M2l00L05K9j79K86m11J28j41J43R7J12k41J80r9j4P8J95l58J29rk18N1
7507a62L57o8j81q5J0K98j73k34K24j49K48k5k75L55k48L4k28J52N7mJ93p0J1
7530C7k37j85M95%l59L67l12j1N09j24l78R3J06j23J99l60J49L06j62q2j79Q8
$$ plain form
7370 111 81 -105 21 77 135 161 -24 -85 -44 136 81 87 -92 -311 -83 -333 98 -8 -146 212 -290 188 169
7393 169 52 -95 147 -319 -85 62 10 155 213 -114 -187 271 -141 128 -25 83 -219 178 120 45 202 -31
7415 -31 -92 110 87 -31 83 -52 139 144 166 126 102 -206 35 -192 -39 176 70 -39 -159 -214 -37 124 17
7438 17 -177 157 60 -223 -28 107 -46 -194 -66 -51 -184 -113 167 113 -135 -206 99 -132 17 33 279 56
7460 56 -113 -101 -11 -214 -187 330 -180 56 146 64 177 200 -206 157 0 43 -69 -69 -28 300 579 114 -366 33
7484 33 75 -225 80 109 -70 216 -195 -67 -208 -65 32 144 -97 83 -16 -30 48 243 -115 14 5 -213 -162
7507 -162 195 127 -54 -139 -129 169 -4 -238 -14 -163 85 60 -215 140 -108 -74 -302 -150 -93 -97 96 26 37
7530 37 -200 -385 110 110 -249 118 -194 -205 304 180 -198 -105 1 -122 77 -283 -134 172 10 -72 -251 -163
7552a63K42k70J61R9L30m53J67N3J05l30R6j09K62m27M18l7j72j85J96K08l61
7573a70K24J17j82k2J54k13M60k78j19J09j27j70j2R4J91oj85L12k88m4K04k1
7595B8o5J82k25j63J45k35K99J51k73p9O63n73J00m0p1J58p8J09r7n9j46K72k24
7618b21J97m7K43R2k84r4J6K81n13M61M6l01M7J30l31L04k46J18J88j4k00K06
7640G8j17Q6p4k63J50K72l56K77K24m02R7j04K21P1j01qP3j32k32Q5m3J07Q8P8
7664G5j43j33J38Q3R6r4q8J50k6P0j06J51r5j60K62j63J29m85J56J86P0o0j03
7687i0o1Q0J64j49J4j72K79pJ28k1mj28R3J52k76J61n16L50j2N35p27J28k5j01
7711b05J02o5K29K53m26L92l5j74K00j20k71m1J37M3Q9l68L99j3j79J41l39K78
$$ plain form
7552 -163 79 -191 -30 69 399 -54 113 166 271 -59 37 -72 190 -237 181 144 -28 -213 -17 191 -170
7573 -170 54 171 -11 -33 121 -92 368 90 -29 80 -47 -217 -229 -135 56 50 -135 177 -111 -155 49 28
7595 28 -37 145 -80 -243 -98 -333 -34 117 -156 -235 428 -145 -45 -85 -156 2 -76 33 -64 -123 -269 3 -221
7618 -221 -24 -71 172 264 -20 -114 -98 183 -330 131 177 -124 -77 53 -278 26 -220 -102 86 72 -128 78
7640 78 -39 47 -27 -290 -140 132 -224 53 277 -125 -28 -132 89 160 59 51 124 -8 -240 -155 -198 -91 -3 75
7664 75 -68 -201 -63 20 116 22 -66 84 58 128 22 173 78 -82 180 17 146 -339 -183 3 73 13 -90
7687 -90 -151 -71 93 -56 -42 -214 65 58 186 165 161 33 126 278 2 163 -353 -3 -15 520 -207 -79 -104 -205
7711 -205 -103 -168 61 314 -112 280 245 71 271 151 -120 -161 -24 19 108 -260 139 126 -53 88 -251 27
7733B7j9O3J45q6j18k4kL0n9J69k27R1j26L73m46Q5K25l10L20J36p4K07j55n55
7757c30K42j37P2k50J29L66J3k80L11n3R6l55j33M23o7l09L77j83N2k8K48k69
7779f5L02j29j16q7K57J37j88M6M6l9k40K31j16o7l0j82J93J74j13K11j3j46p1
7802ej68L89q3J1q3j13J71l71K38k63P4J22J60r8qp9M29k83l2k28J06j2p6M17
7826B15m93L84k06Pj81L42k02K64j0k91K58jl2k1J96J82l63j89J22k05J32M4J27
7849G9k29R9o0R6k47K51o5k58K72m6J35L4M2J62o1m1k58M5k35J0K99k95M03o2
7873G0J0j22P0J6p9l07L11M3j4l25N13j57j40K88J78l52L6k37L06J80n25K29M1
7896C3q3r4K63k76q3L89j09J03J53m6O4l06j74K24n5mmJ60l86J83K07J09j93k2
$$ plain form
7733 27 8 71 216 130 12 -12 -14 16 -43 126 -101 -10 -136 237 -209 -124 101 -209 111 247 173 380 225 -330
7757 -330 -88 -225 -153 -403 -274 92 105 -175 136 83 179 -176 -309 114 47 -262 115 -68 -16 -44 204 -65
7779 -65 237 108 -8 -95 162 299 111 157 203 164 -76 155 39 -28 -58 -240 -47 127 14 225 212 66 -5
7802 -5 -173 216 133 144 61 -52 119 -252 -14 -277 -203 -81 79 -19 -27 -106 323 40 8 -220 -114 -126 -202 215
7826 215 -278 106 -100 -93 -274 68 -134 130 120 -171 87 86 54 33 229 411 48 -141 -19 -224 -92 -48 79
7849 79 -150 -51 -111 -15 -262 -11 -76 -334 -62 -108 27 61 103 265 204 163 -95 -50 -285 -275 24 -271 132 70
7873 70 80 -42 28 44 -35 -342 -31 12 -2 -327 186 29 -111 177 355 3 39 -198 108 288 -237 -8 33
7896 33 -50 -144 119 -157 -240 149 40 143 296 250 314 8 -166 58 3 -1 -5 155 -231 -48 159 268 75 53
7920E3J84k09j71L25k15j67L33J62M9n36K62J5n1k00J21q4J12MJ01j16j93K78
7942E7k46J63M07l97j19M9p2J04j39K17J61r6j33N3j83j43M97l61K39J42j76J42
7964A66j69j37R5q6K46K7Q1r4r4J03j23k50J38J24j52O0j11N49m87L73k76K07
7986A90l59P8J13J43k37J63K11l39M6k64N16j35k06qj16J73j41R5J52K00l23l1
8008g9J91l75j5K49J27p1j23J09q3%Ll4L4K10k51P8J85m26J01J90L3k38J27o4
8032a22l08N29q1j58J28k98J8L30K1j77K44j99j31K16l58L06L2J01q6N3j09n8
8054a07O2K7J70Pn3nK10q6Q0n65Q2l2J84J34K16n18K50j30M5R0k0j7k67J02r5
8079b36L45J30j27l3K1j21p8J06L5k87K78K67l63K43j71J43O3j83K29j28K31m17
$$ plain form
7920 53 237 28 -143 182 -33 -200 133 295 344 -192 70 85 34 -166 -45 -129 -17 -13 88 -28 -221 57
7942 57 -189 -26 381 -16 -135 -86 -158 -54 -193 24 185 89 -44 9 -174 -317 180 -181 58 200 24 166
7964 166 -3 -140 -45 -131 115 142 223 129 35 138 15 -235 -97 27 -125 -65 -176 373 -114 259 -17 190
7986 190 -169 -91 22 165 -72 91 302 -37 9 -255 261 126 -80 -88 -204 -31 -172 -77 75 275 -48 -79
8008 -79 112 -263 -278 -29 98 27 -96 13 -70 -70 -67 -101 -67 143 -108 -30 155 -271 -170 20 53 -185 -58 -122
8032 -122 -430 99 18 -140 -12 -310 -292 38 59 -118 126 -73 -204 12 -346 -40 -8 93 7 60 -49 -107
8054 -107 -45 -18 152 159 106 101 311 225 305 -260 -178 -210 -26 108 324 -194 56 -74 -29 61 41 24 -243 -141 -236
8079 -236 109 239 112 79 100 -21 -99 7 42 -245 33 300 -63 180 9 152 215 32 261 133 364 -53
8101e3n6L6J16q8K25K9l58K29k5Q5J06l41m0J11j64P3Oj27L26J21q7k90N5M8Q0
8126A7J5j27oM3J3J10p6L3j2J72k44J7j65K5K17m5k7k83N74l86L8Q0j8J60l15
8151a90L71m32K94K16Nl67J53k54K13L9J07l54J58K19l8L02m75p8P5J77pl18J52
8174c2J87j59J23l19N04m55k04J82J57J80k69J29J5k12L2m4M06
$$ plain form
8101 -53 -109 -73 43 -45 180 209 -149 80 55 140 246 -95 -135 -24 -188 -115 -109 -236 90 211 124 -166 -111 -63 17
8126 17 32 -95 -101 -58 -45 65 -11 22 10 182 -62 -45 -210 -185 32 -13 -40 -323 251 -135 -97 -17 -35 125 -190
8151 -190 181 -251 43 259 264 -103 50 -204 9 48 155 -199 -41 178 140 442 -33 -111 -36 141 134 -184 -32
8174 -32 155 -4 119 -200 304 -151 -355 -173 -16 164 -105 24 39 -173 -141 -185 221
8191B21
$$ Imaginary data points
##PAGE= N=2
##DATA TABLE= (X++(I..I)), XYDATA
0@%%%%%%qJ6j6J6j6J6k4L2l9N1o0O9q4R7j11J33j52J73k02K31k63L00l38L82m33
31b30M85n41O08o79P55q41R34j035J149j272J407j560J726j912K123k358K627
48A386k937L292l714M224m844N627o653Q053j0097J3377j9489L4755j41935l11371
62d30326J75201L63799K48567j22537l27612k35589Q2377K88956K34620l2242
72B45214k39832k30996j3243K00158K35533N2353j73572k45554q0323J60983K50134
83A60855Q6458j63355k53372q7915J59394K41406P7206j58037k31666p6179J40134
94a05071K10717Q0763j14182j94888j00350P6993J84063J32008l4831j77385j67311
105b09474k162J77716K01904L6886j72538k25708o1678J65550K35986Q2190j46973
$$ plain form
0 0 0 0 0 0 0 0 -8 8 -8 8 -8 8 -16 16 -23 28 -32 37 -47 50 -61 72 -80 93 -109 122 -141 159 -179 203 -230
31 -230 255 -286 322 -357 398 -443 491 -544 605 -667 740 -820 906 -1006 1117 -1241 1386
48 1386 -1551 1741 -1973 2251 -2593 3034 -3619 4434 -5663 7714 -11775 22980 -118955 -430326
62 -430326 -255125 108674 357241 234704 -92908 -328497 -246120 42836 277456 245214
72 245214 5382 -225614 -238857 -38699 196834 249187 75615 -169939 -250262 -89279 160855
83 160855 247313 83958 -169414 -257329 -97935 143471 220677 62640 -169026 -245205 -105071
94 -105071 105646 186409 72227 -122661 -223011 -146018 38045 170053 135222 -42163 -209474
105 -209474 -211636 -33920 167984 204870 32332 -193376 -255054 -89504 146482 228672 81699
116H1699k30302r6846J17662K12853J11306q1075j88677j28251L9000J65043J45166
127A47578j622j48301j63225k8141J39674J79699M6371j37386j88476n0439J43174
138f1094J95235M9624j44515j90070m2540J45403J86579M4064j35638j79449n0566
149a82967J22740J77360O8938j01724j80802r6253P9725J88103J25301o1415k01089
160f2083j55678M2603K06294J73230l1979k10090j84858J8296J98005J80991q025
171A66706j78368j71050p474J48877J57186K6774j14929j43094m5519Q6567J37508
182F3184O6863o0796j32464p9855N2655J37154Q9476m6558j36588q7524N0959
193h3494J36745Q3946n1373j29598p7403M7269J18410P4123l4177j05005p9935
$$ plain form
116 81699 -148603 -245449 -127787 85066 196372 115297 -73380 -201631 -162631 2412 147578
127 147578 145956 -2345 -165570 -193711 -54037 125662 172033 34647 -153829 -204268 -61094
138 -61094 134141 183765 39250 -150820 -193360 -47957 138622 182686 47048 -132401 -182967
149 -182967 -60227 117133 186071 84347 -96455 -192708 -112983 75120 200421 139006 -62083
160 -62083 -217761 -175158 31136 204366 172387 -37703 -222561 -204265 -6260 174731 166706
171 166706 -11662 -182712 -190186 -41309 115877 142651 27722 -115372 -160891 -74324 63184
182 63184 130047 69251 -63213 -143068 -90413 46741 136217 89659 -46929 -134453 -83494
193 -83494 53251 137197 85824 -43774 -121177 -73908 44502 118625 84448 -20557 -100492
204a00492J1463Q9991R1434J4187p9619j10030m3788O9855J28132O6832o5099
215G2866j42518q4478N7924J47197R4866m8103j41933r8922L3496J28496J01730
226A20621j3416j08427j03364r211Q9854J07836L1923p4040j14114m8522O4667
237e6193J20745N9488o2942j25879o2997O4590J27639O0700o7930j26363n6639
248a25781O8134J22357N4066o4390j16822n5881N5244J13266O5133m2298j09954
259c6926p7920K7217J10891R5221j1063j11783j09928j462J12985J21380J2216
270A30828j09500j25225k0172J01418J22244K6581q8238j14180l3088O9969J00661
281F1298L9266n0464q9161m8702L0984P8343N5788j6812p3106o3093O854P0152
$$ plain form
204 -100492 -89029 962 92396 106583 26964 -83066 -126854 -56999 71133 137965 72866
215 72866 -69652 -154130 -96206 50991 145857 97754 -44179 -143101 -109605 18891 120621
226 120621 107205 -1222 -104586 -113797 -23943 83893 115816 41776 -72338 -120860 -56193
237 -56193 64552 124040 61098 -64781 -127778 -63188 64451 125151 57221 -69142 -125781
248 -125781 -57647 64710 118776 54386 -62436 -118317 -63073 50193 115326 73028 -36926
259 -36926 -114846 -87629 23262 118483 107420 -4363 -114291 -115753 -2768 118612 130828
270 130828 21328 -103897 -124069 -22651 99593 126174 37936 -76244 -109332 -39363 61298
281 61298 100564 50100 -39061 -87763 -56779 21564 77352 60540 -12566 -75659 -68805 1347
293A347O6609k295p0532o8518K785P0467O7195l547o8115o3099K622O3032O1761
306E9712L966n4491o1210j3806M4294O5026K9889l2986p0586m7292K2724P9045
318B4285O4112j4576q5543p6303P749Q7236Q3851q81q4449q6463o557P5215Q4283
331G1959J5987o2198q0909k7782M7835P7883L9019l4939p7220m9476K5936P9047
343B5142N6033k2473q1480n8623K3246Q2687N7994k6134q2346n4939K8211Q0426
355B7744N1274k7209p6575n0314K2196P1612N2894j3277o6732n9411J816O3858
367b124O8012R286o0543p6259k0175N8206Q2131K7978n4243q3619l2611M7889
379c6072P9967L5548l8813p2254l7847K7264O2437L9487j4907n1827m2070L073
$$ plain form
293 1347 67956 65661 -4871 -73389 -70604 -137 67058 63511 -4604 -67703 -65081 -2049 59712
306 59712 63678 9187 -52023 -65829 -21535 43491 73380 40394 -30192 -77484 -54760 24285
318 24285 88397 73821 -11722 -88025 -80276 6960 90811 89930 5481 -80982 -87539 -12324 71959
331 71959 87946 25748 -55161 -82943 -35108 42775 81794 46855 -30365 -79841 -53905 25142
343 25142 81175 58702 -22778 -81401 -58155 24532 82526 56392 -25954 -80893 -52682 27744
355 27744 79018 51809 -24766 -75080 -52884 18728 71622 58345 -8387 -67798 -65982 -2124
367 -2124 65888 75174 14631 -61628 -81803 -23597 58534 86512 32269 -51350 -83961 -36072
379 -36072 43895 79443 40630 -31624 -69471 -42207 20230 59717 44810 -7017 -49087 -46014
391d6014M3299M4599O113l7033m7065j2561L4407M8088J5723l3112m8581j5330
403d7467L2492M7723J5839l1234m6477j6009K8814M4719J9019k3273m4400k5074
415d5328J6847M4860L3642q976m6610m3450N67M7775N3385P049m9642o1364j4007
428f5252M8699O5573J9206m5707o6460k4509L9489O4082K9069l1004o0709l3154
440f0677K2427N5442L8411j3877n1888m1864P322N0172M5088l667m8678m6748
452d8537K721M9858M6560l683m9941m5208N395M9214M3081n887m7357m1932L522
465d2194M4066M2149O83m0380m3549p979L5206M7043J5604l0441n0050k3769K6166
478b7445N2786K9941k1890n2840l2806J7085M9777L4644j1144m3592l4023M537
$$ plain form
391 -46014 -2715 41884 47997 10964 -36101 -48662 -14255 33833 49556 16444 -32137 -47467
403 -47467 -14975 32748 48587 17353 -29124 -45133 -16319 28400 47419 24146 -20254 -45328
415 -45328 -28481 16379 50021 41045 -5565 -49015 -48448 -673 52712 59761 10119 -51245 -65252
428 -65252 -16553 49020 68226 22519 -43941 -68450 -28961 35121 64190 33186 -27523 -60677
440 -60677 -38250 17192 55603 41726 -10162 -52026 -44704 5468 50556 46889 -1789 -48537
452 -48537 -45816 4042 50602 46919 -3022 -48230 -42835 6379 49460 43573 -3784 -45716 -42194
465 -42194 1872 44021 44704 4324 -39225 -47204 -11998 35045 50649 20208 -29842 -53611 -27445
478 -27445 25341 55282 33392 -19448 -52254 -35169 14608 49252 38108 -5484 -39507 -34970
490c4970L5948L3216K623k7195l2282r625K0064L1374J5558j5217l2046j9693
502c2245J1765L1952K0844j1006l2710k1836J0662L1717K1399j0321l1403k1404
514c2586Q430L0640K2872n743k8829k5966J200K8602L1255M629k7994l5456j0114
527c9060K7679M1454J6181k6275m4572k0681K4669M6938K4561k0944m6051k7657
539d3758J6234M3459K9550j0659m0678l1685N174L5768L2721j019l2334l4097
551c1324k998K9198L3187N279k7642l3891o164K7053L2954N463k6615l1701n021
564c2222K6243L1185N352k5375l0015n531K3433K9771Q300k0622k9878j1394J6822
577a3931L0282J6159j3004l0598k0570Q748K9621K4302m652k8604k6821L19K6342
$$ plain form
490 -34970 978 34194 36817 9622 -22660 -32285 -12221 19153 34711 19494 -12552 -32245
502 -32245 -20480 11472 32316 21310 -11400 -33236 -22574 9143 30542 20221 -11182 -32586
514 -32586 -24156 6484 29356 23613 -5216 -31182 -29982 -1380 29875 34504 6510 -28946 -39060
527 -39060 -11381 30073 46254 19979 -24593 -45274 -20605 26333 50894 29950 -16101 -43758
539 -43758 -27524 15935 45485 34826 -5852 -37537 -32363 3405 36126 35107 2773 -31324
551 -31324 -34322 -5124 28063 33342 5700 -28191 -34355 -7302 25652 31115 4500 -27201 -32222
564 -32222 -5979 25206 30558 5183 -24832 -30363 -6930 22841 31141 10519 -19359 -30753 -13931
577 -13931 16351 32510 19506 -11092 -31662 -22914 6707 31009 26357 -2247 -29068 -28749 -2407
590b407K6807L338k2051k6094p407J6789K4564J1068j1796k2543j3005O706K0673
603D642J5948k523j8913j8145O18J8675J8977J409j8237j9499j390J7876J9634
616A9072J293j8121k0137j942J7506K0315K766j7470k2061o054J5947K3810Q842
629B3766j4923k7051j3138J3452K9009J6329j1392l0641k0268R945L0740K2981
641B8809p314k9376k3756M680K7549K4818p48k4194k4146j827K1157K4128N093
654B4873j8010k3327o791J5917K3117P839j4707k1818q647J3868K1007P310j3054
667G577k0419p585J2189J9819O855j1662j9705q485J0683J9015R135q439j9001
680a0023j1489O204J8625J3781l639j7735j5619J74J6995J7715K608j4436j8506
$$ plain form
590 -2407 24400 27738 5687 -20407 -27814 -11025 13539 24607 12811 -9732 -22737 -16031 4642
603 4642 20590 18067 -846 -18991 -18373 302 19279 20688 2451 -17048 -18438 -562 19072
616 19072 20365 2244 -17893 -19835 -2329 17986 20752 3282 -18779 -24833 -8886 14924 23766
629 23766 8843 -18208 -31346 -17894 11115 27444 16052 -14589 -34857 -24912 5828 28809
641 28809 21495 -7881 -31637 -26957 592 25410 24662 468 -23678 -25505 -4348 19780 24873
654 24873 6863 -16464 -23255 -7338 15779 23618 8911 -12907 -21554 -7686 13321 20631 7577
667 7577 -12842 -20427 -8238 11581 18436 6774 -12931 -21416 -10733 8282 17417 8978 -10023
680 -10023 -21512 -15308 3317 17098 13459 -4276 -19895 -19721 -2726 14989 17597 3161 -15345
693a5345n911J2293J8610Q623q770j8089j0578N407J6158J2645k341j4709j3722
706a5729m73J2783J4000L036j1652j4354m322R829J5330N344r877j4741n980R913
720f893J5333O634r975j5606o102R776J6152P525r442j6635q408Q666J8026J0420
734A9471p378j9237j2659O306J9613J4674m150k0146j6929K166J9444J7707l37
747A8545j8529j9082j769J6445J8974L285j4433j8249n022J1620J7149O518r142
760F310j5981p720Q089J4584Q013n918j3924p521N626J3519P610n138j2359p067
774a1877N051J1768P741m385j1667p714L565J1265Q649k445j0799r774N16J0178
788G2J0727J830r532j1972l739P933J2502N601n952j3029p959M326J2389R163
$$ plain form
693 -15345 -21256 -8963 9647 18270 9500 -8589 -19167 -13760 2398 15043 12702 -2007 -15729
706 -15729 -16202 -3419 10581 13617 1965 -12389 -16711 -6882 8448 13792 3915 -10826 -16806 -6893
720 -6893 8440 15074 5099 -10507 -16609 -6833 9319 16844 7402 -9233 -17641 -8975 9051 19471
734 19471 12093 -7144 -19803 -13497 6116 20790 16640 -3506 -20435 -18269 1175 18882 18545
747 18545 16 -19066 -20835 -4390 14584 17869 3436 -14813 -19835 -8215 8934 15452 6310
760 6310 -9671 -17391 -9302 5282 13295 7377 -6547 -14068 -8442 5077 12687 7549 -4810 -11877
774 -11877 -6826 4942 12683 8298 -3369 -11083 -7518 3747 12396 9951 -848 -10622 -10106 72
788 72 10799 12629 3097 -8875 -12614 -4681 7821 13422 7470 -5559 -13518 -9192 3197 12360
802A2360j976j0947j0661m08J0039J1129K681q216j1736m152O890J1725N152n922
816E958j1082o058M869J1205O552m308j1183o738M028J1038O782m158j1299p260
830a1654M000J1987P483m043j2011q786M218J2577R579k899j3190j0426J727J3101
844A663J2056n66j2724j2454o45J1356J3392K718j0411j3616m082R361J2852N105
858A4005p338j2343o088N742J1342O005l898r974p092L121Q981O088k248p961
872a658o042J176P343N875j323o435n868P74O536N711l60o151o254n2N946O857
888F075P76n492p149j988M874P750L908m626p730m941K510Q747O392j473p996
903c63p837p8P449Q435K075o927r212k897N561R066M479m306q947n433K955Q942
$$ plain form
802 12360 10384 -563 -11224 -11632 -1593 9536 12217 4001 -7735 -11887 -4997 6728 11880 5958
816 5958 -5124 -11182 -6313 4892 11444 7136 -4047 -10785 -6757 4281 11063 6905 -4394 -11654
830 -11654 -7654 4333 11816 7773 -4238 -13024 -8806 3771 13350 10451 -2739 -13165 -11438 1663
844 1663 13719 13153 429 -12025 -12670 -1314 12078 14796 4385 -9231 -13313 -3952 8900 14005
858 14005 6667 -5676 -11764 -6022 5320 11325 7427 -2547 -9639 -6518 2463 8551 6303 -1658
872 -1658 -7700 -6524 819 6694 5371 -1064 -6932 -6158 378 6089 5729 -422 -6676 -6728 -782 6075
888 6075 6851 1359 -5790 -7778 -2904 4846 8754 4128 -3602 -8543 -6033 2714 9106 7633 -363
903 -363 -8200 -8278 -829 7606 9681 2754 -6458 -9355 -3794 5272 9751 5445 -3502 -8935 -5980 2962
919B962N591k101q370n920J111Q384N663q87p696o470J543P076O201j328p578
934a819n961J249P675O715j138q182o814O33P933P698j1q357q139n85P696R232
950G825J679p800r196k653O601R595L583n717r020m144L785Q610N178k677q067
965b418n092J751O679N782p60o569m932L44N026M761M47m311m664j65L322M256
981C457N99k938m089j252K897M478J344k668m612j924K689M572K497k272m840
996b062l192J532N396M135j098n342m904j44N333N749Q62m678o409k200M011O917
1012C906L326l653o751m109K771O673M199j697o050n017P73O124N190l00n477
1027i2n271M0N064N197J55m749m856k18M668M906R9m863m995P1N037M644L28m932
$$ plain form
919 2962 8553 6452 -1918 -7838 -6727 1657 7320 6433 -1263 -7733 -6190 886 7087 5759 -1819
934 -1819 -7780 -6531 1144 7859 6721 -1461 -8275 -7642 291 7989 7978 -379 -8518 -9103 -1407 7825
950 7825 9504 1704 -7492 -10145 -3544 6051 9634 3917 -5103 -9247 -5462 3148 8326 5649 -2418
965 -2418 -7510 -5759 920 6702 5942 -627 -5559 -5215 -189 4572 5019 708 -3956 -4121 -799 3457
981 3457 4056 1118 -2971 -4223 -1326 3152 4496 1828 -2784 -4708 -2019 2553 5050 2778 -2062
996 -2062 -5254 -3722 1674 5809 4711 -631 -5535 -5679 -346 5403 6265 1587 -4822 -7022 -3011 3906
1012 3906 7232 3579 -3172 -7281 -4510 2163 6362 4665 -1385 -6402 -5629 495 5685 5385 -92
1027 -92 -5363 -5323 -259 4938 5093 344 -4512 -4730 -62 4844 4943 80 -4915 -4844 193 4837 5165 233
1045B33n250q9M524N529P30m540n929j537M063O566K091l909o273k589L004O069
1061B693L518k290n740m036J656N159M403p01m748m116Q5L830L618Q81k662m096
1077b546q04J865L673J013j616k836j548J251K810J598j430k523j393R59K497
1092I70J823r66k986j819O33K963K406j63l216l130r9L297L738M65l225m217j099
1109d625K779M647K247k765m510k813J972N318L068j404m745m144Q83M684M354
1124D946k86m398m657m6L948M478M33m021l847o23L208L845R75l405l440j290
1140d180L123L793J044l026l928j002L478L495P64l063l478r75K994L991J449
1155D479l055l964j492K070L950K237j527m267k580J033M193K618p11l075l060
$$ plain form
1045 233 -5017 -5106 -582 4947 5677 1137 -4792 -6329 -2266 4300 6391 2482 -3791 -6380 -3376 2693
1061 2693 6211 3921 -1819 -5855 -4199 960 5363 4662 -86 -4202 -4117 -287 3331 4212 1550 -2546
1077 -2546 -3350 -1485 2188 3201 1585 -1251 -2799 -1548 1262 2860 1430 -1093 -2486 -1527 970
1092 970 2793 1827 -1159 -2978 -2345 618 3024 2861 -355 -3485 -3584 -287 3451 3916 691 -3526 -4625
1109 -4625 -1846 2801 5048 2283 -2227 -5040 -3068 2250 5318 3914 -831 -4975 -4092 592 4946
1124 4946 4660 262 -4395 -4441 -493 3985 4418 397 -3450 -4073 -865 2980 3955 550 -2890 -4180
1140 -4180 -1057 2736 3780 754 -3174 -4176 -698 2797 3561 498 -2980 -3955 -961 3030 4479
1155 4479 1424 -2540 -4032 -1962 1988 4225 2698 -1569 -4149 -3116 1077 3695 2984 -91 -3151
1170c151l23L108L224L22k444k832j130K001K549J311j243k245j441P12J862J673
1186A953m35j618k022k9K316J316J70j633j840J9J793J764K47j865j735m21J499
1203e21K321O95j846k530r62J863K925J362j493l703j805J331L735K181j282l666
1219a395k893J154L172L452l66l436l094j72K957L526O70k742l717o02K568L241
1235B323R32k244k826r51J836K774J012j570k712j198J780K707M81j470k206j386
1251b718J949K184J089j759k500r60J221K806J285j341k460j903J045K925J734
1266B597p34k317j904L11J813K291L41j559k435q58J630K126J082j072k042j234
1282a964N09J725J184K70j770j368j43J064J577L26q27j879r7R84Q49J076j092
$$ plain form
1170 -3151 -3474 -366 2858 3180 736 -2096 -3226 -1225 1324 2635 1392 -853 -2294 -1582 280 1953
1186 1953 1518 -100 -2122 -2151 165 1481 1651 18 -1822 -1803 -10 1754 2001 136 -1599 -2020 -521
1203 -521 1800 2495 649 -1881 -2843 -980 1945 3307 1814 -1889 -3694 -2363 1372 3553 2271 -1395
1219 -1395 -4288 -3134 38 3490 3124 -312 -3406 -3578 -621 2905 3575 833 -2884 -3486 -918 2323
1235 2323 3255 1011 -1815 -2766 -930 1844 2856 1286 -1426 -2624 -844 1863 2344 874 -1332 -2718
1251 -2718 -769 1415 2504 745 -1755 -2715 -1494 1312 2597 1256 -1204 -3107 -2062 863 2597
1266 2597 1863 -454 -2358 -2047 -234 2057 2398 839 -1596 -2454 -824 1302 2384 1312 -730 -1964
1282 -1964 -1455 270 1454 1724 -46 -1414 -1557 -493 1084 1410 583 -1296 -1393 -409 440 1516 424
1299D24j304o51O15J789O02n50j761r05Q00J712J290j259j922j085R30K737Q67
1316B329r11j994j937M01K869J875j45k465k326p1K168K790P5k121k627m45J903
1333f32K801L54j446k494j037J528J970J222j214j933j238J013J997J175j085
1348I81j744j164J263J658O45q66j385r89R68J687P46q47j556r57M09J890J036
1365A775l89j419j307J21J275J389J71j404j103l75Q06J478N45p38j374j114M92
1382a171J711Q74q4j105j299n39J445J039M88o39j468n81N46J476O44p7j690n50
1400i80K38J077J091o30j261p65K77J581Q17n79j231j003M21J364J008l63j498
1417d36j306O10J826P06J68j841j734L74J686J494K90j351j981k05J243K122M33
$$ plain form
1299 424 -880 -1531 -916 873 1475 925 -836 -1741 -941 771 2061 802 -1120 -2205 -1275 1462 2329
1316 2329 1418 -576 -2513 -2112 757 2632 2487 22 -2304 -2375 -207 2583 2658 537 -2090 -2535 -632
1333 -632 2169 2523 1077 -1417 -2454 -926 1044 2266 1052 -881 -2119 -1106 891 2066 981
1348 981 -763 -1927 -664 994 1639 773 -612 -1601 -633 1054 1800 953 -603 -1560 -1151 739 1775
1365 1775 1386 -33 -1340 -1219 56 1445 1616 212 -891 -1266 -460 1018 1563 825 -549 -1663 -1171
1382 -1171 540 1414 1330 225 -1074 -1613 -168 871 1359 720 -748 -1329 -783 693 1337 1260 -430 -980
1400 -980 -742 335 1426 796 -465 -1230 -953 628 1445 866 -365 -1368 -947 417 1425 1062 -436
1417 -436 -1742 -1132 694 1400 1568 -273 -2007 -1633 53 1547 1837 486 -1495 -1700 -457 1665 2098
1434B098j246k129r70J187K115O13n88j808q36N38J606R97n37j153q70q6J240
1451A71P26r1r86q85L87J014L26J07r19p98L09O91R99m08q67j089O03Q52O23J45
1471I10o15j118j06O46J152N21p55j328k04J77J048J000o31r01o56rP13J289k12
1490I21n11q47m41N2J414K02j98j130k02nP47P50N3r53q37J80R07M94k3o68p57
1511h52R7J218M30j55q98r21M63P07P26j41q66j266K24J337J163j44r62j562J43
1530a259J109J712j34j161j343m08J137R94J041j076j337k52o8J541O36m01j233
1547e02n75J03J159O96l68p44n72L01P42O82l33p20n91L05M94O35k31o97o06M91
1567c31K17O52N9o94l87k49P27M82N4n85l17k27J97R05J02J61n79r49J07O12P99
$$ plain form
1434 2098 852 -1277 -2247 -1060 1055 1668 1080 -728 -1564 -1026 580 1577 1040 -113 -983 -1069 171
1451 171 897 806 -180 -1065 -678 336 662 769 -150 -948 -639 52 1051 643 -224 -1313 -710 142 765 910
1471 910 295 -823 -929 -283 869 1390 635 -693 -897 -720 328 1328 697 -204 -860 -869 -156 1133 921
1490 921 410 -437 -878 -826 588 790 592 -538 -740 -745 2 752 805 -148 -985 -805 102 596 573 -95 -852
1511 -852 -755 463 893 738 -160 -1081 -618 89 815 674 -192 -1458 -1234 103 1266 1122 160 -1402 -1259
1530 -1259 -150 1562 1428 267 -1076 -1484 -347 647 1688 612 -725 -977 -1045 496 1132 731 -502
1547 -502 -1077 -974 185 881 513 -231 -803 -502 240 922 589 -131 -722 -417 77 712 481 -216 -822 -331
1567 -331 -114 538 597 -97 -484 -733 -6 476 530 -55 -372 -599 -402 503 605 766 187 -762 -655 -43 756
1588G56j40k33r56k96O05M51Q22o09r42j67K5J061K02J77r38o15q3R14Q93m92
1608D35k89j039J47Q60P29N9o16r89l4N16P76K14j089m62J09O82Q24k3r73p10
1628h73l5Q70Q64L94o69j284Q0K26J193J0l74j179k37Q14P64M55n89o46p95L25
1648f86R02M84J53q69o59L7L95J021j52n60l81l24O76mL59l67j32J1M76j12p2
1669A96J46o91J34LL37L25m21n85L19j57M93K31p5k56l68J44O30J93r9k52p33
1690d86k24L04O31N76l22p64m47L10M63O66K27j118n18j1O51N64J42o10m90m76
1710i32Q09P16m0m05m34N5J77M14K32m03o08L42k61O38O4o44J17k33L79M03N06
1731H92p68n28n01Q24M41K45m53p28J17M78J47M19k34o36m03L29Q05L97m41o05
$$ plain form
1588 756 616 383 -573 -869 -264 187 1009 400 -542 -709 -684 377 579 756 -182 -797 -880 34 927 435
1608 435 146 -893 -746 114 843 902 286 -703 -737 -221 555 769 -320 -782 -673 9 833 810 -163 -873
1628 -873 -908 -38 826 1220 551 -733 -653 -427 766 776 402 -777 -1014 -200 564 1019 430 -216 -1011 -686
1648 -686 216 700 853 -16 -675 -638 -243 778 626 66 -315 -639 37 33 392 25 -107 -96 380 268 196
1669 196 342 -349 -215 -212 125 450 29 -556 -237 -394 99 330 255 -1 -369 -225 405 598 499 247 -486
1690 -486 -710 -406 225 801 479 -285 -732 -422 41 707 934 -184 -702 -713 -62 502 644 34 -456 -932
1710 -932 -123 593 553 148 -286 -231 -54 360 592 189 -419 -77 -338 300 364 -280 -163 -396 -17 386 892
1731 892 124 -404 -905 -81 360 605 152 -576 -459 19 166 585 351 -285 -688 -359 446 843 402 -203
1751b03j37J0J67M61J80k93n90K54O9Q6R5M8l71l84K24K95J67P0l86K64j25K0
1773g9L80J26m66j2j43K6M58q6l79J74m46N85m8O1R3o92j79N16K90P2K30p67l16
1796f02K17O40O0Lk56r93J02P95Q12j47o67n54K12L00K74M29l29q69K5N89J49
1817A90J77n14j24j64K16M95Pp9k96j14K95L09R2l90m41M4O49J42R1m22m73k4
1839c34K41N15R8m34l27j62O2M62N26j93o05m08k3L02N37j9j64k45k09N66R2l72
1861i4K67l31k17J76K91l8k00N20n50L23m3lk6K57n48J64J15k17M21k05j34o7
1883a39K1N31k47k60J81K7k63K65RN3k40l47J91K46M27m88j12n56K84N76Q1J82
1905D22j02o33J39p3O90k18j45n24J73q2L98M85m56m65l24L71M20o1K26l12J28
$$ plain form
1751 -203 -340 -330 -163 298 478 185 -405 -151 -82 4 99 147 -224 -608 -384 -89 78 148 -238 26 -99 -79
1773 -79 301 427 -39 -51 -194 -168 290 204 -175 -1 -447 138 90 151 244 -448 -627 -111 179 251 481 -286 -602
1796 -602 -385 255 315 318 62 -931 -829 -34 778 631 -36 -590 -378 -78 196 625 296 -573 -548 41 190
1817 190 367 -147 -271 -435 -219 276 283 204 -92 -206 89 398 490 100 -341 -297 352 494 585 163 -310 -334
1839 -334 -93 422 520 86 -241 -403 -341 121 647 454 -151 -559 -582 -280 257 238 74 -171 -380 186 278 -94
1861 -94 173 -158 -375 -199 92 54 -146 374 -176 147 104 101 75 332 -216 -52 63 -154 267 62 -72 -139
1883 -139 -118 413 166 -94 87 114 -149 116 125 178 -62 -409 -218 28 455 -33 -145 -701 -417 159 240 422
1905 422 320 -313 -174 -247 443 225 80 -444 -271 -353 45 530 74 -391 -715 -344 76 15 241 -71 57
1926E7m0l5J12Q6m02j53L98j17N81m28k02r3J06J87J74q5k57n1l7O86R2l27l98
1949a46k87L52J86J95j54l59J36j03K67K8N1N1k96j99R5L11K38l26o1j87J79k01
1971b30K80J94j38L3j22ll85L30N10l96p4k45M09M1k1k79l0K59Q1R8j29o2k44
1994a23J16K01J57Q5m98k25m4M39J63j46l35m7J53q3O72k76N8p52o9L81O23j63
2016B87n8k16j74J08L32Q4k53k28j60nN33m9R1k00l17L51N4j27R3l72j06K16K80
2039A64j49J78l24r0P8K00J41j36k31J96l1K67K67l53k16p1N2K18J23p6k82M31
2061C56m85K56p0p5P2k32j7P2K39pL3nl53j28M19j83L05J02m88j44L05J94O4k30
2085@k0O6j22L79L8k36J56k61k04K75j75L17q5j56K70k32J81p4l17L5K53r5L68
$$ plain form
1926 57 17 -18 94 180 -222 -375 23 -94 487 59 -143 -236 -130 57 231 146 -111 -162 -199 487 579 252 -146
1949 -146 -433 -81 105 300 146 -213 -77 -180 87 115 166 217 -79 -278 -183 128 366 40 -21 -208 -29 -230
1971 -230 50 244 106 139 17 14 -371 -41 469 73 -1 -246 163 204 183 -96 -126 133 214 312 183 121 -123
1994 -123 -7 194 351 436 -62 -287 -331 108 271 125 -210 -257 -104 -187 485 209 267 -485 -554 -173 450 287
2016 287 229 13 -161 -53 279 363 110 -118 -278 -283 250 201 292 92 -225 126 180 53 146 -226 -332 -116 164
2039 164 15 193 -131 -221 -143 57 198 62 -169 27 -4 263 530 177 -39 -110 -58 160 283 207 -75 356
2061 356 -129 127 57 -18 54 -178 -195 -123 116 109 142 137 -216 -344 75 -108 197 299 -189 -333 -28 166 230 0
2085 0 -20 46 -76 303 341 105 261 0 -204 71 -104 213 128 -28 242 10 191 117 -200 -165 88 -7 361
2108C61k37j23k09j52K67L99j96J24k80k41q3L03L70n0m18k43K2M77K86m46j62
2129b31N9K81J69j6k04l64P5K42K04p3j05l4k40J89K0JQ7j55kq0J37J55j30m0
2153e5J10k94K16J69J83m11K2q0%M96k32m3l1l80M19M1j8K54o37J65J35k17K73
2176H5j73J21K17o8m52K80J7K31m37K66l0j39K50l2K05l66K07k20J45k1o3o1J22
2199H4r3M2R1K19o64K11Q2L14M1l77r5J21mj30K67J7l32J12J6N9J08K16o35L38
2223Hn96O95K52k50j47N3k40J78L92j45k58K02R9k37M2j27m6J00j08J34O8J88
2245B57j43n5j02K13j0j99K8j85N9P8%J22j5l17L09k97L12k8J50m10lJ88R0K22
2269B64k00N9k64j21L10np4k61J45Q6J20K28l52K10k82l56M87K86k31l25M85k63
$$ plain form
2108 361 124 1 -208 -360 -93 306 110 234 -46 -287 -370 -67 303 253 -165 -408 -386 91 377 -69 -231
2129 -231 -172 109 278 262 58 -306 -231 11 215 142 37 3 -237 -48 -28 -27 60 -95 -97 -177 -40 115 -15 -55
2153 -55 55 -239 -23 146 329 -82 -60 -140 -140 356 124 81 50 -330 89 130 112 366 -271 -106 29 -188 85
2176 85 -88 33 250 182 -270 10 27 258 -179 87 57 -82 168 136 341 -25 182 -38 107 86 23 -38 84
2199 84 -9 33 124 343 -321 -110 -28 286 327 -50 -145 -24 -28 -158 109 126 -206 -94 -78 -19 89 305 -330 8
2223 8 -588 107 359 109 -38 15 -225 -47 345 200 -58 144 243 6 48 -79 -125 -25 -133 1 69 257
2245 257 114 59 -43 170 160 -39 -11 -196 -137 -59 -59 63 48 -269 40 -257 55 27 177 -233 -236 -48 42 264
2269 264 64 123 -141 -262 48 43 -31 -292 -147 -61 59 287 -65 145 -137 -493 -6 280 49 -276 209 -54
2291e4M6J04l10K67K0n1j4n8K54j03k28J19j49J93j57K29j07J54j11J2J14l48
2313a78L69p7m60M40k4k1j81j13J66QR7J42J19l60k8oJ27L75m75R8j59oN6j93
2337b84L65Rl95K50L50n96M77k00M3p7j87K52l8K49m02M9K1K12k53j90O98l11
2359D2J5J63M3m99O8K6M05o63N79l91K61j53K29j46j93M19j35j2j13O4Lo0L82
2382C34m96j9k8P6K95k92M7j04J13J59J41R2k00j63q2L81k74L42l32j98M05k07
2404a0jL21n39m0P0K18J84m14L01k93j33J91J09Q6K37k45k35L86j18K9M3j75j28
2427a56L30j66l52L58M9o2j37L65l06M5m7p1K18L1p7k26O1K85k14j07L18k45K14
2450A08j50j1nK36q2J4k25mJ89J60k03o1K11k66j58J73%r8R1k15L85l7j57L61
$$ plain form
2291 -54 -8 96 -214 53 73 22 8 -50 204 101 -127 -8 -157 36 -121 108 1 155 44 56 170 -178
2313 -178 191 114 -346 94 70 49 -132 -245 -79 -71 26 168 287 -73 -101 -107 20 395 -80 18 -141 -147 -91 -284
2337 -284 81 90 -305 -55 295 -301 176 -24 19 -58 -245 7 -31 218 -184 -135 -114 98 -155 -345 353 42
2359 42 57 220 263 -236 -168 -142 263 -400 179 -212 49 -104 125 -21 -214 205 70 58 -55 9 12 -48 334
2382 334 -162 -181 -209 -133 162 -130 -83 -187 -74 85 226 318 118 -45 -127 254 -20 322 -10 -208 197 -10
2404 -10 -11 310 -229 -269 -199 19 203 -211 90 -203 -336 -145 -36 50 287 42 -193 193 75 104 147 -28 -156
2427 -156 174 8 -344 14 63 1 -136 229 -77 -32 -79 -150 68 99 22 -204 -143 142 -72 -179 139 -106 108
2450 108 -42 -53 -58 178 96 110 -115 -119 70 230 27 -34 177 -89 -247 -74 -74 -172 -81 -296 89 52 -105 256
2474B56j59Pj37Q3q0K35l6n5m70M67J58j68o9N5j18K1J70o4j20K48k06oj17J03
2498bp6J1J5m6J75l9l01M12j00O6j44P4l0n1R2j03L8q2j56K26j25j8K12Q9k16
2523g9j39L27j20k33J90L22J02l88p8o3K79j90J78J15j08l36R1K21l52L08n2M7
2545D2L12l88o6J87K4j88r1L98m7j24L2m18M00m91M25L51m94L87j45j06J53m18
2567b65L87j80L44l17j17L63k65J34j16J03j13M8r1J03l1R2j11Q8P5r0Lk85L24
2590H3m0Q4k84M22k52j24L6o7P0j4L26k91o1J82R5n34J88J55k61N69j88R2k96
2613a10j1Q8l01M66j45m24K37L23o9r6m6o1K44Nm33K56O0k80K30J76Jm10K00O5
2637c5n8J2Q6J09rk50Q4N9J11j21J44k74k9K48j72j11K82q3J21M7j08k83M40j36
$$ plain form
2474 256 97 104 -33 50 -30 205 169 114 -356 111 269 101 32 87 -31 -10 160 96 -24 224 18 12 -105 -2
2498 -2 -78 -67 -52 -98 77 38 -263 149 49 115 -29 45 15 -36 56 -47 -9 -91 -247 -21 -146 -164 48 137 -79
2523 -79 -218 109 -11 -244 -54 268 370 -18 -96 -159 120 -70 108 223 115 -221 -130 91 -261 47 -5 42
2545 42 354 -34 -100 87 111 -77 -168 230 183 59 91 -327 73 -418 7 358 -136 251 106 0 153 -265
2567 -265 122 -58 286 -31 -148 215 -50 84 -32 71 -42 6 -85 18 -13 79 -32 56 131 41 44 -241 83
2590 83 43 127 -157 265 13 -111 -75 -142 -72 -86 240 -51 -112 70 165 -369 -181 -26 -287 282 94 186 -110
2613 -110 -121 -33 -334 132 -13 -437 -200 123 54 -42 -88 -149 95 100 -333 -77 -17 -297 -67 109 110 -300 -100 -35
2637 -35 -93 -81 5 114 105 -145 -61 -2 109 -12 132 -142 -171 77 -95 -206 76 -7 114 161 53 -230 210 74
2661G4m3J50l94J13N2J55k6k30j67K72l70M20O5j91J1O0J77j33%j14K03m6J10
2684A48q1j19q1J60L8k62J63J52J64j95L0K44l18r5J50M4J62o6m55p4M95k75j54
2707b25K0M24k77M0L5J76l99k9K41J82O2k96K8k07R6K36l59r5N27k86Q0K99m20
2730a47j1n1K74l19L59K21n6j82j77L3p7K00O6k47mL16l56K23k84L65L10n32j62
2753b38L83j91j14M9K78l11L9N9JJ67j44R2Q4j04k3J07j10k62L72J1J39m00O6
2776e0J22p4m0k7l1q6q4M02O8j19k61J29N8Q6j31mJ90k76M32n31K56k85L44k4
2800F4j04J35k38QO2J11r1K54k54J07Qn67O87j87J30K47k58m12K65J74l77N12
2822B76m67K76J0J37l65N2n8J48J36m5l10J59P0k19K99k14j72K74J1J11P9m40
$$ plain form
2661 74 31 181 -213 -100 -48 107 81 -149 -316 -44 -414 6 71 -120 -109 -49 128 -5 -5 -119 84 38 148
2684 148 67 -52 -133 27 65 -197 -34 118 282 87 117 361 43 -52 98 142 304 238 -217 -291 204 -71 -225
2707 -225 -205 219 -58 -18 17 193 -206 -235 6 188 250 -46 -18 -225 -129 107 -252 -347 180 -106 -26 273 -147
2730 -147 -158 -209 65 -254 105 326 270 88 -89 -56 -133 67 133 -114 -118 198 -158 65 -219 146 456 -76 -238
2753 -238 145 -46 -160 -111 167 -144 -105 -46 -45 122 -22 70 154 50 27 134 24 -238 134 145 284 -116 -50
2776 -50 72 -2 -42 -69 -100 -186 -270 132 200 81 -180 -51 7 93 -38 -42 148 -128 304 -227 29 -256 88 64
2800 64 -40 95 -143 -135 -73 38 -53 201 -53 54 62 -505 182 -5 125 372 114 -298 -33 141 -236 276
2822 276 -191 85 95 232 -133 -81 -139 9 145 100 -210 -51 19 -200 99 -115 -287 -13 -2 109 188 -252
2844b52M50k36K9q6j35J97K42j89j89j91L38J45K8j26P2m7k7M2N8j61PK19l17
2867a29J45k78L64j51L63m76K95J67n15K05M7J4n3j40P1L84k60O9J6k72N5j46
2889b25K52J66k16J12j43j63J49j4M6j38K61j4o6Rj26K34j67PJ3J23pl19K8R1
2913a07j9J31l0j16K67N2k44K6r2L07J06K1j41k05J38k19k29L5Q2J45J51Q0J38
2936B77J24m55n5nJ78l8Q9o0J38k33P8j71L88j71R3k45J0L27l66K07k26K27k84
2959a73NJ56K12m13K73p6j13q2K83j27N03o46K70j51q3L8n9J20j59K26m4p6K72
2982A56j24J4J07j69L1L3N8Lk69N58l01k05Q7K01k28L11m06K69j67R3l3J21L3
3005A73m63J24K37o5jk00M27j21j18o8J39k18k33K52k12N39r0rj03K23k36r1j05
$$ plain form
2844 -252 198 -38 -9 -95 -230 -33 209 20 -169 -360 -22 123 151 25 97 50 23 65 123 -38 -31 188 -129
2867 -129 16 -262 102 -49 314 -162 133 300 -215 -10 37 51 -2 -142 -71 313 53 122 138 -134 -79 -225
2889 -225 27 193 -23 89 -54 -217 -68 -82 -36 -174 87 73 7 16 -110 124 -43 -36 -23 100 93 -226 -198 -107
2913 -107 -126 5 -25 -141 126 178 -66 -40 -132 175 281 302 161 -44 94 -125 -354 -319 -237 -92 59 139 277
2936 277 401 -54 -109 -114 64 26 115 55 193 -40 38 -133 255 84 177 -68 -58 269 -97 110 -116 111 -173
2959 -173 -168 -12 200 -213 60 -16 -129 -211 72 -55 448 -198 72 -79 -162 -124 -183 -63 -222 4 -40 -116 156
2982 156 32 46 153 -16 15 48 106 109 -160 398 97 -108 -21 180 -48 263 -143 126 -41 52 19 140 173
3005 173 -290 -166 71 6 5 -195 232 111 -7 -75 64 -154 -387 -135 -347 192 102 93 -10 213 -23 -114 -219
3028b19K26j88L39l46L18k8j70j88O37m34l9J40J42j77j33K57J0j31n3J58J40
3049B61l74O9On2m2L24k55m1L45l75L45j87j0q6J48q7J69l9l19K01K06Q8k53K
3073D4q5J50K4j54J84r0j84J0J31j92R2j24L0K36j2l6N8l89L63j01m03O86r1j01
3097D6j03J16j7m8j39j10K57n7l5J49j41J9J23J06j95J66k46L00l5k6k77j87M54
3120A20j37J01J02k05J5k59K57K54m83J09Q9J2K1K2q5j4n3N21k62K38l46J14j73
3143d2L22j58l83K52o8pL05n8p9j63L20l38j10K10J1n4j2K18n2%k5r0L26k42K96
3168C79l27J30J3l78J55%J47k52K22k15J75o5J36n6K6k87L80k49R4K79k98L56
3190C65n93J43o8J24P3l10K08Q7j69l6R8J53j59J60J62o6k89N10l67r8PJ9l4J10
$$ plain form
3028 -219 7 -181 158 -188 130 102 -68 -256 381 -53 -92 48 190 13 -120 137 147 16 -37 121 261
3049 261 -113 -44 -38 -90 -132 192 -63 -104 241 -134 211 24 14 -72 76 -11 158 119 -200 1 207 295 42 44
3073 44 -41 109 133 -21 163 73 -111 -101 30 -162 -70 -194 -164 72 60 24 82 -307 56 -45 -448 238 147 46
3097 46 -57 59 42 -6 -145 -255 2 -55 -90 59 -82 -63 60 166 -29 137 -109 191 156 130 -147 -334 120
3120 120 -17 84 186 -19 -4 -263 -6 248 -235 -126 -37 -25 -4 18 -67 -81 -134 387 125 363 17 131 -42
3143 -42 280 122 -261 -9 -77 -84 221 163 84 -79 241 -97 -207 3 14 -40 -52 166 114 114 89 -1 325 83 379
3168 379 52 182 195 -183 -28 -28 119 -133 89 -126 49 -16 120 64 90 -197 183 -66 28 307 9 365
3190 365 -228 -85 -153 -29 44 -266 -58 29 -140 -176 -78 75 -84 76 238 172 -117 393 26 -72 -65 -46 -80 30
3214C0l3R9r6j25M36m86J56P6j5J76m82J10J98j16J92j31j17m1M96k81j57L7j29
3237b03L3K31k48K1q1O02l24o7M1l6k6q1K29j38L9m9ML7L04l97M01l10j40J07
3261e1J83m5o4M9r5j18J27j9L25o1m07R7L83l58p1K05P8k95j34k9N20l74O4K62
3285A72k83J11J32k13j55N21m60J93o1R5J02l3n3j66J87q0J01K2L9j74j56J62
3307CJ00l20K58k17J04J9oj62K86n00N51o9k70J35L89o49O53k79j84L24l63J01
3329i6M5K51j26k84K56j4O6O3l02J61R1J28l1l89j8L67k07R9K05j70J48l20J93
3352A16J24l08L56j57k22K38j38M0P4j73n0J46k8J95l36j25M56k71J42L50m11
3373A8j09l3J92j38l5J61K02k39p5L54j52k28J28R8p3j16k32K96M6j59L18m9q6
$$ plain form
3214 30 -3 96 0 -125 311 -175 -19 57 42 218 -264 -154 44 -72 120 -11 -128 -169 327 46 -111 -74 -203
3237 -203 -170 61 -187 -166 -247 355 31 -36 5 -31 -57 -138 91 -47 -8 -57 -53 -16 288 -109 292 -18 -158 -51
3261 -51 132 87 23 72 -23 -141 -14 -33 292 231 -176 -79 304 -54 -125 80 158 -137 -271 -300 220 -154 -90 172
3285 172 -111 0 132 -81 -236 285 -175 18 -43 52 154 121 68 -98 89 9 110 132 171 -3 -159 3
3307 3 103 -217 41 -176 -72 -53 -59 -221 65 -435 116 47 -223 -88 301 -348 305 26 -158 166 -197 -96
3329 -96 -51 200 74 -210 46 32 98 161 -141 20 111 239 208 -181 -199 168 -39 60 265 95 243 -77 116
3352 116 240 -68 288 131 -91 147 9 49 123 -50 -100 46 18 213 -123 -248 208 -63 79 429 18
3373 18 -91 -124 68 -70 -105 56 258 19 -56 298 146 -82 46 144 71 -45 -277 19 65 -94 224 175 89
3396H9k58K26J14l77p5L46j84P9j58K69O2L7k99K98o6j8J17j60r5JL96k62k28
3419a46L62l34P7K8k01K46J46m6k46j32K04R6j29Q2R8K4Q9k6o8k85K36J49R1k50
3443F5k07O7J52j76K7Q1k38L97r7l79M40m47N8L41m8j18j05J50J58j97K75l72
3465a73j33M52j08K08l20k13J75L32p4k53K87l10J29p1J69l79N39l03Q5Mk95K30
3487b2R8K06k56R3o0K99l16J24n4k93r6L67j75KM9j80L17J36q6l7k10j1Q0Nk15
3512b35J79J34j89r0o9M0M7K44j58L60l44K1J70p2Ln1Q0l4q4k3J33j91J30r6M1
3537e4P3o1O8J02l42J72K06l75J42J20j75J64K63J39o38L80k97RJ90N5j14k3J
3560Ek33L92j86L32r8l71J14K60j23m4L58l16J46j91j10J33j44J95j03m7k55N64
$$ plain form
3396 89 -169 57 171 -206 -281 65 -119 -40 -198 71 133 170 -129 169 103 85 202 42 -53 -52 344 82 -146
3419 -146 216 -118 -41 -13 -214 32 178 132 -114 -246 -42 54 -75 7 105 129 218 192 124 -161 75 224 315 65
3443 65 -142 -75 77 -99 -72 9 -229 168 71 -308 132 -315 -257 84 36 -82 -187 -37 121 -76 199 -173
3465 -173 -306 146 38 246 -74 -287 -112 220 146 -107 180 -130 -1 -72 97 -282 257 -46 39 43 -252 -22
3487 -22 76 282 26 119 59 358 42 166 112 -181 -277 90 -85 -83 -34 -214 103 239 153 116 -94 -105 -25 -20 -235
3512 -235 -56 78 -111 -201 -270 -230 -183 61 -97 263 -81 -60 110 38 41 -10 70 36 -48 -71 62 -129 1 -95 -54
3537 -54 19 -42 26 128 -214 -42 164 -211 -69 51 -124 40 303 442 -196 184 -113 -104 86 141 27 4 5
3560 5 -228 164 -22 310 212 -159 -45 215 92 48 406 90 236 45 -65 68 -76 119 16 -31 -286 278
3582B78l70J38k56L02N4j53j06J97J57l78K36P5k37Q2pK56l92K63o8q7J35k0j64
3605f5k02K33j8j40q3M0J77P9k20J92j44J24O6p0k97N04r3k6Pk72MN80n87J47
3629f4L45l63L25k57K85n12M58J82l77P7J78m36K97l13K19r0k19L25l7j04Mj99
3651b76Q6K95J6k47J84j32K5q8L1J35J18m27M86k13j72K81j74K06j06k28K87J47
3673B34l99K47K3m04Q7K8J73j20K27k06p8L65j09K3k33N10k93k9j6J66r2j47j34
3696a77K30M1k05J19Ok62J09K54p8j37Q2M06k87O4k51j82K76N4r3j24k40P21l78
3719e2L65j33j91j88roQ2J75j93J29l22M12k49k4l0M04j97J94j0n0o2j38k0j81
3743b94L34M3k79J02K10j88J79m27L64Nl9J15l07K35J82l66p5K65j76p8j00N7
$$ plain form
3582 278 -92 46 -210 92 146 -7 -113 84 241 -137 99 174 -63 19 12 268 -124 139 71 -16 119 99 -65
3605 -65 -267 -34 -52 -192 -275 -235 -58 21 -199 -7 -151 -27 39 -31 -328 176 83 57 64 -208 -204 376 -211 -64
3629 -64 281 -82 243 -14 271 -241 217 399 22 99 277 -159 138 -175 44 -46 -265 60 23 -81 -77 -276
3651 -276 -190 105 121 -126 58 -74 -49 -137 -106 29 147 -280 206 -7 -179 102 -72 134 28 -200 87 234
3673 234 -165 82 105 -299 -212 -184 -11 -131 96 -110 -188 177 68 91 -142 368 75 46 30 196 104 -43 -177
3696 -177 53 94 -111 8 14 -248 -139 115 37 -100 -18 388 101 165 -86 -268 8 62 -31 -155 -395 326 -52
3719 -52 313 180 -11 -199 -208 -214 -132 43 -150 -21 -343 69 -180 -204 -234 170 -27 167 157 107 45 -93 -113 -294
3743 -294 40 83 -196 -94 116 -72 107 -320 44 49 10 125 -182 53 235 -131 -206 59 -117 -195 -295 -238
3765b38L8K82j74m4J24J35N9j99J52j98N2K60l85m5L22k41j03NL64oJ4j56l0O2
3789E0Q0j80K60l00j25Q4Q4J22J87n30Q4J47J77r5j71J50l5j4J12o3m4M01k80
3812A01j22o1J53%k89N14m21j51J60J52J2n4L28q0l8n7n2Q2j18j09j28K73l70
3835b75K71J02l00J84L7j67R0Q4J85m18K64M9m7j60q7j53P88l36N0l25J56J68
3857A60J6o8k33L60k93P8o2k66K21Ok5K29j55j48J20K11j27K89k78q8J87j03k81
3880b50J57j96M87j61r4Op2N2j68J88J21k58Q9J53j17L03m48M63m95K44j68J20
3902d4R3L5jM9R1k07j8J66k12p6lN0r2J27J47j44J25p2J37k25N6k96L01k02M2
3927a73J88R8l83L25j79J55j89J90M7R0l00K11P6k54Q7j7J0J52r3J7k67l7J32
$$ plain form
3765 -238 -200 82 -92 -136 -12 123 182 -17 135 -63 -11 249 -136 -181 141 -100 -203 -198 166 160 174 18 -12 50
3789 50 130 -50 210 -90 -215 -131 -47 75 262 -268 -184 -37 140 45 -126 24 -11 -25 87 24 -20 381 101
3812 101 -21 -82 71 71 -218 296 -125 -276 -116 36 48 -6 322 242 204 147 95 177 59 -50 -178 95 -275
3835 -275 -4 98 -202 -18 19 -148 -58 26 211 -207 57 106 59 -101 -188 -341 447 111 161 -164 -8 160
3857 160 176 108 -125 235 -58 20 -42 -308 -87 -81 -106 123 -32 -180 -60 151 24 313 35 -53 134 31 -250
3880 -250 -93 -289 198 37 -57 -51 -123 -71 -239 -51 70 -188 -99 54 -63 240 -208 255 -240 4 -164 -44
3902 -44 49 84 83 132 223 16 -2 164 -48 -124 -127 -77 -169 -42 105 -39 86 14 151 -74 -18 -314 -13 -215 -173
3927 -173 15 113 -270 55 -124 31 -158 32 79 169 -131 80 156 -98 -11 -28 -18 134 41 58 -209 -246 -114
3950a14K73k02K52k99j7O3J1M2R2j01m4N6J45J9m62L73k16J08L26k40o8p5J44
3973F6n1l18K18l4p8K31K00l7k83L93m25k4n2K34j3NJ5j54o3J61Q9m5j86k5R6
3998h0P3M8j1j00K3K07k71L5P4j63J94M2j49q1K29m02L71N8M1l84J43L5K68o2
4022A38o6JN4j66k7K34l56L7N9Kq4J67j18L17j63M3J40l10j9K1L28q7m01K61j79
4047a74m5K0J08K72m12K76j11L8O9Q5o9K10j01Nl64J76P3r8j11P6K87k53j03J38
4071hP2K31j54k42r9K71l83N75j13j50q0r2K95l86L28j06K08jl10L98l47Q3K19
4094B09j44L0j57L0J08J30l34K16rj21J29k30J75k06J92j29Q1J16rk96J11o5K51
4117G8k70M93k47j2p5l7K7L4J28p4O9j60Q7k28J62M4P3j37K20k64L30j68r5n2
$$ plain form
3950 -114 159 -43 209 -90 -107 -44 -33 9 101 0 -44 12 157 176 -286 87 -129 -21 305 65 -3 -78 66
3973 66 15 -303 -85 -119 -197 34 234 197 -86 307 -118 -142 -194 40 27 32 47 -107 -170 -9 80 35 -151 -176 -80
3998 -80 -7 41 30 -70 -47 160 -111 -76 -2 -165 29 71 -78 -159 70 -332 39 97 138 -246 -103 -68 200 138
4022 138 72 73 127 -39 -66 168 -188 -151 -92 -90 -174 -7 -125 192 29 72 212 -98 -117 -96 232 145 -256 5 -174
4047 -174 -219 -199 -91 181 -231 45 -66 -28 41 126 57 267 166 171 -193 -17 56 -42 -153 -77 210 -43 -146 -8
4071 -8 64 295 141 -101 -200 71 -312 263 150 0 -80 -172 123 -263 65 -41 167 166 -144 254 -93 -10 209
4094 209 65 95 -62 -32 76 206 -128 88 79 -42 87 -143 32 -174 18 -111 -30 86 77 -219 -108 -173 78
4117 78 -192 301 54 42 -33 -70 -43 -9 119 45 114 -46 41 -187 -25 19 92 -45 175 -89 241 73 -22 -74
4141g4L6J23l11M47j14m03O88n74k53N28j31L5j62J76m05L36K33l19j41M26k9
4162A12k67Q9K2j34L53l82M92l38k23K47M4j28L22l18L67k89m2j50L08K39Om39
4184a09L4Q2l64N90j9l21K22q4j45J88j9k24o9K93Q1q7N5j60P4r5J15m1N7q9p4
4209a09lrP0Q0j72L72N5l13k27J31J59K9r4j53J37J49Lk99Q5M87m55M1j10k10
4233c56O46l70r7L01Q4k52k40J50L38j64K0rr6L4o3L2j19Q0J47J55m14J92k9o6
4257i6K94k79K96k37j75L01k56oj5N5J50J30J5k46L9K85j50k68K52l3J45m35l9
4280b73M81j48m6J2J68n54K45K66r3k51j04L24o8k38O20l32J7K27l57j2j11J85
4302d2j63L01j15j46K02j6o4J52o9N3n3L42k31k4j3k24l0M1oL85k46p8j03L03
$$ plain form
4141 -74 -38 85 -226 221 107 -296 392 -182 -435 93 -38 -3 -165 11 -394 -58 175 -144 -285 141 112
4162 112 -155 -66 -44 -178 175 -207 285 -53 -276 -29 15 -113 209 -109 258 -31 -73 -223 85 324 330 -109
4184 -109 -75 7 -357 233 214 -107 115 31 -114 74 55 -169 -238 55 136 49 104 -56 18 -77 38 -3 54 -35 -109
4209 -109 -112 -121 -51 29 -143 229 284 -29 -256 -125 34 63 -31 -184 -47 102 105 -194 -109 378 -77 -36 -146 -356
4233 -356 290 -80 -177 124 208 -44 -284 -134 204 40 60 51 -45 -11 -74 -42 -161 -81 66 221 -193 -1 -30 -96
4257 -96 198 -81 215 -22 -197 104 -152 -158 -173 -118 32 162 177 -69 -30 255 105 -163 89 56 201 -234 -273
4280 -273 208 60 14 26 194 -360 -115 151 58 -193 -297 27 -41 -279 341 9 26 253 -104 -116 -227 -42
4302 -42 -205 96 -19 -165 37 21 -43 109 40 93 40 382 151 127 114 -110 -140 -99 -105 280 34 -44 -147 156
4326A56j48j73J66o9J10j28J91l82K69J34l0o1m9J1j02pK38q3j21J46O0j8j70
4349f0J20k58j4K54m6j0MJ00k49M09Ln81K00L1j70L00j14K4R3k50L28j99j65L11
4373F1J55j95j95M87k67M7k7j30O7r0JK91m5k00J41l72J80J47q5K32l44K63j70
4396d8Ok62J53J43m0K32m31N9L94pl74J95J84k11j14L44k36O9N5rr6j09K44o7
4420G4k21j25K38J99j32j94K76Q3k08K01n66N46j79J48k47K20j7j49J01j75J91
4441F4N4n0k43j29N20J48l20k01R4M12k10p9Q1k46o6M19k83N1j70J84k83K87J42
4464A76n4k27K6M6q7J1k16L61L0o9j7P7K73n41K86k08M0J55j61k18J90r1P2P6
4488g0N7j85L94j69K9J37k58m9k26K18L6N7j0r5K18k86K23N4J54j00k22r8lM0
$$ plain form
4326 156 8 -165 1 -68 42 -86 105 -277 -8 126 96 35 -14 -3 -105 -112 126 43 -78 68 128 110 -60
4349 -60 60 -198 -212 42 -4 -14 -10 90 -159 250 253 -328 -128 -97 -267 33 -81 -57 36 -214 114 -85 -250 61
4373 61 216 21 -174 313 46 93 66 -64 3 -87 -86 205 160 -40 101 -271 -91 56 -29 203 -141 122 -48
4396 -48 -42 -304 -151 -8 -48 184 -247 -188 206 199 -175 20 204 -7 -121 223 -13 56 111 102 6 -103 141 74
4420 74 -147 -272 -34 165 33 -161 115 198 -10 191 -375 171 -8 140 -107 113 96 -53 48 -127 64
4441 64 118 68 -175 -304 216 364 44 -157 -63 349 139 60 141 -105 -171 248 -35 16 -154 30 -253 34 176
4464 176 122 -105 -79 -33 -120 -109 -325 36 66 -3 -20 57 330 -211 75 -133 -93 62 -99 -317 -127 -218 -146 -70
4488 -70 -13 -198 196 27 56 193 -65 -114 -340 -122 -86 -29 -39 -134 84 -202 21 75 229 129 -93 -191 -194 -154
4512a54Lj5R6L75l17k7o6K25J20j00K23o55K11J96q0q0RQ5r1l0L61j26L7k24r3
4537a17M34o1K5n04L39k47L1k7O28n27K38k76L12k55J3k62J94P4J9l8M8O0l2O8
4561A37k73M14n58R5L57k74L00j68L1L8J37k88p7q8L09k62J01R4p7L59k63j71
4583a27J92J9k73n2J05Q2M9J29k22K01o5Rr6Q7K92o54L93L0l01J96l7p6J16K58
4607B55r4p3m7K77o42L24l9L9o7M5q3K13L5n88K44p7L11j02l7N6m5J28k61K83
4631E5l03J01j15L90j22j62J83k43J16J18Lq4mj28K40k60L14j33N7l4J05j94O0
4654d0j6J54J68l90M08l93j9J63K4m5J35k61N0L1R1J5j91M8j93K60O6j53K79q0
4678A11r0k60J60j83M8L14k4R6j58N4j17L3k13M19J0N9k67j92J17K88j50k0k40
$$ plain form
4512 -154 -151 -166 -70 305 -12 -39 -105 120 240 140 363 -292 -81 115 35 -45 -36 49 -42 -72 289 163 200 -24 -117
4537 -117 317 256 281 -223 116 -131 -100 -127 501 -26 212 -64 248 -7 6 -256 -62 12 31 -7 41 101 69 137
4561 137 -136 278 -280 -185 172 -102 198 30 61 99 236 -52 -129 -217 92 -170 -69 25 -52 307 44 -127
4583 -127 65 84 -189 -241 -136 -54 -5 124 -98 103 38 47 -49 38 330 -324 69 99 -202 -6 -43 -119 -3 255
4607 255 161 88 41 318 -324 0 -39 0 -67 -22 -105 108 143 -445 -201 -278 33 -69 -106 -50 -95 33 -228 55
4631 55 -248 -147 -262 128 6 -156 27 -216 -100 18 21 -63 -67 -195 45 -215 99 -34 23 -11 94 -100 -40
4654 -40 -56 98 266 -124 284 -109 -128 35 59 14 149 -112 -62 -31 60 75 -116 -68 -261 -1 65 -88 191 111
4678 111 21 -239 -79 -262 -214 100 76 172 14 68 -49 -16 -229 190 200 259 -8 -200 -83 205 55 35 -205
4701b05L28M7j30Q1j69m9R3JJ24Q7n0O1j84k22L12l5j87k6M12k94%n3K62j57p5
4726b8J40j21J27j3R6k96n9K31k97jJ92O7J85k46j47L30L7j24R7j8k38J55j30
4749f1Mo9J52K49m26K46l42M0Q3l1p2K83k05J23J81j36J25l46J1K14K32k03j23
4772g1L21l79J60q1r3k6oL27N4j44l59K10Q1K25m38J86j48j8J13K15p9ro0K46
4796B27O5K2j88l48NL21q2k03J61K0k38O8j50L03k55K66J36j90r9qK65n5j34J87
4820I6K7k04J03J73j65n3M8o0jK12j89Jk1n0K9J34m9o3O0j45O5l6J47K6k98N07
4846B94l13J32l63J36j47M12k28L51J48o00L60j63r7L32l68J56J90n44M76o8m1
4867E5m21J22q9K51N7j71K59j65p2J21o9J17L24o20L22j57J02J97Q2j95N0m57
$$ plain form
4701 -205 123 170 40 121 -48 -97 -4 -3 121 208 158 219 35 -187 125 90 -97 -123 289 -5 -5 -58 204 47 -28
4726 -28 112 -9 118 105 201 -95 -154 77 -220 -221 -29 38 223 -23 -170 160 197 73 170 152 -86 69 -61
4749 -61 -57 -126 26 275 -151 95 -247 -207 -124 -155 -227 56 -149 -26 155 19 144 -202 -191 23 255 52 -71
4772 -71 250 -129 31 -50 -143 -169 -175 152 206 62 -297 -87 -6 219 -219 -33 -181 -199 -86 129 50 41 -19 227
4796 227 292 314 126 -222 -217 104 22 -181 -20 0 -238 -170 -320 -17 -272 -6 130 -60 -159 -167 98 43 -91 96
4820 96 123 -81 22 195 30 -23 25 -35 -36 176 -13 -12 -33 -83 -54 80 31 -32 28 -117 -52 -88 59 85 -213 294
4846 294 -19 113 -250 -114 -261 151 -77 274 422 -178 182 19 -78 254 -114 42 232 -312 164 96 55
4867 55 -366 -244 -333 -82 -25 -196 63 -102 -174 -53 -122 -5 319 -301 21 -136 -34 163 245 50 100 -357
4889c57O45j10n06M00M6J73n72K16J4J5l02K89j67L01k31O5K61N7k80n0M76k70
4911A13j58M6R0k09K19K26j71k60P2j14K66l44J80J55L32m25R3n7R1k92K13P8
4933A44O8j29r5P7q8KK15m00L38j21K4k67L92k46q5J72N3J27L12n27nJ93l7P0
4957A87m26K87lJ49j84J37k03r0R4j7N7m8N8l26N66k28J85j38l4o8k72K08K34
4980A25N5J96m13K73n34L16q1o9M9K11k27N8k48N95n25J27m2J50Q3o7J90k11p6
5003f5j07O5P1Q4n0r2j82N16j30r5k3N6j2L31j73k03j53k63L32K0J22j68N9L61
5027C01m79j6J6M8J64O9R2m1k83L1J62k36K24L3j03k1j10Q9K26K2l42j15J98M8
5051b3R1m6j52K6L1J31k47J41j69O6j12L07p5j47J50J79k12J18J6j16K22j87J96
$$ plain form
4889 -357 288 178 -328 72 118 291 -281 -65 -51 -36 -338 -49 -216 85 -146 -81 180 237 -43 -93 383 113
4911 113 -45 1 91 -118 101 327 156 -104 -32 -146 120 -224 -44 111 443 18 111 54 145 -147 66 144
4933 144 212 83 -12 65 -23 -21 194 -206 132 11 35 -232 160 -86 -171 1 54 181 493 -34 -39 154 117 187
4957 187 -239 48 45 194 10 147 -56 -146 -52 -69 -12 -60 -2 -328 238 10 195 57 23 -45 -317 -109 125
4980 125 180 376 -37 236 -298 18 -63 -132 -83 128 -99 -41 -289 306 -219 -92 -134 16 99 32 222 11 -65
5003 -65 -172 -107 -36 48 -2 -94 -276 240 110 15 -8 48 36 367 194 -9 -162 -425 -93 -73 49 -119 -60 301
5027 301 -178 -194 -178 -130 34 103 195 154 -129 -98 64 -172 52 85 -18 -39 -149 -60 166 188 -154 -269 -71 -23
5051 -23 68 22 -130 -104 -73 58 -189 -48 -217 -151 -263 44 -31 -178 -28 151 -61 57 73 -43 179 -8 188
5074A88j79J58L9l19j76L73J6k72O9k63J10K70J53mj18k2q5p5L76l26K75k58K32
5097A62Jp3Q2j3k50J83p0J0J34n1j90qmJ46j80J86l75M30J31m0q6k52J96l0l6
5122Cq5M1J79j7K20m68j28J2J68J66j40L6K01j69k25K21l9M15n49k11L33j17K69
5145A16j72K40J14l00J52j98j78J4L86m23N57l37J27l9J54k33m0j3J74J14m07
5166a92J42K43o4k93L77m12K62M9J20n74n3K88p9M01m17J78j60L45M5l43R2o3
5188a08K6K1r5n7M57l58L61l43k5o9N94n84N90m56m0P8n7L8K03Mj81l02M51L4
5212A82k59K3k31L78k93N59l21Q5p6L78p98K68L27j58J43k41k54K07K72k89l8
5233a36J26o1N3K30k89J31J12k42K51k63K56l94K87j65O6L02n92K50O5J48j86
$$ plain form
5074 188 9 167 206 -113 -289 84 100 -172 -103 -366 -256 14 167 163 45 23 -62 -137 239 -87 188 -70 162
5097 162 163 90 172 159 -91 92 22 32 166 115 -75 -83 -87 59 -121 65 -310 120 251 211 125 -127 69 39 3
5122 3 -82 -41 138 121 341 -127 -255 -243 -75 91 -49 -13 188 19 -206 15 -24 391 -158 -369 -36 -153 116
5145 116 -56 184 298 -2 150 -48 -226 -212 174 -249 308 -29 98 59 213 -20 -60 -73 101 215 -192
5166 -192 -50 193 129 -164 213 -199 63 112 232 -342 -395 -107 -186 215 -202 -24 -184 161 206 -137 -45 -108
5188 -108 -82 -61 -156 -213 244 -114 247 -96 -121 -190 404 -180 410 -46 -86 -8 -65 -27 176 180 -1 -303 148 182
5212 182 -77 -54 -285 93 -200 359 38 123 47 425 -373 -105 222 64 207 -34 -288 -81 191 -98 -136
5233 -136 -10 -71 -18 212 -77 54 166 -76 175 -88 168 -226 61 -104 -38 264 -328 -78 -13 135 -51
5254e1O3K15N3l32L14o26K97L00Kk06j27kL06n0J3j82k54J86m8j46M23J80j07
5277B21j62Oj6l55M52j56j16M2M10l25m6J93j82K94k87L1K01j74p7J04k16J26
5299c2j70L56l0o4q4j69J22J09M9K31j21k74nJ85K2k80J95j41J52N9l15K3M53
5322B71k3k73j53K02%m7l4j21J93M1P9j48J25k28o5k0K07J40j20J39j42j5L7k44
5346a99L30k71K43p9K05p6j91N7k0R3l4J46j19k68K19J07n5Nl32K57j39R6n6j05
5370a86K66q4M9j44J32P8j42P3J42k25r3K96j14L8J01j70N2j77M3N6J43k10J62
5393H6k76J2J33K15n3j32L1j39R5p7jJ40j72N04m45J37L26p17L77N4M5k9j39j88
5417b13J69P0K5l6j55J96k18L32k27M7J60k61oJ40J27q7k98K47j85L49j19j67
$$ plain form
5254 -51 12 227 280 -52 262 -364 -67 233 235 29 -98 -100 206 156 169 -13 -267 -81 -129 -275 148 328 221
5277 221 59 65 49 -306 146 -10 -126 -84 326 1 -45 148 -34 260 -27 4 205 31 -46 58 -158 -32
5299 -32 -202 154 124 60 -24 -193 -71 38 87 318 197 -77 -82 103 125 -155 40 -101 51 110 -205 -182 271
5322 271 248 -25 -178 24 24 -23 -57 -178 15 56 135 -13 112 -116 -181 -201 6 146 26 165 23 8 45 -199
5346 -199 131 -140 103 24 229 153 -38 19 -1 92 58 204 85 -183 36 143 88 93 -239 18 -121 -25 -81 -186
5370 -186 80 -4 45 -99 33 111 -31 42 184 -41 -134 162 48 86 187 17 69 -108 -65 -9 134 -76 86
5393 86 -190 -178 -45 170 117 -15 16 -123 -28 -105 -106 34 -138 366 -79 58 384 -333 44 98 143 114 -25 -213
5417 -213 -44 26 51 15 -140 56 -162 170 -57 -10 150 -111 -117 23 150 63 -235 12 -173 176 57 -110
5439a10k3K58k21m6k64L80r4J34J09j17j62k1K52j21JL3J49k38P4j81L61j20k67
5462b34K26k06J50J62j42j23PJ42J50k56J55K1j01J37J6K93l21J13k21J60j59
5483c1L77l55Q6j0k32J03K5P7k09M41l60K4M1j1p6m2J1R8j50K98mL9k48P5J24
5508I1k98K78k97K63k28K65l46K24J13jL56m94M5K6M7j50L02p4j9p2r7R9L38n16
5532a45j42L91JK63m05l14K19J55P6J1j93L76j27n4j4k58m5M95j02j50k33mL76
5555A77k9l66N70o24L92Q4rj79k42O6K26l99J06K74L3l51M77j88rK6P6k69nJ67
5579Dl02O08k49J70l40L44j46j2%m3k75K29j58L35m39M36j00j91P8J12K6j22j05
$$ plain form
5439 -110 -133 125 -96 -142 -406 -26 -120 14 123 6 -156 -177 75 -46 -45 -12 137 -101 -27 -208 153 33 -234
5462 -234 -8 -214 -64 98 -44 -167 -160 -18 132 -124 31 52 -49 88 104 397 76 189 -32 128 -31
5483 -31 346 -9 77 67 -165 -62 -37 40 -169 272 -88 -64 -23 -34 -110 -152 -141 -43 -193 105 101 140 -108 -33 91
5508 91 -207 71 -226 37 -191 74 -272 -48 65 64 420 -74 -29 -3 44 -106 196 122 103 31 -66 33 371 -145
5532 -145 -287 104 105 368 -37 -351 -132 23 99 110 -83 293 166 112 98 -160 -205 290 188 38 -195 -199 177
5555 177 148 -218 352 -272 120 204 195 16 -226 -160 66 -333 -227 47 80 -271 206 18 9 35 111 -158 -163 4
5579 4 -298 310 61 231 -109 235 89 77 77 34 -241 -12 -170 165 -274 162 62 -129 -51 61 87 -35 -140
$$ [...]
8191B18
##END NTUPLES=NMR FID
##END=
