##TITLE=1H_CA-8589
 CDCl3, 8 sc, 
 7.5.2019
##JCAMPDX= 6.0         $$ Bruker NMR JCAMP-DX V2.0
##DATA TYPE= NMR FID
##DATA CLASS= NTUPLES
##ORIGIN= UXNMR, Bruker Analytische Messtechnik GmbH
##OWNER= root
$$ XWIN-NMR		Version 3.5
$$ Tue May  7 12:34:09 2019 Russian Standard Time (UT+4h)  she@DPX200
##.OBSERVE FREQUENCY= 200.1315
##.OBSERVE NUCLEUS= ^1H
##.DELAY= (6, 6)
##.ACQUISITION MODE= SIMULTANEOUS
##.ACQUISITION SCHEME= undefined
##.AVERAGES= 8
##.DIGITISER RES= 18
##SPECTROMETER/DATA SYSTEM= spect
##.PULSE SEQUENCE= zg30
##.SOLVENT NAME= CDCl3
##.SHIFT REFERENCE= (INTERNAL, CDCl3, 0, 15.7039)
##AUDIT TRAIL= $$ (NUMBER, WHEN, WHO, WHERE, WHAT)
$$ ##TITLE= Audit trail, XWIN-NMR		Version 3.5
$$ ##JCAMPDX= 5.01
$$ ##ORIGIN= Bruker BioSpin GmbH
$$ ##OWNER= she
$$ F:/spectra/data/she/nmr/H-F/1/audita.txt
$$ ##AUDIT TRAIL=  $$ (NUMBER, WHEN, WHO, WHERE, WHAT)
(   1,<2019-05-07 12:32:59.98 +0400>,<she>,<DPX200>,
      <created by zg, POWCHK disabled, PULCHK disabled
       configuration hash MD5:
       00 E9 B6 7A A2 85 ED C7 34 08 36 98 17 FE 4E 26
       data hash MD5: 16K
       ED 48 2E 85 28 E2 26 11 8E AE B5 42 33 24 CD 7D>)
$$ ##END=
$$ 
$$ hash MD5
$$ F9 CC 8E 03 D5 78 0E C6 D4 E2 88 61 3E 06 6A 39
##$RELAX= 
##$RELAX= 
##$RELAX= 
##$RELAX= 
##$RELAX= 
##$RELAX= 
$$ Bruker specific parameters
$$ --------------------------
##$DU= <F:/spectra>
##$EXPNO= 1
##$NAME= <H-F>
##$PROCNO= 1
##$TYPE= <nmr>
##$USER= <she>
##$AMP= (0..31)
100 100 100 100 100 100 100 100 100 100 100 100 100 100 100 100 100 100 
100 100 100 100 100 100 100 100 100 100 100 100 100 100 
##$AQSEQ= 0
##$AQ_mod= 1
##$AUNM= <au_zg>
##$AUTOPOS= <>
##$BF1= 200.13
##$BF2= 200.13
##$BF3= 200.13
##$BF4= 200.13
##$BF5= 200.13
##$BF6= 200.13
##$BF7= 200.13
##$BF8= 200.13
##$BYTORDA= 1
##$CFDGTYP= 0
##$CFRGTYP= 5
##$CHEMSTR= <none>
##$CNST= (0..31)
1 1 145 1 1 1 1 1 1 1 1 1 1 1 1 1 1 1 1 1 1 1 1 1 1 1 1 1 1 1 1 1 
##$CPDPRG= <>
##$CPDPRG1= <>
##$CPDPRG2= <>
##$CPDPRG3= <>
##$CPDPRG4= <mlev>
##$CPDPRG5= <mlev>
##$CPDPRG6= <mlev>
##$CPDPRG7= <mlev>
##$CPDPRG8= <mlev>
##$CPDPRGB= <>
##$CPDPRGT= <>
##$D= (0..31)
0 1.2 0 0 0 0 0 0 0 0 0 0.03 0 0 0 0 0 0 0 0 0 0 0 0 0 0 0 0 0 0 0 0 
##$DATE= 1557217979
##$DBL= (0..7)
120 120 120 120 120 120 120 120 
##$DBP= (0..7)
150 150 150 150 150 150 150 150 
##$DBP07= 0
##$DBPNAM0= <>
##$DBPNAM1= <>
##$DBPNAM2= <>
##$DBPNAM3= <>
##$DBPNAM4= <>
##$DBPNAM5= <>
##$DBPNAM6= <>
##$DBPNAM7= <>
##$DBPOAL= (0..7)
0.5 0.5 0.5 0.5 0.5 0.5 0.5 0.5 
##$DBPOFFS= (0..7)
0 0 0 0 0 0 0 0 
##$DE= 6
##$DECBNUC= <off>
##$DECIM= 24
##$DECNUC= <off>
##$DECSTAT= 4
##$DIGMOD= 1
##$DIGTYP= 9
##$DL= (0..7)
0 120 120 120 120 120 120 120 
##$DP= (0..7)
150 150 150 150 150 150 150 150 
##$DP07= 0
##$DPNAME0= <>
##$DPNAME1= <>
##$DPNAME2= <>
##$DPNAME3= <>
##$DPNAME4= <>
##$DPNAME5= <>
##$DPNAME6= <>
##$DPNAME7= <>
##$DPOAL= (0..7)
0.5 0.5 0.5 0.5 0.5 0.5 0.5 0.5 
##$DPOFFS= (0..7)
0 0 0 0 0 0 0 0 
##$DQDMODE= 0
##$DR= 18
##$DS= 0
##$DSLIST= <SSSSSSSSSSSSSSS>
##$DSPFIRM= 0
$$ [...]
##$SUBNAM2= <"">
##$SUBNAM3= <"">
##$SUBNAM4= <"">
##$SUBNAM5= <"">
##$SUBNAM6= <"">
##$SUBNAM7= <"">
##$SUBNAM8= <"">
##$SUBNAM9= <"">
##$SW= 24.9337058887773
##$SWIBOX= (0..15)
0 0 2 0 0 0 0 0 0 0 0 0 0 0 0 0 
##$SW_h= 4990.01996007984
##$TD= 16384
##$TD0= 1
##$TE= 0
##$TE2= 300
##$TE3= 300
##$TEG= 300
##$TL= (0..7)
0 120 120 120 120 120 120 120 
##$TP= (0..7)
150 150 150 150 150 150 150 150 
##$TP07= 0
##$TPNAME0= <>
##$TPNAME1= <>
##$TPNAME2= <>
##$TPNAME3= <>
##$TPNAME4= <>
##$TPNAME5= <>
##$TPNAME6= <>
##$TPNAME7= <>
##$TPOAL= (0..7)
0.5 0.5 0.5 0.5 0.5 0.5 0.5 0.5 
##$TPOFFS= (0..7)
0 0 0 0 0 0 0 0 
##$TUNHIN= 0
##$TUNHOUT= 0
##$TUNXOUT= 0
##$USERA1= <user>
##$USERA2= <user>
##$USERA3= <user>
##$USERA4= <user>
##$USERA5= <user>
##$V9= 5
##$VALIST= <valist>
##$VCLIST= <CCCCCCCCCCCCCCC>
##$VD= 0
##$VDLIST= <DDDDDDDDDDDDDDD>
##$VPLIST= <PPPPPPPPPPPPPPP>
##$VTLIST= <TTTTTTTTTTTTTTT>
##$WBST= 1024
##$WBSW= 4
##$XGAIN= (0..3)
0 0 0 0 
##$XL= 0
##$YL= 0
##$YMAX_a= 284953
##$YMIN_a= -204274
##$ZGOPTNS= <>
##$ZL1= 120
##$ZL2= 120
##$ZL3= 120
##$ZL4= 120
##$ABSF1= 10
##$ABSF2= 0
##$ABSG= 5
##$ABSL= 3
##$ALPHA= 0
##$AQORDER= 0
##$ASSFAC= 0
##$ASSFACI= 0
##$ASSFACX= 0
##$ASSWID= 0
##$AUNMP= <proc_1d>
##$AZFE= 0.1
##$AZFW= 0.1
##$BCFW= 1
##$BC_mod= 2
##$BYTORDP= 1
##$COROFFS= 0
##$CY= 11.3945322036743
##$DATMOD= 1
##$DC= 2
##$DFILT= <>
##$DTYPP= 0
##$F1P= 18.9103706918063
##$F2P= -1.10871071338519
##$FCOR= 0.5
##$FTSIZE= 0
##$FT_mod= 4
##$GAMMA= 1
##$GB= 0.15
##$INTBC= 1
##$INTSCL= 1
##$ISEN= 128
##$LB= 0.24
##$LEV0= 0
##$LPBIN= 0
##$MAXI= 10000
##$MC2= 0
##$MEAN= 0
##$ME_mod= 0
##$MI= 1.114404
##$NCOEF= 0
##$NC_proc= 0
##$NLEV= 6
##$NOISF1= 3.799351
##$NOISF2= 2.8
##$NSP= 1
##$NTH_PI= 0
##$NZP= 0
##$OFFSET= 15.70392
##$PC= 1
##$PHC0= -9014.229
##$PHC1= 15.00026
##$PH_mod= 1
##$PKNL= yes
##$PPARMOD= 0
##$PSCAL= 0
##$PSIGN= 0
##$REVERSE= no
##$SF= 200.130013532006
##$SI= 16384
##$SIGF1= 3
##$SIGF2= 2
##$SINO= 400
##$SIOLD= 16384
##$SREGLST= <1H.CDCl3>
##$SSB= 0
##$STSI= 0
##$STSR= 0
##$SW_p= 3612.71676300578
##$SYMM= 0
##$S_DEV= 0
##$TDeff= 0
##$TDoff= 0
##$TI= <>
##$TILT= no
##$TM1= 0
##$TM2= 0
##$TOPLEV= 0
##$USERP1= <user>
##$USERP2= <user>
##$USERP3= <user>
##$USERP4= <user>
##$USERP5= <user>
##$WDW= 1
##$XDIM= 8192
##$YMAX_p= 0
##$YMIN_p= 0
$$ End of Bruker specific parameters
$$ ---------------------------------
##NTUPLES= NMR FID
##VAR_NAME=  TIME,          FID/REAL,        FID/IMAG
##SYMBOL=    X,             R,               I
##VAR_TYPE=  INDEPENDENT,   DEPENDENT,       DEPENDENT
##VAR_FORM=  AFFN,          ASDF,            ASDF
##VAR_DIM=   8192,          8192,            8192
##UNITS=     SECONDS,       ARBITRARY UNITS, ARBITRARY UNITS
##FACTOR=    0.0002004,     1,               1
##FIRST=     0,             0,               0
##LAST=      1.6414764,     0,               0
##MIN=       0,             -204274,         0
##MAX=       1.6414764,     284953,          0
$$ Real data points
##PAGE= N=1
##DATA TABLE= (X++(R..R)), XYDATA
0 0 0 0 0 0 -8 0 -8 8 -8 16 -16 24 -32 32 -40 48 -64 72 -86 102 -119 136 -159 184 -209 241 -273 311 -352
29 -352 399 -447 504 -566 633 -705 788 -876 972 -1079 1196 -1324 1466 -1623 1797 -1990
45 -1990 2210 -2454 2733 -3057 3428 -3869 4398 -5048 5867 -6937 8400 -10536 13965 -20360
59 -20360 36417 -159974 -204274 161110 89660 -104901 -143713 -18214 -52770 -106419 -11643
70 -11643 125786 18602 -162784 -126210 76432 83385 -94927 -164448 -35293 43038 -11255
81 -11255 -61393 -33186 -29663 -62578 -54209 14682 58116 39664 -9132 -37393 -36638 -13062 14684
94 14684 33688 34112 15471 -33827 -94138 -88051 20638 106986 39579 -91569 -98298 860 44765
107 44765 11483 -2321 3148 -26221 -39018 26146 75158 -5529 -123312 -96182 47315 101567
119 101567 8332 -85380 -91108 -61236 -16304 59328 83302 -14401 -114376 -73342 34421 52863
131 52863 -1698 -17686 1250 -12710 -33776 -5589 20146 -21921 -57515 342 60825 6589
143 6589 -74181 -40772 37616 23523 -29762 -4742 46311 18597 -39696 -32268 7158 3278 -9333
156 -9333 26496 49158 -17858 -97041 -63972 38049 68305 12761 -36651 -49542 -44914 -8880
168 -8880 42872 35305 -34348 -64647 -14422 31784 9374 -36746 -47882 -31443 -9659 20134
180 20134 32705 -18934 -93685 -78279 24470 70943 5986 -55951 -39429 -10277 -14903 -7339
192 -7339 21594 13473 -30005 -34825 7404 17866 -26136 -43018 8017 47872 13508 -34673 -27019
205 -27019 4125 10518 9954 17018 7516 -11133 -2449 20466 13843 -13005 -13501 16385 36199 22517
219 22517 -7553 -28060 -24724 7606 50082 51809 -5189 -52196 -24375 33152 39767 6870 -8209
232 -8209 -5229 -5971 3167 23012 15294 -22704 -32031 12601 48899 18457 -38244 -42336 2275 29052
246 29052 20080 7081 -5449 -24488 -21543 13226 29939 1127 -25313 -9178 17946 13385 -11676
259 -11676 -20790 -6205 11210 17368 11667 -6707 -27472 -21029 15501 34282 8007 -21490 -15089
272 -15089 6134 10546 3066 -4081 -9402 -5561 10776 19180 1379 -25342 -24203 8869 32957
285 32957 16529 -16961 -26669 -10549 8432 18457 12735 -10007 -24068 -6279 19292 14826 -12243
298 -12243 -24621 -9227 13767 19987 3626 -18781 -25166 -8415 17787 26082 2225 -27721 -24891
311 -24891 4765 19699 7451 -8403 -12908 -7469 4794 12324 1663 -16941 -17378 3662 20572
324 20572 11302 -13797 -22978 -5128 14814 14100 106 -11341 -13309 -2706 12429 11232 -7267
337 -7267 -16741 -3389 14242 14019 -3454 -19072 -14394 6936 20154 10918 -9392 -19897 -9998
350 -9998 11928 20901 4736 -16396 -16423 1069 14663 12048 -3985 -17281 -10156 11167 19643 4700
364 4700 -15124 -17887 -1072 17081 15781 -3172 -16158 -9739 5774 14678 8970 -7068 -15614
377 -15614 -3840 13313 13217 -2504 -13710 -8432 7497 16664 6956 -10549 -14390 -1528 12108
390 12108 13266 1309 -12418 -11192 5306 16392 8399 -7590 -13625 -3947 11796 15187 392
403 392 -14075 -10033 6147 15453 9639 -5399 -14320 -5944 10626 15119 3292 -10381 -11384 1496
417 1496 15145 12440 -4893 -14344 -4908 10018 13747 3949 -9220 -11225 1727 14328 11513 -2236
431 -2236 -11313 -6943 6893 15102 6380 -8985 -10951 2025 13214 11424 -672 -10672 -6587 7629
445 7629 14533 6033 -6598 -9540 -251 12429 13736 828 -10452 -6126 6871 13653 7788 -4891
459 -4891 -10682 -862 13291 13687 667 -9326 -6435 5058 13513 9080 -4067 -10268 -2377 9914
473 9914 13475 4102 -8719 -9232 4223 13834 7378 -4899 -8634 -2390 7497 11849 4259 -7817
487 -7817 -9211 1996 11702 8690 -3455 -10533 -3595 8486 10727 2072 -6189 -6868 449 9798 9537
502 9537 -2895 -11402 -3797 9375 11649 2516 -6915 -7626 1012 10069 9471 -374 -9080 -6733 5660
517 5660 13641 5623 -7722 -8203 2540 9125 6603 -63 -6577 -6831 2964 12349 7784 -5979 -11243
532 -11243 -1672 9706 8811 -1585 -7655 -4355 1581 5247 5353 -1173 -9216 -5282 7929 10178 -2791
547 -2791 -11812 -5739 4926 7934 3131 -3482 -7355 -4921 3382 9596 4340 -8067 -10075 2588
561 2588 11403 4281 -5666 -5318 418 4873 7985 5138 -4726 -9591 164 12893 11280 -1594 -7927
576 -7927 -1094 7179 7045 3033 841 -1770 -1754 5636 10566 1438 -9235 -2923 10994 11026 -808 -7047
592 -7047 -3785 1277 4553 6337 3100 -5681 -9077 555 10226 3666 -9916 -9277 2543 6297 220
607 220 -4363 -6560 -8144 -2228 8484 7276 -8084 -16772 -6696 6630 5888 -3152 -6501 -4293 -3938
622 -3938 -2021 3774 2206 -8501 -9679 4278 10415 -2175 -12039 -4564 5590 4461 118 366
636 366 -652 -4907 -3074 5698 7206 -2318 -5929 4113 9572 -313 -8488 -1950 6653 6356 3930
651 3930 1964 -4915 -9138 905 14498 10872 -5593 -11215 -909 7433 4560 419 124 -2896
665 -2896 -5109 4005 13142 2532 -15080 -10619 9761 14904 1419 -7073 -4118 -2018 -1811 5434
679 5434 12117 4179 -9996 -8384 6030 9537 -333 -2782 5261 6506 -907 -2144 3063 3634 2061
694 2061 5309 6646 280 -3296 3371 9307 4512 -1858 1307 7137 5854 2499 3243 693 -5475
709 -5475 20 16576 17226 -4545 -17199 -3193 13019 10800 2686 1467 -1705 -9069 -4640 12009
723 12009 15166 -3705 -16058 -2441 13072 5919 -7938 -6275 1231 199 -99 6266 4697 -8535
737 -8535 -13048 -287 10601 5562 -3445 -3798 -1533 -3604 -2826 4299 7014 784 -2957 -122 -1195
752 -1195 -4907 1168 11459 7983 -4934 -6857 2662 6772 3139 2370 3668 -144 -3080 5101 13482
767 13482 5163 -10035 -7451 10325 16768 6172 -3026 -4196 -4348 98 12633 17828 3651 -12463
781 -12463 -8695 6792 12101 5679 1044 431 -2076 -1961 5587 9447 336 -7095 1054 10635 4717
796 4717 -4764 -2128 3834 1033 -1308 5417 8971 395 -7120 -1803 5563 2885 -655 5205 8987
811 8987 -1116 -10541 -3014 10034 10117 2308 -802 -1642 -3973 -637 8694 9925 -106 -6882 -864
826 -864 7537 6595 283 -2524 -1902 272 6240 10651 2918 -10115 -9155 5395 12511 5697 -1533 -3089
842 -3089 -4763 -4576 3644 11121 5030 -7094 -7272 2984 5333 -2358 -4072 3124 4353 -2677 -3951
857 -3951 1886 1669 -4095 -2374 4559 3500 -3550 -3931 1658 1706 -3693 -3208 3674 6079 522 -4143
873 -4143 -3710 -2485 -165 5649 8159 216 -8600 -5864 3318 6514 3557 539 -1684 -3342 -744
888 -744 4898 5097 -1813 -5297 1249 7998 4457 -3451 -4377 -441 1515 3487 6353 3025 -5592 -6992
904 -6992 1758 7594 3428 -2000 -1209 971 -489 -1746 944 2772 349 -720 2267 1924 -3627 -4609
920 -4609 1977 5444 940 -2850 -828 851 -676 -1065 1028 1124 -812 -15 2513 799 -4496 -4731
936 -4731 2299 6742 2821 -2674 -3720 -2662 -871 2970 5107 963 -4573 -3514 1956 3623 103
951 103 -2491 -987 1486 1899 894 -749 -2998 -3106 1613 5831 3046 -3450 -4857 -1209 1735 2160
967 2160 1613 -87 -2165 -1649 826 1522 -651 -1939 88 2599 1231 -2121 -2848 -772 646 1625
983 1625 2333 385 -3215 -2994 977 2380 -366 -1825 284 1813 297 -1819 -1757 -337 584 1405 2309
1000 2309 187 -3997 -4102 1437 5012 1816 -2664 -2659 -165 1017 811 223 -902 -1430 -37 2156 2031
1017 2031 -1441 -4020 -1624 3028 3804 480 -2699 -3151 -1106 1890 3107 977 -1726 -1844 -230 953
1033 953 890 -221 -1092 -245 1246 1321 -259 -1927 -1584 917 2718 1139 -1700 -1886 -24 891 700 370
1051 370 -265 -577 206 953 -65 -1590 -1563 545 2633 1780 -1416 -3048 -1208 1514 2335 1070 -1169
1068 -1169 -2584 -1222 1505 2073 -19 -1801 -1394 460 1674 834 -1588 -2564 -827 1562 2276 517
1084 517 -2235 -2930 -373 2093 1461 -730 -1847 -1409 -167 906 517 -884 -1401 -389 726 769 -819
1101 -819 -2227 -1406 933 1583 -231 -1669 -1470 -402 657 686 -589 -1530 -975 268 701 -36 -1360
1118 -1360 -1660 83 1750 810 -1610 -2339 -1027 866 1639 530 -1488 -1951 -461 1082 1140 -205 -1775
1135 -1775 -1728 389 1643 428 -1521 -1763 -421 1062 1314 -370 -2129 -1710 31 1104 730 -672
1151 -672 -1910 -1307 591 1083 -362 -1578 -1317 -327 622 305 -1135 -1800 -703 630 735 -340 -1677
1168 -1677 -1812 -324 1103 344 -1286 -1497 -755 264 767 -90 -1610 -1763 -235 1022 535 -1021 -1935
1185 -1935 -970 833 1097 -264 -1331 -1403 -657 474 899 -361 -1910 -1229 522 999 -232 -1440 -1391
1202 -1391 -467 469 297 -628 -1331 -1265 -204 929 251 -1626 -2040 -302 662 -150 -1019 -1358 -1203 -312 638
1221 638 162 -1375 -2041 -895 717 737 -984 -1980 -1029 239 416 62 -460 -1404 -1349 480 1376 -214
1239 -214 -1696 -1046 561 995 329 -372 -649 -518 156 847 833 -534 -1301 201 1616 718 -881 -369
1257 -369 645 605 162 342 -146 -799 -17 1366 1122 -610 -1494 -144 1371 740 -698 -828 -298 -243 195
1276 195 1030 60 -1911 -1467 960 1328 -550 -1697 -952 -89 107 252 178 -794 -1757 -898 1105 843 -1433
1295 -1433 -1734 267 843 -577 -736 137 -226 -903 25 991 -290 -1604 -554 1416 1056 -917 -1059
1312 -1059 559 898 -379 -329 669 -66 -1011 686 2095 -15 -2086 -566 1900 1407 -538 -796 12
1329 12 -237 -406 996 1630 -436 -2325 -417 2192 868 -1774 -1079 881 260 -778 266 822 -964
1346 -964 -1634 390 1704 23 -1782 -801 963 282 -1040 76 1254 -59 -1165 61 705 -663
1362 -663 -678 1522 1637 -892 -1712 416 1798 700 -68 365 106 -902 -5 2205 1649 -1365 -1663 1433
1380 1433 2466 -6 -1034 277 425 -613 586 2424 820 -2272 -1800 1552 2163 -202 -1146 299
1396 299 174 -1420 -554 1763 1073 -1682 -1307 1021 336 -1692 -793 1274 315 -1889 -1119 944 445
1413 445 -1433 -994 607 -109 -1531 -181 1537 -415 -3036 -1140 2227 1527 -1099 -1201 -355 -1022 -851
1430 -851 1441 2342 -514 -2920 -1063 1785 1411 -514 -462 239 -621 -838 1242 1729 -963 -2230 507
1447 507 2219 413 -1039 -100 184 -1143 -641 1813 1948 -1112 -2489 -105 1287 -216 -669 1345
1463 1345 967 -2363 -2615 1013 2482 -167 -1538 -44 178 -1384 -791 1579 1220 -1937 -2354 776
1479 776 2197 -113 -1777 -603 170 -542 332 1931 292 -2865 -2172 1301 2350 427 -671 -575 -1068
1496 -1068 -1206 684 2343 738 -2013 -1423 962 908 -726 -166 1075 -228 -1665 140 1795 -23
1512 -23 -1946 -614 1388 550 -819 -81 626 -933 -2122 -4 2462 995 -1666 -1578 -61 -380 -435
1529 -435 1283 1503 -1357 -2794 -597 1650 795 -688 -595 -175 -730 -540 965 798 -1479 -2048 538
1546 538 2143 232 -1502 -696 -119 -692 164 1982 962 -1904 -2276 301 1673 469 -325 317 -2
1563 -2 -1511 -1012 1372 1714 -578 -1263 361 729 -745 -455 1007 549 -1228 -763 1150 970 -843 -1308
1581 -1308 67 709 145 211 829 -323 -2083 -1048 1653 1839 -263 -1082 -441 -365 -456 761 1356 -85
1599 -85 -1567 -763 771 673 -508 -526 388 275 -320 122 518 -587 -1328 204 1540 467 -856 -473
1617 -473 15 -381 -234 792 942 -392 -1118 -419 508 73 -171 605 754 -624 -1249 136 852 -116 -577
1636 -577 320 514 -372 -387 358 178 -721 -435 941 1023 -485 -1283 -365 527 345 254 696 -22 -1382 -890
1656 -890 933 1174 -205 -717 -7 309 -217 -235 304 279 -251 -223 564 463 -701 -883 344 887 236 -188
1676 -188 -66 -291 -617 -67 591 419 -97 -126 -83 -172 -337 33 517 307 -282 -325 -37 -115 -175 315 530 -234
1698 -234 -580 165 459 -281 -653 72 676 436 -134 -264 -200 -384 -206 640 1004 -93 -1124 -546 565
1717 565 599 86 31 -73 -320 -211 240 262 -226 -349 100 596 334 -338 -509 -133 66 238 428 81 -537
1738 -537 -502 198 353 103 56 122 -138 -426 -220 14 158 212 60 21 -144 -325 -205 272 310 -263 -369 127
1760 127 238 11 -201 -134 -190 174 401 160 -269 -626 -390 273 824 416 -426 -647 -211 222 513 334 -237
1781 -237 -549 -53 307 274 3 -184 -222 3 411 221 -193 -382 -215 223 491 259 -249 -264 80 47 68 107
1803 107 126 -133 -22 48 -39 -38 152 238 176 -21 -322 -303 211 401 131 -138 -143 -43 144 322 -22 -459 -136
1826 -136 201 358 219 -187 -464 -240 400 602 173 -364 -419 -151 345 606 106 -394 -230 55 319 275 27
1847 27 -372 -204 285 338 53 -127 -187 9 311 282 -110 -311 -40 142 174 162 -75 -151 113 243 0 -128
1869 -128 -133 39 210 264 -88 -322 -93 327 405 114 -248 -361 -71 351 290 -148 -315 -63 61 288 327 -221
1891 -221 -562 -182 397 475 43 -481 -422 174 417 203 -57 -253 -286 -90 330 244 -244 -435 105 354 216
1912 216 -66 -291 -166 150 231 94 -138 -245 -76 387 446 -120 -428 -131 347 201 26 4 -169 -110 406
1933 406 493 -99 -404 -160 337 480 27 -422 -162 238 193 183 235 -245 -523 -7 601 240 -479 -349 116
1954 116 260 120 -75 -126 -233 -28 317 448 -156 -640 -172 606 506 -374 -439 -8 113 85 328 144 -494
1975 -494 -336 370 669 -17 -630 -390 259 425 -5 -86 -18 -223 -123 554 513 -424 -707 116 690 54 -437
1996 -437 -74 143 -47 46 298 90 -442 -325 456 602 -393 -852 152 726 12 -385 59 13 -322 11
2016 11 605 154 -797 -546 530 770 -146 -737 -149 407 74 -89 202 -120 -786 -192 990 549 -691
2035 -691 -781 150 571 93 -131 -28 -232 -379 90 729 185 -786 -406 617 532 -443 -438 247 154 -169 110
2056 110 369 -151 -489 267 741 -33 -732 -193 754 451 -316 -270 152 34 -92 555 553 -618 -1076 353
2076 353 1216 249 -742 -353 227 136 55 457 229 -646 -643 626 1165 -90 -1023 -129 768 256 -310 136 243
2097 243 -550 -311 759 684 -514 -654 384 660 -258 -572 207 513 -93 -391 259 198 -525 -128 959
2116 959 546 -1010 -839 588 852 -193 -519 85 42 -266 155 700 -25 -1168 -508 1132 996 -646
2134 -646 -1015 129 440 -89 260 464 -472 -1141 -194 1089 570 -691 -711 331 461 -263 -195 326 -64
2153 -64 -633 78 706 -89 -810 -89 813 100 -698 -198 531 138 -489 -103 278 -157 -272 562 622 -569
2173 -569 -1222 72 1237 511 -685 -501 49 -184 1 832 484 -923 -1148 366 1227 169 -812 -314
2191 -314 348 196 47 393 152 -945 -631 792 1100 -329 -914 -92 443 -14 -80 469 207 -504 -355
2210 -355 409 403 -380 -309 674 506 -605 -695 319 603 -151 -320 170 -65 -464 98 765 17 -906 -441 814
2231 814 774 -343 -740 -204 108 63 563 640 -502 -1326 -251 1124 728 -513 -616 -100 4 -43 416 331
2251 331 -454 -780 188 921 155 -951 -483 511 409 -178 8 263 -298 -499 242 604 -74 -483 -9 460
2271 460 -115 -587 -97 610 318 -271 -256 -162 -204 -31 674 466 -531 -798 131 655 178 -373 -318 -59 37 273
2293 273 416 -108 -857 -454 665 852 -125 -795 -409 123 229 261 454 -234 -798 -201 680 415 -372 -530
2313 -530 209 411 -66 -263 -81 -27 -138 163 447 25 -660 -301 441 364 -169 -192 139 199 -129 -108 0 -94
2335 -94 -94 337 448 -200 -728 -251 569 524 -101 -404 -162 -107 69 358 245 -357 -445 245 623 172 -640 -463
2357 -463 73 499 307 46 -248 -475 -215 532 768 -93 -621 -301 299 217 -6 -90 -143 -46 111 323 -83
2378 -83 -437 -355 292 561 118 -423 -322 82 183 179 109 -182 -309 -29 280 81 -342 -226 220 369 82 -295
2400 -295 -340 -174 120 272 252 -190 -560 -103 445 271 -206 -287 -22 179 145 77 -220 -406 -127 393 492 -38
2422 -38 -667 -519 210 500 174 -221 -301 -167 92 311 210 -244 -392 24 355 205 -244 -390 -128 229 363
2443 363 53 -205 -353 -175 194 297 0 -263 -189 175 184 -4 -161 -110 34 277 169 -181 -366 -139 258
2464 258 345 78 -319 -288 40 199 198 -34 -219 -171 156 302 34 -391 -352 112 325 317 -115 -446 -260 134 392
2487 392 220 -171 -458 -225 196 334 5 -322 -212 32 266 165 -172 -368 -214 171 326 97 -304 -304 -21
2508 -21 243 172 -21 -275 -165 50 150 9 -184 -219 55 282 10 -129 -314 -174 159 320 -45 -314 -219
2529 -219 29 211 174 -135 -289 -98 148 243 73 -402 -320 35 333 257 -117 -330 -216 187 376 252 -185
2550 -185 -355 -113 246 223 64 -181 -223 105 332 174 -140 -228 -97 155 326 80 -173 -202 79 252 199 22
2572 22 -159 -74 181 303 33 -163 -64 107 252 185 -125 -282 -12 230 308 49 -131 -168 58 291 136 -144
2594 -144 -221 -50 140 254 33 -188 -244 104 210 143 -209 -285 -182 155 196 69 -191 -234 -91 210 244 -27
2616 -27 -279 -162 142 231 108 -227 -199 -48 239 297 -18 -197 -186 33 238 223 -119 -131 30 216 174 -31 -151
2639 -151 -71 79 316 137 -92 -181 29 197 189 23 -212 -145 74 209 110 -28 -181 -65 247 225 -47 -283
2661 -283 -121 161 152 146 -36 -154 -96 198 291 78 -158 -302 111 301 70 -117 -173 -55 57 167 211 -143 -284
2684 -284 19 291 216 -108 -145 -18 107 189 80 -165 -73 -88 209 221 6 -293 -95 219 166 -24 -185 -126 -60
2707 -60 61 140 74 -222 -183 60 249 79 -174 -211 108 133 25 -45 -118 -148 -20 312 137 -173 -289 19 222
2730 222 117 -63 -188 -77 -18 106 114 -81 -245 -150 219 258 -123 -272 -75 148 126 70 -18 -153 -156 117 261
2753 261 154 -194 -247 88 252 128 -123 -77 44 33 84 158 10 -267 9 288 203 -146 -175 50 78 63 -14
2776 -14 -5 -70 -34 40 250 22 -267 -173 241 223 -154 -199 -79 -31 36 160 26 -233 -166 74 237 68 -254 -252 54
2801 54 157 20 12 -7 -201 -89 163 217 -131 -260 -71 183 185 -76 -152 29 -20 16 65 19 -204 -165 171 301
2825 301 -70 -265 -24 169 65 -45 -5 -46 -124 1 254 115 -218 -241 111 308 1 -224 -125 69 9 0 142
2848 142 -53 -259 -103 269 197 -191 -238 -15 139 27 -7 -19 -121 -137 50 196 70 -267 -174 167 212 -115
2870 -115 -163 5 7 41 41 86 -96 -147 27 251 13 -202 -104 109 213 0 -83 -26 -98 -21 130 184 -113 -274 -40
2895 -40 299 162 -150 -99 -25 57 47 85 18 -121 -97 121 278 -97 -214 -83 195 84 9 6 -38 -187 -21 233
2919 233 147 -136 -165 63 273 23 -165 -33 127 -2 -41 66 12 -138 -84 272 191 -204 -204 56 222 44 -12
2942 -12 -78 -20 -11 116 118 -6 -176 -130 188 217 -57 -165 -10 44 42 121 58 -121 -214 -44 148 42 -159 -133 98
2967 98 82 3 -61 -39 -15 -68 69 185 -79 -220 -86 128 67 -89 -45 -16 46 -33 2 -83 -115 -82 126 101 -84 -182
2993 -182 -64 217 127 -69 -69 -108 -103 -34 151 11 -176 -134 53 144 -48 -196 -111 25 171 116 22 -107 -140 -80 202
3018 202 133 -160 -186 15 79 29 26 -76 3 -16 80 114 -26 -109 -57 133 168 21 -153 -57 81 44 37 -21 -27 -65 84
3045 84 90 -33 -82 -18 57 118 15 -151 -31 7 -3 124 42 -98 -173 39 152 66 -37 -60 5 48 42 -4 -64 -99 -63
3072 -63 74 98 -84 -195 -78 65 128 62 -30 -40 -82 45 107 -26 -29 -43 44 42 8 -48 -82 20 116 36 -34 -23 -92
3099 -92 52 116 116 9 -95 -21 81 58 -52 -86 26 -2 142 54 -45 -122 23 101 92 -5 -42 6 17 32 50 -49 -83
3126 -83 -22 34 73 -15 -58 -69 60 89 24 -70 -125 -49 85 99 51 -88 -75 -3 121 59 -8 -24 3 62 66 25 -69 -78 62
3155 62 108 54 -23 -82 -57 55 79 16 -25 9 -19 40 28 32 -66 8 69 36 -27 -34 -25 100 152 20 -6 -53 -106 18 67 67
3185 67 64 -97 -8 68 -13 -90 -53 43 56 38 -9 -81 -72 16 42 -11 -4 -38 -51 24 81 -34 -28 34 -30 68 16 -37 -53 -3 111
3216 111 65 7 -35 -76 5 34 77 35 1 7 85 31 -15 -49 -37 29 78 40 -19 -55 -46 103 84 -3 -37 -24 -7 114 32 -53
3246 -53 5 14 125 -2 72 -17 -45 40 91 -8 25 -76 -57 23 0 -3 -24 -64 -32 35 -13 -22 -56 -45 34 21 -26 -89 -21 44
3276 44 54 42 2 -50 -21 26 27 32 -30 -82 14 -46 37 -42 -26 -2 47 40 43 10 -52 32 -2 -42 -12 8 56 47 13 -9 -33 39 13
3309 13 9 -8 -20 -66 -33 23 28 -21 -7 -33 3 15 10 -50 -47 25 59 -36 -26 -42 -19 29 57 18 -29 -29 5 82 33 3 -46 -45 31
3342 31 13 -17 -31 53 -20 80 17 -27 -64 -63 -1 48 28 -36 -75 -18 102 125 -6 -62 22 67 41 18 -20 -83 8 2 -3 -17
3372 -17 -50 -90 30 47 10 -82 -112 4 52 63 -22 -56 18 -11 55 25 -80 -88 73 89 63 -49 -56 -42 12 107 83 22 -74
3401 -74 14 119 90 22 -71 -15 44 102 -36 36 -78 3 39 76 -77 -76 -72 28 97 7 -85 -72 -22 93 37 56 -7 -55
3429 -55 -32 127 96 -61 -119 6 60 62 36 -114 12 32 70 38 -83 -141 -96 70 97 14 -69 -58 44 98 69 11 -47
3456 -47 -41 48 115 65 -123 -47 31 103 82 -55 -92 -21 53 32 56 -106 -85 -57 120 155 -62 -75 -92 59 -6 17 -61 -74
3484 -74 -14 101 111 15 -178 -74 104 124 18 -49 -175 -60 8 84 -10 -100 -95 75 180 11 -109 -118 32 92 52
3509 52 -29 -97 -97 8 80 102 -133 -196 25 162 125 -34 -105 24 25 75 99 -3 -153 -133 90 144 -1 -103 -70 66
3535 66 66 -26 -40 -93 -135 13 206 84 -136 -132 33 139 62 -78 -95 -6 64 117 74 -61 -128 7 181 123 -137 -143
3561 -143 8 109 54 -25 -88 -133 -55 153 134 19 -234 -125 183 181 -60 -101 -12 3 58 141 19 -167 -165 25 257
3586 257 117 -159 -166 50 84 43 56 -60 -50 -5 165 214 -58 -231 -33 262 110 -129 -90 -70 22 42 77 -19 -161
3611 -161 -187 146 148 -26 -193 -110 67 94 -19 -2 -90 -44 63 178 55 -217 -192 51 153 45 -97 -142 -37
3634 -37 74 87 19 -53 -248 -71 151 234 -26 -208 -39 119 20 43 18 -93 -125 57 243 57 -224 -133 99
3657 99 200 -29 -151 -42 51 41 90 29 -112 -168 118 270 118 -127 -150 97 103 42 9 -138 -95 3 167 139 -18
3682 -18 -257 -81 196 197 -2 -120 -111 32 142 196 63 -218 -161 23 178 45 -190 -162 90 130 21 -82 -59
3705 -59 -98 33 178 170 -153 -286 13 144 108 -119 -170 -75 18 106 24 -123 -159 -98 148 189 -116 -329 -50 147
3729 147 145 -122 -96 -156 -88 117 166 -21 -222 -170 76 169 29 -219 -114 14 129 120 46 -175 -171 13 241 150 -70
3754 -70 -184 -5 75 80 15 -35 -81 21 111 57 -63 -242 -28 181 168 -119 -210 -104 24 141 120 -38 -188 -151
3778 -151 29 167 0 -139 -144 89 211 43 -102 -177 -86 65 227 171 -233 -305 -77 262 154 -90 -170 -111 36
3801 36 140 91 -85 -193 -51 98 204 -75 -260 -147 31 133 61 27 -201 -83 62 175 -28 -136 -120 28
3823 28 139 89 -114 -151 24 148 161 -29 -161 -143 58 234 204 -89 -146 33 127 197 36 -118 -163 10 158
3846 158 116 -90 -214 -22 167 266 25 -227 -161 -16 156 140 53 -201 -159 118 216 42 -85 -46 46 183 96
3869 96 -76 -141 -86 80 271 144 -110 -233 -43 154 191 16 -100 -167 58 184 61 -96 -104 1 198 206 -34
3892 -34 -238 -146 6 181 128 -82 -227 -116 62 183 22 -127 -107 33 122 46 -143 -193 -19 158 61 2 -153
3915 -153 -194 -14 245 181 -68 -234 -119 17 149 2 -83 -123 -47 95 89 -52 -277 -169 125 303 90 -168
3937 -168 -212 -80 158 215 66 -80 -171 69 159 65 -61 -50 3 233 206 -31 -178 -86 100 211 129 -32 -187
3960 -187 -18 109 162 62 -61 -74 96 163 97 -117 -181 84 177 254 38 -183 -184 59 238 171 -72 -187 -124 76
3984 76 222 66 -107 -151 54 147 108 -84 -238 -61 85 173 87 -133 -226 -116 102 161 55 -156 -84 59 107
4007 107 146 -138 -65 16 179 56 -35 -152 -152 115 253 170 -69 -153 -117 126 134 -53 -113 -123 70 177 37 -150
4031 -150 -131 44 177 111 -73 -257 -201 23 171 136 -30 -214 -169 60 104 -74 -130 -140 49 87 79 -36 -260 -149
4055 -149 150 186 55 -187 -231 -19 161 156 -5 -69 -82 58 68 124 -111 -87 78 169 144 -16 -165 -90 56 196
4079 196 43 -79 -94 -124 113 116 -98 -110 -8 85 133 -6 -46 -111 35 174 211 -21 -159 -121 118 279 55 -138
4103 -138 -194 -45 35 108 71 -79 -173 -19 144 77 -132 -213 -60 93 160 4 -150 -118 -21 118 218 -2 -157
4126 -157 -87 68 97 -1 -26 -39 30 126 82 15 -151 -142 102 176 66 -178 -162 59 203 65 -5 -139 -55 0 127
4151 127 160 -131 -237 -16 178 48 -43 -214 -28 43 142 70 -61 -195 -69 140 159 -32 -231 -89 68 27
4173 27 -41 -25 -91 -91 36 180 -8 -212 -232 51 245 39 -73 -73 46 77 83 72 -61 -223 -69 153 125 -178 -247
4198 -247 -13 151 172 -15 -85 -77 -67 107 169 27 -202 -132 98 133 11 -140 -91 6 64 68 9 -76 -79 114 209 100
4224 100 -156 -105 72 181 60 -63 65 20 50 152 103 -155 -211 41 285 106 -130 -134 -128 34 165 81 28 -165
4248 -165 -81 104 143 -5 -223 -36 47 129 73 -7 -133 -107 11 153 73 -147 -217 22 103 48 -118 -72 5 38 -12
4273 -12 -8 -78 -114 12 134 121 -188 -190 -24 173 73 -94 -135 -100 15 98 114 -5 -244 -116 191 203 -22 -188
4297 -188 -106 20 28 74 96 -145 -154 40 169 60 -131 -194 -47 155 87 -83 -1 -81 -121 43 100 -82 -205 -85
4321 -85 77 26 -43 -86 -8 33 -43 23 28 -102 -91 37 92 -31 -131 -49 151 105 -17 -111 -32 -76 51 171 68 -184
4347 -184 -110 68 204 109 -80 -101 29 61 192 190 -1 -133 -24 202 257 -67 -144 -60 71 42 102 54 -18 -66 -25
4372 -25 68 63 -36 -124 95 116 -26 -149 -6 31 21 21 -11 -94 -136 37 89 -26 -150 -129 94 66 -11 -82 -102 -103 -34 104
4400 104 117 -117 -251 -27 179 131 -34 -138 -66 -27 74 143 17 -97 -151 20 197 26 -132 -88 130 73 -45
4423 -45 41 29 -104 -25 94 80 -50 -45 3 97 25 -30 -48 94 70 -3 -27 -54 -45 -15 171 61 -140 -133 25 126 12
4450 12 25 -56 -98 -72 100 99 -21 -16 -81 87 172 80 -70 -76 30 78 103 64 -87 -81 13 170 46 -36 -57 -23 67 -13
4478 -13 37 -51 -56 12 -42 66 7 -136 -29 187 59 -47 -49 -2 25 84 49 -50 -20 -77 26 88 -11 -152 -98 121 160
4505 160 4 -19 -112 -62 6 3 42 -99 -145 -26 51 65 -23 -67 -8 52 -7 16 -65 -117 -56 120 151 -6 -79 -32 45 28
4533 28 31 4 -21 1 -7 135 20 0 -49 -37 98 -13 -97 -101 70 62 45 7 -29 -76 27 71 75 -38 -69 30 31 50 -82
4562 -82 -35 9 38 146 15 -154 -139 -49 71 82 26 -6 0 -49 71 53 14 -4 -11 -4 63 15 -59 -76 29 133 -16 -57
4590 -57 -39 -74 -29 84 88 -15 -79 -12 50 -30 -133 -73 -45 79 59 -52 -71 -39 -54 64 39 -27 -120 -73 10 107 85 1
4618 1 32 26 2 6 -102 7 19 28 148 36 -55 -25 44 93 103 -12 3 -53 8 31 62 15 3 7 40 2 -61 -95 14 50
4648 50 101 36 -67 -160 -68 85 48 25 28 5 -25 -19 -66 -19 48 94 0 38 -47 -63 -80 45 152 54 -74 -58 -8 -45 45
4677 45 41 -52 -48 -10 -20 -98 -49 14 32 48 51 -58 -124 -43 15 25 124 32 26 -24 -26 20 -8 15 -32 26 44 35 -40 -75 61 91
4709 91 118 32 -84 -55 -54 44 10 66 -10 -11 0 -33 -5 -78 10 41 7 -1 -45 -103 -20 -2 29 6 -16 -87 -76 25 -5 -2 -27
4740 -27 -14 84 -44 -39 5 -15 97 91 2 -52 -148 -58 99 164 42 -8 -40 -54 -62 84 83 -78 -22 50 47 53 -78 -77 16 139
4770 139 113 11 -8 -36 -21 7 -13 24 -32 4 28 -27 -18 -54 37 67 54 11 -147 -53 -28 61 20 4 -98 -67 6 41 39
4799 39 26 10 -20 30 11 -53 -61 -76 114 95 -23 -69 -119 -41 66 45 -54 -33 -98 -93 15 99 75 20 101 44 -81 32
4827 32 -72 -26 44 12 41 -39 -32 -10 47 46 29 -106 79 43 -40 -57 23 58 -8 71 46 -119 -122 -95 64 165 52 1
4855 1 -68 -45 -37 -13 122 -70 -120 -24 82 7 -89 -11 22 -13 18 -12 -64 -66 -18 20 46 32 -45 36 49 19 -84 -62 28 -34
4885 -34 -12 55 -74 -90 11 122 54 10 -54 -92 -7 46 14 -5 64 -52 24 66 17 -20 -80 9 146 -27 4 -70 4
4912 4 9 59 55 26 -36 -58 41 22 24 -6 16 124 -42 -97 21 -37 -26 39 46 -30 -145 -12 38 57 -56 -107 -19 57 8 -4
4942 -4 -112 -106 -54 48 160 17 -150 -31 13 69 62 10 -125 -82 -5 50 118 48 -154 -130 98 -15 -56 40 13 28 -19
4969 -19 41 6 -71 -60 33 18 -87 -91 20 65 7 -55 -78 12 51 -19 -13 -20 -94 -136 130 85 -4 -178 -61 -57 53 20 39
4998 39 -116 -108 3 137 130 -80 -157 -21 71 25 42 -61 -103 -96 26 102 -14 -64 -129 14 86 9 8 -25 63 -4 7 87
5026 87 91 -51 10 58 -29 -120 -1 120 89 1 -63 -49 67 92 -8 -1 -3 -100 33 158 57 -74 -135 -17 40 52 -21
5053 -21 -130 -172 -72 106 177 -34 -144 -121 53 87 16 -35 -99 -56 -24 86 48 31 -112 -61 1 -9 -78 -3 -6 4 -28
5080 -28 -5 -20 -23 17 37 46 -54 -78 90 152 29 -82 -104 21 29 54 50 -92 -103 -21 170 122 -62 -150 -49 -6 97
5107 97 11 -53 -64 -89 43 137 66 -103 -134 46 31 48 82 -81 -25 -38 61 48 -41 -90 -57 60 -20 -15 -56 -2 1 -66 21
5136 21 6 -15 32 97 82 -96 -81 94 105 18 -85 -81 -35 90 113 79 -47 -99 -110 99 164 -1 -82 -89 30 78 109
5163 109 6 -34 -121 -95 129 48 -36 -179 4 84 45 -17 -106 -39 -30 7 60 64 -31 -49 41 52 -7 -78 34 41 94 -48
5191 -48 -59 -52 -10 116 129 -43 -137 -39 74 66 33 -53 -84 -74 73 127 75 -149 -134 -5 188 54 -47 -124 -83 106
5217 106 157 23 -47 -105 -65 117 100 -44 -98 -23 13 2 -4 -84 -51 -27 53 65 -59 -38 -56 54 137 59 -101 -47 52
5244 52 81 7 -2 -105 -16 61 130 63 -89 -81 1 125 103 -88 -57 -25 95 124 78 -23 -139 -24 84 133 -18 -169
5270 -169 -78 38 71 80 -29 -106 -84 6 140 16 -85 -112 15 91 46 47 -28 -74 -29 106 -56 -101 -78 31 81 100
5296 100 -84 -95 -57 60 85 17 -56 -85 -40 82 129 -53 -119 -22 139 88 -66 -90 -58 37 142 73 -5 -97 -96 77
5322 77 177 35 -110 -107 35 105 40 -20 -97 -75 71 73 -21 -41 -150 43 112 92 -38 -119 -80 73 83 -16 -127 -140
5348 -140 -44 138 69 -38 -93 -84 98 106 49 -75 -178 -6 65 142 54 -119 -105 33 152 91 22 -6 -38 96 75 28
5374 28 -63 -63 67 104 55 -50 -163 -32 108 106 -3 -72 -62 -34 106 49 -53 -137 -49 165 76 -4 -62 -211 -18 186
5400 186 99 -5 -194 -88 90 174 33 -89 -64 -26 87 75 -40 -158 -21 27 57 35 -100 -132 -19 75 153 -59
5424 -59 -70 3 -12 120 15 -30 -80 25 88 53 -25 -117 -35 63 153 69 -142 -122 48 98 137 -11 -73 -115 -13 194
5450 194 24 -34 -95 -40 63 123 -104 -168 -150 50 158 58 -13 -124 -99 137 63 21 -124 -104 34 109 59 2 -131
5475 -131 -27 125 162 -17 -156 -112 -35 168 97 -21 -64 -49 77 123 50 -156 -80 61 126 -14 -92 -128 -54 88
5499 88 151 64 -109 -168 -2 159 131 -50 -149 -24 47 117 19 3 -114 -47 118 112 -49 -105 -139 53 103 148 -61 -130
5525 -130 -86 173 114 47 -99 -119 52 116 25 -24 -73 -10 41 172 -20 -105 -74 20 173 102 8 -153 -81 51 161
5550 161 -42 -99 -54 59 157 111 -28 -154 -62 120 149 65 -177 -160 -62 110 153 16 -130 -109 -36 180 83 -147
5574 -147 -118 0 94 25 -1 -139 -71 62 154 118 -133 -207 -35 173 107 7 -141 -56 60 108 5 -33 -50 -128 164
5599 164 124 -50 -177 -115 123 188 121 -67 -128 -54 61 129 28 -121 -103 38 147 60 -114 -134 -78 61 92 36
5623 36 -64 -121 -26 125 75 -21 -195 -79 15 52 13 -44 -34 39 77 110 -112 -191 -55 150 132 -32 -190 -110 20
5648 20 148 103 -60 -102 -16 69 142 49 -132 -182 15 155 133 46 -138 -177 63 202 98 -110 -207 -17 68 157 37
5673 37 -161 -117 -32 80 82 -59 -29 -39 124 61 -29 -68 -21 1 85 63 -110 -119 -42 80 79 -39 -105 -108 78 142 74 -135
5701 -135 -97 1 186 179 18 -227 -207 10 197 122 -139 -205 -85 133 162 134 -141 -114 -64 78 143 12 -163 -127
5725 -127 144 69 54 -80 -160 -55 47 162 27 -112 -89 8 115 -29 -83 -66 66 80 -13 -12 -80 -128 121 71 6
5750 6 -139 -198 75 195 101 -74 -206 -52 115 179 135 -108 -218 -86 171 224 -12 -241 -129 2 174 197 -2
5773 -2 -228 -177 52 147 45 -36 -217 43 101 101 -1 -110 -86 -32 116 73 -42 -142 58 116 -13 -161 -75 50
5797 50 93 37 -44 -136 -98 3 87 83 -105 -222 -1 166 156 -45 -114 -130 -38 164 97 -117 -247 -100 93 211 93
5822 93 -136 -194 -48 150 179 72 -105 -144 -26 158 97 -109 -186 -61 80 117 49 -87 -16 -16 112 94 34 -67
5846 -67 -118 144 145 -64 -203 -2 91 158 79 -110 -116 6 133 147 -68 -148 -141 111 226 91 -134 -118 -4 47 219
5871 219 40 -158 -204 -2 172 126 -35 -185 -148 47 140 75 -102 -160 -77 158 156 -7 -174 -145 38 131 -10 -73
5895 -73 -98 -12 56 150 42 -125 -37 64 139 90 -45 -92 18 174 137 -47 -101 -74 47 170 100 -111 -177 2 190
5920 190 220 72 -155 -85 24 175 113 -85 -109 -54 128 179 24 -208 -141 -14 145 133 -5 -129 -148 98 129
5943 129 20 -77 -129 15 110 45 -45 -165 -71 56 168 92 -102 -159 15 175 152 -74 -168 20 58 173 30 -116
5967 -116 -118 -42 144 154 -41 -133 -150 120 157 62 -151 -103 -46 132 100 45 -206 -122 37 111 90 -16 -188 -62 162
5992 162 141 -7 -107 -126 7 174 94 -39 -146 -43 92 115 9 -104 -130 17 185 113 -88 -131 -55 102 124
6015 124 49 -126 -74 26 138 15 -25 -103 -57 72 117 21 -107 -136 33 152 103 -52 -209 -105 11 146 56
6038 56 -23 -147 20 183 129 -19 -64 -41 63 88 51 -93 -161 -80 59 153 -4 -149 -203 46 181 48 -3 -183
6062 -183 4 86 160 39 -125 -54 10 151 108 -82 -172 -84 66 151 -63 -83 -116 -4 85 144 -2 -112 -22 99
6086 99 122 -8 -165 -106 66 202 74 -73 -113 -63 10 175 65 -168 -53 -32 111 14 1 -123 -28 26 132 48
6110 48 -36 -150 -37 123 124 -30 -165 -102 -6 95 66 -43 -162 -43 121 81 5 -153 -92 36 223 69 -35
6133 -35 -84 -32 140 93 21 -163 -23 31 174 136 -127 -90 -41 36 123 65 -153 -74 -28 99 92 -57 -136 -8 127 132
6159 132 75 -123 -74 -4 158 79 -68 -163 -28 110 107 49 -134 -83 -29 72 48 -45 -149 -49 108 79 56 -77 -51
6184 -51 50 65 120 -8 -122 -60 35 150 7 -113 -78 29 24 85 32 -131 -59 76 134 112 34 -111 -11 121 61
6209 61 -34 -149 -54 69 122 128 -42 -96 -52 98 119 53 -39 -154 2 192 61 -94 -120 -38 95 149 29 -103 -138
6234 -138 17 134 87 -39 -119 -99 108 77 14 -115 -139 -42 87 72 -66 -121 -54 70 151 37 -113 -129 -15 91
6258 91 21 13 -103 -73 81 139 18 -40 -114 -34 131 92 -83 -60 -66 32 152 160 -43 -107 -5 153 147 2 -102 -100 79
6285 79 113 91 -47 -61 -56 65 118 18 -94 -77 48 84 -6 -76 -86 -33 51 148 43 -18 -124 -43 116 60 -7 -137
6311 -137 18 86 153 30 -112 -122 -1 185 69 -35 -70 -93 52 157 117 -14 -93 -25 100 121 -2 -99 -87 132
6335 132 150 20 -48 -56 -93 121 140 21 -149 -129 23 120 85 -58 -86 18 32 31 21 -8 -3 -33 79 62 -67 -131 -28
6362 -28 73 -2 21 -84 -51 -54 122 112 -45 -165 -34 146 103 -15 -94 -85 -69 160 88 -67 -190 -81 97 171 83
6387 83 -94 -126 38 109 42 -26 -91 -69 -6 83 37 -74 -141 4 65 119 47 -30 -44 -21 80 -6 -46 -17 35 50 126 -46
6415 -46 -105 -76 149 65 25 -68 -55 -24 124 67 -17 -136 -152 65 141 70 -101 -86 -64 121 50 59 -76 -81 11 123 100
6442 100 -82 -125 -119 24 87 92 18 -68 -5 73 31 46 -103 -12 68 112 55 -36 -3 18 52 83 -58 -16 -38 113 72 -70
6470 -70 -118 -48 31 115 84 -26 -103 -64 16 95 38 -84 -169 27 132 76 -89 -79 -26 40 65 37 20 -101 -61 77 74
6497 74 33 -125 -94 86 50 66 -60 -2 -76 50 40 -36 -68 10 10 78 37 -41 -62 63 144 5 -18 -99 -26 55 45 4
6525 4 -39 -99 12 22 76 21 -145 -66 -37 83 134 -28 -117 -58 87 110 -18 -136 -122 -48 44 71 42 -76 -64 -18 90
6552 90 50 -35 -132 -46 76 18 8 -60 -55 6 8 48 -34 -31 -23 83 47 -27 -86 -39 43 108 -32 -62 -43 6 118 41 -18 -118
6582 -118 -16 104 97 25 -32 -122 3 73 116 62 -92 -49 -33 84 53 -62 -17 30 41 -21 50 -88 -77 -56 28 76 -1
6609 -1 -102 -31 23 42 13 7 -120 -9 105 49 -41 -58 -30 50 76 -11 -87 -88 30 49 37 -34 -117 -2 87 123 -11 -54
6637 -54 -31 -75 105 30 -3 -32 -56 42 74 67 -36 -74 -12 54 42 -58 -63 -79 2 34 87 -76 -62 -113 52 43 -50 -3 -26
6666 -26 -6 76 43 -37 -50 -29 14 80 -3 -110 -92 -42 83 42 -14 -88 7 85 57 -18 -28 -104 -29 98 85 -17 -77 -29
6694 -29 47 42 27 -128 -56 -49 81 139 69 -79 -15 13 91 23 -52 -111 -23 49 84 32 -80 -40 -28 45 19 -48 -110 -10 126
6723 126 125 -44 -76 -30 5 -39 79 -69 -61 -13 82 76 -53 -48 -65 -19 98 -21 -60 -67 -65 -1 65 24 -24 -40 3 46 61 -45
6753 -45 -64 -14 67 65 9 -69 -49 37 56 30 -14 -91 -2 65 39 63 -78 -70 33 25 8 -60 -34 -60 102 48 -16 -97 -110 -10
6783 -10 99 62 -12 -25 -20 -9 123 68 -42 -33 2 50 68 2 42 -6 21 55 8 -22 -40 -11 89 -2 -19 -67 25 42 -10
6812 -10 61 -53 -79 -62 -7 80 -36 -112 7 25 49 76 -4 -23 -30 -30 55 40 -63 -34 33 1 22 -64 -19 -30 29 10 22
6841 22 -50 -2 51 51 73 8 16 -63 29 77 86 -44 -16 -4 22 95 -56 -96 -61 4 34 86 -25 -92 -21 54 56 -1 -90 -51 28
6872 28 99 52 -46 -30 30 130 70 -5 -81 -26 1 84 61 -6 -44 67 91 113 -37 -70 -36 1 29 71 -90 -69 -15 22
6900 22 68 4 -17 -30 31 44 66 -11 -89 -39 27 137 33 -62 -97 -18 20 57 -37 -43 -74 25 59 24 -49 -26 117 -9 17
6929 17 -38 -32 -99 24 84 86 -38 -88 20 102 57 71 -66 -36 102 38 76 -37 -74 -69 -29 39 10 -1 -83 23 84 4
6957 4 -65 -64 11 24 67 25 -73 -14 25 70 73 -106 -68 -11 2 56 -8 -111 -83 -24 91 90 -47 -66 35 129 52 -12 -40 48
6987 48 -58 72 15 -41 35 -26 31 71 4 14 -36 0 62 8 -11 -26 -132 -25 73 59 -40 -99 -17 6 50 -63 -62 -70 12
7016 12 102 80 -48 -73 -66 34 49 51 -13 -13 59 -3 -24 1 -33 -18 64 62 -23 -34 -18 52 75 26 -52 -78 -45 33 22 41 8
7047 8 -93 8 102 70 -60 -61 -39 48 59 -1 -69 -37 -53 25 52 22 -59 -94 18 30 -19 -39 8 -7 43 33 -60 -65 -36 26
7077 26 113 33 -47 -48 60 53 -8 -19 -2 -23 7 57 4 -46 -53 2 55 33 -50 -30 -44 2 95 43 -8 -60 -9 89 35 7 -46
7108 -46 -29 -24 24 -16 52 -33 5 27 47 38 -47 -26 88 8 1 -18 -5 2 -17 -22 -19 -17 -34 34 90 54 -44 -88 -29 43 23 21 15 -66
7142 -66 5 110 40 -9 -32 -43 59 102 -17 -67 47 36 78 58 -33 -70 -39 17 71 29 -10 19 14 4 -33 -15 -71 -36 14
7171 14 67 6 43 -39 34 52 67 2 -22 75 41 51 28 -11 -66 54 56 65 20 -7 -41 34 29 -11 -6 -26 -56 16 68 -6 -79 -127
7203 -127 28 84 55 -4 -73 10 51 13 -4 -88 -54 -39 64 1 13 -17 -42 16 44 13 -68 -82 13 -23 -15 14 62 -49 75
7232 75 54 28 -13 -31 102 -2 -83 6 -61 -17 53 40 -15 -34 -98 25 -12 102 -79 -28 -49 37 28 10 42 -111 -5
7259 -5 14 35 -13 -7 -16 27 23 -16 14 19 -3 42 13 -2 -42 28 5 71 -3 -13 23 31 -10 78 -24 -34 -22 47 28 -53 -78 -38 69
7292 69 0 19 -50 -55 6 42 114 84 -38 -57 0 42 56 -18 6 -71 -47 26 -17 -49 -77 -9 21 66 0 26 -10 28 -19 69
7322 69 -23 10 -52 4 64 21 -5 -49 -2 27 37 24 26 -22 57 -16 -11 -8 8 -12 0 12 -20 -60 -86 25 -8 7 19 3 -36
7353 -36 44 7 87 9 -21 18 40 36 -7 -43 -21 12 28 35 20 -7 35 53 10 -16 -23 -50 21 81 13 44 -41 3 3 32 -5 -49
7385 -49 -65 4 -33 -36 -24 -31 27 12 39 -28 0 -18 56 100 49 -38 51 23 45 -8 -38 -106 -35 46 17 -27 30 -30 18 67 -4
7416 -4 -27 -49 13 -4 0 27 -13 7 26 73 29 15 -52 -52 11 2 2 -86 -58 -14 -12 17 48 -61 5 7 9 7 -89 -7 -35 -5 16 -29
7450 -29 26 -52 15 50 49 17 -64 25 22 23 17 -88 -28 -18 -45 18 -8 -60 -38 20 41 61 -11 45 25 64 72 -35 -39 6 -9 -3 -35
7483 -35 -26 -74 28 55 45 29 10 -19 15 41 17 -36 -66 1 16 15 -52 -101 -1 33 13 -23 -12 -39 15 36 5 -42 16 11 -69
7514 -69 14 -33 24 -12 -26 37 37 21 -45 2 -39 2 -8 -4 -73 -24 24 1 62 -74 -17 9 29 -8 -47 -19 22 54 -49 -101
7544 -101 -56 -49 42 -17 18 18 6 22 73 53 30 -37 -21 -6 20 5 -75 15 -39 -16 8 32 -88 -44 -21 9 -20 5 3 10 45
7575 45 -20 -20 12 -78 6 79 11 46 -77 18 47 22 3 -22 -30 15 19 23 20 -31 13 11 40 11 -21 16 -21 70 28 -46 -24 -46 -31
7608 -31 -11 22 -52 -17 14 -22 -10 21 -53 69 0 1 -2 -57 -5 -18 5 1 48 -8 31 -69 -32 57 -31 -36 5 61 42 -10 -14 0
7640 0 -29 51 7 -25 46 -18 -10 -38 -3 44 -17 16 -13 54 -10 -23 43 -5 20 7 -12 -12 53 -13 21 7 8 -34 8 24 17 -12 -38
7673 -38 -39 -40 -50 -28 -31 14 56 -6 -30 -55 79 18 -34 66 -13 -7 -17 11 -50 -8 1 -11 -19 4 80 53 15 -1 -15 8 50 103
7705 103 -41 14 71 -3 -4 25 -15 -101 34 107 64 4 -8 80 -6 -19 -29 1 -23 9 40 39 47 -15 36 28 29 22 39 -22 21 35
7737 35 -28 -32 -27 30 -3 -34 -12 17 25 74 -8 -10 11 50 31 58 -44 25 -2 -29 63 -5 -15 -49 -53 34 9 82 6 -43 -19 -36
7769 -36 46 -12 13 12 -27 -7 29 -74 -23 56 23 13 18 -45 32 31 21 61 47 1 -45 10 -32 4 1 -81 -40 -28 9 20 -35 -62
7801 -62 -48 57 -51 76 40 14 13 15 -26 -56 27 22 60 -5 -11 -10 57 -18 -6 -12 -64 -22 61 40 43 51 30 42 17 42 -28 9 41
7834 41 -50 -29 14 49 20 -37 -27 59 -5 -58 2 -34 -13 -54 -1 2 -11 1 19 -6 3 -14 29 4 -35 -40 -14 -91 -40 -12 -8 -27
7866 -27 -13 -17 2 30 -46 26 37 29 -1 49 56 -8 42 -8 -35 -44 43 -15 -59 51 22 8 56 0 -39 49 31 -57 -6 -7 0 -25 -5
7899 -5 47 56 7 -8 -28 -36 36 -20 31 25 36 -89 -9 26 -16 -8 -1 -37 -20 -8 -24 11 -2 -4 2 -21 -64 -40 10 -1 -10 -17 12 43 -80
7934 -80 41 29 24 -26 -15 -14 -15 -19 -35 -15 52 -39 -43 15 51 10 35 38 -33 47 -65 -8 9 18 5 30 45 48 -23 -23 0 -18 -100 18
7968 18 23 -17 -18 47 29 26 15 11 70 -53 -2 -31 7 -11 -4 -11 -28 -57 -37 -6 -87 -22 28 49 -40 19 -6 46 -25 -44 3 51 11
8001 11 -63 -43 -10 22 25 52 -9 -95 12 -89 63 -26 -10 50 1 7 30 25 26 -17 57 24 -3 -9 -54 10 -67 -76 -36 -6 -21 -120
8033 -120 -22 -84 2 -17 -47 -48 -4 36 -12 -27 3 25 -12 -24 49 -27 -65 40 -33 -30 10 22 32 4 20 -57 -21 -17 38 -18 33
8064 33 -53 -51 73 -20 -34 58 -31 13 14 44 -59 4 43 -68 8 -43 -28 5 -7 -13 26 -30 -34 8 33 -11 71 30 -40 -24 14
8095 14 -3 65 15 -19 77 7 6 -33 1 13 -24 31 12 -42 11 -4 -36 -45 18 -29 14 -54 39 65 4 36 -1 70 -5 35 66
8126 66 25 30 60 -36 2 -59 -1 -28 -5 -28 -32 29 -8 21 24 -27 55 -30 60 -2 83 28 43 33 -23 11 -1 37 -21 -11 -63 71
8158 71 -10 -7 -54 39 -22 -23 -4 -1 -30 -8 23 15 18 -54 6 -21 -41 -41 22 -24 -20 -43 -41 -8 -29 32 -49 -20 -28 28 -1 35 -1
8191a
$$ Imaginary data points
##PAGE= N=2
##DATA TABLE= (X++(I..I)), XYDATA
0 0 0 0 0 0 0 0 0 0 0 0 0 0 0 0 0 -1 0 0 6 -6 4 -6 8 -8 8 -9 12 -12 12 -12 16 -18 18 -19 21 -25 27 -30 31 -35 39 -43
42 -43 47 -53 58 -67 76 -85 98 -114 138 -165 204 -259 342 -475 708 -1166 2259 -5948 41414
61 41414 284953 175503 -103551 -108527 51386 61866 -12297 54875 142366 27212 -139519
72 -139519 -67853 128033 112677 -81287 -120915 38548 120352 32221 -35093 2157 29092
83 29092 5592 16829 72406 86607 32901 -25402 -38097 -13497 17602 34963 30409 7126
95 7126 -23905 -55610 -72116 -32019 63144 103806 6412 -112285 -82938 40408 73854 8148
107 8148 -27222 -15014 -24927 -32272 14457 39233 -40537 -124290 -62424 77363 91775 -35898
119 -35898 -119915 -75087 52 40431 67868 48562 -51266 -119018 -43889 70286 64297 -20142
131 -20142 -45242 -14674 -14585 -32396 -9514 14333 -19522 -48069 3183 50324 -8381 -80839 -35220
144 -35220 48234 27182 -38986 -22390 25328 -5342 -62437 -44520 7356 5628 -19161 -3469
156 -3469 6436 -50287 -99405 -40805 58777 58968 -26783 -75286 -55889 -22846 9646 36059 10144
169 10144 -56465 -69541 -6792 34273 -2315 -50531 -44638 -8855 13314 20987 11453 -34558 -77167
182 -77167 -35454 62395 80808 -8327 -69706 -30942 18987 15006 7899 23543 11958 -26775
194 -26775 -25152 19048 28242 -12847 -24227 25016 53078 7308 -39753 -18785 24018 26893 11699
207 11699 9739 2277 -12251 -3230 17770 9692 -15158 -11046 18064 26990 1567 -27080 -30473
220 -30473 -9022 22733 42980 22580 -33508 -60333 -14548 43201 34413 -13795 -28864 -12473
232 -12473 -3806 1270 11633 1616 -27822 -26678 16774 39187 -1353 -50483 -36049 19420 39015
245 39015 11654 -12438 -17998 -21125 -10178 20204 27659 -5777 -28867 -6288 21109 10989 -15467
258 -15467 -17395 4200 19366 14732 334 -14216 -21275 -5581 26084 32389 -1758 -28752 -12840
271 -12840 14130 14345 215 -6297 -5415 1084 12361 13355 -5736 -23495 -11639 20878 32753 5254
285 5254 -26876 -24087 3600 21058 18586 4131 -14735 -19281 2507 23724 12034 -15692 -19537
298 -19537 3468 22896 17818 -4323 -20504 -14394 8537 26750 21244 -6941 -28000 -13540 19377
311 19377 27118 5281 -12193 -9248 2111 11772 12875 243 -13350 -7093 14372 23283 6472
324 6472 -16295 -16343 7043 23365 13717 -5279 -12150 -5765 6805 16357 9898 -8083 -12393 4474
338 4474 18563 10743 -8235 -16338 -3775 16649 21293 4135 -14902 -15671 1331 19432 18803 -2286
352 -2286 -19093 -10546 10642 18481 7672 -8669 -14505 -1771 17018 17443 -2712 -18204 -11358
365 -11358 9024 20683 10824 -9838 -16665 -2958 13048 14604 2819 -11094 -12658 2464 16462
378 16462 10108 -7658 -13647 -2293 12498 14511 309 -14507 -11235 5556 15436 9117 -5198
391 -5198 -13638 -6194 10478 15711 2207 -12679 -11588 2520 14531 11050 -5638 -15420 -4962
404 -4962 11915 14809 2582 -11089 -12875 238 14487 12455 -3223 -13271 -7272 7344 15447
417 15447 6733 -10153 -13904 644 14193 11295 -2285 -11579 -7235 7242 15344 6605 -8038
430 -8038 -11562 -1540 11264 13516 1169 -11724 -7974 7478 14802 6739 -6124 -10733 -1884 11591
444 11591 13213 745 -9981 -6977 5259 13841 9285 -4844 -11843 -2458 10945 12421 1950
457 1950 -8688 -8556 3864 14765 9461 -5512 -11379 -2796 9156 12405 3481 -8430 -9310 2337
471 2337 12560 10063 -1977 -10983 -6196 8260 13931 3125 -8782 -7448 2782 10606 9490 -313
485 -313 -9336 -5814 6984 13127 5436 -6428 -8583 1819 12528 10121 -1363 -7330 -2956 5840
499 5840 11363 7069 -4662 -8932 2039 13875 10961 -1264 -7855 -3370 6785 12249 7012 -3569
513 -3569 -7940 -1083 10551 13444 2287 -9297 -5586 7458 11561 4333 -3221 -5487 -1614 7522
527 7522 12547 4311 -8332 -8621 3921 13153 7768 -4137 -7377 -55 6917 7503 4106 -1676 -5798
542 -5798 123 11229 10100 -3661 -9573 705 11620 10392 1940 -3868 -3435 2085 8977 10848
556 10848 3268 -6671 -4724 8662 14546 4118 -6042 -2379 6112 8687 7025 2368 -4750 -5415
570 -5415 5493 14781 8358 -5715 -8711 1437 9490 6171 -750 -2642 -2072 -726 4494 6438 -2457
585 -2457 -10458 -2367 10270 6629 -7266 -11111 -3193 3372 3853 1734 -2576 -8411 -8202 1708 8455
600 8455 -89 -12189 -8515 4987 6841 -2501 -7252 -5368 -2951 2145 8408 3969 -10113 -13742
614 -13742 327 12564 7508 -4434 -6578 -952 1713 2303 5032 2914 -5350 -4834 8048 11555
628 11555 -2233 -10526 -1 10761 6651 -1107 -1231 22 -2016 146 6949 6592 -2992 -5835 3860
643 3860 8101 -2197 -9068 -375 8453 4902 -1508 -3330 -5776 -6105 3554 12559 4640 -11591 -13103
658 -13103 1064 9141 2793 -4130 -3488 -2875 -3168 3306 8468 -2270 -15684 -7232 12900 13488 -4354
673 -4354 -12569 -4481 1895 2074 5097 7563 -1262 -12287 -7048 8207 9952 -2249 -5729 2840 4434
688 4434 -3441 -4555 1934 3190 -126 962 1851 -3348 -5830 973 5785 -172 -6549 -2759 3353
703 3353 886 -4232 -3828 -3350 -5959 -1129 10030 6117 -14518 -21375 -2144 13850 6041 -7391
717 -7391 -8572 -6637 -8785 -3506 9145 7914 -11031 -19144 -2150 12610 2390 -12782 -8611 2771
731 2771 2391 -1214 1993 504 -9622 -10149 4272 12774 3639 -7286 -5590 255 401 699 5858
746 5858 6540 -897 -4725 -268 1750 -479 3763 10621 4975 -7440 -6740 5159 8802 2388 -642
761 -642 1357 -165 -1824 4292 9451 536 -11510 -5341 12086 13975 -1368 -10707 -6326 -620 3905
776 3905 10756 9938 -5390 -16955 -7215 10097 11821 524 -5748 -3723 -2450 -1302 4250 5976
790 5976 -2706 -8449 508 9165 1975 -8050 -3749 4390 2220 -1462 3157 5431 -2695 -8383 -980
805 -980 7248 3867 -1624 2093 4907 -3483 -9736 61 12228 8463 -3078 -5804 -2524 -1452 1742
820 1742 7987 6327 -4052 -8660 -335 7749 4255 -3563 -4760 -1035 2145 5035 5375 -2545 -11662
835 -11662 -6433 8583 12162 667 -7956 -6001 -2726 -574 5363 8729 798 -10033 -7170 4667
849 4667 6556 -2073 -4292 3020 4418 -2756 -4033 2549 3301 -2225 -951 5335 3728 -3474 -3212 3279
865 3279 3724 -1308 -816 5400 6137 -733 -4733 -1530 2367 4026 6524 5889 -2124 -8159 -2175 7843
881 7843 8526 1938 -2009 -2290 -1282 1705 5573 4112 -2415 -4281 2616 7830 2300 -5519 -4382 2097
897 2097 4228 3495 3144 -305 -6515 -5196 4353 8392 1700 -4615 -2709 1111 315 -1049 1223 2789
913 2789 110 -1605 765 971 -3112 -3166 3300 5636 -186 -4209 -1120 1666 159 -652 1270 1384
929 1384 -658 -462 1499 228 -3622 -2419 4226 6599 583 -5141 -3923 -202 1933 3717 3588 -1031
945 -1031 -5223 -2539 3456 3860 -675 -3039 -571 2059 1560 -493 -1706 -2152 -1079 2737 4945 636
961 636 -5313 -4693 886 3678 2215 157 -1395 -2298 -1096 1434 1608 -662 -1736 402 2254 386
977 386 -2767 -2364 695 2100 1613 917 -939 -3323 -2002 2208 2977 -529 -2017 303 1743 -143
993 -143 -2031 -1157 957 1539 1124 777 -995 -3549 -2197 3098 5091 317 -4078 -2618 1072 1879 646
1010 646 -327 -898 -769 540 1871 913 -2084 -3266 47 3920 3042 -1447 -3737 -2140 929 3059
1026 3059 2581 -397 -2699 -1791 664 1577 739 -508 -931 27 1260 778 -1018 -1782 -647 1599 2336
1043 2336 117 -2464 -1774 726 1526 504 -195 -554 -552 118 702 -358 -1387 -752 1273 2191 510 -2462
1061 -2462 -2851 -42 2492 1936 -339 -2188 -2232 -158 2164 1779 -897 -2127 -821 1059 1453 12
1077 12 -1917 -1896 380 2282 1753 -721 -2710 -2032 940 2729 997 -1558 -1838 -530 874 1298 518
1094 518 -948 -1010 301 1114 458 -948 -1569 -202 1840 1696 -512 -1655 -743 752 1320 729 -583
1111 -583 -1197 -120 976 988 -152 -1052 -723 883 1851 373 -1754 -1756 340 1874 1648 -97 -1766 -1450
1129 -1450 593 1645 848 -680 -1681 -884 1114 1769 -82 -1777 -1223 593 1462 853 -999 -2056
1145 -2056 -898 974 1486 296 -1116 -1647 -544 1138 1025 -688 -1604 -719 527 857 153 -1109 -1252
1162 -1252 58 1165 602 -721 -1493 -1052 544 1388 204 -1387 -1131 50 774 611 -450 -1461 -1080
1179 -1080 593 1338 125 -1319 -1514 -221 1247 836 -846 -1672 -992 72 719 617 -744 -1923 -859
1196 -859 972 864 -856 -1709 -1036 68 718 18 -964 -1364 -709 268 802 -136 -1787 -1617 289 1074
1214 1074 -233 -1258 -1082 -366 285 699 -109 -1446 -1419 90 1308 725 -1025 -1601 -222 1156 762
1231 762 -145 -647 -930 -488 1029 1428 -444 -1638 -495 1156 1006 -79 -917 -730 -187 386 602 159
1249 159 -949 -1293 165 1231 -45 -1698 -1052 386 35 -655 -626 -772 -1126 -375 595 -50 -1759 -2033
1267 -2033 -419 786 -109 -1807 -1603 -474 -266 -384 -27 -823 -2281 -1427 949 903 -1466 -2222 -819
1284 -819 326 187 -141 -512 -1132 -1466 -452 1126 606 -1618 -1695 501 1139 -571 -954 188 61 -675
1302 -675 35 790 -356 -1451 -174 1584 770 -1235 -1204 632 912 -580 -795 370 -18 -875 357
1319 357 1357 -602 -2386 -457 1983 888 -1558 -1445 -72 99 -280 464 771 -1083 -2302 -233
1335 -233 2151 482 -2261 -1267 1146 577 -876 -41 589 -765 -1270 762 1784 -271 -1857 -439
1351 -439 1483 702 -815 31 1279 45 -1127 71 1096 -93 -451 1369 1281 -1119 -1540 853 2023
1368 2023 438 -729 -199 40 -478 135 1712 866 -1840 -1672 1491 2139 -834 -2003 -117 629 -484
1385 -484 102 1368 -201 -2716 -1544 1819 1901 -970 -2020 -208 319 -1056 -498 1497 666 -1996 -1492
1402 -1492 1082 681 -1514 -626 1479 458 -1745 -777 1345 765 -1133 -679 1055 561 -789 171 1571
1419 1571 -123 -2135 46 3102 1759 -1473 -1354 470 397 200 1706 2059 -840 -2471 10 2788
1435 2788 1669 -857 -796 502 52 -334 1218 1505 -979 -1871 914 2481 31 -1698 -390 567 -386
1452 -386 -170 1736 1307 -1621 -2371 370 1940 150 -839 669 610 -2038 -1888 1863 2719 -488 -2088
1469 -2088 -106 718 -606 -289 1670 1063 -1796 -1681 1499 2544 -345 -2021 -225 1114 341 403 1324
1486 1324 -143 -2409 -1090 2417 2592 -182 -1545 -753 -317 -183 1253 2027 31 -2291 -1218 1443
1502 1443 1212 -696 -544 817 -87 -1475 191 1670 -115 -1865 -409 1677 694 -1112 -571 437
1518 437 -575 -1445 517 2403 516 -2250 -1593 686 661 -1 899 831 -1579 -2351 297 2362 852
1535 852 -1173 -831 177 -97 -61 946 677 -1200 -1419 1145 2299 -90 -1832 -577 747 236 404
1552 404 1501 295 -2163 -1712 1307 2273 388 -967 -225 38 -964 -468 1591 1514 -975 -1579 444
1569 444 923 -545 -582 842 463 -1178 -644 1157 851 -1100 -1255 445 1063 49 -252 138 -495 -1622
1587 -1622 -330 2010 1566 -1067 -1726 -278 258 69 698 923 -473 -1558 -411 1210 775 -674 -620
1604 -620 441 365 -382 -175 310 -456 -871 529 1586 166 -1290 -671 367 94 57 673 569 -584
1622 -584 -1219 -99 842 385 -251 254 328 -760 -1029 407 1155 -39 -728 157 542 -326 -465 342 266
1641 266 -486 -310 820 780 -757 -1266 14 1076 471 -36 182 -299 -1210 -396 1233 1138 -431 -966 -27
1660 -27 408 -113 -275 282 271 -194 -214 451 262 -660 -672 624 968 -39 -570 -183 -178 -263 199 740 278 -387
1682 -387 -326 -60 -69 -54 168 498 191 -442 -367 117 160 2 330 446 -223 -561 124 514 -202 -467 245 746
1704 746 218 -428 -348 -105 -60 80 670 605 -446 -1209 -209 938 600 -212 -288 -116 -278 -82 295 255 -230
1725 -230 -328 177 439 75 -523 -444 137 341 277 167 -171 -531 -362 338 517 19 -182 -30 -245 -372 -35
1746 -35 288 353 83 -100 -143 -113 -158 9 412 358 -274 -382 176 377 -44 -272 -37 94 214 245 -3 -434
1768 -434 -421 -55 539 760 75 -649 -610 37 461 459 138 -424 -528 120 501 230 -96 -141 -123 88 274 93
1790 93 -317 -395 45 419 444 74 -440 -349 84 234 20 56 34 -150 -111 41 20 -39 100 191 -35 -228 -284 -98
1814 -98 333 439 -72 -278 -147 33 196 125 -116 -358 -108 376 393 -34 -348 -432 -59 481 461 -134 -578 -346
1836 -346 99 500 387 -232 -513 -246 156 276 119 -245 -364 -77 321 305 -183 -287 -159 83 302 198
1856 198 -265 -361 42 160 117 72 -56 -148 100 157 -93 -197 -58 151 187 161 -126 -278 35 386 260 -31
1878 -31 -337 -352 14 438 166 -268 -314 -24 208 282 114 -300 -494 -40 471 333 -158 -393 -226 285 491
1899 491 20 -326 -304 -133 118 414 277 -360 -379 275 442 140 -253 -266 -31 239 260 11 -165 -159 81 336
1921 336 315 -170 -407 19 405 216 -56 -80 -2 11 315 316 -290 -438 -42 376 281 -123 -411 -179 275 152
1943 152 80 -3 -254 -485 179 560 134 -541 -325 314 411 18 -285 -190 -60 94 264 155 -244 -515 -31
1964 -31 674 365 -468 -495 163 278 114 143 -23 -334 -235 509 639 -152 -716 -215 479 438 -134 -322 -75 -72
1986 -72 33 475 389 -506 -639 291 682 -70 -529 -146 242 64 46 122 -28 -446 -264 459 474 -491 -715 238
2008 238 733 -42 -500 -130 168 -218 0 383 -28 -702 -353 742 679 -422 -780 -50 593 169 -247 34
2028 34 -128 -493 32 942 447 -903 -673 488 728 -32 -413 -67 8 -116 235 567 31 -703 -328 735
2048 735 600 -493 -488 360 386 -209 0 325 -203 -455 228 645 -134 -791 -78 737 381 -519 -388 314 315
2069 315 -112 251 275 -645 -778 548 1248 38 -1032 -500 528 388 -72 130 33 -574 -459 695 959
2088 959 -356 -1097 24 931 230 -576 -107 235 -405 -204 674 510 -683 -687 396 670 -319 -676 146
2107 146 569 -120 -521 179 287 -325 -140 775 288 -1042 -697 784 896 -397 -764 109 221 -161 66
2126 66 542 -177 -999 -221 1226 779 -912 -1018 303 776 68 -73 236 -445 -859 244 1255 411 -1001
2145 -1001 -700 506 573 -266 -264 285 34 -451 167 742 12 -789 55 874 205 -713 -128 687 150 -467
2165 -467 -10 487 77 -164 348 359 -633 -935 388 1473 315 -1045 -585 360 188 151 669 188 -983
2184 -983 -866 762 1277 -43 -1040 -317 571 331 -91 120 -22 -693 -324 926 905 -554 -1019 81 725
2203 725 101 -200 257 117 -515 -313 464 472 -412 -266 533 425 -676 -663 516 695 -193 -441 99 114 -306
2224 -306 107 605 -104 -874 -183 893 583 -587 -777 31 505 242 263 177 -644 -1047 156 1324 507
2243 507 -887 -745 160 349 133 215 161 -487 -671 313 844 -35 -991 -360 727 504 -250 -213 126 -203
2263 -203 -424 304 612 -122 -638 55 359 -69 -513 1 636 182 -537 -345 16 73 167 518 264 -600 -724
2284 -724 328 749 30 -586 -264 127 182 280 199 -264 -682 -82 832 739 -420 -945 -159 460 409 193 163
2305 163 -319 -658 63 759 328 -635 -402 298 487 -90 -334 7 131 -16 69 317 -58 -630 -116 620
2325 620 416 -408 -290 205 201 -193 -140 91 61 30 277 263 -250 -615 -123 771 446 -343 -514 -43 116 180
2347 180 331 80 -352 -377 342 613 -35 -611 -261 359 503 130 -253 -357 -286 71 597 465 -257 -655 -68
2368 -68 510 320 -135 -177 -57 102 184 122 -145 -290 -116 383 521 -160 -536 -210 259 312 162 -15 -165 -284
2390 -284 81 406 13 -324 -118 302 304 -59 -421 -253 92 259 265 100 -291 -360 14 531 294 -314 -263 186
2412 186 314 115 -83 -183 -163 41 457 298 -221 -601 -244 497 582 62 -351 -254 9 217 272 93 -234
2433 -234 -300 158 384 142 -260 -340 38 356 294 -54 -325 -173 19 299 219 -93 -324 -48 155 178 -33 -155
2455 -155 -34 86 156 39 -269 -314 60 289 315 -63 -357 -225 226 301 94 -161 -183 -87 222 285 -35 -413
2477 -413 -215 235 433 120 -299 -369 -81 312 342 70 -201 -356 -11 305 308 -184 -335 -107 153 229 58 -214
2499 -214 -305 -51 309 235 -82 -275 -321 101 288 193 -163 -203 -49 139 138 2 -150 -82 172 278 3 -215 -267
2522 -267 52 283 214 -79 -234 -150 91 233 120 -162 -324 56 277 212 -93 -261 -104 162 396 96 -210
2543 -210 -354 -35 181 312 33 -329 -267 81 286 177 -95 -239 -156 120 302 33 -207 -159 76 284 189
2564 189 -106 -323 -219 197 248 64 -139 -145 20 211 198 -114 -231 -62 124 152 -55 -181 -222 15 175 118
2586 118 -111 -293 -123 128 228 13 -217 -236 31 197 117 -106 -273 -167 161 253 32 -236 -235 -49 270 235
2608 235 -32 -267 -222 77 233 143 -77 -280 -74 204 278 -1 -181 -163 -19 224 169 -67 -281 -140 223 186
2630 186 77 -130 -192 119 210 24 -55 -110 -23 155 282 11 -222 -172 100 261 102 -131 -237 -64 210 205 28
2653 28 -135 -155 30 238 208 -120 -315 12 217 124 42 -129 -186 -22 182 225 2 -239 -200 100 272 -6 -160
2676 -160 -145 73 179 124 17 -104 -239 57 317 110 -221 -190 12 233 117 20 -122 -106 10 162 197 -70
2698 -70 -242 -76 325 201 -83 -216 -72 83 152 161 15 -261 -172 103 312 -18 -249 -116 88 273 20 -79
2720 -79 -23 -42 22 206 104 -263 -251 128 285 115 -76 -85 35 149 133 22 -75 -200 -59 236 198 -146 -298
2743 -298 34 291 245 37 -46 -43 -99 127 279 33 -208 -137 211 317 82 -175 -78 139 57 48 70 -25 -134 17
2767 17 283 170 -170 -181 100 193 45 -75 -84 -16 0 153 179 -32 -339 -47 230 191 -102 -241 20 107 63 73
2791 73 5 -159 -161 186 308 64 -286 -153 122 154 -2 -111 -37 -8 19 186 131 -187 -279 54 274 10 -181
2814 -181 -145 38 41 44 40 -47 -151 -96 244 206 -91 -295 54 235 37 -157 -26 -24 -47 7 219 37 -183 -167 181
2839 181 223 -111 -289 -128 77 156 -12 15 -32 -225 -13 256 206 -262 -243 107 257 62 -61 -96 -82 -47 28
2862 28 153 43 -194 -148 217 178 -142 -224 -28 97 16 -5 28 -55 -196 46 269 29 -264 -118 252 207 -65
2885 -65 -132 -20 15 43 136 100 -158 -241 106 285 180 -141 -154 50 112 49 91 49 -144 -127 162 254 -80 -298 -22
2910 -22 258 99 -26 -16 19 -65 8 192 93 -159 -157 60 170 -46 -137 -72 155 128 -42 33 -10 -87 -17 121 219
2935 219 -161 -191 62 176 -91 -130 -37 -15 19 92 73 -120 -222 -72 258 182 -150 -231 -75 104 131 22 -53 -141
2959 -141 -154 63 227 -12 -193 -114 81 167 -42 -147 -51 -6 51 126 126 -151 -233 84 188 16 -162 -109 46 42
2983 42 -24 -74 8 -70 -34 158 122 -155 -231 6 161 51 -73 -185 -53 39 95 181 -44 -121 -107 88 197 -9
3007 -9 -163 -72 71 211 -32 -86 -51 -73 46 137 176 -62 -143 20 125 125 -64 14 -35 32 33 10 -61 -160 -6 156
3033 156 161 -84 -111 -13 113 19 -37 -10 -73 -95 49 47 -72 -115 -70 43 72 -40 -118 -150 25 34 29 -38 -126 -207 53 157
3061 157 50 -152 -99 -6 47 17 -57 -82 -11 -28 120 70 -23 -115 -35 101 104 -38 -134 -130 -24 47 133 -51 -53 -94 69
3088 69 95 -45 -127 -14 90 64 49 -82 -79 -34 -14 76 1 -119 -106 35 79 24 -23 -85 -65 70 9 -91 -91 -126 31
3115 31 82 55 -61 -173 -37 67 54 -8 -40 -78 18 35 19 -39 -102 -39 144 37 -14 -77 -80 5 59 67 -53 -89 -26 24
3143 24 46 -14 -46 -34 36 48 0 -148 -95 -50 -1 48 -41 -126 -113 -29 -16 43 -76 -88 -39 41 30 -22 -1 -36 45 49 17 -22
3173 -22 -53 -17 40 155 16 -46 -48 -55 1 39 14 -54 -61 30 21 43 46 -48 -21 74 64 -73 -13 16 90 128 60 -47 -73 -5 42
3204 42 76 -20 -26 -65 5 23 14 -16 -30 -28 80 35 16 -77 15 18 51 -35 29 20 -39 51 -21 23 -61 -76 49 123 28 -22 -51 19
3236 19 135 78 -35 -32 -67 0 92 60 -36 -49 -60 88 25 -11 -29 5 29 88 52 -55 -68 36 -4 16 4 -65 -106 14
3264 14 61 -59 2 17 -25 2 22 -81 0 -28 -7 44 -13 -38 -14 10 6 21 -17 -36 9 16 27 -22 -1 23 -26 62 0 8 -38
3295 -38 -57 14 -3 -11 -55 3 44 45 42 -54 -33 -45 123 12 -11 -5 16 -9 26 21 42 -5 3 28 12 -4 -53 23 15 -44 54 -16 -45
3328 -45 -6 34 33 -29 -60 -29 29 40 37 -20 -88 -63 -19 11 76 -22 -90 16 82 -14 -12 -36 26 14 37 -36 -60 15 74 103 27
3359 27 -52 -85 -47 27 100 15 23 -37 18 53 71 -37 -57 -22 41 20 -50 -95 -44 38 12 4 -51 -12 -105 2 55 -40 -55 2
3389 2 8 59 40 -91 -43 -28 85 22 -44 -13 -80 5 121 43 -19 -44 -56 72 116 -22 -35 -49 -23 40 55 -72 -120 -77
3417 -77 139 77 -56 -92 -89 64 48 45 -46 -29 -4 39 91 9 -99 -69 4 176 34 -84 -73 -52 80 100 -16 -68 -89
3444 -89 69 130 4 -26 -120 12 88 57 -11 21 5 -61 40 100 49 -165 13 109 68 22 -76 -98 32 21 66 44 -175
3471 -175 -109 -2 111 -25 -129 -94 70 112 69 -1 -104 -87 35 23 99 -79 -130 -44 146 126 -6 -134 19 64
3495 64 71 48 47 -108 -103 112 159 41 -156 -53 82 156 55 -44 -129 36 24 47 95 -177 -150 -2 212 -16 -168
3520 -168 -88 -2 50 22 56 -113 -166 9 205 116 -75 -120 26 156 65 -22 -54 -23 10 57 185 -3 -147 -117 122
3545 122 184 -12 -122 -30 11 95 70 38 -52 -77 -11 216 63 -154 -114 57 182 96 -49 -125 -53 49 115 117 -97
3570 -97 -210 -22 183 111 -130 -176 -43 105 39 22 -87 -113 -120 74 236 -39 -206 -104 105 159 26 -89 -59
3593 -59 -53 -16 87 17 -81 -198 27 289 120 -143 -119 26 105 50 53 -80 -103 -69 148 162 -84 -153 -37 157 83
3618 83 -68 -111 -39 3 70 206 12 -247 -92 152 221 63 -136 -94 16 109 49 -9 -18 -87 -19 243 85 -107 -201
3643 -201 -31 172 44 -79 -63 -108 8 128 146 75 -191 -12 191 188 -30 -132 -23 137 69 28 9 -114 -39
3666 -39 93 240 92 -212 -154 126 189 26 -72 -93 -29 114 123 5 -147 -213 -74 236 122 -120 -196 -24 86
3689 86 128 93 -95 -158 -123 106 177 -65 -237 -133 119 135 -55 -77 -52 -45 87 159 28 -184 -197 155 244 -9 -237
3714 -237 -128 26 50 42 65 -90 -141 92 174 158 -89 -228 25 258 62 -107 -114 -65 34 267 137 -73 -205 -134
3738 -134 187 159 -21 -145 -96 182 171 60 -9 -123 -145 31 213 83 -247 -223 4 111 92 -74 -67 -111 6
3761 6 35 41 -112 -192 -18 205 137 -130 -228 -57 136 144 13 -87 -186 -49 162 150 -82 -232 -96 111 208 -61
3785 -61 -155 -123 -12 144 213 56 -217 -266 41 302 138 -148 -205 -2 77 172 11 -115 -158 -27 176 136 -152
3808 -152 -233 -11 156 159 -25 -117 -151 -38 98 168 63 -195 -97 70 84 -12 -146 -98 96 138 -22 -105 -194 -76
3832 -76 22 215 17 -184 -213 -30 135 92 -21 -78 -136 43 139 14 -130 -208 -46 186 161 -128 -256 -165 81
3855 81 228 153 -62 -252 -117 155 142 80 -177 -127 82 148 51 -166 -201 -48 191 195 52 -189 -241 7 270 163
3879 163 -136 -163 -32 23 148 -25 -115 -114 -14 82 50 -120 -237 -93 171 194 9 -146 -192 -44 114 192 -47
3902 -47 -230 -59 80 80 -39 -137 -134 78 206 101 -141 -216 -127 135 282 177 -91 -202 -93 182 147 1 -118
3925 -118 -82 111 130 87 -141 -109 -48 229 278 54 -200 -142 74 198 168 -36 -68 -12 125 176 30 -92 -12 99
3949 99 157 146 -133 -222 -19 194 152 -8 -189 -157 -8 181 164 -19 -187 -83 32 76 -52 -172 -108 87 195
3972 195 151 -132 -305 -194 103 269 55 -102 -168 -61 58 193 48 -118 -79 21 130 -17 -101 -119 -22 221
3994 221 199 -70 -200 -223 23 172 144 -9 -144 -59 115 170 -15 -71 -87 33 149 82 -106 -142 -67 185 225 44
4018 44 -193 -206 -8 154 181 -11 -135 -70 119 128 -9 -131 -73 128 137 54 -84 -195 -54 165 242 103 -146 -234
4042 -234 -62 144 127 -62 -108 -31 79 163 78 -99 -134 76 160 238 -76 -218 -157 7 290 159 -34 -84 -32 82
4066 82 125 101 -97 -37 61 128 0 -126 -105 19 226 163 -19 -167 -119 -5 204 134 -10 -141 32 109 101 -53
4090 -53 -121 -20 87 169 45 -170 -178 -137 150 255 10 -198 -198 34 96 98 35 -134 -109 39 162 64 -159 -172 42
4115 42 237 100 -33 -126 -99 61 152 134 -86 -183 -63 190 102 -60 -93 4 97 -15 22 -56 -159 -34 142 203
4139 203 -39 -178 -161 98 164 1 -44 -102 3 35 121 44 -149 -172 25 216 62 -220 -218 -25 84 102 26 -108
4163 -108 -120 -37 91 149 -55 -167 -62 103 123 -44 -77 -45 -4 113 99 -68 -205 -101 146 166 103 -166 -71 96
4187 96 87 37 63 -69 -77 24 195 75 -162 -101 120 167 131 -19 -144 -69 31 97 166 -16 -135 -76 201 240 -100
4212 -100 -129 51 109 12 28 -44 -112 -15 168 176 39 -155 -128 57 158 14 -109 -29 52 56 86 90 -116 -204 13 216
4238 216 89 -124 -208 -54 97 119 1 -76 -209 -93 121 117 -92 -293 -125 108 64 -2 -67 -158 -151 9 88 24
4262 24 -145 -99 31 192 17 -144 -45 79 10 -34 -45 -55 -40 -9 103 99 -80 -184 19 181 -2 -44 -96 -31 29
4287 29 93 160 -71 -202 -70 207 214 -116 -199 -3 116 66 51 -49 -154 -121 59 245 108 -138 -130 45 193 67
4311 67 -66 -91 -3 -35 67 110 -70 -136 -10 121 149 -80 -60 34 70 -59 38 8 17 5 99 139 2 -141 22 192
4337 192 66 -14 -109 21 102 94 110 17 -122 -109 99 173 81 -190 -147 67 131 40 -16 -114 -141 -98 191 164 -95 -258
4363 -258 9 89 54 -69 -62 -57 -46 25 5 -40 -171 -131 -35 89 -163 -167 36 51 -19 -30 -11 -61 -62 90 138 -8 -164
4390 -164 -80 41 179 -72 -94 -65 -5 64 73 90 -171 -177 45 179 34 -148 -60 -18 90 79 66 0 -45 -20 46 143
4416 143 14 -210 -85 115 98 -3 -13 23 -40 47 97 87 -68 -69 14 131 80 -29 -38 77 141 2 -44 37 -85
4441 -85 2 144 115 -131 -108 99 173 88 -85 -122 -80 34 17 89 -31 -131 -46 70 161 12 -179 -30 105 115
4465 115 46 -12 -100 -133 95 143 118 -76 -105 3 58 7 -26 -38 27 22 -2 45 6 -95 -108 112 75 -115 -68 28 -61
4492 -61 37 41 18 -39 30 43 48 -92 -136 -56 85 166 -33 -118 12 -12 18 123 65 -100 -71 66 139 72 -102 -129 -17
4519 -17 57 28 40 -81 -17 -32 84 90 -25 -166 26 87 68 -44 8 -51 -77 49 -73 -41 -62 -39 21 92 -24 -85
4545 -85 -51 89 116 18 17 -57 -79 33 96 -19 -50 -26 -4 76 82 -31 -31 63 100 44 -21 -94 -99 20 165 108 -21 -36 -37
4574 -37 -13 14 47 40 -62 -40 12 48 21 -29 -48 93 78 -28 -122 -77 39 51 66 24 -100 -124 -22 29 63 4 3 96
4602 96 65 -26 -97 -15 37 48 57 75 -94 -125 -38 63 40 44 3 -26 56 89 35 -41 21 59 94 89 -57 -116 -48 100 188 -26
4632 -26 -37 -39 -79 -35 95 72 -20 -15 54 43 15 -110 -143 53 69 44 2 -132 -89 53 115 84 4 -44 -107 -72 26 19 -114
4661 -114 -7 65 -23 -34 -74 -119 27 84 88 -47 -28 -31 51 4 27 20 -69 11 95 7 -18 35 49 103 61 24 -83 -25 -33 102
4691 102 75 85 -20 -103 -27 24 50 9 -1 16 30 47 -63 -17 -49 -21 42 54 -93 -148 -110 17 99 52 -41 -58 -13 -46
4719 -46 8 14 44 58 30 -49 -2 -91 -15 40 110 62 -62 -47 4 19 31 74 41 22 36 35 44 -6 -67 -13 56 126 4 -98
4749 -98 -70 -8 96 110 22 -112 -55 49 -3 -33 83 -25 2 12 29 -58 -26 -27 54 77 50 -47 -12 38 -6 22 44 -36
4777 -36 -93 -54 -38 -3 -25 10 24 0 -20 -78 -19 32 -9 28 -6 -11 -55 -79 56 44 44 18 90 -59 7 36 -1 -30 -4 89
4807 89 92 67 -81 -58 61 81 155 36 -69 -94 -83 36 100 -45 -5 33 63 -102 -129 -7 17 27 77 10 10 -31 -68
4834 -68 31 -15 -33 -50 -15 63 -46 -34 -1 29 3 47 -71 -92 -110 -35 108 84 43 -121 -72 -36 22 2 49 -66 -24 -1
4862 -1 44 9 -106 0 122 29 16 -32 -68 -44 34 75 79 -71 29 -51 45 55 -98 45 62 25 -30 18 4 47 -1 58
4890 58 59 -43 -78 -39 69 112 -5 -28 -22 -6 -20 -8 96 -37 -35 81 103 -28 -109 -16 -16 35 37 -45 -60 -30 -15 109 54
4919 54 5 -4 49 62 -76 -102 -19 49 1 -15 -90 -47 -69 10 89 66 -86 -84 11 23 -5 -55 -59 -7 -14 102 122 -22 -172 -108
4949 -108 116 141 46 -46 -46 -34 46 47 30 -67 -157 -84 68 36 -48 -19 10 66 -68 19 91 -13 19 44 78 -26 -12 38
4977 38 76 20 -44 -88 69 29 -43 3 10 -8 39 136 72 -122 -142 -30 119 89 41 -6 -131 -54 85 145 49 -77 -115
5004 -115 40 100 55 -84 -66 -35 10 28 141 34 -133 -14 65 114 35 -7 -26 12 -45 25 87 -25 31 -1 64 -49
5030 -49 -62 46 181 9 -106 -55 -8 80 135 10 -140 -56 -27 101 168 19 -123 -58 55 161 5 -12 -91 -162
5054 -162 -45 123 147 -80 -194 -92 26 73 39 -26 -65 -41 -4 96 -37 -69 -148 43 33 -32 -39 52 22 -7 8 2
5080 2 86 25 58 -21 -20 -94 -5 69 196 -1 -94 -31 109 139 24 -5 -90 -90 55 129 99 -2 -107 -3 150 131 39
5107 39 -72 -103 -37 69 154 56 -143 -80 90 142 5 -7 -46 -54 -15 84 62 -32 -113 88 66 43 -56 -73 9 -14 -12 -10 -25
5136 -25 -27 6 50 49 -64 -61 35 125 25 -79 -94 63 87 75 0 -69 -209 -44 117 174 19 -153 -117 13 101 73 -25
5163 -25 -93 -96 64 130 23 -43 -128 1 101 126 -10 -47 -95 60 7 34 -8 -38 14 95 0 5 -53 -2 58 34 -82 -43
5191 -43 -44 86 -29 18 -39 -170 -93 70 129 -8 -65 -127 41 43 60 -57 -78 -73 123 54 18 -100 -120 20 147 81
5217 81 46 -34 -69 -21 123 90 -60 -83 41 158 53 37 -85 -9 -12 94 12 -16 -131 -51 92 67 -41 -92 50
5242 50 48 73 20 2 -34 -8 115 29 -12 -132 -59 -7 44 -11 -111 -131 -20 98 26 32 -53 -139 -20 118 26 -67 -69 -77 58
5271 58 76 19 -129 -158 -31 73 126 -70 -84 -50 80 83 37 -18 -63 -19 109 63 -53 -87 5 86 111 89 -70 -126 27
5298 27 99 129 -23 -95 -79 47 131 68 -127 -95 22 74 125 -69 -150 -41 53 19 27 -117 -114 -64 71 109 25 -123 -98
5325 -98 28 76 45 -61 -83 -21 66 117 -29 -152 -76 29 139 51 -91 -181 -17 38 40 -39 -62 -61 25 167 40 -66
5351 -66 -57 57 34 115 -13 -132 -54 61 97 82 -29 -122 -64 67 150 20 -110 -51 36 95 158 -53 -165 33 86
5376 86 64 35 -112 -217 -10 172 79 -9 -89 -22 35 68 -20 -94 -104 29 72 20 -24 -155 -38 89 169 26 -101
5401 -101 -135 -41 78 103 77 -113 -44 -16 62 -9 -13 -83 -39 93 85 7 -154 -28 18 189 106 -36 -170 -39 74 80
5427 80 88 -98 -89 9 107 30 -60 -118 -10 134 60 -55 -134 -102 40 121 61 14 -169 -57 102 125 -28 -66 -60 27 145
5454 145 107 -45 -178 -60 56 148 6 -79 -111 19 159 110 -32 -120 -24 52 130 72 -105 -80 -22 140 14 -77
5478 -77 -95 -74 89 148 86 -95 -134 -8 115 103 43 -86 -120 15 106 36 -60 -120 21 185 70 21 -143 -90 85
5503 85 186 73 -76 -127 -108 108 49 4 -91 -62 18 123 103 -210 -147 8 93 150 -55 -92 -179 1 81 156 58 -136
5529 -136 -54 30 180 2 -124 -67 62 154 66 -22 -120 -116 123 68 57 -129 -160 -3 147 115 -107 -134 -56 14 171
5554 171 -51 -91 -131 -1 99 175 -75 -164 -87 20 169 93 -69 -178 -90 40 114 12 -65 -100 33 114 52 -120
5578 -120 -41 -53 96 127 43 -151 -64 54 195 110 -31 -126 -49 117 68 -21 -101 -29 59 140 150 -96 -139 9 94 166
5604 166 -39 -129 -173 11 191 117 -13 -161 -122 28 119 40 -158 -73 7 107 126 -23 -180 -110 116 106 71 -113
5628 -113 -114 -75 47 38 -25 -89 -3 98 85 75 -155 -124 -8 152 75 -89 -134 -4 127 171 -22 -206 -148 -36 84
5653 84 126 0 -177 -141 98 164 145 -99 -141 -95 87 294 7 -118 -162 -41 145 64 -20 -174 -79 12 73 63 -28
5678 -28 -84 -21 117 22 -175 -167 23 148 53 -4 -93 -110 5 113 85 -95 -119 -59 161 126 -84 -128 -21 123 153
5703 153 88 -109 -158 -27 197 237 21 -182 -209 10 191 116 -56 -192 -154 13 130 168 -45 -237 -164 103 199
5726 199 -1 -184 -114 -63 70 128 28 -51 -92 94 128 -22 -122 -40 57 92 -19 -96 -44 47 186 109 -33 -180
5750 -180 -34 70 233 -17 -147 -105 25 247 109 22 -110 -193 -17 249 202 -90 -284 -102 138 238 76
5771 76 -169 -252 -41 113 207 40 -133 -148 24 151 75 -118 -67 14 32 87 57 -83 -123 67 97 58 -101 -75 60
5796 60 133 65 -43 -89 -29 106 166 13 -167 -148 59 276 65 -75 -188 -106 74 215 70 -127 -238 -65 155
5819 155 144 -7 -262 -222 86 177 114 -114 -188 -61 70 225 118 -173 -174 24 108 170 -11 -113 -16 26 97 76
5843 76 -32 -77 32 28 56 -40 -128 -1 108 38 -26 -153 -121 33 194 116 -87 -181 -40 155 139 49 -195 -161 51
5868 51 166 127 -65 -181 -108 83 220 84 -138 -205 -13 156 235 68 -164 -117 1 198 185 -35 -182 -51
5890 -51 195 184 29 -85 -41 -17 95 92 -110 -44 -13 75 82 -38 -125 -21 50 202 75 -87 -78 -60 140 102 33 -198
5916 -198 -153 14 230 42 -78 -189 -67 141 188 33 -124 -130 -45 184 152 -26 -239 -77 112 235 -4 -124
5938 -124 -115 -77 98 184 -17 -152 -93 62 133 88 -46 -169 11 63 99 -68 -131 -96 16 184 74 -109 -104 -3
5962 -3 147 160 -12 -163 -46 53 145 110 -90 -190 -24 149 108 -4 -220 -141 31 73 50 -141 -109 -88 130 164
5986 164 9 -163 -212 1 183 108 -41 -129 -79 59 90 68 -143 -157 64 146 132 -40 -102 -58 100 151 27 -151
6010 -151 -145 3 168 80 -54 -202 -93 92 76 9 -110 -155 -53 126 132 -21 -186 -97 32 171 93 -101 -167 -8
6034 -8 55 130 -24 -119 -111 33 135 115 -143 -137 -67 115 108 6 -108 -95 -6 105 117 -41 -139 -20 65 171 -40 -120
6060 -120 -81 0 139 89 -31 -166 -23 119 124 -52 -105 -142 -34 164 95 -20 -131 -91 113 117 56 -153 -109 13
6084 13 67 128 -17 -126 -72 122 162 3 -109 -157 15 102 81 44 -132 -132 92 115 52 -72 -148 31 132 89 -10
6109 -10 -84 -110 77 130 120 -67 -172 -58 92 179 75 -91 -136 -21 177 96 -18 -112 -88 146 202 42 -75 -80
6133 -80 53 164 47 -69 -140 -54 87 109 31 -125 -112 -2 87 41 -69 -100 -83 73 170 78 -173 -79 -55 89 102
6158 102 -58 -63 -65 86 122 5 -29 -133 -57 67 52 2 -135 -58 17 120 65 -105 -114 -23 147 151 -48 -103 -62 45
6184 45 77 53 22 -114 -28 103 88 -3 -101 -80 42 195 93 -104 -99 -21 68 97 25 -55 -121 19 99 41 -9 -174 -37
6211 -37 67 143 10 -125 -106 -14 151 52 -82 -116 -77 26 140 36 -108 -139 17 48 87 -38 -126 -47 135 133 37
6236 37 -99 -156 -47 84 96 18 -127 -100 43 39 29 -45 -84 -24 122 81 -92 -103 -77 -5 192 126 -77 -155 -97 127
6262 127 106 15 -88 -107 69 87 55 -120 -141 -12 125 159 7 -172 -106 6 175 125 -69 -100 -82 47 96 30
6286 30 -63 -145 -22 145 120 -55 -100 -45 39 177 83 -52 -99 52 84 104 -91 -104 -67 89 180 112 -88 -52 25 32
6312 32 59 -14 -158 -109 119 116 33 -170 -114 -5 115 127 -36 -107 -59 13 51 81 -149 -122 -49 130 75 -87 -91 -105 -37
6339 -37 51 77 -38 -146 -50 3 55 32 -42 -86 -24 27 64 -42 -1 -30 -12 51 -17 -80 -43 18 17 114 -86 -130 -23 85
6367 85 62 -18 -46 -133 -3 90 118 -93 -193 -102 87 115 105 32 -119 -11 93 88 -1 -109 -89 4 156 32 -123
6392 -123 -53 37 38 90 81 2 -110 95 43 3 -95 -68 2 106 58 46 -53 -67 12 90 41 -101 -95 14 106 63 -9 -59 -28
6421 -28 93 110 76 -139 -81 -54 105 115 43 -153 -62 30 114 110 -21 -130 -55 46 101 19 -73 -104 -24 63 -1 84 -61
6448 -61 -73 -41 89 66 -40 -161 -49 78 15 -59 -90 -48 51 21 10 -20 -103 -13 71 115 -68 -105 -24 116 73 -13 -90
6475 -90 -64 51 60 103 34 -112 -112 90 116 62 -65 -82 7 122 100 42 7 -77 4 57 142 15 -74 -85 66 12 -27 -59
6503 -59 -76 32 44 8 53 -49 -75 46 31 8 -32 -15 30 66 -31 -58 -63 -36 66 96 80 -152 -46 40 89 74 -4 -116
6531 -116 24 84 84 20 -89 -95 -8 125 60 9 -124 -55 64 125 90 17 -119 -19 131 112 25 -62 -35 11 42 44 -57
6558 -57 -90 -6 68 12 -9 -34 17 48 49 29 -19 -120 -40 100 47 -23 -114 -126 -9 98 31 -16 -127 -35 80 112 22 -53
6586 -53 -4 -7 117 82 -1 -83 -115 65 141 58 -18 -73 -28 87 47 -32 -24 -73 11 70 91 59 -143 33 91 14 30 -19 -46
6615 -46 -2 41 82 -47 -28 5 28 92 -8 -104 -72 69 36 18 -18 -86 5 86 56 -29 -130 -147 84 69 90 -23 -58
6642 -58 1 107 54 -7 -59 -111 0 75 24 -21 -76 -23 3 80 79 -40 -14 -60 53 82 30 -45 -122 146 137 84 -25 11
6670 11 40 96 98 66 -53 31 32 63 33 -82 -62 16 95 69 -12 -86 -38 23 101 -26 -65 -146 60 98 16 25 -40 -88 -28 96
6700 96 8 -7 -73 -113 51 93 -11 -50 -72 2 38 -4 -32 -53 -67 79 24 45 -35 -7 -2 143 89 4 -97 -34 16 56
6728 56 37 33 -71 -22 92 24 -66 -24 25 76 99 6 -106 5 47 45 71 -35 -110 -92 34 32 29 -82 -87 3 18 63 -27
6757 -27 -59 -23 65 127 39 -62 -40 -65 50 85 -53 -35 -68 60 73 18 9 -101 14 94 67 73 -36 -61 -19 42 9 -28
6785 -28 7 -28 53 104 -8 0 -95 35 44 40 -25 -78 0 10 72 -6 -95 -92 5 64 4 -53 -87 -21 -24 78 -45 -60 -73 5 33
6816 33 27 -42 -68 -38 76 62 -25 -66 -51 14 24 30 -40 -56 23 -20 88 27 -13 -5 -6 78 19 -6 -7 15 17 187 84 -20 -37
6847 -37 -51 72 97 -9 -83 -60 32 63 18 -32 -69 9 53 35 -71 8 1 15 41 24 -17 -57 -32 67 35 -4 -116 -30 -32
6876 -32 52 31 -61 -100 14 72 52 18 -126 -78 10 118 68 -39 -63 -59 43 54 47 -12 -52 10 74 52 -14 3 66 73 51
6905 51 -19 -39 -34 12 79 97 -16 -114 28 52 47 0 -59 -90 79 54 53 -20 -37 -65 -29 84 -27 -41 -112 -62 64 69 -41
6934 -41 -73 -18 80 -4 69 -101 -49 7 24 34 36 -32 -83 38 68 50 10 -98 -37 -14 64 -28 31 -38 1 8 48 -24 -33 6
6964 6 48 96 19 -64 -46 40 77 15 -26 -99 -45 54 100 42 -26 5 8 104 20 -128 -36 -17 -25 27 -5 -35 -46 13 75 120 -12
6995 -12 -43 -24 31 89 43 -56 -44 52 -22 46 4 -85 -22 -6 56 30 -49 -9 2 97 56 43 -54 -19 6 81 55 -17 -103 34
7025 34 42 6 -93 -52 52 0 53 50 8 -69 -8 61 46 -40 -85 20 46 45 66 16 -99 -58 3 85 -56 -83 -40 4 58 80
7055 80 15 -41 23 12 44 41 -18 -85 -35 41 49 -30 -118 13 69 45 -10 -37 -24 9 30 -1 -16 -42 38 14 91 44 -32 -70 1
7086 1 71 23 2 -53 -3 54 87 42 -65 -90 -21 60 64 0 -18 -70 30 94 44 -40 -59 -58 16 25 -18 -14 -46 -42 4 14 -33 -11
7118 -11 -58 48 94 9 -36 -66 18 10 57 -15 -1 18 66 122 35 -59 -23 -1 82 37 -49 22 -32 82 107 100 -11 -120 -12
7147 -12 86 112 14 -83 -79 82 58 29 -28 -54 -40 92 124 -34 -14 -1 39 68 14 -28 -22 -3 40 -8 28 46 21 35 -22 -6
7177 -6 10 -72 39 108 -13 -23 -36 -2 7 14 98 28 -61 45 88 -32 16 -42 -6 -5 95 76 -75 -16 -5 73 104 16 -41
7206 -41 -50 102 66 29 9 -48 13 31 42 60 -24 -66 -12 33 -1 10 -62 19 13 -4 45 -3 -57 -35 -6 38 -17 -70 92 23
7236 23 7 8 -45 -19 15 33 60 -54 -43 -17 105 16 -23 -58 -25 11 -2 53 75 -42 -44 27 50 21 -35 32 -14 65 58 -18
7266 -18 39 -54 4 88 43 -43 -75 -9 36 -41 10 38 -37 4 9 65 43 -41 5 55 66 -23 -95 76 57 58 -5 -14 -72 -27 60
7297 60 -17 53 -34 -31 30 71 68 -27 -25 2 -41 82 17 13 -36 25 47 104 29 -16 10 38 22 -19 19 -83 16 26 66 -50 -22
7328 -22 -50 -27 30 56 -107 60 -21 19 -18 51 -5 -31 -13 7 19 1 -66 43 76 11 -25 -115 -24 30 51 -41 10 -75 -17
7357 -17 -61 71 17 -68 -60 -19 33 7 -80 -58 -84 7 58 -12 5 -48 26 65 22 -6 -49 -57 -5 27 33 24 -37 -11 -6 24 28 -54 -55
7390 -55 29 -20 -16 -2 -51 -21 91 32 -36 -27 13 0 -14 -56 -27 -36 -18 107 8 -22 9 -20 -64 25 -5 -8 34 -59 27 51 -9
7421 -9 -18 -59 -44 88 -28 -39 39 -54 61 37 -53 7 5 -37 22 24 -11 -32 -52 40 -15 30 -34 -13 39 33 -14 -9 -86 -23 45 19
7453 19 -12 2 -13 59 -20 32 5 -45 -16 40 -40 31 -15 -36 -8 8 -25 41 0 -61 -9 2 -29 -35 -71 -26 9 1 9 -16 -28 25
7485 25 28 -21 -59 -15 38 37 15 -37 -29 -15 -8 81 15 1 18 -19 14 7 91 -40 -4 58 6 39 -33 -81 46 -50 -45 9 39 -9
7517 -9 44 -22 4 27 -37 -7 -7 10 -26 20 38 22 40 18 -55 -53 9 19 1 -47 26 34 -29 36 14 42 -37 -56 18 -12 0 -36
7549 -36 -72 57 28 59 -49 -26 -8 33 51 -10 49 -8 36 39 38 63 30 9 -4 19 -44 -14 1 56 12 95 30 -36 20 -48
7579 -48 -4 -4 -34 12 -35 36 -14 45 -65 17 24 -60 29 -50 -29 -9 -3 -1 12 -27 40 40 84 8 10 50 -42 12 -46 -17 12 -47 -54
7612 -54 41 -16 -6 9 -40 34 62 38 57 20 -3 35 22 14 11 26 17 19 6 58 -40 4 -12 -44 4 -39 -28 45 -22 0 13 -7
7644 -7 -2 28 52 -16 -67 -37 -12 -20 -15 -33 32 -69 5 34 -1 -3 -83 -17 5 43 -30 24 -21 3 -47 58 36 -20 24 -25 89
7675 89 29 17 30 42 82 59 0 -72 17 39 -1 -42 -7 33 45 38 -39 4 53 6 -14 23 8 31 -47 35 40 70 -28 -24 11 -16
7707 -16 7 -42 -45 -11 52 -47 68 -17 6 -21 28 -1 40 -55 -13 5 2 56 -1 4 -22 -14 31 -20 -21 16 -3 17 -29 -16 53 19
7739 19 -47 54 -36 -52 -54 67 21 -29 7 0 17 -5 17 2 10 -23 -46 63 44 11 -90 -33 1 -4 11 -9 -42 15 -50 -8
7769 -8 -6 -11 0 -12 -23 -2 22 -38 -26 -45 -24 38 20 -15 -40 8 -4 10 4 3 0 23 37 19 55 12 5 53 -6 -11 -10 63 27 9 -43
7804 -43 -5 10 -19 -20 22 10 -77 42 86 -28 64 42 64 -11 8 26 5 -26 20 36 45 26 39 3 60 -13 -84 85 -7 12
7834 12 -29 0 19 2 15 -13 -20 -51 -82 33 59 -35 -58 0 -9 76 -3 17 8 -2 -11 17 27 -13 -42 13 7 -16 -35 38 45 -64
7866 -64 12 68 62 -26 -16 3 35 70 31 -19 -14 -43 23 11 4 35 -1 -18 17 -4 31 21 -38 13 -2 -89 60 -55 37 -11 15
7897 15 -9 24 1 26 23 3 -25 -4 1 41 -66 -34 -3 -8 7 1 -35 35 5 59 52 -39 28 13 57 -18 42 -24 5 21 13 31 45
7930 45 17 17 49 0 48 -5 -30 0 13 -29 -6 -51 1 18 -58 -51 48 46 55 -12 -92 -34 -30 10 -7 -16 -83 -69 -12 -91 -14 3 -12
7963 -12 8 -7 14 40 8 -53 26 5 13 40 21 -27 -24 72 29 108 -34 -2 -18 -30 7 33 19 25 19 64 8 64 -51 36 72
7994 72 4 -22 26 40 24 41 -96 53 51 15 46 28 -92 -26 -32 3 10 11 -32 -7 -63 7 -49 -22 23 -33 -65 -44 -30 54 -8
8025 -8 -20 31 54 -37 -30 25 -31 -39 -25 27 14 17 20 -8 -19 25 -34 7 -14 26 -34 25 -18 -2 43 3 -81 18 20 41 -48 -34 -37 -15
8059 -15 -15 -21 -26 -24 -17 27 74 -13 45 -40 66 34 32 -29 60 1 -54 1 22 60 -21 -20 -42 -1 48 50 -8 -12 47 19 22 -5 -6 9 29
8094 29 85 -11 83 20 -13 45 -24 -33 0 -33 19 20 -27 94 19 4 37 -51 34 46 -1 -49 18 10 3 24 -59 24 -2 0 55 16
8126 16 5 34 20 23 -34 -22 -20 -32 -53 -54 -53 31 -14 -16 1 -40 -5 17 -42 -11 41 30 20 25 -32 -11 6 16 20 54 53 69 -19 41
8160 41 -42 -19 21 17 11 -9 86 -11 57 36 37 21 -25 -4 -18 11 6 60 -7 13 43 16 14 12 28 -66 44 12 -18 52 -1
8191a
##END NTUPLES=NMR FID
##END=
