##TITLE=1H_CA-8588
 CDCl3, 8 sc, 
 7.5.2019
##JCAMPDX= 6.0         $$ Bruker NMR JCAMP-DX V2.0
##DATA TYPE= NMR FID
##DATA CLASS= NTUPLES
##ORIGIN= UXNMR, Bruker Analytische Messtechnik GmbH
##OWNER= root
$$ XWIN-NMR		Version 3.5
$$ Tue May  7 12:27:08 2019 Russian Standard Time (UT+4h)  she@DPX200
##.OBSERVE FREQUENCY= 200.1315
##.OBSERVE NUCLEUS= ^1H
##.DELAY= (6, 6)
##.ACQUISITION MODE= SIMULTANEOUS
##.ACQUISITION SCHEME= undefined
##.AVERAGES= 8
##.DIGITISER RES= 18
##SPECTROMETER/DATA SYSTEM= spect
##.PULSE SEQUENCE= zg30
##.SOLVENT NAME= CDCl3
##.SHIFT REFERENCE= (INTERNAL, CDCl3, 0, 15.7039)
##AUDIT TRAIL= $$ (NUMBER, WHEN, WHO, WHERE, WHAT)
$$ ##TITLE= Audit trail, XWIN-NMR		Version 3.5
$$ ##JCAMPDX= 5.01
$$ ##ORIGIN= Bruker BioSpin GmbH
$$ ##OWNER= she
$$ F:/spectra/data/she/nmr/H-F/1/audita.txt
$$ ##AUDIT TRAIL=  $$ (NUMBER, WHEN, WHO, WHERE, WHAT)
(   1,<2019-05-07 12:25:57.50 +0400>,<she>,<DPX200>,
      <created by zg, POWCHK disabled, PULCHK disabled
       configuration hash MD5:
       00 E9 B6 7A A2 85 ED C7 34 08 36 98 17 FE 4E 26
       data hash MD5: 16K
       31 9C 27 3E 9A B9 28 BC 3E 32 78 7C 74 F4 7C F3>)
$$ ##END=
$$ 
$$ hash MD5
$$ 0F C0 84 5A 6B A4 45 16 A0 B6 7E 3B 48 F4 E6 76
##$RELAX= 
##$RELAX= 
##$RELAX= 
##$RELAX= 
##$RELAX= 
##$RELAX= 
$$ Bruker specific parameters
$$ --------------------------
##$DU= <F:/spectra>
##$EXPNO= 1
##$NAME= <H-F>
##$PROCNO= 1
##$TYPE= <nmr>
##$USER= <she>
##$AMP= (0..31)
100 100 100 100 100 100 100 100 100 100 100 100 100 100 100 100 100 100 
100 100 100 100 100 100 100 100 100 100 100 100 100 100 
##$AQSEQ= 0
##$AQ_mod= 1
##$AUNM= <au_zg>
##$AUTOPOS= <>
##$BF1= 200.13
##$BF2= 200.13
##$BF3= 200.13
##$BF4= 200.13
##$BF5= 200.13
##$BF6= 200.13
##$BF7= 200.13
##$BF8= 200.13
##$BYTORDA= 1
##$CFDGTYP= 0
##$CFRGTYP= 5
##$CHEMSTR= <none>
##$CNST= (0..31)
1 1 145 1 1 1 1 1 1 1 1 1 1 1 1 1 1 1 1 1 1 1 1 1 1 1 1 1 1 1 1 1 
##$CPDPRG= <>
##$CPDPRG1= <>
##$CPDPRG2= <>
##$CPDPRG3= <>
##$CPDPRG4= <mlev>
##$CPDPRG5= <mlev>
##$CPDPRG6= <mlev>
##$CPDPRG7= <mlev>
##$CPDPRG8= <mlev>
##$CPDPRGB= <>
##$CPDPRGT= <>
##$D= (0..31)
0 1.2 0 0 0 0 0 0 0 0 0 0.03 0 0 0 0 0 0 0 0 0 0 0 0 0 0 0 0 0 0 0 0 
##$DATE= 1557217556
##$DBL= (0..7)
120 120 120 120 120 120 120 120 
##$DBP= (0..7)
150 150 150 150 150 150 150 150 
##$DBP07= 0
##$DBPNAM0= <>
##$DBPNAM1= <>
##$DBPNAM2= <>
##$DBPNAM3= <>
##$DBPNAM4= <>
##$DBPNAM5= <>
##$DBPNAM6= <>
##$DBPNAM7= <>
##$DBPOAL= (0..7)
0.5 0.5 0.5 0.5 0.5 0.5 0.5 0.5 
##$DBPOFFS= (0..7)
0 0 0 0 0 0 0 0 
##$DE= 6
##$DECBNUC= <off>
##$DECIM= 24
##$DECNUC= <off>
##$DECSTAT= 4
##$DIGMOD= 1
##$DIGTYP= 9
##$DL= (0..7)
0 120 120 120 120 120 120 120 
##$DP= (0..7)
150 150 150 150 150 150 150 150 
##$DP07= 0
##$DPNAME0= <>
##$DPNAME1= <>
##$DPNAME2= <>
##$DPNAME3= <>
##$DPNAME4= <>
##$DPNAME5= <>
##$DPNAME6= <>
##$DPNAME7= <>
##$DPOAL= (0..7)
0.5 0.5 0.5 0.5 0.5 0.5 0.5 0.5 
##$DPOFFS= (0..7)
0 0 0 0 0 0 0 0 
##$DQDMODE= 0
##$DR= 18
##$DS= 0
##$DSLIST= <SSSSSSSSSSSSSSS>
##$DSPFIRM= 0
$$ [...]
##$SUBNAM2= <"">
##$SUBNAM3= <"">
##$SUBNAM4= <"">
##$SUBNAM5= <"">
##$SUBNAM6= <"">
##$SUBNAM7= <"">
##$SUBNAM8= <"">
##$SUBNAM9= <"">
##$SW= 24.9337058887773
##$SWIBOX= (0..15)
0 0 2 0 0 0 0 0 0 0 0 0 0 0 0 0 
##$SW_h= 4990.01996007984
##$TD= 16384
##$TD0= 1
##$TE= 0
##$TE2= 300
##$TE3= 300
##$TEG= 300
##$TL= (0..7)
0 120 120 120 120 120 120 120 
##$TP= (0..7)
150 150 150 150 150 150 150 150 
##$TP07= 0
##$TPNAME0= <>
##$TPNAME1= <>
##$TPNAME2= <>
##$TPNAME3= <>
##$TPNAME4= <>
##$TPNAME5= <>
##$TPNAME6= <>
##$TPNAME7= <>
##$TPOAL= (0..7)
0.5 0.5 0.5 0.5 0.5 0.5 0.5 0.5 
##$TPOFFS= (0..7)
0 0 0 0 0 0 0 0 
##$TUNHIN= 0
##$TUNHOUT= 0
##$TUNXOUT= 0
##$USERA1= <user>
##$USERA2= <user>
##$USERA3= <user>
##$USERA4= <user>
##$USERA5= <user>
##$V9= 5
##$VALIST= <valist>
##$VCLIST= <CCCCCCCCCCCCCCC>
##$VD= 0
##$VDLIST= <DDDDDDDDDDDDDDD>
##$VPLIST= <PPPPPPPPPPPPPPP>
##$VTLIST= <TTTTTTTTTTTTTTT>
##$WBST= 1024
##$WBSW= 4
##$XGAIN= (0..3)
0 0 0 0 
##$XL= 0
##$YL= 0
##$YMAX_a= 481828
##$YMIN_a= -922510
##$ZGOPTNS= <>
##$ZL1= 120
##$ZL2= 120
##$ZL3= 120
##$ZL4= 120
##$ABSF1= 10
##$ABSF2= 0
##$ABSG= 5
##$ABSL= 3
##$ALPHA= 0
##$AQORDER= 0
##$ASSFAC= 0
##$ASSFACI= 0
##$ASSFACX= 0
##$ASSWID= 0
##$AUNMP= <proc_1d>
##$AZFE= 0.1
##$AZFW= 0.1
##$BCFW= 1
##$BC_mod= 2
##$BYTORDP= 1
##$COROFFS= 0
##$CY= 11.3945322036743
##$DATMOD= 1
##$DC= 2
##$DFILT= <>
##$DTYPP= 0
##$F1P= 18.9103706918063
##$F2P= -1.10871071338519
##$FCOR= 0.5
##$FTSIZE= 0
##$FT_mod= 4
##$GAMMA= 1
##$GB= 0.15
##$INTBC= 1
##$INTSCL= 1
##$ISEN= 128
##$LB= 0.24
##$LEV0= 0
##$LPBIN= 0
##$MAXI= 10000
##$MC2= 0
##$MEAN= 0
##$ME_mod= 0
##$MI= 1.114404
##$NCOEF= 0
##$NC_proc= 0
##$NLEV= 6
##$NOISF1= 3.799351
##$NOISF2= 2.8
##$NSP= 1
##$NTH_PI= 0
##$NZP= 0
##$OFFSET= 15.70392
##$PC= 1
##$PHC0= -8855.191
##$PHC1= 15.00026
##$PH_mod= 1
##$PKNL= yes
##$PPARMOD= 0
##$PSCAL= 0
##$PSIGN= 0
##$REVERSE= no
##$SF= 200.130013532006
##$SI= 16384
##$SIGF1= 3
##$SIGF2= 2
##$SINO= 400
##$SIOLD= 16384
##$SREGLST= <1H.CDCl3>
##$SSB= 0
##$STSI= 0
##$STSR= 0
##$SW_p= 3612.71676300578
##$SYMM= 0
##$S_DEV= 0
##$TDeff= 0
##$TDoff= 0
##$TI= <>
##$TILT= no
##$TM1= 0
##$TM2= 0
##$TOPLEV= 0
##$USERP1= <user>
##$USERP2= <user>
##$USERP3= <user>
##$USERP4= <user>
##$USERP5= <user>
##$WDW= 1
##$XDIM= 8192
##$YMAX_p= 0
##$YMIN_p= 0
$$ End of Bruker specific parameters
$$ ---------------------------------
##NTUPLES= NMR FID
##VAR_NAME=  TIME,          FID/REAL,        FID/IMAG
##SYMBOL=    X,             R,               I
##VAR_TYPE=  INDEPENDENT,   DEPENDENT,       DEPENDENT
##VAR_FORM=  AFFN,          ASDF,            ASDF
##VAR_DIM=   8192,          8192,            8192
##UNITS=     SECONDS,       ARBITRARY UNITS, ARBITRARY UNITS
##FACTOR=    0.0002004,     1,               1
##FIRST=     0,             0,               0
##LAST=      1.6414764,     0,               0
##MIN=       0,             -922510,         0
##MAX=       1.6414764,     481828,          0
$$ Real data points
##PAGE= N=1
##DATA TABLE= (X++(R..R)), XYDATA
$$ [...]
3124a623L386P64J59m059l800K714M372k31p09n9m309l104N946N733j831l136
3140B13k387m022O68Q234M427m068m630k590j020L907N414P54l130l811k900J554
3156c387N833N55l478J379J308m725j032M941R75l537J641R61l392l93M005J660
3172C314k447j644j600o9M204L281l226l796k789J05O509O395l674p346k491l31
3188e605K951Q630L699r245q268K692M749J584L049L27o463m163L168M431J100
3203B636r19k550r82J177L9K58K307p01m914K45M906k13p89K670j936p495J128
3220e133P850K082l006q33l366m616L166R084K755n369o869j698L620M696M77
3235B840p13p28m840j610P189M230p213l870N214J737l345J432J428m324q44M916
$$ y = [-1623, 1763, 2527, 2686, -1373, -5173, -2459, 1913, 1682, 973, 914, -3395, -6499, -553, 5180, 3349, 213, -2174, -6196, -5528, 2706, 7133, 3065, -1565, -4155, -5175, -1268, 4146, 4900, 1770, -2041, -4941, -3387, 2446, 3001, -477, 902, 2210, -2515, -3547, 1394, 2369, -1168, 473, 1434, -1958, -2351, 1654, 3314, 867, -777, -2377, -2446, 1758, 5039, 1813, -1983, -4772, -4667, 1842, 8237, 4563, -2783, -5274, -5605, -2654, 5976, 9675, 430, -7838, -5146, -397, 1187, 4236, 4563, -1900, -6063, -2895, 1536, 2636, 1717, -833, -1815, -638, -599, -341, 1966, 1265, -3649, -3404, 1502, 1289, 500, 3170, 1234, -6261, -5133, 2717, 4799, 1793, 960, -2406, -7022, -3856, 5228, 7983, 2614, -4255, -5953, -2333, 2363, 2840, 2127, 1399, -3441, -5051, 2138, 6368, -845, -4715, 499, 2236, -1109, 323, 1751, -2573, -3417, 1499]
3251A499J753l599q25P55j15m47K57N49O47l77N00J509j992n435J372Q783K43
3268E077o985j096K953l355N03Q124J383r087k554N085J894j905J81O36o71m84
3284c01J165J014j190k511O81N640j157n542J228M327k807k318N068R66o867J306
3300a298P564k316q800J445O888J061k020j54k079l424O2N815M906l666q412r0
3316d518O332P89j974K359p24o258J225Q461j569r124J113O819j404k264L057
3331B320r72n562O67O147J494m992k663K867L031k705l144L963K402m095j31N428
3347D055m091p573N051R699l859o529K073J914l434J628N980k713p077J296O631
3362C051P65n073k105K837K294j493L75K771n206o314O776R650n450q704M304
$$ y = [1499, 3252, -347, -1172, -417, -532, -979, -722, -173, 474, 97, 597, 2106, 114, -5321, -3949, 4834, 5077, -1908, -3004, -51, -3406, -2903, 5221, 6604, -2483, -5037, 48, 1942, 37, 218, 854, 183, -301, 864, 1878, 688, -1823, -1142, 4498, 3341, -2201, -973, 3354, 547, -1771, 3297, 4263, -2604, -1298, 6266, 3950, -4850, -3405, 3483, 4544, 2524, 2370, 291, -3133, -3071, 2744, 7650, 3984, -4428, -4518, 1814, 2603, 629, 2988, 2264, -3994, -2769, 5692, 4123, -5001, -3888, 2931, 1527, -737, 2320, 1348, -4214, -3547, 2600, 4094, -898, -3561, -694, 2337, -368, -3512, 451, 2853, -1242, -1373, 4055, -36, -7609, -2558, 7141, 3282, -3247, -1174, 740, -2694, -1066, 4914, 2201, -4876, -3580, 3051, 3816, -1257, -3362, -525, 1769, 276, 651, 3422, -1784, -8098, -1322, 8328, 2878, -5826, -1522]
3377a522M204m895L11O195k633q502L826Q282k231p288M1M990J047j858O9R61
3393I97m179k962O529O105o329p255N856N646o129j210N236k065n999N431P073
3408F745o432p681N306O313k218l146J043k18k533N58N511J390p028l609P600
3423A601M972p126l601N480J05m508N041N278q945o915Q938P648n813n192K764
3438b73N91k636K714L804k787o060J005Q219J270p665l317N547J543l759L068
3453A264L432p896m990J0304O096r065n247O354J832m825K183L987m311m678M869
3468f91O359l421p283K12O691J216m597M46K758m758j709Q422L187r999m378Q994
3484A449L024n938Q6L563m997k277P787M027p579n317M356N150j363l378R75J081
$$ y = [-1522, 2682, -2213, -1902, 4293, 1660, -6842, -3016, 5266, 3035, -4253, -4212, 778, 1825, -33, 36, 997, -3182, -6144, 385, 6490, 161, -7094, -1238, 4408, -1721, -2931, 2305, 240, -5759, -328, 6745, 313, -7368, -2062, 4251, 2033, -1113, -70, -288, -2821, -2263, 3248, 4638, -2390, -5999, 1601, 6573, -553, -4154, 1326, 1431, -3077, 1964, 7242, -1703, -8618, 320, 7968, 2155, -3037, -273, 318, -2318, 396, 4200, 1413, -4647, -3642, 4577, 5847, -1818, -5135, 412, 1955, -1804, 1264, 4696, -3200, -8190, 2114, 8210, -855, -6102, 252, 2084, -2741, -558, 3429, -882, -5560, -691, 5668, 2247, -5036, -4824, 1867, 3083, -1514, -1068, 1690, -3068, -4777, 3645, 6832, -3167, -7545, 1449, 4473, -1465, -1379, 2184, -2813, -5090, 2697, 6724, -855, -6172, -1816, 3334, 1971, -1407, -432, 649]
3500F49k823j78O762l3q989j061J0417J192r439p16O411j730k531O030M91q631
3516d179k061Q991M109o027m657J373K639J060J266J464m373o181L323J0153l70
3531F530r725j997O561q13j658O056j86j0414j171J0828K642p834k529M634Q74
3546A798k355J090J629k039k954K599M222k516o091J329P347o55m996J090R88
3561D86l578K528P371m074j0058K422Q582k16l504O67j161m236K294P189P54p435
3577a969n223M971O680k084m408J270K103l830J05O097j844p695K707Q514k231
3592C163p265J141L707n76J109K024m466n041K980P041K152n699n457Q31M731
3607C75K499O60m59p011n421P348J0954k959r959m69L120n76K861N420l693q687
$$ y = [649, -2174, -2352, 4410, 4377, -4612, -5673, 4744, 5936, -3503, -4219, 2192, 462, -2069, 3961, 4452, -4179, -6240, 2751, 6860, 833, -3824, -2451, 188, 1248, 2514, 3978, -395, -6576, -3253, 6900, 6530, -3195, -5192, 1369, 556, -1102, 4954, 4768, -5646, -6817, 4011, 6653, -1181, -3710, 924, 1798, -557, 533, 2162, 123, -2831, -232, 3990, 1474, -4617, -3288, 4059, 3404, -1592, -502, 486, -3092, -564, 6807, 2733, -7325, -4903, 3679, 3463, -41, 626, -535, -4771, -2477, 4712, 5466, -1969, -7192, -2221, 4459, 2375, -2033, -763, 1340, -2490, -2385, 3712, 1868, -5827, -3120, 5394, 3163, -4102, -2961, 746, 170, 1279, 3303, -1163, -6204, -3224, 3817, 5969, 270, -5187, -4356, 375, 2874, 3534, 3075, -3936, -9357, -2009, 8945, 5986, -3973, -4442, -1322, -1898, 963, 6383, 2690, -5997]
3623e997K84P353K136k565j878K38L09q82j1K345O72k303l2J363k841k274O030
3640A947M898n446n183J355J052P86N637J609r266o193O253Q162J112m417m992
3655b686k846J972N348N382j008q699n567N990Q902j513n261q01o48j733M747
3670A579M328m240n646L085M349k149j884M54MR49J224r36k403j215K275M622
3686D396P96o657m398L091O072L80j348j555n808j553Q730O517n547p443j12J196
3702c243K645M658P32n870l520J624L536J865j268k234M05M63k014l80L691J382
3718B472k760N03n31m423Q67P768K241o261n095L87K124O357M437m582r838k650
3734h984O064Q748L245o106r280k679N404P555N206l485j1179n090Q401P612o62
$$ y = [-5997, -5713, 1640, 3776, 1211, -667, -429, -120, -1002, -1013, 1332, 2004, -299, -331, 1032, -1809, -4083, 1947, 6845, 1399, -3784, -2429, -1377, -591, 5046, 6655, -2611, -8804, -2551, 5611, 6723, 2306, -2686, -5532, -3560, 1788, 7170, 6162, -2537, -8104, -2114, 6788, 5275, 14, -787, -1435, -3168, 1579, 5907, 1667, -3979, -894, 3455, 1306, -578, -124, -120, 829, 2053, 1117, -1286, -2501, -226, 4396, 5192, -1465, -5863, -2772, 3300, 3680, 2332, 777, -5031, -6584, 2146, 8663, 3116, -4327, -4439, -3243, -598, 4060, 4792, -1078, -4598, -2974, 562, 2427, 1159, -1075, -670, -207, -2221, -2601, 1090, 2472, -288, 215, -316, -4739, -3872, 3896, 6137, -124, -5219, -4832, -2708, 3649, 8086, 3504, -6334, -8984, -2920, 5828, 9073, 2967, -6313, -8992, -3588, 3967, 9173, 5688, -5491, -10581, -2180, 5432, 4770]
3749D770k864l104m024O09P321L017m599l769M97J163R37P41j85Jj32j743j004
3766b368J742J551O84J373k382o150O8P325L847k084l094n111k690N758Q830r40
3782F359p877l856M87L499N198J701m398n520l4M067L885k49m992j969L788J361
3798A450j514k69J202j902O19K422j996l949K596M808o97l297k304j159K667O339
3814E016K042o982o772l78O767P580K64p431n948l69L849O594M519n913j0464
3829g626J74Q513L360j321j568l372l079L303N141j003k910j099l41N67J543N34
3845H16j06M13j371j684o67J315J707L895m94p359m925O072P189M4j578l859o630
3862g222j089R955P775m497q507l112K292N886L939j807n431l727R96O140M335
$$ y = [4770, 1906, -1198, -5222, -4613, 2708, 5725, 1126, -2643, -2146, -983, -46, 695, 510, 511, 379, -1364, -2368, -626, 925, 1609, 2982, 600, -5550, -5482, 1843, 5690, 3606, 512, -4599, -7289, -1531, 7299, 6359, -1518, -5374, -4887, -1388, 3810, 5511, 1113, -4407, -4441, -374, 3511, 3262, -1730, -3699, 89, 1450, -64, -333, 869, -1033, -414, 2008, 12, -3937, -1341, 3467, 2770, -527, -2831, -3990, -1323, 5016, 7058, 76, -6696, -7074, -307, 7273, 7537, 106, -5842, -6211, -2362, 4232, 8751, 2838, -7626, -7452, 1061, 4421, 3100, 1532, -1840, -4919, -1616, 3525, 2522, -388, -1487, -1828, -1261, 282, 816, 710, 1123, -248, -1932, -2599, -1284, 423, 4318, 3824, -3535, -8460, -2388, 4801, 4845, 3267, -592, -7222, -8311, 1644, 9419, 4922, -3585, -6697, -4405, 1481, 5420, 3613, -1818, -5545, -4549, 1591, 5926]
3877E926l832o298P15L340J189Q69P23m169k968M677L210m114j588M299O77l525
3893h69r63M17j37J925L689K80n278n668J294Q641M806n480o101l16N53K329O171
3910E293J155q417n267N952N487j190j927j588k950R28N871R26m832k688J775
3925a472K355K54q25j5O18j340j045J781L74l519J573P579j414r896j380O711
3941C39L040m21L96l074p124J921Q611L843n100n690j183L193M320Q46j707m285
3957b075k658L765P493r44p750j863M194O35j014L772k5p113k67P284J058o432
3973a940o05N174R08l409k045M65P96J336K824J187n285n904K908Q553O32n885
3989b90k102O91j330L513N820l331r002J120P845N10l420q70j044k033K547O055
$$ y = [5926, 2094, -4204, -3489, -149, 1040, 1909, 2632, -1537, -4505, 172, 3382, -732, -2320, 1979, 2656, -869, -1832, -1415, -1552, 373, 4062, 4342, -936, -6604, -5310, 3331, 8137, 2657, -3444, -3760, -3207, -878, 5293, 6448, -1969, -7236, -1284, 4203, 3013, 1086, -502, -3452, -2524, 3347, 4273, -559, -3247, -1472, 883, 1137, 312, 297, 915, -425, -1470, 311, 685, -2834, -1261, 6318, 4904, -4992, -6372, 339, 3379, 2958, 3354, 280, -6844, -4923, 3688, 7531, 2431, -3259, -4442, -1249, 3071, 3917, 2210, -2075, -4733, -968, 6525, 5581, -2169, -4032, 162, 797, -217, 3555, 3530, -3583, -3850, 3434, 4492, -1940, -2545, 2629, 3537, 128, -1917, -1452, -656, 680, 3504, 4691, -594, -6498, -3590, 4963, 5595, -290, -2392, -1701, -3031, 482, 6302, 2971, -6031, -4911, 2934, 3444, 24, -846, -1890, -3923, -1376, 4679]
4005D679l14o216l944L993M779j728l806K003K044l080k74L789j301n571M138
4020h09P285m009q031J843M560N3R71J548m017m732K640O955M85n584l904K833
4036a913M134k2p20j44l627k924O411P458o302q614L156N353j496k46L154l314
4052C44n020L319O312k463n679K6M382J571k200j595k08n86Q38L979J736o405
4068a649n302N877N964l624l276K417j006k687M521L980n983n780M606O125j548
4083B635l729q39K77N75J946K558j070n478j942O542L684n363l629L986J479k413
4099g81K247J702o199l105P834N084n413n599K059K593j78K081N26l703l777K859
4115a770N648Q6o423k617N477K672k531l78N10m519j206P955L591p676m677M921
$$ y = [4679, 4365, -1851, -5795, -1802, 2977, 1249, -2557, -554, 1490, -1590, -1864, 1925, 624, -4947, -809, 6476, 2467, -5564, -3721, 839, 892, 1863, 3411, -606, -5338, -2698, 4257, 4742, -842, -4746, -1913, 2221, 2199, 1479, 1335, -2292, -5216, 1195, 8653, 2351, -6263, -3107, 2246, 750, 504, 3658, 344, -4676, -1357, 4955, 2492, -3187, -3161, 1221, 2792, 592, -1003, -1211, -1797, -959, 3020, 4756, -1649, -6951, -1074, 4890, 1266, -2010, 407, -599, -3286, 1235, 5215, -768, -6548, -1942, 4183, 2635, -1094, -1933, -1656, -1081, 865, 3423, 2353, -3125, -5067, 1475, 5159, -204, -3833, 153, 1632, -781, 1466, 3168, -3031, -6136, 1698, 6782, 1369, -4230, -2171, 422, 244, 2325, 2851, -852, -4629, -1770, 3878, 3964, -2459, -5076, 401, 3073, 542, 164, 674, -3845, -5051, 2904, 6495, -1181, -5858, -937]
4131i37K539j723N28R47l643j250M432K473l187l945N89M802J834l443k088J193
4147h79j524P12N037M74p500j895P654K233m898j268K126j866N39M296K11o441
4163b989j773M786M664j395m385j737K197J068K88K720j948n899Q39P676Q97o650
4179a641j703L926j39j72L201j441o146J20O913K111m208k964P86J410J316M53
4195A822m14j860k408K328N052j601o533mN875K82k642Q10l48l955K184N745m30
4212C903o060j150L639J342l65j233j280p38J596K819P03l544l631J935N155p6
4228C015m363o94J007r96K313M410l640o232K064O537m26l814j026O9j26K615
4244G13K881j797m673j905L827M574n33n029j416K322J098L74K605k432m603J704
$$ y = [-937, 1602, -121, 407, 1354, -2289, -3539, 893, 3366, 179, -3766, -3177, 1625, 3459, 16, -2072, -879, -2403, -1691, 3346, 3820, -3680, -5575, 2079, 4312, -586, -1854, 272, -1594, -1055, 3241, 3452, -2989, -4762, 24, 4688, 3293, -1092, -2829, -632, 436, 724, 3444, 1496, -4403, -3564, 4112, 5009, -1641, -3344, 582, 443, 271, 3472, 2031, -4115, -3995, 2918, 5029, 821, -2143, -1357, 53, 1369, 1822, 1408, -452, -2860, -532, 4520, 2919, -3614, -3618, 2257, 2539, -103, 707, 359, -3596, -1412, 4333, 3903, -2157, -3307, 332, 1674, 1309, 76, -1204, -1942, -346, 2473, 3176, -368, -3999, -2064, 3091, 3015, -1348, -2042, -1035, -2031, 282, 4692, 1052, -5180, -3116, 3421, 2995, -819, -1845, -1776, -1902, 713, 3594, 1797, -2876, -4781, -954, 3620, 3087, -1942, -3358, -1036, 62, 436, 3041, 609, -3994, -2290]
4260b290N648j221m250N32J591m27J192J315k289k727K083L044l91k735j803J276
4276a452L727l58k813O7l15o01L116L583m372n916K289N672Q6j480j246k283j022
4293c318M659L031k637l969q41K434K881N86k410k051K71J237J853J155l363l253
4309c735L108L651j661k554J241n0n75K377J613m472k933L568L618n64k514k744
4325b626O02L199K180n91k152k956j435M199M658k297m916N9J945L40K070J131
4341C410m040k958L417K616j357j167K1j3Q7J029p09j168P81R53P6j95k270j355
4359b842L716L393l134l387j91N36J812L934l57o291l367M312M516J119j826m193
4375b250k945K383N060J574k450l956j988K798M579O9l240j256q70K14L221J831
$$ y = [-2290, 3358, 2137, -2113, -1581, 10, -417, 775, 2090, -199, -2926, -843, 2201, 1810, -925, -2728, -1452, 2275, 1917, -896, -829, -1144, -1745, 1371, 4954, 582, -5334, -3045, 2627, 2713, 1233, -13, -2296, -3318, 1341, 4372, 1735, -2234, -3075, -641, 2240, 2826, 416, -1635, -1364, -127, 1726, 2881, -482, -3735, -627, 3024, 1363, -1191, 50, 0, -575, 1802, 3415, -1057, -3990, -422, 3196, 2632, 118, -2626, -2024, 1175, 3355, 2764, 612, -2344, -3779, 420, 5078, 2781, -2135, -2076, -131, 209, 2279, 3410, -630, -3588, -171, 2445, 1088, -79, -58, -71, 16, 1045, 336, -832, -51, 902, 978, 783, -1487, -2842, 874, 4267, 1133, -2254, -2445, -1909, -97, 3837, 3480, -2811, -6178, -1866, 2650, 3769, 1943, -2250, -5195, -2812, 2248, 3822, 1372, -2584, -4572, -1774, 2805, 2874, -366, -1622, -2492, -2278, 943, 2774]
4391B774l122k642K729J196j681L38Q58n59l96J219j016k158J420K394Q97j079
4407A172l071j644K461L877j57k209j506k509P99N850K295m812l586Q47J852J406
4423A065J918j711l769L56K535J062L80j142j627l29J981m72j259J012J071n93
4439D78K83n47k893J399M594L28m360j608r7Q38L898K930l481n897n55M100L860
4456C270J619l519n260p99L647L971J480j842n422k182M079M297p79j912j413
4471g65k488J127M400N65k727o64L44j639N56K392R27j636m89n59j206R33K172
4488A243J008k26k458m201J145N916J819k796k134j704j625L806M721p89n342
4503a617k454J225L046L057O1m942j763J863J535J353L45k129k170J073J629K78
$$ y = [2774, -348, -2990, -261, 935, -746, -408, 450, -109, -505, 714, -302, -2460, -1040, 1354, 2251, 1172, -1899, -3543, -1082, 2795, 2638, 429, -1077, -3586, -2787, 3063, 5358, 546, -3040, -2193, -341, 1065, 2983, 1272, -2497, -2141, 394, 1456, 1836, 694, -933, -1262, 719, 247, -1012, 0, 1071, 478, 761, 214, -2679, -1280, 3314, 3642, -718, -2326, -2423, -1585, 2313, 5243, 1762, -4135, -4690, -590, 3270, 4889, 1370, -3890, -4689, -1042, 2929, 4409, 2567, -2855, -5037, -958, 3339, 2560, 648, -765, -3253, -2126, 2274, 2839, 112, -552, -208, -1847, -1291, 1101, 2028, 392, -97, -656, -1862, -929, 1243, 2251, 2025, -433, -4634, -3489, 2427, 4246, 1450, -684, -2388, -4013, -207, 4514, 3725, -1617, -4071, -2846, 200, 3257, 3318, -1624, -3387, -1524, 11, 1364, 1709, -420, -2590, -1517, 112, 390]
4519C90L81l02j820O12J658j792j743L148K328k483k599P72L4J124K906O48l893
4536f31l386N28L136M115L94m770l427J247L460J766J036k613m580N63L922J185
4552A945J40j34l365k233L160L395j252k010O13r84j355J856K078Q05o83k452
4568d76k211J100K372Q07J205K42n105l102M112N069J17k570l225k338J436N058
4584B491K614l379l587j018L36M110L614k604m794j737K580L428J233j961l109
4599a783K03Q21K09J827K134l150l516K214K338j564p07K923j53k466r80N77K46
4616h27K047R53j901j966M2K99K436K190j805l332n54J257J792K286j041l991
4632b115j471M280J545j914M12L41k730j051L562J607k022j146L7N29J65p96M44
$$ y = [390, 771, 469, -1351, -739, 919, -873, -2616, 532, 2860, 377, -2222, -1450, -1416, -292, 2614, 3262, -631, -4017, -3489, -353, 3762, 4156, -614, -4041, -2794, 666, 2432, 3468, 855, -3725, -3162, 760, 1945, 2085, 1951, -1414, -3647, -487, 2908, 1656, -354, 259, -725, -2080, -224, 1854, 2659, 1976, -476, -2687, -1587, 785, 1592, 2797, 3039, -2066, -5168, -1056, 4013, 4130, 1560, -1665, -4003, -2567, 2491, 5105, 1726, -1861, -2879, -2543, 1567, 5181, 2577, -2217, -3954, -1374, 2054, 3287, 1326, -1783, -1580, -759, -550, 1277, 3411, 261, -3255, -1041, 1297, -267, -974, 1949, 1796, -670, -1650, -1073, -827, 1220, 2173, 272, -1694, -1652, -1353, 1083, 3273, 1468, -1864, -2418, -1161, 631, 2917, 1876, -2115, -3586, 694, 2239, 325, 737, 1078, -1652, -2703, 859, 2466, 444, -702, -665, -136, 29, -767, -323]
4649c23K048R0l356q93J962P49k14K593r41m266j048L467J662J00j92l101k814
4666d477L019M796j95l485j423o08J246K229J394j318k673j915J344M782J367
4681D083m304k218K186j22j106K726J897l506k060K172N20n12J054R04j366j068
4697g20j91%J148J483k77j322j221l76J810K602j160l485M07J742p29Q84L039
4714C634k609m690J447M693m7k519J7l30j174J083J816P66j406j916r9K098M24
4731A188j928K43J466q60j310J308J92j723J327K334j742k742J651J241j439N57
4747b37J515j470j975J678K130n49j978j226J061K027n7j335J179o90k594J276
4763a245L850j172l378O58K059j707m65K608k07j937N55J134j230o60J104Q56
$$ y = [-323, 1725, 1815, -1541, -2434, -472, 277, 63, 2656, 1715, -2551, -3599, -132, 1530, 1630, 1438, -1663, -4477, -1458, 3338, 3143, -342, -1765, -2373, -1127, 1102, 2496, 1178, -1495, -3410, -2066, 2716, 4083, -221, -2439, -253, -375, -1481, 1245, 3142, -364, -2424, -252, 268, -244, 810, 1714, 348, -720, -911, -911, 237, 1720, 1443, 121, -1100, -1476, 334, 2936, 1776, -1709, -1302, 440, -289, 595, 3634, 1025, -3665, -2218, 2475, 2428, -91, -74, -404, -1578, -495, 1321, 2087, 681, -1235, -1334, 764, 1188, -740, -497, 969, 109, -1201, 107, 299, -1424, -97, 2237, 495, -2247, -596, 645, -794, -237, 1278, -192, -2167, -489, 1641, 1092, -886, -2112, -1051, 976, 919, -416, 763, 73, -2521, -1245, 2605, 1433, -1945, -1287, 772, -935, -1400, 1208, 1001, -936, -381, 753, -477, -1137, -33, 823]
4779H23p11p61k34M46P09m09N13P88j855k148K884K445k462k323K081R91j879
4796a102J483J602k413k378J638K386k56q83j66m75j98K85R41O45r24j590P57
4813f48J922j446r22J719O84k527R93J908j416k414K867J136k434n87K379l97
4829H17j350M61R20r10l63K38R19O84k334q25K599J022j688l17J376j233j756
4846a740K346J979k595j592K367N62j836N61J015j305q51J546P86p36j036q9J117
4863D99J163j563l29J215q29j628J545K219k859j291K805P30k720J77K081r91
4879B24j497J599Q09j622p17J308K25n6m66m34J095o85p40O10J170j383j130K447
4897G57O02k987N09K093j283j232J921O77k782N9K184q2r34j52M26J93m96k94
$$ y = [823, 112, -649, -883, -437, 272, -137, 376, 1164, -691, -2839, 45, 2490, 28, -2295, -214, 777, -1102, 381, 1983, -430, -2808, -1170, 1216, 960, 77, -89, -564, -762, -477, 464, 1109, 185, -1405, -648, 1274, -172, -1094, 625, 1309, -1218, -225, 1683, 267, -2147, 720, 1856, -578, -1165, 1214, 817, -533, -72, 848, -62, -425, -187, 732, 1416, -918, -1743, 856, 1878, 190, -127, 1249, 16, -1740, 606, 2585, -10, -1602, 765, 1327, -509, 52, 1067, -238, -1089, 457, 1243, 507, -529, -618, 499, 1662, 99, -230, 985, 156, -1472, 73, 2292, -567, -1858, 947, 1677, -1043, -866, 1215, 224, -1273, 326, 1135, -487, -1204, 104, 329, 273, -193, -627, 468, -217, -957, -347, 823, -560, -1690, 757, 1359, -1628, -1119, 974, -309, -1541, 380, 1057, -1725, -1666, 518, 436, -498, -650, -224, -31, -527, -821]
4915h21M28O45r45m99J959O86k611k93K256q04j598J560J321k243p92K693K53
4932A195j994K20J184n85m45O00K55p11K7l24J193K31j618n0J732k95j943J380
4950E2J772k216j084K627K70k347L39K315j129j238P69M46j294L49J164R0o58
4967B27k38l15P29K04j002L18Q23j029n85J939L12k381K78K105r61j341J256P45
4985A084k106j38K341K44j318k35K7K13j47K00L5P56j031q80R22J493j418m33
5003c91J928o03k476J477J250j432o29J413M9j590J213P94p44o93K2K42Q8M20
5021C38N3k56j99j266P2K194J81k243R1J422j101n07K319j43k224j51K053n64
5039F9p09N02J03n74J85N85m35K94k35j8L52J70j453J55J643r3j394J259j28j686
$$ y = [-821, -393, 252, -693, -1192, 767, 1453, -1158, -1451, 805, 1, -1597, -37, 1284, -959, -1751, 942, 1195, -799, -579, 605, 20, -425, 175, 430, -281, -254, -578, 615, 846, -772, -822, 910, 615, -1328, 52, 1824, -392, -1476, 1151, 1421, -926, -587, 1728, 599, -639, 130, 576, -718, -369, 795, 885, 227, -11, -326, 403, 607, -395, -77, 746, -283, -868, 1071, 1383, -998, -720, 1385, 424, -917, 339, 1084, -1022, -1160, 1181, 1425, 107, -128, -101, 112, -35, 165, 200, 956, -75, -955, -33, 1460, 42, -391, 1537, 934, -1542, -65, 1185, -247, -876, 537, 586, -1004, 209, 1003, 259, -434, -412, -170, -82, 338, 391, 135, -64, -1330, -1258, 936, 1117, -1126, -1035, 387, -714, -1221, 1098, 955, -1269, -1420, 633, 69, -640, -138, -35, -609, -424, 161, -274, 20, -215, -233, 119, 289, -1164, -1009, 634, 541, -853, 406, 278, -1408]
5059a408R20K329j232k074L36J153l39P60R82p60j692k3J180J051L2j573p26Q15
5077b69M54n72J273R15k108q86J261M47j122J189P79j710j164J806L64m22P94
5094A029o87j497J98J200P21K05m31j847j75J639J115k85J29j775k268J645L321
5111B237m49k061Jo50q46K408K239j707k621K06N38J023J162l48j364m78L35J86
5129a89Q45O81j707n39R54k85n46J837J04j519j96O55o29o34K168O58k133j114
5147a589R21L34Q49N95m52j451p16P57J156J383j179k225M64J912m28m76J207
5164A062j156j418L81J774n99j43Q01q89r09O84K15r5Q35M17j478j122M76J114
5182e0J146N93j713j828L59J127J133R88n62l384j236L432K624j071j091j371
$$ y = [-1408, -488, 1841, 609, -1465, -1129, 24, -315, 445, 1427, 667, -1025, -1048, 132, 1183, 1215, -358, -1084, -269, 185, -387, 886, 1801, -307, -1193, 68, 515, -607, 582, 1361, -349, -1513, 293, 657, 235, 1029, 342, -1155, -957, 243, 964, 1169, 738, -1109, -1284, 355, 1470, 1185, 1314, -461, -2729, -1084, 2237, 1788, -273, -272, -922, -1768, 640, 2879, 1172, -1449, -1243, -705, 318, 1480, 1132, -232, -710, -375, -189, 656, 1337, -370, -909, 45, -240, -786, 1051, 1155, -364, -560, 95, -534, -1168, 1000, 1658, -475, -1589, -668, -334, 515, 1110, 658, -793, -1509, -752, 404, 1787, 608, -1617, -1153, 759, 331, -145, 1062, -94, -1512, -1131, 643, 44, -99, 702, -187, -1096, -412, -197, -292, 543, 960, -518, -1640, -1164, -50, 1096, 1689, -24, -1852, -1493, -366, 767, 1755, 1193, -2191, -3427, 5, 2629, 1558, 467, -904]
5198i04j561R81L261P93j843k031r10O64K738J434j717j796n6k72O81K153k51
5215A364j402k51k87n90J434J962j210k105O49Jn80J368K197r37l174m44J105
5232i00K180R70j288j543r25K32J235K274Q12k946k786J438K383K41m3n89k214
5249a469NJ850N16m98O13r05j278O32J384p12p69Q51M28n65r79M24M53J756o84
5268A053k767Q2J660j99N18J824j393l484J92L473J414j305j481j829j52K827
5284D33J455m40j100j300j247J033K541L58j664q43r40O64J705L10j039J97L86
5301E09j627o76K646J199j874r85N15m45j88J942R22r61k204j488J237L387J095
5318C004k801j791q2L73J757K667j093l562j085J300J647J770P5l085j749K256
$$ y = [-904, -2465, -1484, 1777, 2570, 727, -1304, -2214, -1550, 1188, 2622, 905, -891, -947, -1219, -538, 1615, 1364, -38, -289, -576, -1166, 268, 2230, 1020, -1085, -436, -435, -1015, 353, 2550, 1613, -1561, -2005, -900, 1280, 2250, 962, -581, -1506, -1274, -39, 2235, 3047, 101, -2685, -1247, 1136, 1377, 1334, 745, -1469, -1464, 386, 902, 404, 1017, 112, -1166, -534, 850, 138, -631, 220, 648, 83, -896, -472, -19, 1737, 1053, -1714, -1632, 28, -171, 347, 2171, 778, -2706, -2514, 959, 2373, 1068, -413, -2242, -2394, 433, 1888, 1448, 348, -952, -2199, -1166, 1375, 1733, 69, -774, -1714, -1050, 655, 965, -74, 123, 509, -1118, -1794, 852, 2051, 177, -808, -293, -738, -926, 1016, 1938, 977, -1227, -2715, -1478, 1909, 3004, 203, -1588, -1670, -1297, 460, 3127, 2034, -1528, -2613, -1313, 334, 2104, 2179, -906, -2655, -399]
5334c99J836n45l35lj289r39J824J204o56p40p91O40J041j050q67J697R58j460
5352A26j931J338J155j84O49J29k123j290J432J883N09m07j799j997J883K365
5368A738L30r71j408j065O47J766K41j036P3q15o86J810J175j280k004J548J383
5385A446j809n60J486L84q15k42m39l89J130O05J50o24j040j672J698K620N7j766
5403B20j758o09J117K822P92k535j745L01O07P73K103o43l445m31K380J652j162
5420D39p32l20j34O08J60Q0M56o94j304J170J354j598q68J913O40j648o01K39
5438h40O90N53R21j212j543J0J554Q38L45o76j956p46J721J900p0j371j953K22
5456a613K230J020j571m75L48p13K74J743l69k257j63K058O80j139j09m05J68
$$ y = [-399, 1437, 892, 557, 554, -735, -1674, 150, 1354, 698, -42, -833, -193, 848, -202, -1069, 628, 1586, 126, -1805, -467, 688, 504, 1153, 1282, -841, -2131, -699, 1184, 1693, 1286, -513, -2510, -627, 1738, 2068, 1097, -311, -1376, -729, 1037, 1278, 242, 315, -500, -1186, 624, 1799, 519, -1485, 63, 1446, -363, -923, 563, 947, 132, -110, -549, -938, 192, 797, 947, 323, -717, -2389, -691, 1929, 1986, 220, -1538, -2147, -1030, 1792, 2584, 49, -1696, -1395, -788, -15, 2088, 1445, -2000, -2431, -51, 1601, 439, -293, -613, -747, -139, 21, 101, 557, -137, -1441, -271, 1083, -515, -1383, 530, 1170, -478, -1079, -840, -150, 403, 1324, 112, -1431, -1421, 133, 971, 1316, 640, -1316, -2062, -341, 1559, 1489, 118, -1835, -1613, 617, 1637, 66, -409, -61, -774, -500, 1243, 874, -1383, -1546, 512, 1192, 53, -56, -461, -293]
5473b93J103j18r40k69O03L31P98m77j764n40J906J024j52m04j689j327J709L188
5491B689o29k991j47Q41J55R63M81j453j555N73J687J071m83k591J17J774P70
5508A272j105n84O06j356N46J803o0j806K17J313k3j019K21m71l39J900M56j466
5526A05j366K2J579Q63O0j984q58J062Q25O94M72j201k319J163K650m44j876l12
5544h65K01K03J376O12k020j135P44J091Q22o32r03q12J062J212n55p01k53n35
5562a088J032J707j180k243N17J687n3N4J74j263j198K108J826j329j999K10L18
5579g20R40P63l79j684M23N34P94N83j367j811O15K548j20j388L11m37k13J479
5597H71R34k024j240R01J290m39J29n06j093J257J066K05j183r41l76J365K017
$$ y = [-293, 810, 692, -248, -517, 86, 417, 1215, 738, -1026, -1566, 340, 1364, 1212, 808, -881, -2208, -499, 2689, 2060, -931, -1078, -237, -82, 881, 1362, -91, -1646, -1073, 614, 1685, 1202, -1389, -1272, 502, 1272, 167, -417, 189, -1167, -621, 1182, 1122, -684, -467, 846, 823, -196, 25, -446, -785, 1115, 1571, 105, -1261, -1239, 340, 1203, 1263, -721, -1579, -517, 308, 1002, 1474, 273, -2046, -883, 1767, 1323, -553, -865, -664, -461, 915, 1527, -493, -1628, -884, 207, 1029, 397, -506, -1318, -256, 956, 401, -300, -553, -1088, -56, 1651, 471, -1772, -1255, 432, 379, 433, 607, -656, -1854, 254, 2080, 751, -1248, -1038, -720, 220, 983, 604, -1080, -657, -123, 671, 1254, -113, -1924, -1309, 1239, 1119, -269, 42, -395, -608, 871, 1805, -219, -1459, -558, 732, 293, 422, -84, -1177, 80, 1146, 1351, 168, -773, -1149, 216, 2233]
5614B233j149k092M6J244L88K49K51j791j082J974J600j403j053o9q5J058J397
5631A716r41j436m89Q18J078N85j024j738N84J655K52p62L2j451l5K056Q81k096
5649c15j143R14J243k21J88o35j649P08K081Qj090r97m76J131J638k53j757m32
5667a057O12J56J468O3k218j264K226J635r08q99m57p15R33K287r39k081m31Q95
5685f94J458L14n73j700M4J477N20k5n88j549m5K041J088j581j081M22P9P86Q89
5704A282r17k225Q42J663Q25j203l77j316O86J563L88j119j194n3O06J589J43
5721A183j855o93J135J055m46j15m06j519J429J820l29k090k85J119N62N38n46
5738E57j673m02J466J126M77j127j677n11K250J687j738j305j3L52R39J405j217
$$ y = [2233, 1084, -1008, -962, 282, 670, 919, 1170, -621, -1703, 271, 1871, 468, -585, -654, -739, 319, 1716, 775, -661, -1150, -332, 746, 1331, 307, -1431, -847, 808, 1060, 298, 330, -1121, -1156, 900, 1781, -315, -1458, -544, 699, 478, 666, 31, -1618, -910, 1171, 1179, 89, -908, -1384, -253, 1385, 1132, -625, -1057, -445, -289, 1179, 1242, -976, -2240, -14, 1621, 713, -186, -643, -1358, -425, 1862, 923, -1158, -1589, -694, 764, 1078, 505, -1195, -1151, 326, 846, 821, 233, -1316, -1361, 680, 1768, 187, -894, -472, -393, 393, 1282, 365, -1860, -1018, 645, 1470, 267, -110, -1426, -740, 823, 1211, 92, -1102, -1155, -549, 1040, 1183, -672, -1365, -230, 825, 379, 264, -142, -1661, -232, 1588, 1259, -831, -1116, 3, 565, 1103, 557, -1116, -1518, -52, 1074, 1551, 424, -1253, -1764, 486, 2173, 435, -870, -883, -531, 408, 1813, 596]
5755E96j996J78J616P39k72o12j505J47J891O50j100j173KL69J179P62k073o15
5773a217J154O05j0L21j089j341Q46K226k27j682j180P45Q26J523j00k137r50
5790a687J203R42O32n17j719m85J772J569q47j208j90m42Q99J786q29k160J79
5807a102J405L04n46M4q12l12J586O17j023j411j71J106J842j74k107j053Q99
5824i08J582N36R5j707j790N03L138K6j482q44o59R49J903P64k096j797O89J070
5842b8P61N97j093j647L87J603L79m93l95j257J258J317p44j410K45J255j95m78
5860F2K42r75n23K030P74r88j643n96J127J894O50j559k012M10J305P13M68j057
5878C22j990K72K115Q31o09o65j502Q1J931Q94j664j014K36J502l04J37o51q33
$$ y = [596, -1400, -1222, 394, 1133, 861, 249, -1256, -1109, 782, 1432, 332, -841, -839, -470, 709, 1471, -602, -1217, -63, 542, 532, 853, -236, -1577, -731, 1495, 1268, -414, -1594, -849, -23, 1500, 1400, -737, -1687, -484, 458, 1090, 573, -1146, -1631, 141, 1710, 863, -345, -535, -977, -78, 1708, 879, -1281, -1102, 303, 607, 61, 105, -707, -1019, 567, 1184, 161, -1250, -1421, -315, 1527, 1353, -754, -1807, -908, 674, 1210, 1305, -402, -2192, -1689, 1449, 1475, -7, -851, -1510, -561, 1342, 2106, 10, -1787, -1098, -28, 733, 1330, 237, -1410, -1023, 580, 959, 466, 71, -1186, 72, 1389, 645, -765, -520, 735, 540, 62, 304, -671, -1194, 836, 1610, 622, -1021, -1617, -490, 1404, 2054, 495, -1517, -1107, 198, 911, 1379, 322, -1668, -1396, 719, 1550, 941, 276, -1226, -1145, 786, 1680, 16, -998, -762, 740, 436, 573, -78, -911]
5896i11L4J538J63j134n26j38J634J473j423k210K32J330P40M98n89k068j077
5913b434K291K106k39j458j764q59K236K129m04k462n19L55J001J198K47j686
5929b62r88O21M87K0P02p46j065J412Q48j734l10J233J066j241k80o47k61J130
5947a5J618k91j540j250m96J885K511j028k665j069J235J652J553n90k650j340
5963b480J654J764L81l22j248j890O68K902O02k318r23O18R75M6J31q48l61N11
5981a38K39L94O1q93r35K139P61k033j396J143J457L00j32j387j306Q51J741P37
5999A603n69j192j897N51K635J165j470j793k67Q86J181O50j454r13P66k52L28
6016d2R23m3j670r3J744R8j845J11J204L73j00j262o50O29K125mj077n27j186
$$ y = [-911, -877, 661, 824, -310, -836, -974, 660, 2133, 710, -1500, -1268, 62, 802, 1300, 711, -1357, -2434, -143, 1963, 1724, 266, -1498, -2357, -121, 2008, 1604, -858, -1377, -1022, -21, 1177, 1424, -262, -1250, -629, -142, -122, 580, -166, -1231, 181, 1029, -705, -1015, 218, 1284, 43, -237, -884, -1145, -15, 1603, 1312, -228, -1478, -1974, -89, 2422, 1394, -1271, -2340, -1105, 547, 2100, 1510, -1140, -2480, -826, 938, 1319, 997, -251, -2141, -1473, 1429, 2031, -287, -1210, -592, 383, 429, 560, -288, -649, -138, 101, 495, 556, -337, -1272, 867, 1628, -405, -1801, -658, 799, 1099, 967, -420, -1726, -875, 866, 1603, 1034, -158, -2055, -1504, 1131, 2296, 826, -967, -1234, -348, 833, 1483, 29, -884, -118, -370, -42, 881, 838, -832, -925, 819, 917, -928, -817, 387, 760, 660, -602, -1252, -623, 1502, 1498, 421, -106, -1292]
6035a292l6K281J784j740k577n13J162K115J512k000k806L85J812P11O98j42j829
6052d75j885J740K271k0j624j237J90J389O28j193m59J073m59q07P94L98j131
6069h07M83R35k90j622K03N86R92J215q93k507l2J939J481j135l12q73q27R55
6087e09J967K41j340j726m25J873J731q45k192K48J000M26j90Q18p64j220O17
6104b90J274m09p10k15K93P59N46j793p77J330Q98J04o86j356m17J133J856k20
6122A320p79j092j315N86L076M73k336k105J288J574K62o6p08r45m47J279J037
6139A102o8p60j739O50K048m73q14k91N96j84J02j53n14J3J318j78j181N4l3J54
6159c51R17J228j428k413N63K080Q80n52j435j238P60J418M79K3r90j379n0K423
$$ y = [-1292, -1328, 953, 2737, 997, -1580, -2093, -931, 1184, 2696, 696, -2110, -1725, 87, 798, 1496, 1354, -475, -2360, -620, 1651, 1631, 7, -1230, -1040, 349, 977, -216, -675, 398, -61, -868, -74, 324, -807, -324, 611, 321, -1301, -1098, -512, 480, 1695, 802, -1705, -1737, 202, 1683, 548, 236, -637, -1464, -509, 1458, 1699, 359, -1367, -1792, 81, 1812, 967, -1225, -977, 23, 449, 259, 1077, 313, -907, -290, 984, 575, -135, -350, -57, 702, 1248, -545, -1322, 8, 906, 1010, 324, -1032, -1449, -316, 1540, 1320, 541, -551, -1866, -1280, 1796, 2269, -67, -2172, -884, 690, 952, 886, 178, -767, -1214, 65, 1102, 1034, 274, -1465, -815, 1233, 760, -54, -345, 251, 67, 169, 16, -498, -485, 833, 655, -526, -472, -505, -351, 566, 1794, 366, -2047, -1484, 596, 1476, 924, -511, -1749, -989, 429, 908, 931, -59, -1438, -1488, 935]
6177I35J399k076j668N06Q55L53N48n08j534J43J433K33n02J15j139K48J031J76
6195E48j246l13O88R03K05k77j830k3J981N35q42o46k98j064J389J855k05k497
6213a137k69J026J132M72j017j227l24J267P44q6j79j257m0J199O88q46q45M18
6231b81k64O12O23o96j199R35J516p33r15J45k01j46J777k72j134n00L4J168O53
6250A122J6j971k27J129O79J1k53q42r09J010K117n59j614l34M0K10J257J16j195
6269a97q83R04J277o77J41j146j42J226L50o38n25J11J27M23R20j024j874O01
6287a026J848J4q15M8j175K18J459M99j091r43M50L20P83L72j148q59N67P97K26
6306E44J80j068j260J117J442m55j056L37k04J40P21N78j826k73J209O14l55m82
$$ y = [935, 2334, 258, -1410, -904, -49, 304, 852, 344, -1190, -1047, 386, 619, 117, 232, -907, -659, 372, 548, -698, -1011, -323, 580, 785, 508, -1322, -1345, 636, 1171, 329, -317, -615, -1679, -290, 1565, 1360, -1137, -1406, -380, 752, 1224, 207, -1020, -1344, -77, 667, 581, 402, -855, -895, 304, 992, 146, -699, -281, -545, 67, 690, -6, -1205, -270, 1246, 513, -402, -257, -458, -604, 1173, 901, -233, -733, -699, 469, 1122, 1138, -833, -1060, 69, 748, 759, 506, -336, -1245, -235, 1882, 1323, -291, -625, -585, -375, 882, 998, -197, -1080, -176, 1101, 424, 565, -581, -723, 503, 853, 215, -310, -199, -72, 351, 1271, 247, -1627, -1026, 822, 836, 21, 69, -1106, -888, 571, 1070, -21, -964, -514, -194, 589, 961, -187, -1046, -479, 318, 544, 724, -344, -1604, -487, 955, 500, -556, -219, -423, -283, 438, 1016, -810, -1083, 126, 740, 385, -97]
6324i7m70n46J403O06m43o10m67j49P21J017o96j514M80J303r4k01n5j202lJ545
6344E28P82r56j167J10L26R14P48q97j555N25O48L59J08m98q46K63J525j57r50
6363a90n4k68k0J432L93j833m08Q22N14l1J73o52p79N86J051r9r43k29k7Q52Q80
6384A170n49j429J52J060K07r0L0j079l73J469M98o75p11J36N1L41Q12n77j104
6403f61k4J128K33or19n71K72R99K46m25k49p69j22J722K27j190q24J197J5J27
6423D06Rp05q05Q53P87k9l36l50k17K10O96r7l93n45J78L36P08j26r78o61J366
6444C07O46q79l47k05k17O17R92m06r24j28M33O02N1m35r89N3R04M24j56o44l38
6465f39K40Q10K10j014j49R5L82j19J125m79j773O23J197j5n83k16j47p9P65L80
$$ y = [-97, -567, -1113, 290, 896, 453, -157, -624, -773, -52, 965, 269, -1245, -765, 538, 444, 243, 188, -1014, -1017, 528, 1310, 354, -813, -703, -377, 537, 1285, 388, -1167, -642, 6, 365, 473, -25, -871, -608, 917, 760, -190, -244, -512, -532, 900, 1293, -540, -948, -126, 388, 357, 530, -122, -901, -315, 736, 637, -306, -535, -562, 290, 1170, 621, -808, -656, 404, 611, 521, 551, -528, -901, 568, 1066, 391, -320, -184, -133, 208, 1020, 443, -661, -685, 443, 676, 670, -249, -820, -548, 451, 697, 272, 23, -746, -868, 854, 1081, -109, -933, 264, 279, 406, 415, -290, -1095, -242, 545, 516, 180, -170, -387, -177, 519, 422, 29, -516, -338, -2, 706, 580, -398, -1059, 307, 953, 74, -273, -478, -695, -78, 914, 508, -416, -544, -111, 491, 542, 107, -882, -829, 75, 499, 343, -301, -639, -399, 411, 621, -393, -542, -447, -65, -184, 941, 462, -1311, -688, 509, 494, -89, -305, -452, -531, 234, 614]
6485F14l23l23n38L61O54J58j048o58J252N20m56m5J2p48N41P24l74p33Q4M77
6505A51k37O58K20j456j62P99P37l81k87p35Q7Q52N84j097O8N1k64N94Q98n51
6525E29j313O79O72k76o99K72k91Q9P66K34o60n78K13LJ187j67r80m24P69N55
6545E80j62J72q01p52Q63J235j77j292K2m0j89R68Q29j056j168K87O70L82j71
6564B00m67j69L96L34n07M06J0o36J51P78p8j434R53Q56o71j55J3l39M8P38L99
6585H26j163k92L85K0M97K59q30q53O61Q47K73L08q57j619R43J266l37k79J43
6604A98n36n31R32P79q22p54M39P90m46K77Ko85L15L80l11M2k07N7J52M02k46
6625B27p80M2R67m98K64L12j269l40J563M31p42k89j1q8r2R99J84q20q58N73M07
$$ y = [614, 291, -32, -570, -209, 445, 603, -445, -1103, 149, 669, 213, 168, 180, -568, -27, 697, 323, -410, -326, 151, -86, 572, 792, -664, -826, -27, 710, 329, 42, -693, -606, 246, 830, -267, -199, -148, -412, 182, 1080, 529, -784, -105, 567, 291, -408, -136, -427, -338, 428, 662, 2, -576, -363, -360, 827, 660, -320, -744, 25, 580, 418, 590, -211, -963, -100, 1135, 958, -334, -312, -352, -541, 427, 1256, 200, -968, -681, -11, 371, 200, -267, -436, -40, 294, -213, 193, 203, -433, -282, 496, 418, -1016, -63, 793, 122, -33, -20, -359, -311, 427, 826, -337, -629, -244, -224, 273, 532, -298, -1151, -490, 357, 630, 938, 81, -1538, -595, 671, 334, 55, 198, -338, -869, 63, 842, 20, -734, -295, 495, 49, 326, 328, -357, -42, 338, 27, 69, -138, -81, 71, 473, 227, -553, -511, 456, -42, 222, 534, -735, -1075, 488, 919, 177, -112, -123, -211, -303, 696, 880, 60, -798, -225, 182]
6646A82N47k20q10R2P17p54j96P40j06n90qR29n74N0L78J59n01k13r3j42R82L75
6668I44p28q72J0N84K95O23k21r92k80j62Q10J159j65j974l77J383R60r60N5M26
6688E18r61m32J053R18r89m78l04L01O16l7m47K10J83m14k54P96J86k05J01m63
6708a02n94K79P15k47M2M40n38j242Q57J541o04q53m32M60J19L73N1j4l71o20
6728g40J00J382M46j092j119J051K13q89O31O16n59k74k01J06K19P57l70q35M54
6747a04O9n52k2J249M13j151q23P57J73P24j67o29M2j38l28L17J593p48j563k44
6767a132J381L30J4l36J3q19L69M31N05j24o05q73L43J039J45l40l42J38j49n2
6787f4Q2L3N67j48j182j16J305K36q88N1O07p16m21J056L16k91p61l69M52P36
$$ y = [182, 729, 509, -301, -209, 508, -246, -442, 298, 192, -398, -406, 523, -51, -1, 377, 536, 35, -178, -271, -413, 569, 944, 216, -656, -646, -62, 233, 856, 635, -357, -637, -799, 11, 1170, 1005, -969, -1346, 37, 997, 37, 92, 518, -443, -875, 178, 1096, 107, -371, -675, -374, 242, 205, -242, -32, 151, -263, -517, 279, 465, 260, 361, -102, -696, -417, 298, 51, 93, 533, -5, -1247, -390, 1151, 547, -306, -738, -278, -159, 214, 265, 251, -120, -740, -640, 742, 1188, 96, -1023, 28, 241, -648, -17, 599, 40, -234, -435, -329, -110, 647, 277, -558, -104, -35, -587, -609, 640, 1053, -98, -921, -164, 9, 733, 566, -63, -21, -159, -487, -170, 1423, 675, -888, -1132, 249, 579, 593, 257, 270, -549, -180, 251, 756, 632, 27, -846, -503, 536, 681, 341, -1, 137, -12, -64, 18, 51, 618, 470, -712, -828, 477, 713, -175, -124, 483, -233, -654, 402, 718, 427, -334, -703, -251, 485]
6807D85K80n29j38j02o45K33O37Q93j129o09M79L0L43K27n26k35L42l87o8L66
6827e3Q18o47p08K85K96R8n02M46L7J38q43J1R29M98p44q03Q90K35r91L38P64
6848D92k49j076L27L73O43J87n57o28k9N62PQ0K04o30k88K77K94M07P8n54q58
6869i38O58O85p93J55Q25l82r37m9J384l09k34j3N9n59M95L2J57J3m27n59M55
6890b82O15r2k31j15j48l19N65Q50n80j81j51m91K29J250J04j205l99N99j57n7
6910a96P02l3o03L29o12J64N85j73m38L12P16p37j29N09K95r29j16L90j55K22
6930A03M24l30o14M47J72N5KR6n75j15J71nK19N56p14m37L80j18J77K7N59p26
6952b46n50P25L07k91k1K16n00K4K09J0J66Q3l7n41M07l06L60p9K77n45j37O24
$$ y = [485, 765, 236, 98, -4, -649, -416, 221, 1114, -15, -624, -145, -115, 228, 455, -71, -306, 36, -351, -419, -53, 765, 118, -590, -305, -9, 89, -413, 33, 70, 208, -635, -624, 305, 803, 59, -744, 146, 381, -610, -272, 492, 243, -833, -506, -133, 510, 697, 140, -488, -517, 45, 52, 132, 336, -294, -582, -305, -11, 396, 474, -80, -938, -280, 405, -388, -233, 592, 210, -727, -776, 608, 299, 65, 52, 111, -448, 47, 79, 236, 249, -178, -737, -282, 333, 241, 10, -105, -253, -572, -7, 843, 263, 82, -69, -560, -331, 919, 1023, -182, -581, 18, -139, -196, 506, 473, -130, 199, -413, -249, 336, 163, -275, 37, 753, 16, -113, 396, 691, -238, -354, 36, -119, 103, 527, 197, -417, 30, 202, 257, 259, 355, -220, -335, -164, -169, 50, 606, -108, -545, -165, -283, -106, -79, 480, -246, -796, -71, 236, -55, -76, 140, -360, -336, -127, -117, 49, 132, 95, -446, -39, -345, 15, -64, 213, -332, -469, 155]
6974A55K30n66K29k43l71K44N66O8n43M7o8k93K90N78L6n14k47n9K60L20J97j57
6996A59k03k16J79K73Q3m51k91O33J51p94K49L69m48j39N65K52o84M53J81m95
7016a74j21M84l75K95K20j62n96M66l1j99N53J34o41j06K40j70J11M79k8n68k0
7037b09N04k37l9J86k0l29K53K32j68j45K1N8J84J20l01m73L11L92m36J08N88
7058F00o90k32N98K39j029K24O57m07j97N19k0o42K09L85l7j24l02k77N02K38
7078B14l50k8P3qp3L25j16n25L49K55Lk76J41p6k61R7J99N17o85N6j25J28L40
7101A74n43J1N86j24k70M53k53k00Q3O68n49k13L02R8k27k91P55k85q14N60l0
7122a09j51J58k90K90m1M71l96K05k31l40L60N37l51p26L26L31j84J19K06k12
$$ y = [155, 385, -181, 48, -195, -566, -322, 244, 312, -231, -184, -252, -545, -255, 323, 359, -155, -402, -461, -201, 119, 316, 159, -44, -260, -81, 192, 275, -176, -467, 166, 317, -477, -228, 141, -307, -446, 119, 371, -313, 140, 321, -174, -295, 189, -186, 109, 329, 167, -429, 37, 6, -193, 360, 494, -147, -253, -13, -183, -72, 407, 379, -189, -209, 295, 58, 19, 205, 185, -144, 109, 341, 173, 28, 49, 107, 291, 411, 110, -363, -52, 340, -96, 12, 600, -90, -322, 276, 515, -514, -290, 367, -40, -237, 282, 262, -380, -171, 214, 177, 53, -249, -526, -24, 214, -136, -164, -91, -99, -172, 153, 37, -488, -139, 116, 119, -157, -16, -92, -353, -256, -57, 460, -225, -169, -294, -166, 174, -369, -358, 228, 104, -166, 287, 34, -166, -83, 585, 36, -177, 125, 223, -4, -295, 460, 175, -639, -79, -109, -260, -102, -392, -102, -143, 328, -68, 137, -94, -434, -74, 463, 112, -614, -288, 43, -141, -22, 184, -28]
7142b8n50R45K02n56m27L32J8J14K51j58n05K2j0L39N82n73j48j96Q00l99j63
7163a08L18j30n34P11M43r23n60J071j50j24l2J48l51j1N99l44N9k03j57N69J48
7184D39m42n91P76Q2m50M0O63p47l54O68L87m27k75K96j46k52N74L9l13l60M36
7205D3m5k2k7k8l02O36L2q9J98p56L4O84L90q54m32N38Q0n13L93L21m09m37P75
7228B10k0k07m85L91K88n8j74N5m77J93J82L74J74q06k22Q89K3j71k12O6n72J46
7250d13Q78p5o40k11M50K6l56L53l90J42k5J14N09j07l47l77Q39K27p63o4L79
7271A49j84L5L98n8j061J30R14J21m98r8j6J27J80R6Rm47j43N54M77l12n18k66
7293d11M92j18J46K63m3r53k5J302k85p98J42N51n08J48M61k94k58K8O47n4l09
$$ y = [-28, -578, 367, 569, 13, -414, -82, -64, 50, 301, 143, -362, -340, -350, -11, 571, -2, -150, -346, 454, 55, -108, 210, 80, -454, 257, 700, -223, -783, 288, 138, 14, -18, 130, -221, -232, 367, 23, 82, -121, -278, 291, 439, -3, -594, 182, 264, -186, -146, 517, -230, -584, 84, 471, 44, -231, 65, -81, -333, 241, 280, -33, -393, 43, -2, -24, -51, -79, -381, 255, 287, 198, 396, -360, -326, 358, 748, -106, -538, 0, 80, -433, -40, 281, -128, -565, 210, 190, -17, -502, -111, 177, 119, -55, 0, -477, -284, -102, 272, 446, -360, -582, 307, 330, 159, -53, 13, -559, -413, 465, 390, -250, -461, -11, 15, -341, 12, -378, -236, -261, -147, 362, 255, -92, -469, 370, 597, -166, -230, 149, -35, 0, 398, 340, -721, -591, 323, 444, -54, -152, -168, -41, 139, 235, 244, -203, -346, 208, 685, 373, -145, -411, 81, -37, 109, 372, 329, -624, -649, 653, 368, -430, -288, 263, -245, -97, 364, 70, -188, -160, 487, 433, 124]
7314A24l54p2O17O1l11m10L58j70J10P38n89p42M24O46j8k81l40j00j82O31R23
7335A063r56o49K5N21K60K54k45m96j91L45J8P18m20r79J85R49m04m22L15J26
7355A7kk25J055r69j85J66K85j78J77o48O6K77O41n19l42K27l12M57Q77m96r17
7376e48J99Q6L73J35M65j195k14N70O10m12m56L56m0j20J25O13m60k80j69L80
7396A8J76k2r72Q06M59j30n31j71L26J23P4J22o15n8J92P28j55K03m86j000M71
7417d42J016L98q89o69n7P45L26j21j41mm28k15P18P41r35n49L58O70k40k89K41
7438B34r5r3o6J29r2l5J16o4j3K04o77K37N77L26m08n43j53M19R71l17q48j80
7460c71L26k51M72L72j1r50l57Q73O17o03o63R6L00M30n75J31J16N1j97n6N43
$$ y = [124, -230, -302, 315, 376, 65, -345, 13, -157, -47, 691, 102, -640, -216, 430, 412, 131, -209, -309, -491, 140, 1063, 107, -542, -517, 4, 264, 518, 273, -223, -414, -69, -51, 667, 247, -732, -547, 402, -2, -424, -109, 17, 15, -210, 845, -124, -309, -143, 142, -36, 141, -507, -441, -164, 477, -42, -384, -157, -469, -12, 865, 369, -548, -349, -263, 110, 245, 710, -485, -699, -129, 481, 69, -387, -31, -71, -191, -66, 547, 87, -193, -362, 18, 194, 172, -800, 6, 465, 335, -196, -367, -41, 82, 156, 278, -337, -395, -203, 525, 370, 573, 87, -913, -442, 574, 972, 83, -586, -643, 102, 428, 307, 166, 162, -266, -481, 237, 978, 43, -506, -148, 522, 282, -7, 234, 139, 46, -20, 109, 17, -18, 98, 34, 21, 225, -452, -215, 362, 688, 280, -263, -416, 3, 974, 657, -191, -371, -45, -296, 176, 548, 537, -413, -770, 103, 720, 117, -546, -450, -150, 280, -295, -164, -48, 3, -194, -250, 293]
7481B93o4n63K35Q73l59q50J01o6O40N54p24q32K65O82J11J29k7p47m92K93J053
7502E05L93q31j275O78P17O23m22o77K55r9n51J094K43o57l88K03L87j19Q4k74
7522a11j26O95m64l40j1N79J65j45l00n87O7M19K76L01N3j063j49Q85J059m95
7542G08j460q1P23L54N9L1j85p65o2O33O62j92o25n73O91N17m77k27K89k9l1M08
7564C68j33m26L28J74K58o00N0j40j72Q19L84q26o41J92N69J84j10n01n05N67
7584a61L84J60M10o94j201P55O66J22l33l77j37K64J45O09p63k98L72OJ66J43
7604B38l1m45K17J9M0k29k50K22M74N5n09m62M42N30m2n2l12m72l75J105O59o51
7626A71o92k45N26O67K78m17q33k2O57L03J70n05o23M56L85j1k41JR7l34J68P67
$$ y = [293, 229, -334, -99, 774, 415, -435, -334, -400, 240, 794, 70, -762, -497, 185, 296, 425, 398, -349, -841, -548, 505, 898, 67, -1208, -530, 187, 810, 388, -289, -34, -133, -684, 410, 653, -4, -392, -189, 198, 79, 163, -111, -237, 458, -6, -346, -357, 222, 387, 242, -58, -645, -578, -159, 117, 418, 471, -592, -741, 144, 1203, 708, -752, -833, -110, 244, 303, 334, 149, -616, -678, -45, 617, 425, -200, -773, -82, 435, -42, -269, 20, -9, -40, 368, 235, -191, 137, 311, 569, -31, 19, -121, -293, 526, 910, 84, -557, -365, 204, 388, 278, -223, -728, -161, 223, 383, 793, 99, -1102, -347, 319, 441, 108, -269, -406, -142, 3, 612, -151, -449, -77, -71, 95, 238, 207, -238, -21, -2, 38, -191, -441, -219, 255, 310, -199, -661, -219, 311, 269, 217, -95, -567, -942, 163, 822, 171, -521, -766, -240, 427, 705, 288, -545, -567, 90, 393, 563, 58, -565, -109, 276, 265, 24, 25, 122, -212, -44, 723]
7648G23p37n31L45N68k38k38M29p43O93L21n42j90j96J7N09N68n70o03O9N47j91
7669A0L74O9o88n98R26L96q0l33o23R2N33O27k07m60p70O81K13j60K16m92O8N17
7691C11r8k74J99m89J15N56L99r01m26O53N5O2Q5q5r10L06J177r4m96n89q6M49
7713h1O17J3o10l37L11j7R32k32r38n42J042O5R3p4l79j19j87R79q6m61m00L13
7735i8K81J79k51o91J18N56K96l08k00j85j30J081J10p31o08O86l81M89N21n54
7755A80j081M43Q19J40m05m04l28K43P26J80l80l11m56M67O56r9p06l75N61pJ36
7776aK35l87n10J26J224J07j514M97L46j68q8L84m18l27M26M29J76p76j44J7L32
7797c4N21k54m01j35K92j68R82n21j103K21P06J05q4Q9o22k98Q98M05n17m73p9
$$ y = [723, -14, -545, -200, 368, 130, -108, 321, -422, 271, 592, 50, -140, -336, -319, 190, 758, 188, -415, -346, 201, 10, 384, 453, -235, -833, 93, 489, 409, 76, -547, -455, 78, 705, 498, 38, -732, -51, 162, 2, 218, -274, -206, 311, 213, -61, 138, -351, -236, 320, 719, -182, -608, 45, 100, 162, 247, 162, -748, -442, 735, 641, 145, -444, -530, -81, 536, 549, -61, -398, -87, -104, 828, 596, -342, -884, 158, 223, 316, 242, -137, -256, -443, 536, 450, -11, -411, -98, 183, 362, 111, -580, -462, 94, 390, 82, -118, -303, -433, 648, 758, 27, -581, 105, -276, 213, 734, 180, -901, -458, 361, 501, 96, -308, -636, -393, 333, 513, 133, -178, -634, -167, 489, 390, -316, -691, -130, -137, -1, 234, -153, -663, -537, 687, 794, -720, -223, 123, -45, -133, 251, -167, -494, -68, 361, 537, -239, -383, -366, -34, 487, 233, -168, -303, -11, -179, 803, 282, -821, -600, 106, 211, 127, 216, -406, -704, 194, 599, 82, -391, -470]
7818d70M26O18k65l89l98K34M26L39m9o02p25N07Q74O1q42l50N01o4M11L92m06
7839B29o25K39O07j3l45m58P6M63P2M7l75m58J75N26M98p18n99L66M16l2M9J30
7861B70o18m84P42O76l39q03L3J79M83L35m16n84j09P17O9K22o45l28J06P70l0
7882B46m34K55l43J52K83M52r38m83O02M91J6j34j20q33N08M44M04o77m24K96
7902b37M06L41m93l87L65J04n8J73j59l55m10P42M18Q6q15L2J31J32L60Qp86p5
7924d77O51L16K05o47l82J5N63j54K72k54l92l86J112J41o81l58K42K40j22L84
7944B88l24m60L37Q22q3m92k45J5l2N42j67k25l99N45l23N77L5q03k65M45M16
7965B04j49J96k80k86R5O19p8n44n07O12O55k36n83N6l14Q03J5M8m09o17M24P51
$$ y = [-470, -44, 574, 309, -80, -478, -244, 182, 521, 472, -130, -855, -348, 526, 587, -255, -605, -104, -168, 243, 635, 229, -396, -157, 450, 437, 92, -366, -290, 173, 245, 292, -83, -541, -366, 160, 658, -60, -659, -293, 123, 91, 140, 270, -348, -832, -90, 586, 247, -556, -523, -344, 139, 474, 58, -526, -635, 82, 151, 373, -272, -600, -494, 276, 246, -188, 67, -276, -124, 159, 611, -327, -810, -208, 283, 299, 165, 45, -788, -280, 164, 568, -109, -533, -237, 169, 510, 17, -370, -5, 99, 41, 214, 55, -300, -710, 32, 450, 536, -279, -247, -116, 16, 376, 384, -402, -477, 174, 490, 695, 48, -334, -319, 244, 90, 362, 108, -284, -670, 442, 583, -98, -456, -214, 26, -96, 288, -36, -496, -159, 663, 580, 88, -157, -142, -174, 368, 201, -24, -423, 122, -201, 376, 411, -392, -657, -212, 204, 55, 251, -29, -315, -220, 399, 321, -223, -730, -118, 537, 301, -282, -226, -540, 263, 278, 326, -83, -700, -276, 475]
7987D75k0j61p55L34M9J37M27l90p42L54O55J32p51p1J4L4K46P55n55p87J45Q13
8009C38q2K52n55n32N87N5J17Q7k05o21N18O85l19q81K07K76K63m6K5l71l73O14
8031C9J71pl14p3L66j91L89n76j0q1l7L68P54o19p14J07P12N4m29P8k07m03P18
8054I5O68l19o93j55N04K46J00l24l05J5K92m8M42n43l60K01O24m46l77L14l2
8075a01J9N25O0q35m46Q78P28q86j17j04M1J64N66P2p69m64N17N01k4k62l50p3
8097c60M93M7k4K91p57n6K27O49m60k99m39M72M87M20n10l84L9M10K3l55n8J97
8119E3k10N22L4n28l6k38J44Q77Q2j062n18Q65K76Qk7m64l69J95O04L97m97n54
8141d46PM38O09m79k66q6Q4K12Q5k4m02o9N67j62R3Q7K90r39J03O36k55m37J3
$$ y = [475, 455, 294, -461, -127, -78, 59, 486, 96, -646, -292, 363, 495, -256, -327, -313, -279, -33, 722, 167, -620, -475, 338, 256, 508, -47, -579, 8, 63, 180, 267, 62, -559, -41, 644, 325, -556, -349, -73, 190, 144, 169, -202, -575, 39, 210, 203, -111, -184, 182, -9, 380, -196, -206, -287, -324, 44, 798, 179, -535, -428, 284, 338, -91, -13, -220, -623, 95, 763, 444, -249, -404, 100, 346, 446, 122, -183, -168, 124, 76, 518, -25, -385, -184, 440, -6, -383, -69, -101, -82, 443, 503, -332, -778, 100, 828, -58, -175, -279, -238, -74, 492, 564, -205, -669, -152, 349, 325, 63, -287, -360, 133, 180, 156, 447, -310, -366, -139, 510, 50, -249, -688, -216, 271, 691, 181, -203, -164, 246, 269, -86, -144, 53, -157, 365, 399, -129, -165, -403, -259, 618, 700, -362, -880, -15, 261, 269, 242, -222, -591, -396, 208, 605, 108, -446, -439, -1, 608, 129, -137, -223, -139, 73, 158, 134, -268, -337, 230, 68, 161, 248, 538, -401, -298, 338, 83, -354, -341]
8164c41P68j4n73j82n5L62N66k78l13j96q9q5R31J25p42m19O25L7P3k06K09n26
8186c23K6N10K04j95m05
$$ y = [-341, 427, 413, -160, -342, -397, -35, 531, 253, -60, -256, -345, -430, 501, 626, -116, -535, 90, 127, 200, -6, 203, -323, -297, 213, 417, 222, -183]
8191a83
$$ Imaginary data points
##PAGE= N=2
##DATA TABLE= (X++(I..I)), XYDATA
0@%%%Qj6QqJ7k5L2l4M2n6O9q4J03j20J43j72K02k36K76l19L66m21M80n47O19o99
29c72P93q94R99j118J258j403J555j728J922k133K358k610K896l207L545l929
45b068M364m852N406o044O794p681Q747j0063J1735j3937J6977k1461K8747m2528
59b5864P7330l16982o56994P71858O32480l61738m31937K72935J52337l40620
69b27195j03987M60494K19729l59157l22266J57667K35147j1982j08061m0254
79i9865l2105L4797R4360j2644o0870J27893O5905k87777j56934M14799L01692
90C89251l96118l56012L27559K63135l70525k02000M93595L04336m75387m14135
100d36301L22268L92559j60408k12822J80213P7939l05668q9199L52919J34976
$$ y = [0, 0, 0, 0, 8, -8, 0, -8, 9, -16, 16, -18, 24, -32, 37, -47, 56, -64, 79, -93, 109, -127, 149, -170, 196, -225, 255, -292, 327, -372, 421, -473, 526, -592, 666, -737, 818, -910, 1012, -1121, 1237, -1373, 1523, -1684, 1861, -2068, 2296, -2556, 2850, -3194, 3600, -4081, 4666, -5397, 6338, -7599, 9378, -12083, 16664, -25864, 51466, -265516, -922510, -150652, 481828, 120090, -311847, -38912, 113425, -227195, -331182, 129312, 349041, -10116, -332382, -174715, 60432, 48450, -59611, -99865, -131970, -97173, -2813, -15457, -76327, 51566, 117471, -170306, -327240, 87559, 389251, -6867, -362879, -35320, 227815, -142710, -344710, 148885, 453221, -22166, -436301, -114033, 278526, 118118, -94704, 85509, 163448, -142220, -231419, 121500, 256476]
110B56476k99137j22153K17109P0613j25313J1094M7479r7225P362J75277j9059
121A22523k03219J4425J64708n9728j37000J27316J47573j77247j66850K24523
131E7024K02795k69556k68705K67955L23529j94041k66849J45728J03934k41211
141a39397p291M04329Q1317m38098k02692K93985K03965j12152n8526O6907o6555
152B5792j26363P0706J57256j6221j07410J101K9612m0091L6617J15907o1005
163H5901j76230O0958J87494q1421j60831J55975J60056k44565k26138K42931
173D130K74002j46103k05068Q4244N8506j66124j4820K87203J29341k76663k56484
184b27836J12924K14940J5432n0826j407q8951j12392R9782J76650m2445j37070
$$ y = [256476, -42661, -164814, 52295, 122908, -2405, 8689, 56168, -41057, -33695, 141582, 122523, -80696, -66271, 98437, 38709, -98291, 29025, 176598, -649, -167499, 57024, 259819, -9737, -278442, -10487, 313042, 119001, -147848, -2120, 101814, -139397, -146688, 257641, 338958, -99140, -301832, -7847, 196118, 83966, 25440, 92347, 25792, -100571, -29865, 127391, 111170, 3760, 4861, 34473, -5618, 30999, 146906, 85901, -90329, -29371, 158123, 76702, -84129, 71846, 231902, -12663, -238801, 4130, 278132, 132029, -73039, 11205, 69711, -96413, -111233, 175970, 305311, 28648, -227836, -114912, 100028, 115460, 64634, 63227, -25724, -138116, -38334, 138316, 95871, -41199]
195d1199J846K3817l6100P7854J16275j22042k03475Q0702K18743k1428j58051
206f3058J9972R8805p4910j11878J02783J53399p8465j50609O6641J10919j09193
217c5594j06979J52410J42543j19111j32615M7378L9371l2635O4594R0751q1411
228B8702j32464L2807J06837J0755l9705n883j2887l3293L0357Q3699p191j14721
240e2987l2513J12053N6030p8765k9237N5447l2237o9592P3982R3198p8955q7032
252g0608Q0162O7889q6824o7956O6154O4041j8875k2223k51l4437m4963L9982
264b7909J05799K0481j08405p7722M5913O1484J0152J3045j2251q0207k1333J01732
276C0779N2899p9682n4419L4701J6276m433M0879J3631p2430m8263N7119P1350
$$ y = [-41199, -39353, -15536, -51636, 26218, 142493, 20451, -183024, -102322, 116421, 94993, -63058, -43086, 55719, -19191, -131069, -28286, 125113, 46648, -103961, -37320, 73599, -35594, -142573, 9837, 152380, 33269, -99346, -51968, -12597, -45232, 19362, 110113, 28702, -103762, -70955, 35882, 46637, 6932, 1049, -11838, -45131, -14774, 68925, 61734, -52987, -85500, 26553, 82583, 3818, -25419, 30028, -2209, -71801, 2181, 95379, 16424, -70608, 9554, 77443, -9381, -77337, -11183, 52858, 33983, 11760, 11509, -22928, -67891, -27909, 77890, 98371, -10034, -87756, -41843, 19641, 29793, 42838, 30587, -49620, -70953, 30779, 83678, 3996, -50423, -15722, 554, -3879, 37000, 50631, -21799, -70062, -12943, 58407]
288E8407j5112o2281j0002M1324P408l7041K389L6546q875j9928L3978N918p0785
301c8054k2378P7157M7371l4630l7891k0985j3222L8583O3797q771o8584l2242
313d9849K8086M2825J8653k2865l9002r818K0384L1748K6464k1341o8645j5401
325e8761O9136L9372l6093k7919L547n988Q498L2094n985l8152J330K9062M336
338A4477j4144j5535j1646J9102L9376Q52l9074k8308K255L1183M2023n710n8959
351b4108k3879L8709L0876R89n539k8808l3861K6977N7751K1m7742k8835O691
364c0758L4424L8712j0137n0815j7724K4703K2123J1426l307l2806k0018L3185
376i92L1467j4090k3932r796K6K5948K7766k4748m3521N809L4172J5322p20j8522
$$ y = [58407, 43295, -18986, -28988, 12336, 19744, -17297, -14908, 21638, 12763, -7165, 26813, 32731, -38054, -60432, 16725, 64096, 29466, -8425, -29410, -42632, -4049, 59748, 50977, -17607, -49849, -21763, 21062, 39715, 16850, -22152, -31970, -11586, 20162, 46626, 25285, -43360, -58761, 10375, 49747, 13654, -14265, -10718, -16706, -8208, 23886, 17901, -20251, -18921, 10141, 14477, 333, -15202, -26848, -7746, 31630, 32482, -6592, -34900, -32645, -1462, 40561, 34851, -24108, -47987, -9278, 21598, 22587, 17048, -11760, -45621, -18644, 39107, 39128, -8614, -37449, -30758, 3666, 42378, 32241, -18574, -36298, -11595, 10528, 21954, 18647, -14159, -34177, -992, 30475, 16385, -7547, -17343, -17317, 8631, 36397, 11649, -31872, -26063, 8109, 23431, 22711, 4189]
390D189l1662L833M0635J3554k3727j8583q669N857L5675J9701l8277l7175J6736
403a7913L1673J1958n455k8468k6233K1922L8602L99k1609j4068j2242J0580L8543
416B7689N653m4900k3044K5244K6900Q733j0092l2258j5458L0808K8862r434k0795
429b092j5656o827K5463L4876j5066m1044m445K1687J5249J1346j1258l8482p193
442c3442M2397K2272k0835k0060p333J533K2994J9495j9401k9099j875J7737K2168
455A6551R502k7873l1736J8029L5526k512j8283q984j3238N249L8281J0536m0862
468i814k1509K1982J8375M624N35k1637k5591J5973L8240Q017k5792k9703j678
481b7978L4752K7477j9861k8682j292K611Q929L3310N465n1330k3003M4976K9890
$$ y = [4189, -27473, -23640, 16995, 30549, 6822, -11761, -20430, -14573, 21102, 40803, 2526, -34649, -17913, 13760, 25718, 20263, -8205, -34438, -12516, 26086, 26485, 4876, -9192, -21434, -10854, 27689, 33342, -11558, -34602, -9358, 17542, 26275, 16183, -16075, -31533, -725, 28137, 18703, -2092, -17748, -24575, 888, 35764, 20698, -20346, -24791, -3104, 12145, 23491, 12233, -26249, -33442, 8955, 31227, 10392, -9668, -17001, -15468, 7526, 27021, 7620, -21479, -23354, -5617, 16551, 26053, -1820, -33556, -15527, 19999, 17487, -796, -9780, -23018, -17769, 20512, 31048, -9814, -31323, -9341, 9034, 13658, 14193, -7444, -33035, -17062, 21178, 29195, 3403, -26300, -27978, 6774, 34251, 14390, -14292, -15584, -12973, -4044, 29266, 34731, -16599, -39602, 5374, 35264]
494C5264k0091j5401k793j0770R321L1744J754l2060j4646J8112K5090J270k3854
507B940j4739J3224J1911j406Q563l144l2892j96N1018R023n1082j5740L2810
520A0290Q055q017J3627o031l7221K93M6774J9824l2073l2611L432K4100J2137
533B2579m424k413q249k1300P788M4069N39n2221o483M5562M361k9170P066J0290
547A7994k3617N282M3562m518n1533q084L9396J9869j4368j6337n858j930P763
560G621K7380J7629l8221n3309K3436O9674P9m9767m489J0078k5650J2883O7566
573F4910r16q2469k5391N5240K7239k1560o686Q822j3985j9334J3607K8727l368
586B4836l0537k702K3065p795k3805J9009K4887k3811j9997K1371l810k5540L2109
$$ y = [35264, 15173, -228, -3021, -13791, -4470, 27274, 29028, -3032, -17678, 434, 25524, 26794, 2940, -11799, 1425, 13336, 11930, 20493, 17349, -15543, -15739, 35279, 44302, -6780, -22520, 10290, 18345, 10328, 23955, 17924, -19297, -19004, 27770, 47594, 15521, -17090, -13658, 10442, 22579, 18155, 15742, 7493, -13807, -6019, 38050, 38589, -13632, -20115, 25447, 29808, 638, 7704, 17994, -5623, -341, 43221, 38703, -12830, -20914, 18482, 38351, 23983, 7646, 1788, -142, 7621, 35001, 52630, 14409, -38900, -15464, 54210, 54289, 4522, 33, 10111, -15539, -2656, 64910, 63994, -18475, -43866, 11374, 38613, 17053, 10367, 19189, 5204, -14130, -523, 28204, 24836, -5701, -8403, 14662, 6867, -16938, 2071, 26958, 3147, -16850, 4521, 711, -24829, 7280]
599G280M0803n0910o3831L7988O4682j1083l1943O928p376m1038P402P6937L4621
612G0460p4459p6277L5421P4081l653l3171J4311j026m8430N319O8863P617n8024
625a8968j3755L0998O472j10J2986j7061k8349J9458L5342j6636l2906J7373L4727
638B9571j8225m0475J6059M5873j5729m3523L2482M7242o1338p1959P0965R7499
650H8442m7282q8619K2618M5076k9508j3659N5148J9485o1878m4271L4645M8659
662B8856l926k8374l949Q870p739l970J1751l08m512J4575o127l8931J2824O3061
676D2101j0275p1964Q539N9533k4953m5160O0999O0632q1100r9003N4513J19697
688G3559K509q5240k4245L0719j5856k3416P0514P5681o7564j17224J4081R7230
$$ y = [7280, 48083, -2827, -66658, -28670, 36012, 24929, -7014, -86, -7462, -48500, -41098, 35839, 70460, -3999, -80276, -44855, 29226, 25573, -7598, 6713, 5687, -42743, -37424, 31439, 39056, -18968, -32723, -1725, 4747, 4637, 17623, 562, -27787, -8329, 27013, 10377, -22529, -5156, 29571, 11346, -29129, -13070, 32803, 17074, -26449, 6033, 53275, -8063, -80022, -9057, 88442, 41160, -47459, -24841, 20235, -9273, -22932, 32216, 51701, -10177, -54448, -19803, 28856, 24930, -3444, -7393, 1477, -6262, -10232, 1519, 1211, -3301, 11274, 5147, -33784, -20960, 42101, 31826, -40138, -31599, 27934, 2981, -42179, 18820, 79452, -1648, -100651, -46138, 73559, 76068, -9172, -33417, -2698, -18554, -41970, 28544, 104225, 36661, -80563, -66482, 30748]
700C0748K7048l0533j7375k1110j9591K6866L6387p240j3676N48k6838k2378M8978
713A1834N7998m0225q1559J0624P3164J340n7337J7577P0494l8996j14105K0986
725f8205J33859J2323j07642j3261O6568k9408o8075N9466J00013l4677j09180
736e8219k0279O5454M0763j2417j8477l943q658j1593J0113K5414Q444j3839k5407
749b2644j9707K5565N7910p206p8067p479Q0714M058p9483J8421R7546k7301j17421
762g5094Q607J11482J2904p6190K670O5241k9629r5764J9917J27101L0816j04953
774b892n9367M8255L0130j4654K3811L3305m0150n7963P659M2141K9390J0242
786D9907l4826n8691J1146P6301J5441o2647k0174L9481k003m4677K3484P9712
$$ y = [30748, 57796, 27263, 9888, -11222, -30813, -3947, 32440, 25200, 11524, 12072, -14766, -37144, 11834, 69832, 29607, -51952, -41328, 31836, 33176, -24161, -6584, 63910, 24914, -89191, -68205, 65654, 77977, -29665, -42926, 23642, -5766, -73841, -14375, 85638, 50961, -58219, -78498, -13044, 27719, 15302, -3175, -7118, -15776, -27369, -17256, 8158, 16602, 2763, -22644, -42351, -16786, 41124, 33918, -44149, -51628, 29086, 33144, -46339, -27918, 69628, 42327, -75094, -66487, 44995, 57899, -18291, -15621, 49620, 19991, -75773, -55856, 71245, 102061, -2892, -62259, -14004, 16126, 1472, 25283, 58588, 18438, -39525, -31866, 10275, 39665, 49907, 15081, -43610, -32464, 43837, 59278, -3369, -23543, 15938, 13935, -30742, -7258, 72454]
798G2454j1230j10658k9227J02272M8784p2856k3884P1065j2100j06121N072J22941
810E6512L3443q5234m2322K9182N768j3875K7090L8150j5519n2244k2775L0005
822a1819M0941J1993k1977l5288j3517L3861L6518k1529l4405J9924J5985m2205
834b1518j799P9310J4123r7283l7740P9147L5546n4855q228N9080m545p9243j8580
847e6585P1961M3973l7323l1549J6842o743m2251J5979P1623J2739n9005l3714
859c4053Q398R965K6248L2489k4727n4081K305L7170K554l616J9344j4373n5413
872d7790j655P1179L6873n2523n6132J7236L4992r342l26M6160P53q3582l7490
885h1647P2975N5465k9106k2736J2334k4154l6392L1170O0142L822m0376k8627
$$ y = [72454, 61224, -49434, -78661, 23611, 72395, -461, -24345, 46720, 34620, -71501, -66429, 56512, 89955, 4721, -37601, -8419, -2651, -16526, 10564, 48714, 33195, -19049, -41824, -11819, 29122, 41115, 19138, -16150, -29667, 4194, 40712, 19183, -15222, 4702, 20687, -21518, -23317, 55993, 70116, -27167, -64907, 14240, 49786, -5069, -13297, 45783, 41238, -38005, -56585, 15376, 59349, 22026, -9523, 7319, 576, -41675, -25696, 45927, 58666, -339, -34053, -25655, -15690, 10558, 43047, 18320, -35761, -33456, 3714, 6268, 2652, 21996, 7623, -47790, -49445, 21734, 58607, 6084, -50048, -32812, 2180, -7162, -7488, 38672, 39425, -44157, -81647, -8672, 46793, 17687, -5049, 7285, -16869, -53261, -22091, 38051, 41873, 1497, -27130]
897b7130n216J2855K9067K2664j2092l6507j7286K2480K8312J023p462q242k9196
910b6730j4426M9989N1477l6125o2167P870L1831m236P110L3988j3606n9487j3602
923d8114M6683L1718j1990j6737r19n595j4962L516K8617R617k2598r653J3456
936C039o201j4523J8518J9012j9222j3576J5676n18j7064J2418K0454j7366k0899
949b0252J4580J9568o424j1739J78M14p654o65J9462J7895j7227l0305L843K0426
963B100k166n44K0846m140l6823r174K6544J2910o34P258o840k7529q464K1013
977e643J8885L790r124j6953r881O745J6612J4168k553k6826j7562J9645K4115
990A5418k579p493n528k0351p002L4531K9035j8447l0858j0280L022J4783K5496
$$ y = [-27130, -32346, -19491, 9576, 32240, 20148, -16359, -33645, -11165, 17147, 18170, 10708, 2466, -26730, -41156, 8833, 60310, 24185, -37982, -30112, 1719, -2517, 4593, 38581, 24975, -34512, -48114, -1431, 30287, 18297, 1560, 641, -4954, -19916, -16400, 12217, 21834, -764, -10417, 3039, -3162, -17685, 833, 19845, 623, -12953, 2723, 2205, -14859, -2441, 18013, 647, -20252, -5672, 13896, 7472, -4267, -4089, -3675, -11329, -11994, 7468, 25363, 8136, -22169, -18326, 2100, -66, -610, 20236, 16096, -20727, -29901, -3357, 9553, 8919, 16177, 9337, -18192, -26656, -5643, 13242, 17032, 7908, -9045, -18926, -12181, 4431, 18599, 16046, -10780, -28342, -8697, 15418, 12839, 5346, -182, -20533, -27535, 6996, 36031, 17584, -13274, -23554, -20532, -5749, 19747]
1003A9747P446k1309k3112o924J1746K3615J2126j3715j8078o215P35J1433J8548
1016A6043k102j9361l733O956j441N172J2364q721k0688L352J7429L811j717j356
1030F008j0729q428O758J1315P140Q5j3590j5866O519J6466K575J15J141j3121
1044c612j2409J0625J3828l321k819R70o710k262R049J524o502K012J699m868
1058b796L426N362q066m270Q668K103m547K626M68o732J454M777m291o05P300
1073D877k743n184O788Q11j2304M93J2748M77n702R85l446n852O080Q098r33j130
1089D063k762r549M19J1473J668o257K272J24o412L349O968n757l198N666k160
1104i3n774P826L970j0010j096R370k137o049N130K701n750k275O86O20N258L031
$$ y = [19747, 27193, 5884, -17228, -24152, -12406, 11209, 23335, 9620, -8458, -14673, -13938, -2505, 16043, 13941, -5420, -9153, -2197, -3638, 1534, 13898, 5177, -15511, -12159, 5270, 9081, 7364, 6008, -4721, -13149, -6391, 4924, 12064, 12149, -1441, -17307, -10788, 5678, 8253, 8368, 9509, -3612, -16021, -5396, 8432, 5111, 2292, 3262, -3448, -5710, 3339, 4863, -1639, 373, 2072, -2796, 630, 5992, -2074, -6344, 2324, 4427, -120, 2506, 2974, -3758, -2304, 2473, -1818, -2423, 4877, 2134, -3050, 3738, 4549, -7755, -7262, 5486, 5963, 261, 1246, -2200, -8052, -1972, 6126, 5193, 4063, 1301, -8248, -7829, 3644, 5312, -945, 1327, 1451, -4961, -1612, 5356, -401, -3599, 2067, -93, -5867, 1959, 5929, -4081, -5177, 4193, 2056, -3993, 1137, 3838, -1912, -4187, -3501, -2881, 2377, 5408]
1120E408n541k565K353n277n13J3101J171j4121q88Q672m358q11J1496k817j4652
1135i342K826J1707l737n721L878M41l560K592M475J08m138o466J774J0817Q0
1150E734j1897L119J0124q492o421J4922L465j7911J283J7792o394j5774Q975
1163a475J1699q722m835R380J353r880k552R911N847q865r890R031J1513j0430
1177B085q456J4368L236j9966L782K3271q658k5244J1941K0325j2320j1481J5170
1190H053K755j8103j21J9180P1j7960l071J5363M781j3549k955J3896j647j7755
1204a1062P603K2551j4691k5813J8685K4467k0655j6524K3136O556k6334K895
1216i186K7810q463k7764Q339K6217n931k0601N739J5527r109j4525J5872J7228
$$ y = [5408, -133, -2698, -345, -5622, -6135, 6966, 8137, -5984, -6872, 1800, -2558, -3369, 8127, 5310, -9342, -6516, 5191, 1454, -4267, -389, 52, -3508, -916, 3559, 3667, -471, -6937, -5163, 5654, 5734, -6163, -3044, 7080, -1412, -7833, 7089, 10554, -7357, -6074, 11718, 5324, -10450, -1475, 10224, 1502, -3333, 6047, 7400, -2480, -5032, 4879, 10726, 1861, -8029, 1002, 12515, 2085, -6371, 7997, 11233, -8733, -4951, 18320, 9662, -15582, -3641, 16684, 4364, -7117, 8053, 10808, -7295, -7416, 11764, 11835, -6125, -9196, 6167, 10948, -2601, -5556, 8340, 6693, -11062, -3459, 19092, 4401, -21412, -2727, 21740, 1085, -15439, 7697, 14253, -12081, -9186, 18624, 10161, -17603, -9264, 16953, 11022, -9579, -3840, 11687, 2578, -11947, 3925, 21153]
1229B1153k2916k2176K7859K3402k9091j7194L1400O969l5205M648L6586j3869
1241A1566l6787J9426L3411k0392k7984K0258K0749k0317j4857K0848J0311k6925
1253a0693r508L2738J0878l6922j1249L7175M974l5645P069L2968k3614l4181
1265c6010L4398L4542l8024k9738L5916J9356l5144q128L6264p58l9472K588M1565
1278A7355j461m1627K842M1318o415m1158J2099L8527j9890l3007L1452K6555
1290B6590m2490k0346M9948J7233m6673r233L6946o221k9670K4259L2891l3625
1302c91l9719L1623M2856k3188l5200K2709K1432l5349j3923N5130J6119o6298
1314b4199k1066O5147J6397n6554L28N0301k0115n2342L0409N1560k9061m3196
$$ y = [21153, -1763, -23939, 3920, 27322, -1769, -18963, 12437, 19406, -15799, -11151, 25435, 11566, -25221, -5795, 27616, 7224, -20760, -502, 20247, -70, -14927, 5921, 16232, -10693, -20201, 12537, 23415, -13507, -24756, 12419, 17393, -18252, -11183, 21785, -1829, -36010, -1612, 32930, -5094, -34832, 1084, 20440, -14704, -22832, 13432, 12674, -26798, -24210, 17355, 15894, -25733, -22891, 18427, 12012, -29146, -17047, 21480, 1590, -31417, 35, 26590, -15900, -36246, 13702, 30935, -15738, -24971, 11975, 5754, -23916, 343, 33234, -391, -40110, -8487, 34369, 11181, -24019, -1310, 20122, -15227, -29150, 25980, 42099, -24199, -45265, 19882, 36279, -20275, -19947, 30354, 10239, -42103, -11694, 39866, 10805, -32391]
1326c2391K7501K9268l2059k0868L6293J9056l7364j6842L3242N682l3393J0309
1338a1566M4258k2945n5860K5579N5218k7644m0864L8107K2996n6845j4492P4881
1350C0823J8043p6293k3013O2468J7203m8015p2M6059j3218n4764J6480O1717
1362C7418j1360n7452J1071M6144k0946l5237L3500K6537m0502j3345M4848k187
1374A8489n0993J5221N4897k1327n0120K3728L6967l3441k5520N0498K6978o4767
1386a9390l9976O4549M8796n4357m2801M7213K1728n5426l354P4726j284q3799
1398d3375o819P0651M975m5653J3099K8841l4079k7423L9767K8211l0290j5550
1410a7645K3729n699l3169J5876M9324j1302n1815R034M1195k3105l2542N1111
$$ y = [-32391, -4890, 24378, -7681, -28549, 7744, 26800, -10564, -27406, 5836, 11518, -21875, -11566, 32692, 9747, -46113, -20534, 34684, 7040, -33824, 4283, 27279, -29566, -44058, 30823, 48866, -27427, -50440, 12028, 29231, -18784, -18856, 27203, 13985, -40779, -24299, 37418, 26058, -31394, -20323, 25821, 4875, -30362, 3138, 29675, -10827, -24172, 20676, 18489, -32504, -17283, 37614, 16287, -33833, -10105, 26862, -6579, -32099, 18399, 45377, -19390, -59366, 5183, 53979, -378, -43179, 4034, 25762, -29664, -33018, 41708, 40424, -43375, -50194, 20457, 25432, -20221, -7122, 21719, -12360, -39783, -16, 28195, -2095, -17645, 6084, 385, -32784, -16908, 32416, 21114, -30701, -21667, 19528, -3577, -36119, 14992]
1422A4992M0594p2004n7027O9672O2434n1300m0237M2937P464n6957J0131P9492
1434E0191J910q1906k4939N6746K8684k3748l309J5664k6577l1523L3565M6364
1446D1122k1805l6929J4078J0110k4741J3557M4044k2147n3136K4190M7425l2816
1458B952l9347M5010L8042n1840m1455M9116M0660m3037l2501M4799K3145n7914
1470b2370k5834O7534L7106o1050l9540M3253K1010l1434O135L5329k1408m3819
1482c5088J7610L4917q304j0400J3337j0062k7023J4255L4248j1761l1718J5695
1494d294L0889k6669l8821L1888N1669k7024n2886K3260L9091l4034k5300N5642
1506B3411K7718o8485m2126N7118M7383k6917k7289O389q256j6556K6490M2287
$$ y = [14992, 55586, -16418, -73445, -3773, 58661, 7361, -32876, 10061, 17525, -39432, -29301, 50191, 52101, -29805, -54744, 2002, 30686, 6938, 3629, 19293, -7284, -38807, -5242, 41122, 19317, -17612, -3534, 6576, -18165, -4608, 39436, 17289, -35847, -11657, 35768, 2952, -36395, 8615, 46657, -5183, -46638, 2478, 43138, 101, -32400, 12399, 35544, -22370, -48204, 19330, 56436, -4614, -44154, -901, 20109, -11325, -5190, 30139, 8731, -35088, -17478, 17439, 9135, -1265, 12072, 2010, -25013, -10758, 23490, 11729, -19989, -4294, 26595, -74, -38895, -7007, 44662, 17638, -35248, -11988, 27103, -6931, -32231, 23411, 51129, -17356, -59482, -2364, 45019, 18102, -9187, -2798, -11054, -27610, -1120, 41167]
1518D1167j0192m9556j8720K4957K3204Q184P173j7764m3276l328N1921K2864
1530C6634l4033j4209J8866j5201k5390L6394M2697l4168m8760J9350L4501j4905
1542A776j5800K7095J4023l8311k9019L1198L8842j1813k6682L622J575k0344
1554b3838J0638M5601L050m8144k0171K0738J2987Q757J7406j1824m2722n457
1566c2979L9705J9035j5893j1104l93j0539m107K2946K0513j8243l1855Q763L1351
1579A7200m907k6131J0364K2520j7494k1562J9830J6403k0865n370K6071l87l1784
1592a6112n727K5876J4270p132j0942r491p711O655K2626J4482j6656k9237l881
1605b2980K0475J1699K095K476j4861k5083Q835L5014L430k5312m086R733r548
$$ y = [41167, 30975, -18581, -37301, -12344, 10860, 19044, 26217, 8453, -34823, -38151, 13770, 36634, 2601, -11608, 7258, -7943, -33333, 3061, 45758, 11590, -37170, -17820, 16681, 1776, -14024, 13071, 27094, -11217, -40236, -9038, 29804, 17991, -8691, -5069, -3494, -23838, -13200, 32401, 35451, -12693, -32864, -12126, 861, 9618, 27024, 15200, -27522, -32979, 6726, 25761, 9868, -1236, -1629, -12168, -16275, 6671, 27184, 8941, -22914, -14151, 17200, 12293, -13838, -3474, 19046, 1552, -20010, -180, 16223, -4642, -10012, 16059, 15672, -16112, -21839, 4037, 18307, 11175, 233, -9258, -16969, -10314, 12312, 26794, 10138, -19099, -22980, -2505, 9194, 11289, 13765, -1096, -26179, -17344, 17670, 21100, -4212, -8298, 1435, -8113]
1618h113n118K0176J0778j6522j3754N751P036k433J795J0159K615j9743j8364
1631b5737J3841K6710L411j2148r234j3397q178K4098L0630q279l2282j4552O032
1644a9085J6143K4629N941k7950k8089N619K6312J6159l599j7471j5287M83J2380
1657c815J5800P103j4853k2696L482K0913K558r309L161K163j1468k647J1701
1670B093K651m071M232R17j1258o781N992J1586Q977l444j6813j0224P323J3920
1684E100J0020j93j8040j8893R104K3159O301q512r235j1363j132J8027J4473
1697A8816j0994j5864j347M988O584O786k988r000n87L668n6M04k64j922M239
1712B463N384q545j1598O649J2710K702l332p219j3427j61J9793J3444r310j5428
$$ y = [-8113, -13231, 6945, 17723, 1201, -12553, -6802, 234, -2199, -404, 9755, 12370, -7373, -25737, -11896, 14814, 18225, 6077, -3157, -16554, -24732, -634, 29996, 21717, -10565, -25117, -19085, -2942, 21687, 27628, -322, -28411, -22792, 3520, 19679, 16080, -1391, -16678, -16195, -3815, 11985, 19088, 4235, -18461, -14979, 5934, 8492, -817, 2344, 4507, -6961, -9608, 2093, 4744, 673, 4905, 5822, -5436, -12217, -6225, 5361, 14338, 10894, -5919, -16143, -8820, 5100, 15120, 14927, -3113, -22006, -12902, 10257, 16558, 8046, -1189, -12552, -13684, 4343, 18816, 7822, -8042, -9389, -4401, 2183, 8969, 5981, -3019, -3606, 62, 6, 410, 146, -1776, 2463, 7847, -698, -12296, -5647, 7063, 9765, 6433, -786, -14213, -14374, 5419, 18863, 9553, -5875]
1726e875r807K467J8855J5317j0121k1815o324R088J3683J0778o272j8840o438
1739a5304J0373J0466M963k950j4549p844J2557J1130o243n821K895k35j306K984
1753A116j199n882M419O890k425n397l939j547Q675J1876n151j6184m453P981
1767e220R070P952l790j7859p219J4421J3223r94o218j0724q350J0004J7829j195
1781A0930j3755o515K364O487Q340j272j1519l422P103M558m5k978o733O73J2020
1796F236L423j1818o504M217M065N232M712r876j4583O709J7609K981q921q870
1810e388n842M881J5041N421j1405j2594k241J0531J4792N40j6043r103O096O700
1824A386M258M396q245j4140N560J7839o98j3308k179M437J372L493J465p286
$$ y = [-5875, -15682, -13215, 5640, 20957, 10836, -10979, -17303, -8215, 5468, 16246, 9974, -8866, -15304, -4931, 5535, 10498, 7548, -7001, -14845, -2288, 8842, 2599, -3222, -327, -562, -1868, 1116, -83, -5965, -1546, 5344, 2919, -2478, -6417, -7964, 711, 12587, 7436, -8748, -13201, -5220, 3850, 11802, 8012, -9847, -17066, -2645, 10578, 9584, 3366, -7358, -15708, -5704, 12125, 10930, -2825, -9340, -6976, -489, 7851, 6579, -4940, -8362, -1259, 3299, 3254, 276, -6457, -5784, 6236, 9659, -2159, -8663, -4446, -381, 4851, 9563, -313, -14896, -8187, 9422, 12403, 3482, -5388, -11230, -6349, 8692, 14113, 2708, -9886, -12127, -1596, 13196, 13736, -2307, -11410, -5314, 1386, 5644, 10040, 1795, -12345, -6785, 11054, 10356, -2952, -5131, -694, 678, 4171, 5636, -1650]
1838a650n468N662Q213K025o941j0030J621J2568L781q521n407m69J10R458J0458
1853A5410j1797j8419N848J6678Q44n369k614p669l348J2804J2305p480j5433
1866h240l244J0067J1074k393j1070l766L788L191O494M578j2785j4420J0875
1879e851J8937n389j3209M49J247j784R777Q789j3382j4715Q333J6080l44j0855
1893a917o654K827N945L851J349j124j1235o591J5044J5173j2884j7339P523J0948
1907D916l722Q35M900j0988r722J4839J4836j0926j6239J959J0914M855j355k811
1921B291n569n123L438J4148M943j8894j2726J5537J4769q591p512M068n087n597
1935i905J5977J1448j8936j7128J2550J6159k984o796j830k980k160Q558R754
$$ y = [-1650, -7118, -1456, 6757, 8782, 1841, -8189, -6568, 6000, 9781, 1260, -4147, -4616, -4506, 4952, 15410, 3613, -14806, -8958, 7720, 8564, 3195, 581, -7088, -10436, 2368, 14673, 7193, -8240, -11484, -1417, 9657, 7264, -3806, -7572, -3784, -593, 5901, 10479, -2306, -16726, -5851, 13086, 7697, -5512, -5063, -3816, -5600, 4177, 12966, -416, -15131, -6798, 9282, 8938, -1917, -8571, -5744, 201, 4052, 5401, 4277, -6958, -13549, 1495, 16668, 3784, -13555, -6032, 4916, 1194, 2029, 6929, -4059, -13781, 1058, 15894, 4968, -11271, -9312, 1602, 6457, 5102, 2291, -3278, -8401, -4963, 9185, 14128, -4766, -17492, -1955, 12814, 4223, -3289, 779, -4308, -9905, 6072, 17520, -1416, -18544, -5994, 10165, 7181, 385, -1445, -4425, -6585, 1973, 11727]
1948A1727n086j7496k736J9095R287j4155q964Q371N91n081J1654O643k0543j2196
1962a8889K1770J5059j5712j1352Q391L136m250O568N773j1673j2520R539J9050
1975A4890k515j9941m618J5536M946p825L504K735j6563n254K5359J1211k4947
1988c482j4032J6996R663q103Q58L700j1694o994J5178J4125j1551j7500L250
2001i586J5809J813r165l16J175q228J163J9320J042k6766m809K6149O536j8480
2015d343j769Q456q699m588J9586Q474k3729j5313J8093J9063o871j4728L47M536
2029a485l697K836J4234k419k4023j835K5548N484j9426k189J1220p333n761J6576
2043G730M194k1659m028K3166M664k0481n521J5373M537j0339n87R048o858j3383
$$ y = [11727, 6641, -10855, -13591, 5504, 14791, 636, -8328, 43, 634, -4447, 7207, 13850, -6693, -18889, 2881, 17940, 2228, -9124, -733, 2403, -1847, 4721, 10494, -1179, -13699, -4160, 14890, 12375, -7566, -12184, 3352, 8298, 473, 3977, 6712, -9851, -15105, 10254, 21465, -3482, -17514, -518, 9145, 1042, 1900, 5600, -6094, -13088, 2090, 16215, 4664, -12836, -9586, 6223, 8036, -1129, -1445, -270, -8498, -7335, 11985, 13027, -13739, -18548, 7601, 14137, -4343, -6112, 2344, -6355, -10943, 8643, 17117, -6612, -21925, -3832, 15231, 8360, -6368, -6021, -1485, -5182, -2346, 11888, 9469, -14554, -16389, 9159, 14643, -4783, -6972, 4248, -3085, -8846, 7730, 11924, -9735, -13763, 9403, 14067, -6414, -11935, 3438, 7975, -2364, -2951, 6097, -761, -14144]
2057a4144J2505K4148j1413l2059L828K9442J383j6805L006K487j6152K865K8359
2070A7450L895k8643j1873J5374J0393n41J080l755j4142l341J8526J4348j4366
2083D405j8183Q804J4140q852p843J4323K716k1069J513K7633m553l1251M729
2096a3488L0798k582k5279N6J6088k208o618Q968N144j6061j1682J6174J9837
2109A9147r157k0059L06Q713K44O213J0352j3772k1771J1419K3753q368j5292
2122h272J0397N342j7786k27K2976K57k4321o28K3995J337k6151m899K5796J0092
2136A7908k0908r725J4625O12j3454J1656K1027j7872l0856J0371L0473K096j3680
2149B273n700q408n475J8112K1823r507k5807o296J1801R944N868M958q697k1986
$$ y = [-14144, -1639, 22509, 11096, -20963, -17135, 12307, 13690, -3115, -109, 2378, -13774, -10909, 17450, 21345, -7298, -19171, -3797, 6596, 6055, 7135, 3380, -10762, -14103, 4423, 18771, 4405, -13778, -4974, 9166, 314, -7529, 6794, 9510, -11559, -10046, 17587, 13034, -18217, -13488, 17310, 14728, -10551, -10495, 5593, 3385, -3233, 5735, 10879, -5182, -16864, -690, 19147, 9990, -10069, -9763, -1050, -806, 5407, 15759, 1987, -19784, -8365, 15388, 7020, -8272, 2125, 7467, -10319, -10546, 12430, 12687, -11634, -12262, 11733, 13070, -13081, -17980, 7816, 17908, -3000, -12725, 1900, 2512, -10942, 714, 21741, 3869, -26987, -16616, 13857, 15953, 2273, -3427, -11835, -17310, 802, 22625, 13118, -12689, -18985, -7184, 2760, 8628, 13586, 4889, -17097]
2163a7097n680K7011J9567j9476k1349J3941J1341j6790k181K5239P32k8136j760
2176a4638K2854p78j8095O666J7543p577j9529R89J7971O775p186n987l794p223
2190a2009L204K0532Q832k0094j6496O964Q427L171J2319J846k8256j6270K6210
2203a620K3831j4423j6152P791L302j0855L226J7027r41k0147m157J9565O995
2216A3442j8592p622J9088P799j6503o653J0543l83n192J1333N948j8926j2280
2229a7998J5917J5269k167o257q174j2341K387K3138J4677j5736k3750k179J5776
2242a438R889l64J258m608j9515n905K5586J7829j8034j6264R672M978j0337L873
2256c380J5396l318j5526j885P684J214P31N855J133j0665j1351M559J6315P230
$$ y = [-17097, -22777, 4234, 23801, 4325, -17024, -3083, 8258, -8532, -10713, 14526, 15258, -12878, -14638, 8216, 7438, -10657, -3991, 13552, 5975, -13554, -12565, 5406, 12181, 4995, -992, -4786, -12009, -8805, 11727, 20559, 465, -16031, -9067, -640, 2531, 14850, 16696, -11560, -27830, -1620, 22211, 7788, -8364, -573, 2729, -8126, -4900, 12127, 11186, -8961, -13118, 6447, 13442, -5150, -12772, 6316, 14115, -2388, -9041, 1502, 1119, -4073, 7260, 13208, -5718, -17998, -2081, 13188, 11021, 4764, -3410, -15751, -13364, 9774, 24451, 8715, -15035, -17214, -1438, 8451, 8087, 9345, 4737, -14778, -20683, 4903, 22732, 4698, -11566, -1894, 3084, -7253, -3380, 12016, 8698, -6828, -8713, -1029, 185, 916, 6771, 7904, -2761, -14112, -9553, 6762, 13992]
2270A3992o863j0367r590m589J5853K5435k942l0047j2819J1552J0711Q085J0297
2283A8708r588k8006o391K5691K0004p374j7094o632K800M896O586O061l568j4340
2297h247m916J4374Q855q872n394N300r08o663L935O066k990j98N185n652j1178
2312a1303M626J3078L569m888p941o599j331R924J3399K606j3751j7474J747J8007
2326C669Q148o025m589l625q156L470J6438L135j3986n012N702J310j903L051
2340A627K024k541k408n66j50J573L269K626o16p491r626N546J5821M701q533
2355E256q777q828j382J7406J8815p804k3347r959P450J3733J3674P41j7121j7082
2369a7225K789J6298J3115k159j4554j0885M207R937O265J422n879j1973j125
$$ y = [13992, 7129, -3238, -12828, -17417, -1564, 23871, 20929, -9118, -21937, -10385, 326, 8411, 18708, 9120, -18886, -25277, 414, 20418, 13044, -4050, -10682, -7882, -2986, 3600, 9661, 6093, -8247, -13163, 1211, 10066, 1194, -4200, 1100, 192, -6471, -2536, 3530, 540, 342, 5527, -125, -11303, -6677, 6401, 9970, 5082, -2859, -9458, -10789, -865, 12534, 15140, 1389, -16085, -14338, 3669, 11817, 5792, 1203, -2422, -10578, -7108, 9330, 12465, -1521, -6533, -831, 479, -1424, 1627, 3651, 1110, -1298, -1864, -2014, -441, 2828, 5454, 4838, -2653, -12279, -6733, 9088, 13789, 5256, -3521, -12349, -13731, 3675, 22490, 14686, -8661, -18620, -11170, 2563, 16237, 16978, -143, -17225, -14436, 1862, 14977, 12818, -1736, -12621, -8414, 1523, 7788, 9210, 3331, -8642, -9767]
2382i767J1690M829m386j008j106n779m19P479L664j634Ol479q052o29Q605Q623
2398H637J532p283j2082l725J0115J0697L741m922j3016r485Q493J6598J688q907
2412B081o345l852J867J0767O227r114r859J791O423L506Q44l786m897R57L589
2427A99J203K52j648k637K937L197n038n954N447Q908j037l897n056p119J942
2442h301J4306P383q396j1360l886K855J0375R482m363j3476n746N036R524N524
2456H957m240q778j953M577L150K900Q11p722n874O998O928m125k153L282j376
2471A382n163J952L359n46J819K230m605p168J87P275P443J646q435r434o06O230
2487b434Q077O319n767j5785k592J4173Q143n709l412k614o247K778J3385J770
$$ y = [-9767, 1923, 6752, 2366, 1358, 252, -5527, -5946, 1533, 5197, 3563, 3569, 90, -7962, -8591, 14, 8637, 10169, 2886, -9196, -12921, -2806, 7891, 11632, 6710, -6306, -15791, -7298, 9300, 10988, 2081, -4264, -8116, -6249, 4518, 10745, 1631, -8228, -6437, -14, 3492, 4336, 550, -4347, -3390, 199, 1402, 1654, 6, -2631, 306, 3503, -1535, -7489, -2042, 6866, 5829, 1932, -3124, -10243, -8301, 6005, 13388, 4992, -6368, -10254, -7399, 2976, 12458, 8095, -5381, -11127, -6091, 3433, 8957, 4717, -4061, -6014, -1437, 1713, 4613, 5424, -2298, -8172, -1174, 5754, 1629, -524, 2758, 1382, -3781, -1829, 1530, 984, 2803, 5033, 428, -6740, -6553, 722, 8165, 9811, 1376, -8058, -8664, -2434, 5643, 11962, 6195, -9590, -12182, 1991, 10134, 4425, 1013, -1601, -7848, -5070, 8315, 10085]
2501A0085j2708o748N647P314J806k177m432k797k05K666N099P84o477j684O474
2516B647m98p316K195O632k286k998M423l665r702N769J4618j620j2174k745L814
2531b906J108K196L862j443q152l688P857R927n024j1525J274Q059q04j944N201
2546C998l215j1913M651J4958k317j2385J838O853m398l193O591J021p228N13
2560d226Q138R66r747m994R506P886o136o280M110p26o379P222J2160q713j5553
2575a2766P390J3195o308p269O628P64q367L842J1944l850j3807K37J2269L626
2589G528q478k815M951q96n805O458R044r219j1227J0864J1513j2133r382J1256
2603A659M196r146K878J0877q844j3649R359J5007n705j2276K552P017l591l356
$$ y = [10085, -2623, -9371, -3724, 3590, 5396, 3219, -1213, -4010, -4215, -1549, 3550, 4334, -2143, -3827, 2647, 2149, -5167, -2972, 3660, 1374, -1624, 2799, -866, -10568, -4799, 9819, 8199, -3975, -6720, -2906, -1798, 398, 4260, 2817, -5335, -9023, -1166, 8761, 3737, -7788, -6514, 1545, 741, -1203, 3998, 783, -11130, -6479, 8479, 6162, -6223, -4385, 2468, -1930, -5123, 1468, 2489, -4739, -4226, 3912, 4878, -4869, -9863, -357, 7529, 1393, -4887, -777, -1503, -7882, -660, 11500, 2787, -12766, -5376, 7819, 1511, -5758, 870, 1634, -6733, -2891, 9053, 5203, -8604, -8367, 3902, 7528, -950, -3765, 1186, 290, -5515, 943, 9987, 768, -10459, 405, 11918, -215, -9597, 1659, 5855, -3291, -413, 10464, 1620, -12029, -2670, 12337, 6632, -5644, -3092, 3925, 334, -3022]
2617c022Q057L380j2028o285J5109Q133j5635q759J4019N009j1991K705J2015
2630A0707r722j4151J2932J4673j2302j2503J0097P848q646l884R220J383j0684
2643e032k97J3546J40j6690j729J6443K824j4612J316J1852q260j0829J4450J0934
2657A4056j8143j0105J6852Q136j4349l437J1653j666j0567O084J2386q247j5005
2670a2352N426J6580l192j3749M135R901q395q264J4780P498j9991o571K1242
2683G048M591j8995j085J5988m189j2803J0103J0811j3046j2025J2880J2654j0494
2696A438j1032R330P988r426n354J2181K513j6450p08K0233p74k1166K674J8711
2710A0158n534j3848J0744R035j5621p683J7962P729j6774p024J4424N102j1776
$$ y = [-3022, 5035, 8415, -3613, -9898, 5211, 13344, -2291, -11050, 2969, 7978, -4013, -1308, 10707, 985, -13166, -234, 14439, 2137, -10366, -269, 7579, -1067, -4951, 4269, 5652, -5032, -5329, 8217, 8357, -8333, -10062, 6381, 9205, -5407, -4091, 7761, -499, -11328, 3122, 14056, -4087, -14192, 2660, 10796, -3553, -6990, 4663, 2997, -7570, -1486, 10900, 2653, -12352, -6926, 9654, 6462, -7287, -3152, 6749, -1646, -9910, 4870, 12368, -7623, -14194, 7048, 11639, -7356, -8441, 7547, 3358, -9445, 658, 11469, -1577, -13602, -722, 11932, 1438, -9594, -264, 7724, -1702, -7056, 5125, 7638, -8812, -9520, 10713, 9939, -11227, -8553, 10158, 4624, -9224, 1520, 10555, -5066, -12749, 5213, 12942, -3832, -10856, 3568, 8670, -3106]
2723c106k380J1867j084j3923L683J6983m445j9593N542J8554o794j4027R869
2736A146R338j5094n033J8621K551j9252j544J7715J39j3384K036J0262o050r573
2750h122R185J1228j0389j3512J0296J3812j0756j1200J3238O872j6735l796J9620
2763I741l22j9473L078J9498n898j7203O954J3229p491r393Q473N280j0636m707
2777h870J3616O593j4307q162J1777O904j1063j216J2342o381j5884J0417J9514
2790A5280r996j8056Q393J1616j0203m668J4206K186j7531l744J6468N901j2574
2803b722m520R612J582j1038J362J3214k404j3634L601J2572o915r727J1201P501
2817I685j4232n247J3211J743j1260M055J1190q697j2416Q536J3650n022j2120
$$ y = [-3106, -5486, 6381, 5297, -8626, -4943, 12040, 7595, -11998, -6456, 12098, 5304, -8723, 1146, 10484, -4610, -9643, 8978, 11529, -7723, -9267, 8448, 8587, -4797, -2761, 7501, 1451, -8122, 1063, 12291, 1902, -11610, -1314, 12498, 1742, -9458, 3780, 10652, -6083, -9879, 9741, 9419, -10054, -6976, 12522, 6624, -10579, -3625, 9604, 2113, -7280, 1193, 6473, -4163, -8870, 4746, 11339, -2968, -11130, 647, 7551, -3512, -4728, 7614, 1233, -14651, -4234, 15280, 5284, -12772, -4379, 7237, -2966, -7634, 6572, 8758, -8773, -12517, 3951, 9852, -2722, -7242, 2370, 3952, -7086, -5724, 7490, 5086, -8548, -4947, 7625, 710, -9017, 2184, 9685, -4547, -9794, 3417, 5160, -6100, -2045, 9145, 448, -11968, -3432, 10218, 5196, -6924]
2830f924L154P891n923n833J1101Q674j4405j1655J3661J1318j2338o551J2576
2843D746N12j3742L155J3942l977j1447N033P510o704m906P236M229o341l392
2857d146N369J085o308J163J0811j049j4825j755J4582J938j0941M434P891j1821
2871c572j0058J5332J3962j2187j2554N764N225l801J242Q489j868j1257l662
2884h945R417O818m238m640K069j852n243O517J0304n921j0252L651L727n315
2898c903L246J1042n634j4517J780J1917N15m152L415L11r725n337J0062J2357
2912A1377l984j2638j864O882m54j333Q564K386j4423o990J1598Q234n615j480
2926B60K114o274l343Q558O153n396n049K89L16m4L231M316q33p753l476O028
$$ y = [-6924, -3770, 4121, -1802, -7635, 3466, 12140, -2265, -13920, -259, 11059, -1279, -7830, 4746, 5258, -8484, -5329, 8613, 4636, -6811, -1778, 5732, -972, -5878, 1358, 5587, -754, -4146, 1223, 2308, -4000, -2837, 7974, 6925, -7900, -9655, 4927, 6865, -4076, 358, 8249, -3572, -13630, 1702, 15664, 3477, -9077, -3313, 1912, -1889, -647, 7842, 5974, -5283, -8945, 472, 7290, 3052, -1588, 481, -1371, -6614, -97, 10207, 4286, -5966, -2315, 1412, -3903, -657, 10385, 4751, -9766, -7986, 3931, 4446, 294, 3709, 4020, -5705, -11042, -980, 11377, 7393, -5245, -7109, -227, -681, -2014, 6550, 8936, -5487, -12477, -879, 7355, 1740, 260, 2374, -3900, -7243, 1315, 7468, 2072, -2977, -2688, -2372, -2416, 815, 5131, 4298, -3455, -6931, -903]
2942i03N188m297o24N092l435j0696L785J3080q99q270J623J317o808K83R929
2957D365L842o956n793n13K921L743K477J55k989o312j876P528N958l384l328
2972a62o53m052m1R502N741r354p248K465J449R00P085L672r090q954J727P840
2988H27N768L43m230n797l999L43Q142R996k932j2339l876M404K317M280O360
3003I607n124j2565j028R463N358j85j654o393n774L783Q539M016l495p026n775
3018h253L195P700M043p21m066q816l162R448Q034j945m103j495n544j062Q714
3033A967O278m450m910j481j625J308N400K496k330l080l093o8M537K612j470
3048B091j490j500l368J318P455J236n601k328R8k120L967P415j743p618k946
$$ y = [-903, 4285, -12, -636, 4456, 1021, -9675, -5890, 7190, 6291, -1979, -356, 961, -5847, -5564, 4365, 8207, 1251, -4542, -5055, -2134, 1609, 4086, 4241, 1252, -5060, -6936, 592, 6550, 3166, -162, -815, -4867, -4908, 4594, 10335, 981, -6267, -3802, -2353, -1453, 5632, 9304, 214, -8740, -7013, 827, 6595, 6938, 2708, -3089, -7088, -6745, 1397, 11393, 8461, -3878, -7754, -3350, -1033, 3247, 9607, 4483, -8082, -9110, 353, 5711, 5526, 3872, -2521, -8295, -4512, 4027, 8043, 4548, -2478, -8253, -5058, 2642, 6685, 5964, 1898, -6918, -10080, -632, 7402, 5457, 1354, -141, -5685, -6747, 1967, 8245, 3795, -1115, -2596, -4221, -2913, 2487, 4983, 2653, -427, -3520, -3588, 949, 3561, 2091, 601, -899, -4267, -2949, 4506, 5742, 141, -2187, -2089, -4209, -242, 7173, 5430, -2188, -5134]
3063e134J296K515N174L405m265o385k622Q36N863O091p48o061l201j572K09P115
3079B516O121m589p922n55Q95J928O004L845o999p505J462M802M454K061m020
3094B498q235j329N431O400M219l459j0338n267O434Q432L246j369o990r375J554
3109h148J1287N050j665l559o599n145N544Q905R84m595l023k736N45M194L550
3124D589j482k133k903k288L946M851j351l338J06k061j245N603M592m148n026
3139b288q12p79K599P007J807o813n187K6K602L648M231j895n029l124R6L227
3155f84N129j14n181k87J668k944q11N430J344m348n37K365k316q37L915J035
3171B827l647j457j41J385L293J477m384l943L55L023M553L429n730q162K99M270
$$ y = [-5134, -3838, -1323, 3851, 7256, 2991, -3394, -6016, -5180, 683, 6774, 6026, -35, -3236, -4808, -4599, 2516, 8637, 4048, -3874, -4429, -3534, -1606, 4398, 8243, 1244, -6261, -4799, 3, 4457, 6518, 2498, -5737, -7066, -1635, 4765, 8984, 5525, -4813, -10080, -3646, 4786, 8032, 6663, -327, -9702, -8148, 3139, 8189, 6524, 2965, -3634, -8779, -3235, 5670, 6654, 2059, -964, -3700, -3155, 1039, 4589, 3107, 974, -1929, -4217, -271, 4580, 3229, -109, -3, -2064, -3309, 2294, 6886, 2738, -2288, -3100, -3879, -1280, 5727, 7534, 721, -4466, -4440, -1838, 1810, 6041, 4146, -883, -4007, -3911, -684, 4445, 4331, -850, -1137, 531, -2413, -3224, 2206, 3550, -798, -1335, 1030, -1286, -2123, 1792, 2827, -820, -2277, -2418, -1033, 2260, 3737, -647, -4590, -4235, -1212, 3341, 6770, 1040, -7122, -6823, -2553]
3187b553L561N445L09j0204p223O540P434J95p28j321o032k248N466M825p75k565
3203A26k277p37K042J023o73J434p26l769M21N679ml217J128q33n690K275Q432
3220D634O67n939k208q41j369M349P779n86q216n873J464O139M246j295k736j436
3236a221k852j96O855K941o966n021O515K996m087l18K281l236o27M963J440m675
3252a208j533J844J35J99M59M04J66J18q55O47j092l213K168P712m62q912j047
3269d470N296o68o08N774K05r374k320P568K819l336p52J222r02L2M59M85p06
3286G24j950J090M240j338n308N27N655k248l563M106J878o108MO949k154q359
3302e855K255Q491k47m454j557m45j576J720M847K885n638p185J705Q041J174
$$ y = [-2553, 1008, 6453, 6762, -3442, -10665, -4125, 3309, 3504, 2776, 1455, -4577, -6825, -1359, 3466, 2691, 126, -2151, -2888, -846, 177, -496, 938, 212, -3557, -3136, 2543, 2539, -678, 450, -383, -6073, -3798, 4634, 5301, -638, -2846, -3687, -5056, -707, 7072, 6486, -1730, -7603, -6139, 0, 4246, 2951, 215, -1221, -4073, -4269, 2586, 5527, -1439, -6460, 55, 3051, -1036, -1354, 927, -2309, -2936, 2027, 3467, -1208, -2741, -897, -762, -563, -104, 300, 466, 584, -271, 376, -716, -3929, -1761, 5951, 5489, -3423, -4470, 826, 158, -450, 5324, 5529, -3845, -6165, 1403, 4222, 886, 134, 1356, 454, 486, 945, 1430, 724, -1226, -136, 4104, 2766, -2542, -2015, 3640, 1392, -2171, 1935, 3813, -2295, -2291, 4658, 2504, -5855, -3600, 4891, 4644, 190, -1367, -1812, -3388, -1668, 3179, 6064, 426, -6759, -5054, 2987, 4161]
3317D161m558J76P76m760J371P879j928r269K155P853j130m533J851M59m614J276
3333b835O552M91n490k664L846L319l000k779L243K745l942j441M935k047o747
3348e814M776R278m512q918K787M823k933K27M692k884o420K441O697k58n980
3363a998j542L615L096k368j181J733l147m113O815P915o968r262N064O466m251
3378a26j955N709j621q018M020Q080l424p493J271O195P29l246j261P88j341j268
3394b961N069M739o335p105N974O350n427l923N819j21n902M447O542o408p588
3409f830O239O880l126n354J660R06j488R30M107m4o590k128P408M164p550n070
3425e886O411K621m810K266M561p176o036R106P754q078o368L878K858k548J605
$$ y = [4161, -397, -221, 555, -4205, -2834, 5045, 3117, -6152, -3997, 3856, 2726, -1807, 44, 503, -4111, -2835, 3717, 4208, -1282, -3946, -100, 3219, 219, -2560, 683, 3428, -514, -1955, 2980, 933, -5814, -1038, 8240, 3728, -5190, -2403, 2420, -513, -286, 4406, 1522, -4898, -2457, 4240, 3982, -1998, -3540, 75, 3171, 803, -378, 1355, -1792, -5905, 910, 8825, 1857, -7405, -2341, 4125, -126, -2081, 3628, 2007, -6011, -1991, 6089, 2665, -4828, -3557, 2638, 3367, 121, -1140, -352, -1693, -2961, 2108, 6847, 512, -6593, -619, 5731, 304, -3619, 2200, 2079, -3823, 624, 7166, 758, -6830, -591, 6289, 3163, -2191, -531, 375, -1113, -183, 3924, 3880, -2710, -4838, 2570, 6734, -816, -5886, 525, 3146, -1664, 602, 5163, -2013, -8049, 1057, 8811, 733, -5635, -1757, 1101, -1447, 158]
3440A58K889k881n114K330O985j26q122k539P041K613m338M14L371n570m586R734
3456B259N864j0022o320Q061L664n174J47M434l659m076M883N352m233p310K065
3471d065P418P97n693o42K817j708k282P002K286r900l824J0131L238p210r72
3486b607M132k031k393O137K918q221m782O472N509k764m238N55K501j919n29
3501a260M664j51p591n52J0031J019j0031j197Q259m12m350L709Q92p419j190
3516e579R665K604p604m545L581L564P71q55o13k925l697M477Q270k029j0507
3531e422j013Q333J049l413K999N69q908o06J1238K338r595k995O091J288k774
3546h21L63J744j887k047K497L370k237n839K165P154j067o613P19L134k099Q69
$$ y = [158, 3047, 166, -4948, -2618, 4367, 4241, -3881, -6420, 621, 3234, -1104, -690, 2681, -2889, -7475, 2259, 8123, -1899, -8219, -158, 3506, -1668, -1521, 2913, -746, -4822, 61, 5413, 1180, -6130, -4065, 3353, 4150, -1543, -2185, 632, -1076, -3358, 3644, 5930, -3970, -7794, 2337, 5575, -1635, -2607, 1525, -506, -2899, 3238, 6156, -2065, -6847, -375, 5134, 2370, -1868, -1313, 1188, -731, -1260, 3404, 3253, -4338, -4890, 5141, 6160, -3871, -5068, 3191, 2779, -1571, 2138, 3030, -4389, -5579, 4086, 6690, -914, -5459, -1878, 1686, 2457, 1602, 989, -1936, -5633, -1156, 7114, 5085, -5422, -6435, 1898, 2947, -466, 2533, 3102, -5806, -6412, 4826, 7164, -2431, -5426, 665, 1953, -821, -458, 1286, -601, -2648, -151, 3219, 982, -4857, -2692, 4462, 3395, -3218, -2499, 635, -1464, -595]
3562e95N197l322q846L131R955r13o544n5J161k119J839N917r93p648l127N940
3578a022O483k714o026J241L405k384j243N180q52p094K072Q534k743p691K056
3593b798N228p85j002L73k943l385M582O692r42o748m541L634O025J256k704j993
3609e1m050k297P406R395n852j1244R20O901R02OK652l768p764K336Q780J135
3625E407m444k931J146P07J31j35J588P73k468j438K455j083k090M853L250o072
3641c51n167L452L696J46K353n03p929l886Q529Q395k815p375m130O33M416N273
3657D737J447l768p574k548P785Q225l931p633m56K420k0K606L390m532n320L817
3673a355M704k441l130J381Q23N4Q20r64k124L93K721K389j293n307l144N154
$$ y = [-595, 4602, 1280, -7566, -4435, 5520, 4607, -1937, -1992, -831, -2950, -1111, 4806, 3813, -3835, -6962, -1022, 5461, 2747, -3279, -2038, 1367, -1017, -2260, 2920, 2068, -5026, -2954, 5580, 2837, -4854, -2798, 2430, 1645, 643, 1016, -1927, -5312, -730, 5962, 5020, -1728, -6269, -2635, 3390, 4646, 1942, -51, -4101, -6398, 1008, 10403, 4551, -6693, -5773, 1128, 2030, 2036, 4688, 920, -6844, -4508, 4272, 5407, 963, -1968, -822, -115, 16, -119, 1469, 2242, -226, -1664, 791, -292, -2382, 2471, 5721, -351, -5518, -2066, 1630, 1776, 4129, 3626, -4303, -8189, 340, 8735, 5920, -1455, -5585, -4952, -536, 4737, 6184, 2416, -5158, -7706, 79, 8304, 4373, -3260, -3716, -1296, -1316, 1290, 4680, 148, -5172, -1355, 3349, 908, -2222, -841, -18, 36, 856, -108, -2232, -1839, 882, 3271, 1978, -3329, -6473, -1319]
3689a319N858j374l833j931k745J037Q425L940p696p448K064M713K501J949j450
3704B691n825k039L558M326M27k252k502J07J662j133l64L659O66l105p27K20
3720f31k172J643O209O41p849m035L734M340L571J427o852q242J220R590O546
3735I140j929q692p088J887Q856N738o1o793r329n39J0469P682m482o512j674
3750c327o38K083O617J366o589l851K787K077Q94R8p15o52k36o05o63K136J601
3767B383j088p3k042l970J891P716J983n772m152j736R43N923O418l622r198k456
3783f852M846M851K747j407n678l271K076M487K871k382m796r46L955K311k745
3798F7p35J445j123k56K052j329l366K871M684k052m692o75J406K806M142q94
$$ y = [-1319, 4539, 3165, -668, -2599, -5344, -4307, 4118, 8058, 362, -7086, -5022, -309, 2192, 4141, 2691, -3134, -5173, -1615, 2711, 3138, 886, -1616, -1509, 153, -980, -1344, 2315, 2981, -124, -851, -631, -2803, -1160, 5049, 5690, -2159, -6194, -2460, 1880, 5451, 6878, 26, -8216, -6996, 2594, 9140, 7211, -1481, -8569, -6682, 2174, 7912, 7851, 1058, -8271, -8810, 1659, 9341, 4859, -1653, -3327, -3965, -1882, 4735, 6101, -488, -4339, -1552, 525, 1419, 1517, 802, 150, -86, -691, -1354, 782, 2383, 1295, 1222, -820, -4790, -2899, 4817, 6800, 1028, -3124, -4860, -3917, 2006, 8424, 4802, -4396, -6852, -2006, 2845, 5592, 4185, -1493, -4764, -2688, 1799, 4670, 2288, -2508, -3454, 501, 2812, 67, -668, 777, -346, -602, 1450, 121, -3245, -374, 4310, 2258, -2434, -3109, -1703, 1103, 5245, 4351]
3814D351p433n232M034Q087M575l630r189l765M060O080M505k54p440q417L458
3829f210J0502K057n097l092j459q60L770M216j689m226p70J521J155J069M51
3844A338j366n13q91j232Q09K214J589N80j601o120j692P368O433k741n196k975
3860c996l207K605R710M669q242q863k2O013N880J047m256n983r46L653N659J802
3876E523n283n857K221N775k17j273k81k897j824M637L715m618k274M127P91l893
3892a628j389K697J39Q87K490j454n133k858M081P641J933p607o532J999M211
3907e23K179K987p39q116l587P859O047l722l896j010l98J876M974j41n720k329
3923d259L508K613n53j730l88J122r00r49J416J363k526J147N356k286q961l71
$$ y = [4351, -3082, -8314, -4280, 3807, 8382, 4752, -4437, -8202, -4142, 1938, 6443, 6189, -1251, -9668, -6210, 4292, 6349, 1252, -1840, -3299, -4159, -389, 3827, 2138, -2088, -2858, -1337, -182, 887, 1338, -28, -541, -1432, -2664, -1855, 359, 1948, 2528, 927, -5193, -6885, 483, 6916, 4175, -1021, -3996, -7203, -4598, 5112, 9781, 1539, -7324, -7346, -1333, 4547, 5594, 1338, -4645, -5591, -1938, 3721, 5523, 240, -5617, -3396, 2379, 2162, 889, 608, -2289, -4113, 524, 4239, -379, -2653, 1474, 2265, -1628, -3017, -320, -181, 706, 3196, 1742, -3391, -6249, -2168, 5473, 7406, -201, -6733, -4734, -523, 1656, 4643, 3904, -4212, -7799, 60, 6107, 2385, -1511, -2521, -2919, -1043, 3931, 3790, -1930, -4259, -751, 1862, 1309, -421, -809, 313, -587, -1536, -120, 1243, -1283, -136, 5220, 2934, -6027, -6398]
3939f398R661K457l965j696j909l550K948Q544J331p800n584K214M796L043p40
3954C352l274l577j03M530N091k037q203j267O652J946k644J219j48n501K39P503
3970C778N74o972m54N384J17m079j391K200J690Q55P88q95l905m094M470P757
3986E823p69p670k104L204P64J832L885m040p768K749Q628q5n840p53N74j72K157
4003D15M137j414o672j980N716M424k792m642J989L519k997j222L725j140m054
4018b988K758O403m371p685K664O786j39j728j4k792l337L875O442j797o267k735
4034d925M747M255j598k634o03j072j280N703M908o823q362M474P762j937l112
4049d97J849k141l902L778N703k903o044J181N350Q70l705k111J098J026O45K258
$$ y = [-6398, 3263, 5720, 1755, 59, -1850, -5400, -2452, 6092, 7423, -377, -5961, -3747, 1049, 4092, 3352, 78, -3499, -3602, 928, 6019, 3982, -4221, -5488, 1164, 3110, 466, 1685, 1537, -3964, -3725, 3778, 4352, -2620, -3074, 2310, 2427, -1652, -3043, -843, 847, 1702, 2490, 1595, -2310, -6404, -1934, 5823, 5054, -2616, -4720, -1516, -752, 1080, 4965, 925, -6843, -4094, 4534, 4449, -1391, -2144, -1570, -1742, 415, 4552, 3138, -3534, -5514, 202, 4626, 1834, -2808, -819, 2700, -297, -1519, 2206, 1066, -2988, -230, 6173, 1802, -5883, -3219, 3567, 3428, 1700, 1686, -1106, -4443, -568, 5874, 4077, -2190, -4925, -178, 4077, 2479, -155, -758, -1830, -3110, 2593, 7501, 678, -7684, -3210, 4552, 2615, -497, 1352, -789, -4691, -913, 4790, 1887, -4157, -2976, 2374, 3244, -461, -2572, -1474, -448, 197, 2455]
4065B455M22n745l658O621O442m943m966K585J436k741L080L362n737m912O032
4080b67O533l680m972J0J548J282J131J236k015m529j80O255L193o177l920M736
4096A84K946l580o0K514m632k133P338M217o955n865M066M078n23m39k65k911
4112b020k183L162N392r93o908j608O209L114m002j925J266j954o82O583K428
4127E879q353m028O111M328l196j438R73k056q04M102K200l787l728K054M895
4142C152O07m681j961K211R48j87L126m59o413q39P739K006o064k129L462Nr03
$$ y = [2455, 2877, -2868, -6526, 95, 6537, 1594, -3372, -787, 649, -2092, 988, 4350, -1387, -6299, -267, 6266, 2586, -2386, -2376, -828, 454, 1585, 2821, 806, -3723, -3903, 2352, 5545, -632, -4552, 184, 3130, -450, -510, 2004, -2628, -4761, 2577, 6794, -161, -6026, -1960, 2118, 1595, 1156, 891, -2020, -4203, -1041, 4351, 3358, -3550, -5158, 1051, 4165, 163, -1762, -496, -2450, -3132, 3451, 5879, -2474, -6502, -391, 3937, 741, -697, 276, -1780, -2584, 1518, 3718, -69, -3797, -1743, 3152, 3759, -922, -2883, -672, 276, 89, 3215, 2756, -3657, -4496, 3243, 5249, -815, -2944, 518, 523, -380]
$$ [...]
8191a70
##END NTUPLES=NMR FID
##END=
