##TITLE=1H_CA-8587
 CDCl3, 8 sc, 
 30.4.2019
##JCAMPDX= 6.0         $$ Bruker NMR JCAMP-DX V2.0
##DATA TYPE= NMR FID
##DATA CLASS= NTUPLES
##ORIGIN= UXNMR, Bruker Analytische Messtechnik GmbH
##OWNER= root
$$ XWIN-NMR		Version 3.5
$$ Tue Apr 30 15:38:50 2019 Russian Standard Time (UT+4h)  she@DPX200
##.OBSERVE FREQUENCY= 200.1315
##.OBSERVE NUCLEUS= ^1H
##.DELAY= (6, 6)
##.ACQUISITION MODE= SIMULTANEOUS
##.ACQUISITION SCHEME= undefined
##.AVERAGES= 8
##.DIGITISER RES= 18
##SPECTROMETER/DATA SYSTEM= spect
##.PULSE SEQUENCE= zg30
##.SOLVENT NAME= D2O
##.SHIFT REFERENCE= (INTERNAL, D2O, 0, 15.7039)
##AUDIT TRAIL= $$ (NUMBER, WHEN, WHO, WHERE, WHAT)
$$ ##TITLE= Audit trail, XWIN-NMR		Version 3.5
$$ ##JCAMPDX= 5.01
$$ ##ORIGIN= Bruker BioSpin GmbH
$$ ##OWNER= she
$$ F:/spectra/data/she/nmr/H-F/1/audita.txt
$$ ##AUDIT TRAIL=  $$ (NUMBER, WHEN, WHO, WHERE, WHAT)
(   1,<2019-04-30 15:37:43.89 +0400>,<she>,<DPX200>,
      <created by zg, POWCHK disabled, PULCHK disabled
       configuration hash MD5:
       00 E9 B6 7A A2 85 ED C7 34 08 36 98 17 FE 4E 26
       data hash MD5: 16K
       94 49 DC 99 4F DA CF FB 2B 75 6E 51 78 34 59 6A>)
$$ ##END=
$$ 
$$ hash MD5
$$ 7D 63 CB 40 D2 BB FA 41 03 C7 E0 CD CC 1A 43 0D
##$RELAX= 
##$RELAX= 
##$RELAX= 
##$RELAX= 
##$RELAX= 
##$RELAX= 
$$ Bruker specific parameters
$$ --------------------------
##$DU= <F:/spectra>
##$EXPNO= 1
##$NAME= <H-F>
##$PROCNO= 1
##$TYPE= <nmr>
##$USER= <she>
##$AMP= (0..31)
100 100 100 100 100 100 100 100 100 100 100 100 100 100 100 100 100 100 
100 100 100 100 100 100 100 100 100 100 100 100 100 100 
##$AQSEQ= 0
##$AQ_mod= 1
##$AUNM= <au_zg>
##$AUTOPOS= <>
##$BF1= 200.13
##$BF2= 200.13
##$BF3= 200.13
##$BF4= 200.13
##$BF5= 200.13
##$BF6= 200.13
##$BF7= 200.13
##$BF8= 200.13
##$BYTORDA= 1
##$CFDGTYP= 0
##$CFRGTYP= 5
##$CHEMSTR= <none>
##$CNST= (0..31)
1 1 145 1 1 1 1 1 1 1 1 1 1 1 1 1 1 1 1 1 1 1 1 1 1 1 1 1 1 1 1 1 
##$CPDPRG= <>
##$CPDPRG1= <>
##$CPDPRG2= <>
##$CPDPRG3= <>
##$CPDPRG4= <mlev>
##$CPDPRG5= <mlev>
##$CPDPRG6= <mlev>
##$CPDPRG7= <mlev>
##$CPDPRG8= <mlev>
##$CPDPRGB= <>
##$CPDPRGT= <>
##$D= (0..31)
0 1.2 0 0 0 0 0 0 0 0 0 0.03 0 0 0 0 0 0 0 0 0 0 0 0 0 0 0 0 0 0 0 0 
##$DATE= 1556624263
##$DBL= (0..7)
120 120 120 120 120 120 120 120 
##$DBP= (0..7)
150 150 150 150 150 150 150 150 
##$DBP07= 0
##$DBPNAM0= <>
##$DBPNAM1= <>
##$DBPNAM2= <>
##$DBPNAM3= <>
##$DBPNAM4= <>
##$DBPNAM5= <>
##$DBPNAM6= <>
##$DBPNAM7= <>
##$DBPOAL= (0..7)
0.5 0.5 0.5 0.5 0.5 0.5 0.5 0.5 
##$DBPOFFS= (0..7)
0 0 0 0 0 0 0 0 
##$DE= 6
##$DECBNUC= <off>
##$DECIM= 24
##$DECNUC= <off>
##$DECSTAT= 4
##$DIGMOD= 1
##$DIGTYP= 9
##$DL= (0..7)
0 120 120 120 120 120 120 120 
##$DP= (0..7)
150 150 150 150 150 150 150 150 
##$DP07= 0
##$DPNAME0= <>
##$DPNAME1= <>
##$DPNAME2= <>
##$DPNAME3= <>
##$DPNAME4= <>
##$DPNAME5= <>
##$DPNAME6= <>
##$DPNAME7= <>
##$DPOAL= (0..7)
0.5 0.5 0.5 0.5 0.5 0.5 0.5 0.5 
##$DPOFFS= (0..7)
0 0 0 0 0 0 0 0 
##$DQDMODE= 0
##$DR= 18
##$DS= 0
##$DSLIST= <SSSSSSSSSSSSSSS>
##$DSPFIRM= 0
$$ [...]
##$SUBNAM2= <"">
##$SUBNAM3= <"">
##$SUBNAM4= <"">
##$SUBNAM5= <"">
##$SUBNAM6= <"">
##$SUBNAM7= <"">
##$SUBNAM8= <"">
##$SUBNAM9= <"">
##$SW= 24.9337058887773
##$SWIBOX= (0..15)
0 0 2 0 0 0 0 0 0 0 0 0 0 0 0 0 
##$SW_h= 4990.01996007984
##$TD= 16384
##$TD0= 1
##$TE= 0
##$TE2= 300
##$TE3= 300
##$TEG= 300
##$TL= (0..7)
0 120 120 120 120 120 120 120 
##$TP= (0..7)
150 150 150 150 150 150 150 150 
##$TP07= 0
##$TPNAME0= <>
##$TPNAME1= <>
##$TPNAME2= <>
##$TPNAME3= <>
##$TPNAME4= <>
##$TPNAME5= <>
##$TPNAME6= <>
##$TPNAME7= <>
##$TPOAL= (0..7)
0.5 0.5 0.5 0.5 0.5 0.5 0.5 0.5 
##$TPOFFS= (0..7)
0 0 0 0 0 0 0 0 
##$TUNHIN= 0
##$TUNHOUT= 0
##$TUNXOUT= 0
##$USERA1= <user>
##$USERA2= <user>
##$USERA3= <user>
##$USERA4= <user>
##$USERA5= <user>
##$V9= 5
##$VALIST= <valist>
##$VCLIST= <CCCCCCCCCCCCCCC>
##$VD= 0
##$VDLIST= <DDDDDDDDDDDDDDD>
##$VPLIST= <PPPPPPPPPPPPPPP>
##$VTLIST= <TTTTTTTTTTTTTTT>
##$WBST= 1024
##$WBSW= 4
##$XGAIN= (0..3)
0 0 0 0 
##$XL= 0
##$YL= 0
##$YMAX_a= 84920
##$YMIN_a= -160074
##$ZGOPTNS= <>
##$ZL1= 120
##$ZL2= 120
##$ZL3= 120
##$ZL4= 120
##$ABSF1= 10
##$ABSF2= 0
##$ABSG= 5
##$ABSL= 3
##$ALPHA= 0
##$AQORDER= 0
##$ASSFAC= 0
##$ASSFACI= 0
##$ASSFACX= 0
##$ASSWID= 0
##$AUNMP= <proc_1d>
##$AZFE= 0.1
##$AZFW= 0.1
##$BCFW= 1
##$BC_mod= 2
##$BYTORDP= 1
##$COROFFS= 0
##$CY= 11.3945322036743
##$DATMOD= 1
##$DC= 2
##$DFILT= <>
##$DTYPP= 0
##$F1P= 18.9103706918063
##$F2P= -1.10871071338519
##$FCOR= 0.5
##$FTSIZE= 0
##$FT_mod= 4
##$GAMMA= 1
##$GB= 0.15
##$INTBC= 1
##$INTSCL= 1
##$ISEN= 128
##$LB= 0.24
##$LEV0= 0
##$LPBIN= 0
##$MAXI= 10000
##$MC2= 0
##$MEAN= 0
##$ME_mod= 0
##$MI= 1.114404
##$NCOEF= 0
##$NC_proc= 0
##$NLEV= 6
##$NOISF1= 3.799351
##$NOISF2= 2.8
##$NSP= 1
##$NTH_PI= 0
##$NZP= 0
##$OFFSET= 15.70392
##$PC= 1
##$PHC0= -8863.854
##$PHC1= 29.20026
##$PH_mod= 1
##$PKNL= yes
##$PPARMOD= 0
##$PSCAL= 0
##$PSIGN= 0
##$REVERSE= no
##$SF= 200.130013532006
##$SI= 16384
##$SIGF1= 3
##$SIGF2= 2
##$SINO= 400
##$SIOLD= 16384
##$SREGLST= <1H.CDCl3>
##$SSB= 0
##$STSI= 0
##$STSR= 0
##$SW_p= 3612.71676300578
##$SYMM= 0
##$S_DEV= 0
##$TDeff= 0
##$TDoff= 0
##$TI= <>
##$TILT= no
##$TM1= 0
##$TM2= 0
##$TOPLEV= 0
##$USERP1= <user>
##$USERP2= <user>
##$USERP3= <user>
##$USERP4= <user>
##$USERP5= <user>
##$WDW= 1
##$XDIM= 8192
##$YMAX_p= 0
##$YMIN_p= 0
$$ End of Bruker specific parameters
$$ ---------------------------------
##NTUPLES= NMR FID
##VAR_NAME=  TIME,          FID/REAL,        FID/IMAG
##SYMBOL=    X,             R,               I
##VAR_TYPE=  INDEPENDENT,   DEPENDENT,       DEPENDENT
##VAR_FORM=  AFFN,          ASDF,            ASDF
##VAR_DIM=   8192,          8192,            8192
##UNITS=     SECONDS,       ARBITRARY UNITS, ARBITRARY UNITS
##FACTOR=    0.0002004,     1,               1
##FIRST=     0,             0,               0
##LAST=      1.6414764,     0,               0
##MIN=       0,             -160074,         0
##MAX=       1.6414764,     84920,           0
$$ Real data points
##PAGE= N=1
##DATA TABLE= (X++(R..R)), XYDATA
0@%%%%%%%nJ3j6J6j6K4l2L3m1N4o2P2q8J04j20J37j61J86k11K42k78L17l58M04
$$ 0 0 0 0 0 0 0 0 -5 8 -8 8 -8 16 -16 17 -24 30 -32 40 -48 56 -64 73 -88 98 -113 129 -149 168 -190 214
31B14m53N09n72O39p11P91q80R78j085J200j331J475j631J806k003K223k472K757
$$ 214 -239 270 -302 337 -374 417 -463 515 -570 630 -701 774 -857 949 -1054 1169 -1303 1454
49A454l086L472l930M484n172O056p234Q895j1435J5850k5712Q8745m0879j52432
$$ 1454 -1632 1840 -2090 2394 -2778 3278 -3956 4939 -6496 9354 -16358 72387 31508 -120924
63a20924Q1466Q0218N128l6722P815K899k650l0729n829L5347J7978n6079q200
$$ -120924 -39458 40760 45888 9166 16981 19880 17230 -13499 -19328 16019 33997 -22082 -30282
76c0282Q2374L2828r2847p6278K8919Q3348M7263k8211p6323j7271M8829J1290
$$ -30282 52092 84920 -7927 -84205 -55286 28062 75325 47114 -29209 -46480 2349 13639
88A3639l0877J6835K7127k7140j7899L3652P473m2180k8816J4322N2046N3284
$$ 13639 -17238 -403 26724 -416 -18315 15337 22810 -19370 -48186 -33864 18182 71466
100G1466k6357r6252l2530O3903M8359j503r604k2278k5163J4192J9633j6993
$$ 71466 45109 -51143 -83673 -19770 28589 27086 17482 -4796 -29959 -15767 3866 -13127
112a3127m339K2464l157m958K5484j1085o2575j0523O0470M4742j810l3907n4170
$$ -13127 -17466 4998 1841 -3117 22367 11282 -51293 -61816 -1346 43396 41586 7679 -46491
125d6491j3230N7250L8032k9778k4192J3510Q564j254k551j9222r588K3543J7013
$$ -46491 -59721 -2471 35561 5783 -18409 -4899 3665 2411 -140 -19362 -28950 -5407 11606
138A1606N565J6938k2975p5239n508R3855M7374n1103m8393K858J8905J5636m317
$$ 11606 17171 34109 11134 -64105 -69613 24242 71616 20513 -27880 -25022 -6117 9519 5202
151E202k0646R824L0741r450k0950J2751q361m2028J6461P2714J8556n1825n0643
$$ 5202 -15444 -5620 25121 15671 -5279 7472 -889 -42917 -26456 46258 64814 12989 -37654
164c7654j1412L7017N7194j174n3966j0127L2358o30j6075J0942j833k0141J6048
$$ -37654 -49066 -12049 45145 43971 -9995 -20122 12236 11606 -4469 6473 4640 -15501 547
177E47L5208n10l0575l4816j4697M3664O4027j1309o6350j8028K6521J3262P429
$$ 547 35755 35245 4670 -30146 -44843 -1179 62848 51539 -14811 -32839 -6318 6944 14373
190A4373L805j9643q339K5217O855k0349r080r406p981L9158M8276k9730o7800
$$ 14373 18178 -1465 -9804 15413 22268 1919 -7161 -16567 -24548 14610 62886 33156 -34644
203c4644j3443L2987L3636K3005j3336m6592j2015K9802J2402o304N0j3768j0695
$$ -34644 -48087 -15100 18536 41541 28205 -18387 -30402 -600 11802 5498 5548 -8220 -18915
216a8915L1217K3133l3910l4546P714J9020K2667K2416k2982n2536k224L9730
$$ -18915 12302 35435 1525 -33021 -25307 -6287 16380 38796 15814 -36722 -38946 784
228G84J6596o003r435j9284q01K9606M843l0814r926J2412R160K0955J3949l8734
$$ 784 17380 11377 1942 -17342 -18143 11463 16306 -14508 -24434 -12022 -2862 18093 32042 -6692
242f692m4694J8439M3538J4164l765k1872l3821M023M0660P679k3131m965L062
$$ -6692 -51386 -32947 10591 24755 20990 -882 -34703 -30680 9980 17659 -5472 -10437 -7375
255g375k04J6571P152l1749j9712K6256K5605L302o436k7406k6746K3866M2507
$$ -7375 -7579 8992 16144 -15605 -35317 -9061 16544 19846 13410 -13996 -40742 -16876 25631
268B5631l701k5815p517l012P317K4442j393l4546n755K8920J3628j628o599k9374
$$ 25631 21930 -3885 -11402 -14414 -7097 17345 15952 -18594 -24349 4571 18199 16571 9972 -19402
282a9402j8103L5356L8484j0461k7233j5268n873J9319L0869p899l1548M39J5802
$$ -19402 -37505 -2149 36335 25874 -1359 -16627 -22500 -3181 27688 19789 -11759 -11320 4482
295D482L236N089j564k8321n186L8996J8722k3684k0885p313O25K7496K6529k1626
$$ 4482 7718 12807 11243 -17078 -22264 16732 35454 11770 -9115 -16428 -15803 11693 38222 16596
309A6596l4360K326J6779J1008J0482j2565l1358M506L6182O891j8734j3171j2791
$$ 16596 -17764 -15438 1341 12349 22831 10266 -21092 -16586 19596 26487 7753 -5418 -18209
322a8209J728L5346K0304l1267k9364N628J3826J3739J3772j7921l0071R826K8134
$$ -18209 -16481 18865 39169 7902 -21462 -15834 -2008 11731 25503 7582 -22489 -12663 15471
335A5471l72j2285p862j2347Q355L3195L480l6268j8224J2918J5719J8521M807
$$ 15471 15099 2814 -5048 -17395 -9040 24155 27635 -8633 -26857 -13939 1780 20301 25108
348B5108l2072k6642K0749K6898K73o664j4548j9784J3945L5754l092l2020r508
$$ 25108 -6964 -33606 -12857 14041 14314 7650 -6898 -26682 -12737 23017 19925 -12095 -21603
361b1603Q703J0645J9334J487l2869j6480K2281J9269j17n218j7638j4763K2055
$$ -21603 -12900 -2255 17079 18566 -14303 -30783 -8502 10767 10650 5432 -12206 -26969 -4914
374d914K6728j4112k3302p22M960J1405K0555q311l7078n357K9722J5766k178
$$ -4914 21814 7702 -15600 -16322 -11362 43 20598 12287 -24791 -30148 -426 15340 13162
387A3162r741k3206q826K9586K2719j5049j9024n217n60J8060K3113j5697l2771
$$ 13162 3421 -19785 -28611 975 23694 8645 -10379 -15596 -16156 1904 25017 9320 -23451
400b3451L969K2873P735J432p633k4353j849L1650J2848j9063j2953l965K245
$$ -23451 -19482 3391 11126 12558 4925 -19428 -21277 10373 23221 4158 -8795 -12760 -10515
413a0515K2123J5661k5345k5889J2487K0089P226J676j5622k6704J0142L3994
$$ -10515 11608 27269 1924 -23965 -11478 8611 15837 17513 1891 -24813 -14671 19323
425A9323N617j9323j2781q544N434K9256J0425k8914j9065J1264J2608R032O245
$$ 19323 24940 5617 -7164 -15708 -10274 18982 29407 493 -18572 -7308 5300 14332 20577
438B0577j9281k3743J4858K7872k009j4948q694p429R537K6010j471k8379q982
$$ 20577 1296 -22447 -7589 20283 18274 3326 -5368 -12797 -3260 22750 21279 -7100 -16082
451a6082J2901R999J1891k31k8301j6150K5677K3679p913j3327j1357r910J5928
$$ -16082 -3181 6818 18709 18478 -9823 -25973 -296 23383 15470 2143 -9214 -19124 -3196
464c196K9008o558k8794p343Q989J1366J5570l975k8886q750K4116J3132o158
$$ -3196 25812 19254 -9540 -16883 -7894 3472 19042 15067 -13819 -22569 1547 14679 8521
477H521o458j3330q742K1897K2142j7192k3085J854Q800J0432J2744j1258k9234
$$ 8521 2063 -11267 -20009 1888 24030 6838 -16247 -14393 -5593 4839 17583 6325 -22909
490b2909J283K6089R674n673j0343j7978k442K9378J6316k0598j9150k31N820
$$ -22909 -21626 4463 14137 8464 -1879 -19857 -22299 7079 23395 2797 -16353 -16584 -10764
503a0764J6213J4871j7663k6570O352K0411N743l10q749k0112K370K8363O353
$$ -10764 5449 20320 2657 -23913 -17561 2850 8593 8283 -466 -20578 -18208 10155 16508
516A6508j9948r911K205L807J6265Q260k2017j9094J3034J7961M435j599j5942
$$ 16508 -3440 -13351 -11146 -7339 8926 17186 -4831 -23925 -10891 7070 11505 9906 -6036
529f036j8117J3283K8218j073j8453p732l595N344K3789N534k7946j4489J5901
$$ -6036 -24153 -10870 17348 16275 -2178 -9910 -13505 -8161 15628 21162 -6784 -21273 -5372
542e372J3736L592l96j6567j5196J5234K2368l219j2752p517o097J0281K2232
$$ -5372 8364 11956 11560 -5007 -20203 -4969 17399 14180 1428 -6089 -12186 -1905 20327
555B0327n171k5646k826J5602O791M324l036k1330q086K4945J8095j1683j3945
$$ 20327 15156 -10490 -13316 2286 9077 13401 10365 -10965 -19051 5894 23989 12306 -1639
568a639q518l488J7761K2316j0911k5928k312J1015R301J0036n898k4223l071
$$ -1639 -10157 -13645 4116 26432 15521 -10407 -12719 -1704 7597 17633 11735 -12488 -15559
581a5559K3746R748r894q470r471k093K1100J5134j8404j9112M300P827P579J0630
$$ -15559 8187 17935 8041 -429 -9900 -11993 9107 24241 5837 -13275 -8975 -1148 6431 17061
595A7061j0373k3808L916K3821M470j0412r932j0121N426K5047P116k3272j6256
$$ 17061 6688 -17120 -13204 10617 15087 4675 -5257 -15378 -9952 15095 22211 -1061 -17317
608a7317L701Q906J6051R974j9721k3561P988J9044L241j357o869j7144L914K5503
$$ -17317 -13616 -4710 11341 21315 1594 -21967 -13979 5065 8306 6949 80 -17064 -13150 12353
622A2353L126k2519j0008O686R979J3340N73k3120j3226J4349J3450K973P44j2905
$$ 12353 15479 -7040 -17048 -10362 -383 12957 13530 -9590 -22816 -8467 4983 7956 8700 -4205
636d205j8237J1279K5572k960j9506n862K886J0403J6419l927k7445q262J9137
$$ -4205 -22442 -11163 14409 11449 -8057 -13919 -11033 -630 15789 11862 -15583 -23845 -4708
649d708J3064K790j548j7060j5300J3820K0429j490j0246o046n021Q614J7148
$$ -4708 8356 11146 9598 -7462 -22762 -8942 11487 9997 -249 -6295 -11316 -2702 14446
662A4446p992k2737K769J8355N959n79o721j8347m563K3349J4402q890r475p121
$$ 14446 6454 -16283 -13514 4841 10800 10221 3500 -14847 -19410 3939 18341 9451 -24 -7145
676g145o631J3365J9285r636k0768K428J3368O403J385j0479j8455N076K4130
$$ -7145 -13776 -411 18874 9238 -11530 -9102 4266 10669 12054 1575 -16880 -11804 12326
689A2326O216j0246q320r965l488J9282J5508j3780j4935M747M823K533N460q929
$$ 12326 18542 8296 -24 -9989 -13477 5805 21313 7533 -7402 -2655 2168 4701 10161 1232
703A232j4872J0294K1837j153j6314j0943n571J1329K4259J931k2362j1039M129
$$ 1232 -13640 -3346 18491 17338 1024 -9919 -15490 -4161 20098 22029 -333 -11372 -7243
716g243L569J0797J0699j4600j8626J0306J7584k191r564r161o085J4295K2387
$$ -7243 -3674 7123 17822 3222 -15404 -5098 12486 10295 731 -8430 -14515 -220 22167
729B2167o769k4883n703P700O059J2019M983j7805j2960J0115J0429l42k803j0425
$$ 22167 15398 -9485 -15188 -7488 -1429 10590 15573 -2232 -15192 -5077 5352 5010 2207 -8218
743h218o339J8632J7720j6013k4648K57J2348J2960J2071p789k5247p960J4551
$$ -8218 -14557 4075 21795 5782 -18866 -18609 -6261 6699 18770 10981 -14266 -22226 -7675
756g675J1304O192k2j6843j2907J6724J6956j0895j5437l61P842J3868Q254j7134
$$ -7675 3629 9821 9799 -7044 -19951 -3227 13729 2834 -12603 -12964 -5122 8746 17000 -134
770a34k1701M855J7308O188M540k591k0815r331J9870J4500q691j0069k319L444
$$ -134 -21835 -16980 328 6516 11056 8465 -12350 -21681 -1811 12689 3998 -6071 -8390 -4946
784d946J2814O231j9343j7211J1191J8825O472p01j3624k0266K497K2807R685
$$ -4946 7868 14099 -5244 -22455 -11264 7561 14033 13332 -292 -20558 -18061 4746 14431
797A4431n574n992j1117m809J6126J0890j5154j0886J0967R985J658l203j4277
$$ 14431 8857 2865 -8252 -13061 3065 13955 -1199 -12085 -1118 8867 10525 7322 -6955
810f955j2263J4875K1000j555r967o904r768J268J9461P222j4872p575N295M452
$$ -6955 -19218 -4343 16657 15102 5135 -1769 -11537 -10269 9192 16414 1542 -6033 -738 3714
824C714N225k84j7252p867K1756J6411r292j2931p605n675J0294K0503j63j5754
$$ 3714 8939 8655 -8597 -16464 5292 21703 12411 -520 -8125 -13800 -3506 16997 16834 1080
838A080o241L26K155R748L102j4450m296J6621P461j1130j0799o587L426K0882
$$ 1080 -5161 -4835 -2680 7068 10170 -4280 -8576 8045 15506 4376 -6423 -13010 -9584 11298
852A1298J2471j6451j8693O13M674O794J4007j997k0551m853J4594O904n340o639
$$ 11298 23769 7318 -11375 -10762 -6088 706 14713 12716 -7835 -12688 1906 8810 3470 -3169
866c169q884L353K0914O562j9588j5046K717P205J2137J1212j1173k0571Q70J2181
$$ -3169 -12053 -8700 12214 18776 -812 -15858 -13141 -5936 6201 17413 6240 -14331 -13461 -1280
880a280M092J386k481j1597J435J8147P00j9180q117P723R970J2618K132k1520
$$ -1280 2812 4198 1717 -9880 -8445 9702 10402 -8778 -16895 -9172 798 13416 15548 -5972
894e972j7317R559J5932P022K065j0499j7960M172J9193J819j1671l821L70M986
$$ -5972 -23289 -13730 2202 9224 11289 790 -17170 -12998 6195 8014 -3657 -7478 -7108 -2122
908b122J3073p19k1512q714J4262J2041M668q6j5036j5593R742J8938k01q475
$$ -2122 10951 10232 -11280 -19994 -5732 6309 10977 10891 -4145 -19738 -9996 8942 8741 266
922B66l766l179M649J2123m927j7532M80J4555P393K336n512j9548q090J9590
$$ 266 -3500 -6679 -2030 10093 5166 -12366 -11886 2669 10062 12398 6886 -12662 -20752 -1162
936a162J7905l570r511r005p638Q922J7547m124j4348j6Q007L060K612n301j4675
$$ -1162 16743 13173 3662 -5343 -12981 -4059 13488 9364 -4984 -5000 3007 6067 8679 3378 -11297
951a1297Q03J8822P627p527p556q928m312J5384J5070r956j3451J792M566L919
$$ -11297 -10494 8328 15955 8428 872 -8056 -12368 3016 18086 8130 -5321 -3529 1037 4956
965D956M436p863j3225P496J7871j15j0349o882q026K054J9982J0047j4088j3760
$$ 4956 9392 1529 -11696 -4200 13671 13556 3207 -3675 -11701 -9647 10335 20382 6294 -7466
979g466j557L133J0909Q651j0981j3744Q158J2167m303o351l440m387O847J6506
$$ -7466 -9023 -5890 5019 13670 2689 -11055 -2897 9270 4967 -1384 -4824 -9211 -2364 14142
993A4142j630j7009p004K502N527J3421N179j8140j3869J1325J2277r05m798p534
$$ 14142 12512 -4497 -11501 -8999 -3472 9949 15128 -3012 -16881 -5556 6721 5816 1018 -6516
1007f516n419J1487J3843q021j3838k337K011O063J5478P75k1523j0289J1478
$$ -6516 -11935 -448 13395 5374 -8464 -10801 -8790 -2727 12751 13526 -7997 -18286 -6808
1020f808J0681K091j637j0267o520J2220R590r418r300K362K320O666J0107p901
$$ -6808 3873 5964 4327 -5940 -12460 -240 9350 -68 -9368 -7006 -4686 1980 12087 4186
1034D186j9084r22J4342Q433L125n157j6707m452J7467J0196q616p424j878o19
$$ 4186 -14898 -15820 -1478 6955 10080 4923 -11784 -16236 1231 11427 2811 -4613 -6491 -7110
1048g110J0069R839j0474j5964M040J1450N287L262o736j6621n7J7502P035o944
$$ -7110 2959 12798 2324 -13640 -9600 1850 7137 10399 3663 -12958 -13015 4487 11522 4578
1062D578n257n101j498J2986O658j3566r618Q584P778K690N55j0406j3217Q330
$$ 4578 -679 -5780 -7278 5708 12366 -1200 -10818 -2234 5544 8234 8789 -1617 -14834 -6504
1076f504J8116J704q236p349p679K286J7810N828j5092r092N083N608O364J828
$$ -6504 11612 13316 5080 -2269 -9948 -7662 10148 15976 884 -8208 -3125 2483 8847 10675
1090A0675j2773j0192J1875J1913k750n518m674q246M811J7404J004j4931n826
$$ 10675 -2098 -12290 -415 11498 8748 3230 -1444 -9690 -4879 12525 13529 -1402 -7228
1103g228M374N112O979q51j4817m348J4426P591n812m698o699n605J1459J6044
$$ -7228 -2854 2258 9237 8386 -6431 -10779 3647 11238 5426 728 -5971 -11576 -117 15927
1117A5927n515j5844m550K957P872J1695l333j8072l126J3346N061k822k417p841
$$ 15927 10412 -5432 -9982 -7025 847 12542 9209 -8863 -11989 1357 6418 3596 1179 -6662
1131f662m165J2638J0039q963j0155o52J357Q536J0256q874j6935K931J3140L049
$$ -6662 -10827 1811 11850 2887 -7268 -7920 -6563 1973 12229 3355 -13580 -10649 2491 5540
1145E540j879m845j0145Q40J6079N296j2020p818J2J836J1581Q736j2551j5545
$$ 5540 3661 -1184 -11329 -10489 5590 10886 -1134 -8952 -8940 -7104 4477 13213 662 -14883
1159a4883M646J1034M172P57n811j2186L341J4803J540r249l168j819R95J1890
$$ -14883 -10237 797 4969 5726 -85 -12271 -8930 5873 7413 -1836 -5004 -6823 -5828 6062
1173F062M565j4531r224Q899Q013K210K04r509j0071Q561J4794j848r205m418
$$ 6062 10627 -3904 -13128 -4229 3784 5994 6198 -3311 -13382 -4821 9973 8125 -1080 -5498
1187e498k824N146J4044K80j6817n656Q439N961N239J046j3199r470J1883J2258
$$ -5498 -8322 -3176 10868 11148 -5669 -11325 -2886 3075 8314 9360 -3839 -13309 -1426 10832
1201A0832l119o444m514m369O822J3124l924j3860p83O503L630N271k151j4018
$$ 10832 7713 1269 -3245 -7614 -792 12332 8408 -5452 -6235 268 3898 9169 7018 -7000
1215g000l199J4450P577n430n497o458k660J2085J1381r190j3193J472M319N920
$$ -7000 -10199 4251 11828 6398 901 -5557 -8217 3868 15249 6059 -7134 -5662 -1343 4577
1229D577P585n367j6321l09J4749M885m116m165p637k606J3354Q377j0324q293
$$ 4577 12162 6795 -9526 -9835 4914 9799 5683 1518 -6119 -8725 4629 13006 2682 -5611
1243e611J607J861N805O742q803j2872N612J2052M88l632m985q004K826J5805
$$ -5611 -4004 -2143 3662 10404 1601 -11271 -5659 6393 6881 3249 -1736 -9740 -6914 8891
1257H891K581j3124o640J871L187R079N036j2815j1295O998J0131J744j023p223
$$ 8891 11472 -1652 -8292 -6421 -3234 5845 10881 -1934 -13229 -6231 3900 5644 4621 -2602
1271b602j0343O464J5162j292j0935l046J50K429R725K099j3479o896R658O743
$$ -2602 -12945 -6481 8681 7389 -3546 -6592 -6442 -4013 5712 7811 -5668 -12564 -2906 3837
1285C837K08j518q628o956J0821J2526n761r859k349l33O032J1869k358j6034
$$ 3837 4045 2527 -6101 -13057 -2236 10290 4529 -5330 -7679 -8012 -1980 9889 7531 -8503
1299h503l786R835O450K446j955j2151n414J3208R604o287n767k699l015P550
$$ -8503 -12289 -2454 3996 6442 4487 -7664 -13078 130 9734 3447 -2320 -5019 -8034 -484
1313d84J1465n411j3773K64P545M195L863l322j3293k09J4035M860o904m589l661
$$ -484 10981 5570 -8203 -7939 -394 3801 7664 4342 -8951 -9160 4875 9735 2831 -1758 -5419
1328e419j073J1222Q697j0483j1499L061O128N402N231o895j4974K046J5269L422
$$ -5419 -6492 4730 13427 2944 -8555 -5494 634 6036 11267 4372 -10602 -8556 6713 10135
1342A0135n521m424o285j60J3022N621j0540p266K726K539N352N225q579j1746
$$ 10135 4614 190 -6095 -6255 6767 12388 1848 -5418 -2692 -153 5199 10424 1845 -9901
1356i901O615J1624p15m654m264o325M041J3759N26j2250m900L380L345P568K124
$$ -9901 -3286 8338 7623 2969 -1295 -7620 -3579 10180 10706 -1544 -6444 -3064 281 7849 9973
1371I973j2461q694R169R051o06k408o522p996O934J3854k376j0488k847N52K954
$$ 9973 -2488 -11182 -2013 7038 6432 4024 -2498 -10494 -3560 10294 7918 -2570 -5417 -4865 -1911
1386a911R091j08j2631l721J0025L817k490j001n630m736R878R142o753r241n56
$$ -1911 7180 7072 -5559 -9280 745 4562 2072 1071 -4559 -9295 583 9725 2972 -6269 -6825
1401f825J499N991R135n529j4409k97J0590L606L13l137r591j465J2639O481q773
$$ -6825 -5326 665 9800 4271 -10138 -10435 155 3761 4074 937 -8654 -10119 2520 9001 228
1416B28n634o02o78P204R316p563j2755K648P995K926J636m602j0405K873J3313
$$ 228 -5406 -6008 -6686 518 9834 2271 -10484 -7836 159 3085 4721 119 -10286 -7413 5900
1431E900P35r050k365n22J308R131M899j1854r429N308P677M452J977q613j2004
$$ 5900 6635 -2415 -4780 -5302 -3994 5137 10036 -1818 -11247 -5939 1738 6190 8167 -446 -12450
1446a2450N210J4789J046p544l925l735K368J1934J856j1756n342N274M138M234
$$ -12450 -7240 7549 8595 1051 -2874 -6609 -4241 7693 9549 -2207 -7549 -2275 1863 6097
1460F097K733j0169r751Q153J1490j354m619m484m880M957J2709k973j2293j430
$$ 6097 8830 -1339 -11090 -2937 8553 7199 2580 -1904 -6784 -1827 10882 7909 -4384 -5814
1474e814O187K681M766K4j2803n805J1379R295k003m318p118o594R202J2989m216
$$ -5814 373 3054 7820 7844 -4959 -10764 615 9910 7907 3589 -3529 -10123 -921 12068 7852
1489G852j0563r71J435L054P100j418j2212j492J0674L622k868k719o437l504
$$ 7852 -2711 -3682 -2247 807 7907 6489 -5723 -7215 3459 7081 4213 1494 -4943 -8447
1503h447J0582Q828o892q631j82J457M841P032n486j1613K783R858N67k173k895
$$ -8447 2135 10963 4071 -4560 -4742 -3285 1556 8588 3102 -8511 -5728 4130 4697 2524 -371
1518c71p715L49J2828M963r142o438r64K20Q127P642p869j0242L672O197j71N08
$$ -371 -8086 -7737 5091 10054 912 -5526 -6490 -6270 1857 9499 1630 -8612 -4940 1257 1086 1594
1534A594k343o890L427J0514j304r054k436J030K271Q804K712j1903p823P093
$$ 1594 -749 -7639 -4212 6302 4998 -4056 -6492 -5462 -3191 5613 8325 -3578 -11401 -4308
1548d308O095J324Q61o669p829P620J0750m110p895j390l64L830J0026o19j2975
$$ -4308 1787 3111 3972 -2697 -10526 -2906 7844 3734 -4161 -5551 -5915 -2085 7941 7322 -5653
1563e653m353O198N221M274M14r705o500R024P874m951m624L99j737N169Q383
$$ -5653 -10006 -3808 1413 5687 6101 -3604 -10104 -1080 6794 1843 -2781 -2382 -4119 1050 9433
1578I433n802j1915J169P374M535L686l617j2649l046J3068O937m424m336m196
$$ 9433 3631 -8284 -7115 259 4794 8480 4863 -7786 -10832 2236 9173 4749 413 -3783
1592c783k204Q365Q244p411r058J894M374L725N018m670j2916K60J2365M727l258
$$ -3783 -5987 2378 10622 3211 -5847 -3953 421 4146 9164 4494 -8422 -8162 4203 8930 5672
1607E672l630o506k292J0456N990p734n704K751J661K902M005o621j0147N134
$$ 5672 2042 -4464 -6756 3700 9690 1956 -3748 -997 664 3566 7571 950 -9197 -4063
1621d063J1116J216l728n389q037K399J3903L519r715n198N41L65O336N011q317
$$ -4063 7053 8269 4541 -848 -8885 -6486 7417 10936 1221 -3977 -3436 -3071 3265 8276 -41
1636d1p688N640P045p15j450n020o906N433J1987j151r051k647n6J212Q353J802
$$ -41 -7729 -2089 4956 4241 2791 -2229 -9135 -3702 8285 7134 -1917 -4564 -4620 -3408 4945 6747
1652F747j0034m033O929L266j462o97n168m654Q576R881n180q753k463j86N553
$$ 6747 -3287 -7320 -391 2875 1413 716 -4452 -9106 -530 9351 4171 -4582 -7045 -7231 -1678
1667a678R967j765j2342k433N942K377J565O97o083l736Q464M781o055m370k47
$$ -1678 8289 6524 -5818 -8251 -2309 68 1633 2330 -3753 -7489 975 5756 -299 -4669 -4916
1682d916j45O239P603o342j1237J545O842K725J872k165q585l93J0275K295o428
$$ -4916 -5061 1178 8781 2439 -8798 -7253 -411 2314 4186 2021 -6564 -6957 3318 5613 -815
1697h15k467j053k77Q745O115j0003r727L109O266M735L516n861j0825K225J0360
$$ -815 -3282 -4335 -4612 4133 10248 245 -9482 -6373 -107 4628 8144 2283 -8542 -6317 4043
1712D043O57l895m04k935o81P682K821q982m701M723M292M052J310r833q422P503
$$ 4043 4700 805 401 -2534 -3215 4467 7288 -1694 -6395 -1672 2620 6672 7982 -1851 -10273 -2770
1728b770J0306j014l829l424m709K755R785M04r160k210K941K429N702P53j0921
$$ -2770 7536 6522 2693 -731 -5440 -2685 7100 7504 -1656 -3866 -925 1504 7206 7959 -2962
1743b962o808Q806Q620p69k923n790n670N635R351j905p227J58O07L88N820k60
$$ -2962 -9770 -964 7656 6887 3964 -1826 -7496 -1861 7490 5585 -1642 -1484 -877 -489 5331 5071
1759E071j0106j490R344L944k527l476o164l152J0562Q099n842q273j89K12L715
$$ 5071 -5035 -6525 2819 6763 4236 760 -5404 -8556 2006 10105 4263 -4010 -4199 -3987 -272
1774b72P154k638j0410L09O988K219n13k118p560j221J1041N547p393n446j04
$$ -272 6882 4244 -6166 -5857 1131 3350 2837 719 -6841 -8062 2979 8526 1133 -4313 -4417
1789d417j142N699P010n507q638K592N462M8P73k150p174J905J0557R66p261m302
$$ -4417 -5559 140 7150 1643 -6995 -4403 1059 1107 1880 -270 -7444 -5539 5018 5984 -1277 -5579
1805e579j084K187Q690M483r965q012M495M844J604K527l981p799K724Q730k97
$$ -5579 -6663 -4476 4214 8697 -1268 -9280 -4785 59 1663 4190 209 -7590 -4866 3864 3567
1820C567m843j597k522K090Q874J337j0556m275N233L718K656J226o614n911O095
$$ 3567 -1276 -2873 -5395 -3305 5569 6906 -3650 -7925 -2692 1026 3682 4908 -1706 -7617 -1522
1835a522O599k149l613j457k705L712R444k045j1104k358N817L909M420o97j0103
$$ -1522 5077 2928 -685 -2142 -4847 -1135 8309 6264 -4840 -7198 -1381 2528 6948 6251 -3852
1850c852m813Q671O294k308j903l437l511M518P851l110p623L91K634L084M042
$$ -3852 -8665 6 6300 3992 2089 -1348 -4859 -341 7510 4400 -3223 -2832 -198 2886 6928
1865F928k974r829j67R517L025k813k330m294k074P619N764n672n941O89K048
$$ 6928 3954 -5875 -6042 3475 6500 3687 1357 -2937 -5011 2608 8372 2700 -3241 -2552 -504
1880e04M113M370n499r816K135R131K261j803k952p383j93J0178L422o132l803
$$ -504 3609 7979 2480 -7336 -5201 3930 6191 4388 1436 -5947 -6140 4038 7460 1328 -2475
1895b475J46k67M483M815o299p295M148O235%j162l807n628L545R662l03p600
$$ -2475 -2329 -2596 1887 6702 403 -6892 -2744 3491 3491 2329 -1478 -7106 -3561 6101 5798 -1802
1911a802k746o8K081P164J406q598n549N531M734R05R4n936o284N797R393k065
$$ -1802 -4548 -4616 -2535 4629 6035 -2563 -8112 -2581 2153 3058 3152 -2784 -9068 -3271 6122 4057
1927D057o026k395j320K497Q239Pr134k470M763K693J031K14o123l560P157N998
$$ 4057 -1969 -4364 -5684 -3187 5052 5059 -4075 -6545 -1782 911 1942 2156 -3967 -7527 -370 5628
1943E628m227m260j580j011N433P268l962r808l2N651K768K659j244q624k121
$$ 5628 1401 -2859 -4439 -5450 -17 7251 3289 -6519 -6551 -900 1868 4527 3283 -5341 -7462
1958g462Q460M352l282k919k878j785O588O622n142p886J421L744K331L373k745
$$ -7462 998 5350 2068 -851 -3729 -5514 1074 7696 2554 -5332 -3911 -167 2164 5537 2792
1973B792q407Q02Q142J596l605j525l072k67P781L891p712n912L188L127L651
$$ 2792 -5615 -4813 3329 4925 1320 -205 -3277 -3544 4237 8128 416 -5496 -2308 819 4470
1988D470K661o358q203L805Q620M11k240k652n303J253R240J991p658l802J850
$$ 4470 7131 773 -7430 -3625 4995 5406 3166 514 -4789 -3536 5704 7695 37 -3765 -1915
2003a915J540M829K615p278o230N054N889o46j189k937m855L522Q344j133p635
$$ -1915 -375 4454 7069 -209 -6439 -1385 4504 3858 2669 -268 -5123 -1601 6743 5610 -2025
2018b025j955J675K768N470l06r328l598P038M430j26j290n406m892O247Q624
$$ -2025 -3980 -2305 463 5933 5627 -3701 -7299 -261 4169 4043 2753 -2653 -7545 -1298 7326
2033G326k691o630j595m45L046O734j299r029j543N650K499L69n57o080k477P320
$$ 7326 4635 -1995 -3590 -4035 -989 5745 4446 -4583 -6126 -476 2023 2392 1835 -4245 -6722 598
2049E98N066m869l818n91k60M151N570m512q554J310O290J727J063k635p662n6
$$ 598 5664 795 -3023 -3614 -3874 277 5847 1335 -7219 -5909 381 2108 3171 536 -7126 -7182
2065g182R563K974m907l076j586j093O579N102n674p047K241L487K381K135l775
$$ -7182 2381 5355 448 -2628 -4214 -5307 1272 6374 700 -6347 -4106 -619 1762 3897 122
2080A22p029K721P903J11m856j059j481N24O751J859p461l892L616L095K501J309
$$ 122 -6907 -4186 3717 3828 -1028 -2087 -3568 -3044 3707 5566 -1895 -5787 -2171 924 3425 4734
2096D734o190o043N437P156q02l456k426l410K788Q367n1q021k382K752J926L757
$$ 4734 -1456 -7499 -2062 5094 4292 836 -1590 -5000 -2212 6155 6104 -1917 -4299 -1547 379 4136
2112D136J666p286m523O169M837j550k322k248k840M636O490l036p083q6K865
$$ 4136 5802 -1484 -6007 162 4999 3449 1127 -1121 -3961 675 7165 4129 -2954 -3040 -175
2127a75K375L851j687q644j566P981L376j863k016m585k484P149O541m838o129
$$ -175 2200 6051 4364 -4280 -5846 2135 5511 3648 1632 -2953 -5437 1712 8253 3415 -2714
2142b714m24J411L669N488m087q719M25O677K293n56j829n509j167P255L876n169
$$ -2714 -3138 -1727 1942 7430 3343 -5376 -4951 1726 4019 3463 1634 -3875 -5042 2213 6089 920
2158I20l864M80K17M540L979n964p250L158O456R77r35l008o259J570Q637J795
$$ 920 -2944 -2464 -2247 2293 6272 308 -6942 -3784 2672 3649 2714 -294 -6553 -4983 3654 5449
2174E449n292l369j423M18O769L729p216n858L327L950J226R59l733o240L168
$$ 5449 157 -3212 -4635 -4217 2552 6281 -935 -6793 -3466 484 1710 2669 -1064 -7304 -4136
2189d136Q057n91m514j404j404P37O459J344p672k794M240K627J266M58n718l901
$$ -4136 3921 3330 -1184 -2588 -3992 -3255 3204 4548 -3124 -5918 -1678 949 2215 2673 -3045 -6946
2205f946N666O414k515l704k611k076M180P749j517q146j469L260J745L142L26
$$ -6946 -1280 5134 2619 -1085 -3696 -5772 -1592 6157 4640 -3506 -4975 -1715 30 3172 3498
2220C498n927l140N404M009k233j989k076j412M642N984m568o497J124L551J385
$$ 3498 -2429 -5569 -165 3844 1611 -378 -2454 -3866 776 6760 2192 -4305 -3181 370 1755
2235A755K862j972o874m9O777J871k454j472l505o44O857M494o574n572J790K614
$$ 1755 4617 2645 -4229 -4278 2499 4370 1916 444 -3061 -3705 3152 7646 1072 -4500 -2710 -96
2251i6L542L298m387p367J711O013R29q75j529m095l57P153J812o181k313J845
$$ -96 3446 6744 2357 -5010 -3299 2714 3643 2768 1239 -2856 -3213 3940 5752 -429 -2742 -897
2267h97J604L159J858o778n625N004O237l54j734l217m287K317Q127n1o001k647
$$ -897 707 3866 5724 -1054 -6679 -1675 4562 4208 2474 -743 -5030 -2713 5414 5363 -638 -3285
2283c285Q61J904N123Q83p855m139N142M734N81q90n190m892M205P762q84m953
$$ -3285 -2424 -520 4603 5486 -2369 -6508 -1366 3368 3949 3059 -2131 -7023 -2818 4944 4060 -893
2299h93j712m94J067N758m45p076j198M765K336K97j148n723k819P315N823l230
$$ -893 -2605 -3099 -2032 3726 3281 -3795 -4993 -228 2108 2405 1257 -4466 -7285 30 5853 2623
2315B623m736j984q60L732O585k141p459m27L675J011K852j221o397j324P077
$$ 2623 -2113 -4097 -4957 -1225 5360 3219 -4240 -4667 -992 19 2871 1650 -4747 -6071 1006
2330A006L592l580l075k160o77N057N227m203n510J053K280J016K922j780n995
$$ 1006 4598 1018 -2057 -4217 -4894 163 5390 1187 -4323 -3270 -990 26 2948 1168 -4827
2345d827J253O799O56l759k292j523M75O889L274o698n100J451K618K904L228
$$ -4827 -3574 3225 3881 122 -2170 -3693 -3218 3671 6945 247 -4853 -3402 -784 2120 5348
2360E348l728o369J995N369P1j479j056l064J152O378N78o764k182K439J720L102
$$ 5348 1620 -4749 -2754 2615 2686 1207 151 -2913 -1761 4617 5195 -1569 -3751 -1312 408 3510
2376C510J808n622m922M348M444q78r54j852k919K833O088k013o247p05K306K583
$$ 3510 5318 -304 -5226 -878 3566 2688 1734 -118 -3037 -204 5884 3871 -2376 -3081 -775 1808
2392A808L958q33p910l127N712M127K68j017l838m329M470N630k260m046L39K59
$$ 1808 5766 4933 -2977 -6104 -392 3735 4003 2986 -852 -5181 -711 4919 2659 -1387 -1048 -789
2408g89J611L390j907o506l01O135K277p25k085m644j847O669M259l802l539p10
$$ -789 822 4212 2305 -4201 -4502 1633 3910 3185 1100 -3544 -5391 1278 5537 1735 -1804 -2514
2424b514R6L179M157m022o797J945O042R37j68k628o429K60P933L352l853k996
$$ -2514 -2418 761 4918 896 -5901 -3956 2086 3023 2855 227 -6202 -5942 1991 5343 1490 -1506
2440a506k114p51M774L931m182m723K594K633L6Q05k758m888K939P346k05m669
$$ -1506 -3620 -4371 403 4334 152 -4571 -1977 656 692 1497 -1261 -6149 -3210 4136 3931 -738
2456g38k227k203J430O683K386o153m097K708J933J519J796m241m871M342N614
$$ -738 -2965 -5168 -3738 2945 5331 -822 -4919 -2211 -278 1241 3037 -1204 -6075 -1733 3881
2471C881q94l685j771j952K096O892J58o306k384J750R66L432J619m735l616M441
$$ 3881 2987 -698 -2469 -4421 -2325 4567 4725 -1581 -3965 -2215 -1249 2183 3802 -933 -4549 -108
2487a08L747k308j950j307j365M278N320l217o386r16K891K038M607m63p192k343
$$ -108 3639 1331 -619 -1926 -3291 987 6307 3090 -3296 -4212 -1321 717 5324 4861 -2331 -4674
2503d674N066L187j355m70k956k100M452M514m043m513J090J451K567L306k314
$$ -4674 392 3579 2224 1754 -1202 -3302 1150 5664 1621 -2892 -1802 -351 2216 5522 3208
2518C208o829j32N355J347k1j083l743j326N719K521m871l025K081J240K507K485
$$ 3208 -3621 -3753 1602 2949 2928 1845 -1898 -3224 2495 5016 145 -2880 -799 441 2948 5433
2534E433n568n732L149N085J278q0k476n946M07P087K097m193j597n77k2L965
$$ 5433 -135 -5867 -2718 2367 3645 3565 1089 -4857 -4450 2637 4734 541 -1056 -1633 -1655 2310
2550B310J604n149l531L935K827M29j51l355m609L017O613o55m025j112r35P60
$$ 2310 3914 -1235 -4766 -831 1996 2425 2274 -1081 -5690 -2673 3940 3285 -740 -1852 -2787 -2027
2566b027M632L59n913k088M753K075L03p32m549l304N326N535j664l421j965k681
$$ -2027 2605 2964 -2949 -5037 -284 1791 2094 1362 -3187 -6491 -1165 4370 2706 -715 -2680 -5361
2582e361K899O344o03n930q79K231Q21J805J59m476k045O117K711l467k214j294
$$ -5361 -2462 3882 3279 -2651 -3530 -1299 -478 1327 1486 -2990 -5035 1082 3793 326 -1888 -3182
2598c182n55L854M929l346n381M61K165J204L150j346n961k91O361J544k820k138
$$ -3182 -3737 117 5046 1700 -3681 -3220 -1055 149 3299 1953 -4008 -4299 2062 3606 786 -1352
2614a352j742l69N614L602m392m493Q65J578J451L778k220n937P07N198M0j152
$$ -1352 -3094 -3463 2151 5753 1361 -3132 -2267 -689 762 4540 2320 -3617 -2910 2288 2328 1176
2630A176j098k403N38N423J302n823k443K232J462K826K292n101n132L062M701
$$ 1176 78 -2325 -1787 3636 4938 -885 -3328 -1096 366 3192 5484 383 -4749 -1687 3014
2645C014J99j082j930l780J810O140k95m878j439R52J241L815J015n989l368L741
$$ 3014 3213 2131 201 -3579 -1769 4371 4076 -802 -2241 -1289 -48 3767 4782 -1207 -4575 -834
2661h34L344L7N13l153l771K875N372j842l743n1N07J219L548j459n960n80M513
$$ -834 2510 2547 3060 -93 -3864 -989 4383 2541 -1202 -1253 -746 473 4021 2562 -3398 -3978 535
2678E35K197K5r49m677k636N616M398k415l365p84j240K689M880k557n740N53
$$ 535 2732 2757 1808 -2869 -5505 111 4509 2094 -1271 -2055 -3295 -606 4274 1717 -4023 -3470
2694c470L586J039R53r25m826q78N191K948l355j714j028p74L629L829m059m486
$$ -3470 116 1155 2108 1183 -3643 -4521 670 3618 263 -1451 -2479 -3253 376 4205 146 -4340
2710d340K108K530R09Q71k199n432J862O238J153l499k370j663P3N700K453m668
$$ -4340 -2232 298 1207 2078 -121 -5553 -3691 2547 3700 201 -2169 -3832 -3759 1941 4394 -274
2726b74l500J269J909J470K424l622m483K571M695m36k047o87k407J119N251L87
$$ -274 -3774 -2505 -596 874 3298 -324 -4807 -2236 2459 2023 -24 -711 -3118 -1999 3252 3639
2742C639n166j795K244J207J859J438m568l389M106M097j318j616j822k554K987
$$ 3639 -1527 -3322 -1078 129 1988 3426 -1142 -4531 -425 3672 2354 738 -1084 -3638 -651
2757f51N800j395m810j253Q73J156L940N89n574k510M213K681r08j69k474k528
$$ -651 5149 3754 -1056 -2309 -1436 -280 3660 4249 -1325 -3835 378 3059 2151 1982 -492 -3020
2773c020L658M093k639l741L72Q63J039L598j699n556J17M659J548j233p43l517
$$ -3020 638 4731 2092 -1649 -1277 -414 625 4223 2524 -3032 -2915 1744 3292 2059 1316 -2201
2789b201j137M963L626l844l226K82k29L121L570k948n362Q57L804P33jp34m198
$$ -2201 -3338 1625 5251 1407 -1819 -1537 -1766 1355 4925 1977 -3385 -2528 1276 2009 2008 1274 -2924
2806b924k24N007J698l142k237J51k29L367K251m179m016K716K893L72N37k527
$$ -2924 -3148 1859 3557 415 -1822 -1671 -1900 1467 3718 -461 -4477 -1761 1132 1504 2041 -486
2822d86m468K155N924j15l860j286j018Q20M895J382n528k908K803K090J195N74
$$ -486 -4954 -2799 3125 3010 -850 -2136 -3154 -2334 2561 3943 -1585 -4493 -1690 400 1595 2169
2838B169l408l892L016M617o60k541r48j544J147N165o08n142q96K840R45J498
$$ 2169 -1239 -5131 -2115 2502 1842 -699 -1647 -3191 -2044 3121 2513 -2629 -3525 -685 260 1758
2854A758K77m729k135M596L768j948k127j863j480L504N287k336n453l24J901
$$ 1758 2035 -2694 -4829 -233 3535 1587 -540 -2403 -3883 -379 4908 2572 -2881 -3205 -1304
2869a304J681K569r1n766j546M758K773j384j094k170j955M191L814l295l235
$$ -1304 377 2946 2855 -2911 -4457 301 3074 1690 596 -1574 -3529 662 4476 1181 -2054
2884b054R19R10Q95K717j567m896R52M083O54r57j094k959k72N681J987m303k750
$$ -2054 -1135 -225 670 3387 1820 -3076 -2124 1959 2613 1656 562 -2397 -2669 3012 4999 696 -2054
2901b054N18P53K850K688k985n277J587L872N23m08o53m093O83N007O58l773q94
$$ -2054 -1536 -783 2067 4755 1770 -3507 -1920 1952 2475 2067 1414 -2679 -1996 3011 3669 -104 -998
2918i98J7k2L408J744m424k820K755K152n64K52j554l386K394N020j139l822r89
$$ -998 -981 -1003 2405 4149 -275 -3095 -340 1812 1248 1500 -54 -3440 -1046 3974 2835 -987 -1976
2935a976K58J113L911n2n563j746L509J782O04K05l450l229L792M170j919k232
$$ -1976 -1718 -605 3306 3254 -2309 -4055 -546 1236 1840 2045 -1405 -4634 -842 3328 1409 -823
2951h23o87r40J382M356j633m456lK774P54P64k17m249j394N000K523k536k369
$$ -823 -1510 -2450 -1068 3288 1655 -2801 -2804 -30 724 1488 1271 -2978 -4372 628 3151 615 -1754
2968a754n94o55L319L547l138m693J054K441J344J597j506n143k10N439J695k188
$$ -1754 -2348 -3003 316 3863 725 -3968 -2914 -473 871 2468 962 -4181 -4391 1048 2743 555
2984E55j153k060q83M071L391l332l513J304R54J115K022k219m343J497M933k91
$$ 555 -598 -2658 -3541 530 3921 589 -2924 -1620 -666 449 2471 252 -4091 -2594 2339 2048
3000B048k111j039k074P24N336J594m789k809J481J221K568J795l624m250K626
$$ 2048 -63 -1102 -3176 -2452 2884 4478 -311 -3120 -1639 -418 2150 3945 321 -3929 -1303
3015a303L657o8q61j538k720J372N260J45m400q66K48N44K938J774m679k777L147
$$ -1303 2354 2286 1425 -113 -2833 -1461 3799 3944 -456 -1322 -1074 -530 2408 4182 -497 -3274 -127
3032a27K485r06J89j642k522K324M565k094l952L92J58J442L852o54n600j325
$$ -127 2358 1452 1641 -1 -2523 -199 4366 2272 -1680 -1288 -1130 312 4164 3510 -2090 -3415
3048c415L877J620N4J49l099k377L279L291k096j997K1r63J875L413j664m752
$$ -3415 462 2082 2136 2285 -814 -3191 88 3379 1283 -714 -693 -1656 219 3632 1968 -2784
3064b784M29L114L11N96m02l442r62L992J990k959j172Q8l06K430K299l383m080
$$ -2784 -2355 759 1070 1666 1264 -2178 -3140 852 2842 -117 -1289 -1201 -1507 923 3222 -161 -4241
3081d241K289K743O61O54j747m929N28O091N61k596j182j020r81L724K026l724
$$ -4241 -1952 791 1452 2106 359 -4570 -4042 2049 2610 14 -1168 -2188 -3169 555 2581 -1143
3097a143j957K045J054O17J168k607l452K544M197o31k393p75j726Q97M628L59
$$ -1143 -3100 -1055 -1 616 1784 -823 -4275 -1731 2466 1835 -558 -1333 -3059 -2162 2466 2825
3113B825m527j309K041N18J481J114l627k977M068L539j288j945j727k031K330
$$ 2825 -1702 -3011 -970 -452 1029 2143 -1484 -4461 -393 3146 1858 -87 -1814 -3845 -1515
3128a515N453p89m666r72J127Q78J957J303l938j628L589J182j414n38j280j488
$$ -1515 3938 3149 -1517 -2489 -1362 -484 1473 2776 -1162 -2790 799 1981 567 29 -1251 -2739
3144b739L654L808l017l803L74Q27J680L099j230m826n59M007R32j020j24k104
$$ -2739 915 4723 1706 -2097 -1723 -896 784 3883 2653 -2173 -2732 1275 2207 1187 1063 -1041
3160a041j592M428K801l542k691L94m53K577L963k662m718M14L110K12P45j94
$$ -1041 -2633 1795 4596 1054 -1637 -1243 -1696 881 4844 2182 -2536 -2122 988 1200 1945 1751
3176A751l039n90M186L13k961p61K67J51K864K219m407l763K180K906J052O3j922
$$ 1751 -1288 -1878 2308 2621 -340 -1101 -834 -683 2181 4400 -7 -3770 -1590 1316 2368 2431 509
3193E09l501P28M758k53k629j64o61j47L482J077m673j949K647J823M19O92k922
$$ 509 -2992 -2264 2494 2241 -388 -552 -1213 -1360 2122 3199 -1474 -3423 -776 1047 1466 2158 -764
3210g64l502K742L603q83j881L61j556P84L370q57m169J15K613J149L78m20m358
$$ -764 -4266 -1524 2079 1196 -685 -324 -1880 -1096 2274 1417 -2752 -2637 -24 1125 1503 1083 -3275
3227c275j518M316L590j763j770j619j398K118M502j661l545J68R72M87J496K25
$$ -3275 -4793 -477 3113 1350 -420 -2039 -3437 -1319 3183 1522 -2023 -1855 -883 -396 1100 1325
3243A325m364k18M216J515k139o91j556j589L767L254k821k837P47R42O40J738
$$ 1325 -3039 -3257 959 2474 335 -356 -1912 -3501 266 3520 699 -2138 -1391 -449 191 1929
3259A929j085l947J213L942J79j415j489k195J89N060K038l939k547L21M45K311
$$ 1929 844 -3103 -1890 2052 2231 816 -673 -2868 -2679 2381 4419 480 -2067 -1746 -1301 1010
3275A010K335j963m164J973K177k91j00k98k597R11M121K18l915r50N24P95K615
$$ 1010 3345 1382 -2782 -809 1368 1077 977 679 -1918 -1007 3114 3332 -583 -1533 -1009 -214 2401
3292B401J543m365k438K369K208o2K56j487k810J986M135j625l028k0l19J429
$$ 2401 3944 -421 -2859 -490 1718 1656 1912 425 -2385 -399 3736 2111 -917 -937 -1256 173
3308A73L428K65m949k020K413J809N50N68k239k772K314L257k127j192J34o49
$$ 173 3601 3866 -1083 -3103 -690 1119 1669 2237 -2 -2774 -460 2797 670 -522 -388 -1037
3324a037J239K478r71m560J09K993J159P31o30l725j836M213K485k142r95o59
$$ -1037 202 2680 1709 -2851 -2742 251 1410 2141 1511 -2214 -4050 163 2648 506 -489 -1148
3340a148p20K043K899k497l599Q24K059J198O04p14m252j16M131J334j800o69
$$ -1148 -1868 175 3074 577 -3022 -2198 -139 1059 1663 949 -3303 -3419 712 2046 246 -423
3356d23j336q82K515K620l273j866J770J147J61J087k233l496K221M294m50j759
$$ -423 -1759 -2641 -126 2494 -779 -2645 -875 272 433 1520 -713 -4209 -1988 2306 1856 97
3372I7j060j995O4M687J063l436j694J063L88J928J410l287k748K508L055p49
$$ 97 -963 -2958 -2894 1793 2856 -580 -2274 -1211 -823 1105 2515 -772 -3520 -1012 2043 1294
3388A294p17j139k266J532L649j35k958l97M55L6K218P14l123j681L148J432r65
$$ 1294 577 -562 -2828 -1296 2353 2218 -740 -1137 -682 -646 1572 2286 -837 -2518 630 2062 1097
3405A097q91j252j821L235L827k017l381j74K72J133L078j73m460j163L205J043
$$ 1097 206 -1046 -2867 368 4195 2178 -1203 -1377 -1105 28 3106 2933 -1527 -2690 515 1558
3421A558m6L06k502j401L111K292k405j795K62r8J614K471j479m370Q89K636M16
$$ 1558 1512 1818 -684 -2085 1026 3318 913 -882 -620 -718 896 3367 1888 -2482 -1593 1043 1459
3438A459J2O3l032l62L835R70k414j743J55L5K219K254k844l270P34K456M34J092
$$ 1459 1471 1534 -1498 -1860 1975 2945 531 -1212 -1057 -1022 1197 3451 607 -2663 -1929 527 961 2053
3456B053p51l677J3L509O63k000j90o17p29K882J198l216j546J726J299L93Q48
$$ 2053 1302 -2375 -2362 1147 1810 -190 -380 -997 -1726 1156 2354 -862 -2408 -682 617 1010 1858
3473A858k311k835J768K980o1j620o94r69L95L207K60l763q96J375J214J415M64
$$ 1858 -453 -3288 -1520 1460 1399 -221 -915 -1884 -1489 1718 1978 -1785 -2681 -1306 -92 1323 1787
3490A787l217k237K435K850m25j229q42j466J068L233r54k833j1J234K92J209
$$ 1787 -1430 -3667 -1232 1618 1193 -36 -878 -2344 -1276 1957 1003 -1830 -1841 -607 -315 894
3506H94K74l263r06L291J507j239p71j522j031K544L386k762k257L62Q98O15K454
$$ 894 1168 -2095 -3001 290 1797 558 -213 -1735 -2766 -222 3164 402 -1855 -1493 -595 20 2474
3523B474q55m075j84L320J116o04m34k347j135L822J943k510j716O62l53J421
$$ 2474 1619 -2456 -2640 680 1796 1192 758 -1589 -2724 1098 3041 531 -1185 -523 -876 545
3539E45K520k273k902R97K789P6o37q03j835Q6L699Q12l002j149j37Q21K375J466
$$ 545 3065 792 -2110 -1113 1676 1752 1115 312 -1523 -1437 2262 3074 72 -1077 -1214 -393 1982 3448
3557C448k805l358J921J934M80M69j597k625Q75L621j43j965r53Km16K823R50
$$ 3448 643 -2715 -794 1140 1620 2089 492 -2133 -1258 2363 2220 255 -698 -696 -1112 1711 2661
3574B661k867j877J689J252M30N40j874k583K227L155j350k080l67m25J032L143
$$ 2661 -206 -2083 -394 858 1288 1828 -46 -2629 -402 2753 1403 -677 -1044 -1469 -437 2706
3590B706n84l777p53K233O90P06L46k505k408K888K223r59j045p53j273J070L399
$$ 2706 2122 -1655 -2408 -175 515 1221 1567 -938 -3346 -458 1765 806 -239 -992 -2265 -1195 2204
3607B204j063l206M41J391Q5Q36J05k682o60L150J014j359o80r48q81K590K389
$$ 2204 1141 -2065 -1624 -233 -148 688 793 -1889 -2549 601 1615 256 -424 -1372 -2253 337 2726
3624B726k680k577J077J143P41J152j056l616M09L572M46r45p73j576l41K800
$$ 2726 46 -2531 -1454 -311 430 1582 526 -3090 -2681 891 1337 392 -381 -1957 -2298 502
3640E02J511k067j769Q24J00J446J663k350k540J672K546m70q54o61j262O89L220
$$ 502 2013 -54 -1823 -999 -899 547 2210 -140 -2680 -1008 1538 1068 214 -447 -1709 -1020 2200
3657B200J01k708j060Q66K81K104O79k815k140K032K446n22j14j590k201J647
$$ 2200 2301 -407 -1467 -601 -320 1784 2463 -352 -2492 -460 1986 1464 1350 -240 -2441 -794
3673g94L579m66k583j86n97O52K102R18l400j287K429J105k00K58j904k001K583
$$ -794 2785 2319 -264 -450 -1047 -395 1707 2625 -775 -2062 367 1472 1272 1530 -374 -2375 208
3690B08K433r27k201J04p29J593K712r90l892j69K304O04O41l09k584j541L353
$$ 208 2641 1714 -487 -383 -1112 481 3193 2203 -1689 -1858 446 1050 1691 1382 -1202 -2743 610
3707F10K100j365j610p96m65J519K687j254l095K50J519K64J261n81l026j59K875
$$ 610 2710 1345 -265 -1061 -1526 -7 2680 1426 -1669 -1419 100 364 1625 1044 -1982 -2141 734
3724G34Q20j664j94o08p48K055J910k419k434J067J560Q67P01j617l023J098L139
$$ 734 1554 -110 -304 -912 -1660 395 2305 -114 -2548 -1481 79 946 1647 30 -2993 -1895 1244
3741A244lj092o06j428l60L149R43k611j190O76N94J003J248j850k517J543K089
$$ 1244 1241 149 -457 -1885 -2245 904 1847 -764 -1954 -1278 -684 319 1567 -283 -2800 -1257 832
3758H32m2q99n07j104L01K707L35k900k64J168J03J370K71l003j335K739J918
$$ 832 790 -109 -616 -1720 -1419 1288 1623 -1277 -1541 -373 -270 1100 1371 -1632 -2967 -228 1690
3775A690q05o52q25j975J713L539j137k551j88K77O99J681N03l143o40K338N94
$$ 1690 885 233 -592 -2567 -854 2685 1548 -1003 -1191 -914 -215 1466 1969 -1174 -1814 524 1118
3792A118n31k19q63j233K275J959j606j873N39q3J338J661j598k869M76K824M69
$$ 1118 587 368 -495 -1728 547 2506 900 -973 -434 -517 821 2482 884 -1985 -1509 1315 1784
3809A784m09n64k299o70L601J478k291j558k8j69J998K019j559l119M88K110o
$$ 1784 1375 811 -1488 -2158 1443 2921 630 -928 -956 -1125 873 2892 1333 -1786 -1298 812 806
3826H06R37r71k436M4L434J68j723o84j92j07K200J220k899k121J846J322M01
$$ 806 1743 772 -1664 -1620 1814 1982 259 -425 -617 -724 1476 2696 -203 -2324 -478 844 1245
3843A245O70j878k406J173L071n83j370o69r64L36L218O56l544r89J376N34Q30
$$ 1245 1915 37 -2369 -1196 1875 1292 -78 -747 -1711 -1375 1843 2499 -1045 -2034 -658 -124 706
3860G06J164k406k394J756K803j099o95k53j245M58K707m64k613l52J530M97N36
$$ 706 1870 -536 -2930 -1174 1629 530 -165 -418 -1663 -1205 1502 1038 -1575 -1927 -397 100 636
3877F36L83k669j444K943J893j173m11j437j104J624K800j231k199l0N44L55K091
$$ 636 1019 -1650 -3094 -151 1742 569 158 -1279 -2383 -759 2041 810 -1389 -1419 -875 -520 1571
3894A571m67l114k56K608R99p92k74j302j226K363K028k147j173M64k90R44J494
$$ 1571 1104 -2010 -2266 342 1341 549 275 -1027 -2253 110 2138 -9 -1182 -718 -1008 -64 1430
3911A430j164k294P30K870j98r78j17k206L74L155Q92k491r15K53k54J947J431
$$ 1430 266 -2028 -1298 1572 1374 396 279 -1927 -1553 1602 2494 3 -912 -659 -913 1034 2465
3928B465k032k065J372J404l95N06p25k455J070K650O9j970n82J85j07J969R65
$$ 2465 433 -1632 -260 1144 749 1255 530 -1925 -855 1795 1864 -106 -688 -503 -610 1359 2324
3945B324k469j315J679J048l9N0j287j859J899K488j145j674k93p50J501K207
$$ 2324 -145 -1460 219 1267 1228 1278 -9 -1868 31 2519 1374 -300 -593 -1343 158 2365
3961B365o8l382m60J421P66N68N21k240j370J571K069j112j016K29q51R29K037
$$ 2365 2297 -1085 -1545 -124 642 1210 1731 -509 -1879 -308 1761 649 -367 -138 -989 -60 1977
3978A977j002k626L30J068M97N46L98k631o26K491R25j220l95n30j285K106K254
$$ 1977 975 -1651 -1321 -253 244 790 1188 -1443 -2069 422 1347 127 -268 -798 -2083 23 2277
3995B277k302k213O90J306N71R88q30k953L44K305Q68o87j93j461m39J907J426
$$ 2277 -25 -2238 -1548 -242 329 1317 487 -2466 -2122 183 1051 364 171 -1290 -1729 178 1604
4012A604k279j132J369L11J48J295j874k146J536K618m36r65l27j752M12K947
$$ 1604 -675 -1807 -438 -127 21 1316 -558 -2704 -1168 1450 1014 49 -278 -2030 -1618 1329
4028A329M39k623n33P75p1J550Q11k307j453J414K187o75k8j158j921J202K918
$$ 1329 1768 -855 -1388 -613 -684 866 1677 -630 -2083 -669 1518 843 815 -343 -2264 -1062 1856
4045A856l87j970l16n1K54J718N67k478o24K087M67m33K40j723j250K296K495
$$ 1856 1469 -501 -817 -868 -614 1104 1671 -807 -1431 656 1123 690 930 -793 -2043 253 2748
4062B748j419j732k48k3Q31K040m68k801l50J649M68N61P2j957r33K376J630j615
$$ 2748 1329 -403 -651 -674 157 2197 1729 -1072 -1422 227 695 1256 1328 -629 -1562 814 2444 829
4080H29r97j58r07J805J824j372k385M09J415K09M65k45k166j74K796K67j612
$$ 829 -168 -326 -1233 572 2396 1024 -1361 -952 463 672 1137 892 -1274 -1448 1348 1615 3
4097Ck93n77o4K370J340k535k141R25J115N07Q41p85k762M59K473O6r84k67j017
$$ 3 -290 -867 -931 1439 2779 244 -1897 -972 143 650 1491 706 -2056 -1597 876 942 -42 -309 -1326
4116a326r5K357Q25k603r99J474L43L58J123j952j931J449J921q57j58k47j479
$$ -1326 -1421 936 1761 -842 -1841 -367 -24 334 1457 -495 -2426 -977 944 87 -71 -318 -1797
4133a797Q96K402q00k200j29J048L66J465j50k767r72K259J472l68l60j164j358
$$ -1797 -901 1501 701 -1499 -1628 -580 -214 1251 1101 -1666 -2638 -379 1093 725 365 -799 -2157
4150b157J418K392j132j608K83O23k94J058L76k418n48K700J03m83k28p92j362
$$ -2157 -739 1653 521 -1087 -804 -181 -475 583 959 -1459 -2007 693 796 313 85 -707 -2069
4167b069K405J804j776j373J61r5P31K265j230k837Q48K034J15j28l15j934m28
$$ -2069 336 2140 364 -1009 -848 -943 -212 2053 823 -2014 -1166 868 983 855 540 -1394 -1822
4184a822K739J436j814r81K65o83J486J383j224j959Q62J456m65M09n04k037O21
$$ -1822 917 2353 539 -442 -177 -860 626 2009 785 -1174 -312 1144 679 1088 584 -1453 -832
4201h32K637Rk109m07K19j20J927R68k251j780J179J168K99N69j208j760P93K493
$$ -832 1805 1814 -295 -702 -483 -603 1324 2292 41 -1739 -560 608 907 1476 268 -1492 -699 1794
4219A794n18j367j29q59K81K374J43k338p91J226K06Q05K32j265j409J720J659
$$ 1794 1276 -91 -220 -1079 -798 1576 1719 -619 -1410 -184 22 827 1059 -206 -1615 105 1764
4236A764j185r65k01l34R13J884o32k728N7J485q9J156P3k433j319K863Q31p31
$$ 1764 579 -386 -587 -921 -8 1876 1244 -1484 -1427 58 -31 1125 1198 -1235 -2554 309 1140 409
4254D09m90p49q38J455K195j544j912L84N75p2J919n39k498k09K510J98p31N9
$$ 409 -81 -830 -1668 -213 1982 438 -1474 -1090 -515 -587 1332 793 -1705 -1914 596 794 63 122
4272A22r53j171K445J255k096j105O09M93N37J406j347k690J178J938O8k59l53
$$ 122 -831 -2002 443 1698 -398 -1503 -894 -401 136 1542 195 -2495 -1317 621 689 430 77
4289G7j493k96K459P75j824m63P3K9J144R77j370k039J350J369k19J51n33j750
$$ 77 -1416 -1712 747 1522 -302 -765 -692 -663 481 1458 88 -1951 -601 768 549 700 167 -1583
4307a583Q54K266l91j644j07J07K80J683J24k315p29J613J063l98K14j134j691
$$ -1583 -729 1537 1146 -498 -605 -498 -218 1465 1589 -726 -1455 158 1221 823 1037 -97 -1788
4324a788J449K439q91j436m01O3J80K199k04k382j57J184M27j6N34j656p91J744
$$ -1788 -339 2100 1209 -227 -628 -565 -385 1814 1610 -772 -929 255 682 666 1200 -456 -1247 497
4342D97J578j277j060J12o85Q69K032j469j862L00J333K06N44l40k044j63K486
$$ 497 2075 798 -262 -150 -835 34 2066 597 -1265 -965 368 574 1118 778 -1266 -1429 1057
4359A057P64j642l62l80p37J769J407j615j661R05O27K93P94l79k113K7K104M8
$$ 1057 1821 179 -183 -563 -1300 469 1876 261 -1400 -495 132 425 1219 840 -1273 -1246 858 906
4377I06r08j66p71n06K248Q31k245r53J203J88N12P87j563j630J101J793l87l10
$$ 906 -2 -168 -939 -1445 803 1634 -611 -1564 -361 -173 339 1126 -437 -2067 -966 827 440 130
4395A30p66r29L36K168N73k195r39N09N10J164P05j659j512J312J001J23k35n49
$$ 130 -636 -1565 -1229 939 1512 -683 -1622 -1113 -603 561 1266 -393 -1905 -593 408 531 296 -253
4413b53j702J125K091m44j752J08J32M12J089K72k248n64K197L57j58j43r97j487
$$ -253 -1955 -830 1261 817 -935 -827 -695 -283 806 1078 -1170 -1734 463 820 662 519 -478 -1965
4431a965J736K179j340j210J33l39P79J647j04k470o8J519J25O8M24j805o07J868
$$ -1965 -229 1950 610 -600 -467 -806 -27 1620 1516 -954 -1022 497 622 690 1114 -691 -1298 570
4449E70J030j320q25J01o4R19J208o90k008Q79J193l18L73o55j233m34K644J29
$$ 570 1600 280 -545 -444 -508 411 1619 929 -1079 -200 993 675 1048 393 -840 -1274 1370 1499
4467A499j066p65l03n6J286J489j493j643O39P37M40N98r04j667M21K075k15r26
$$ 1499 433 -332 -635 -691 595 2084 591 -1052 -413 324 764 1362 458 -1209 -788 1287 1072 146
4485A46J63q49Q7J581O93k249n97J076K08L80N64j548j491J631J676r58q79l70
$$ 146 309 -540 -453 1128 1821 -428 -1025 51 259 639 1203 -345 -1836 -205 1471 513 -366 -736
4503g36k54L46J999k00k414l9Q88M77N20M55j745r14J477R98r46l7o47q81R68
$$ -736 -990 -644 1355 1155 -1259 -1298 -410 67 587 1042 -703 -1617 -140 858 -88 -125 -772 -1653 -685
4522f85J799n25j649j07J028j49J042k98j877j21J685O59n78j41j062r45K330
$$ -685 1114 589 -1060 -1167 -139 -288 754 456 -1421 -1542 143 802 224 83 -979 -1924 406
4539D06J235j533j241J99Q7Q64J296p01k211K35J874J0l57N46j951l50K013J169
$$ 406 1641 108 -1133 -934 -847 17 1313 612 -1599 -1364 510 520 163 709 -1242 -1592 421 1590
4557A590j591m00K36m77J052P35j078j292L37J476J05k62oj909N81K422j06j776
$$ 1590 -1 -401 -165 -642 410 1145 67 -1225 -888 588 693 431 425 -1484 -903 1519 1413 -363
4575c63r1p7R1J317R63j892j165J183M96Q7O46q67j619P77K040m84j057M5j8l25
$$ -363 -454 -531 -440 877 1840 -52 -1217 -34 462 549 1195 328 -1291 -514 1526 1042 -15 30 12 -313
4595c13J764k0j960k33J161lP6J02n99j258J790R47q41r94K01m58R70J390q61
$$ -313 1451 1431 -529 -762 399 396 472 574 -25 -1283 507 1454 613 -381 -180 -638 332 1722 861
4614H61j799Q1P81O22L00K04j572r44J702R77r09l9n55r55J170J586j117j199
$$ 861 -938 -857 -76 546 846 1050 -522 -1466 236 1213 304 265 -290 -1245 -75 1511 394 -805
4632h05L16P18PO17k57k012M48J614m0o52l79n02j76J219J350j875r31O25O34
$$ -805 -489 229 236 853 596 -1416 -968 646 606 -46 -425 -927 -1103 116 1466 -409 -1340 -715 -81
4651h1J81J154j048k036O52J816rm04l90j202o1J977O60j770o95R94l82P19J067
$$ -81 100 1254 206 -1830 -1178 638 629 225 -165 -1367 -1428 549 1209 -561 -1256 -262 -644 75 1142
4670A142j276j476J275J278r05N9m72j146R43J932q49j263j4P59n03J633L35k299
$$ 1142 -134 -1610 -335 943 38 97 -375 -1521 -578 1354 505 -758 -772 -13 -516 1117 1452 -847
4688h47m39J210O29J88J40r97j376J274J770n76j291J03l01oJ526J57j955m48
$$ -847 -1286 -76 553 741 881 -116 -1492 -218 1552 976 -315 -212 -513 -519 1007 1164 -791 -1239
4706a239J742J22l06K06r50q27J500J147j022r41M04n66J025J541j142j746N34
$$ -1239 503 625 319 525 -425 -1252 248 1395 373 -568 -164 -730 295 1836 694 -1052 -518
4723e18P97K09N19m8k126k62K453J62r25k09j88l49R34J492j522j328N10N89J03
$$ -518 279 488 1007 959 -1167 -1429 1024 1186 261 52 -136 -485 449 1941 419 -909 -399 190 293
4742B93O75m16j419k07K134j14r85L6p53L89J321M18j633j084Q59M57M47N43j109
$$ 293 968 552 -867 -1074 1060 946 -39 -3 -756 -367 954 1372 -261 -1345 -486 -29 418 961 -148
4761a48j606J390J257m78l36k48q37j72J912L18j471n16O12K33O38N67j565j172
$$ -148 -1754 -364 893 415 79 -169 -1006 -1178 734 1052 -419 -935 -323 -90 548 1115 -450 -1622
4779a622J422O88n27k40m74n29Q92J407q81j233K13M39R0R91Q0j906p98J737Q29
$$ -1622 -200 488 -39 -279 -753 -1282 -390 1017 136 -1097 -884 -445 -355 636 716 -1190 -1988 -251 578
4798E78r6op90j342J392J504j066q50J67O4J52J283k70j559j96J082J10M0K18
$$ 578 482 476 -314 -1656 -264 1240 174 -676 -509 -445 -293 990 720 -839 -1035 47 157 197 415
4817D15j266m87J823P73j489l50R1kJ035P61j125j573R83Q77J66N4%j559J31J660
$$ 415 -851 -1338 485 1258 -231 -581 -490 -492 543 1304 179 -1394 -411 466 632 686 686 -873 -742 918
4837I18P15j209o20k00l22J086J478j639j121P09P55k17K86j76j477N88J843o09
$$ 918 1633 424 -196 -396 -718 368 1846 207 -914 -205 550 333 619 443 -1034 -446 1397 788
4855G88p16j70r8j47J485O6j606m46Q44O88j48O34j008j333J031J403n51m89k83
$$ 788 72 -98 -196 -343 1142 1208 -398 -844 0 688 540 1174 166 -1167 -136 1267 716 227 -56
4874e6r33O48J815m31j874K9P67j54O34M88j429m42J367J16m38l62k53l47P40
$$ -56 -989 -341 1474 1043 -831 -802 -35 -189 445 933 -496 -938 429 545 107 -255 -508 -855 -115
4893a15J368r18j528O51L64k6J006j27j974J70J542M11l40m70k98r46J236J218
$$ -115 1253 335 -1193 -542 -178 -204 802 675 -1299 -1129 413 824 484 14 -284 -1230 6 1224
4911A224j427p90M85k53M26J432o83j704M44J368m60M1j32p75l34J615L54j495
$$ 1224 -203 -993 -508 -761 -335 1097 414 -1290 -846 522 62 103 -29 -804 -1138 477 831 -664
4929f64j3K73j11P20R13j220j236N35J591q04J85m30j017M17K066j00j178o80
$$ -664 -677 -404 -515 205 1118 -102 -1338 -803 788 -16 169 -261 -1278 -861 1205 1105 -73 -753
4947g53K96j82J384O47j557o46M37J020j74M89j071p44N33J322m80p39L45n15
$$ -753 -457 -639 745 1392 -165 -811 -374 646 472 961 -110 -854 -321 1001 521 -218 127 -388
4965c88L34J233k28j736j06J252L34K23l2j313j087J941J304j371l99j09n27O99
$$ -388 -54 1179 951 -785 -891 361 695 918 886 -427 -1514 427 1731 360 -39 -148 -675 24
4983B4J533m35j998J64R08l7M72K40j648m23J927N08j067j14j81m99P89J024p29
$$ 24 1557 1122 -876 -712 196 159 631 871 -777 -1200 727 1235 168 54 -127 -626 163 1187 458
5002D58j299R81j19L08N40m31j690M99J533J76r50j76m58n85J900N18j363o55
$$ 458 -841 140 21 329 869 438 -1252 -753 780 956 6 -170 -628 -1213 687 1205 -158 -813
5020h13L98J91J47O34j99j583N51J226l24l02J9q90J58J225j2r70k25M67K59L34
$$ -813 -415 -224 -77 557 358 -1225 -674 552 228 -74 -55 -945 -787 438 426 -544 -769 -302 -43 291
5040B91L71j307j047J457J089q35j00l91q20N46J654j50j607JL09L06O53O55j504
$$ 291 662 -645 -1692 -235 854 19 -81 -472 -1292 -746 908 758 -849 -848 -539 -233 420 1075 -429
5059d29q54J231L06k67M61o38p22N71J169m35j168N58k49M16O45j37j350L71J332
$$ -429 -1283 -52 254 -13 448 -190 -912 -341 828 393 -775 -217 -466 -50 595 458 -892 -521 811
5078H11k59j68j4j124m61J643J128j362n95J10l15O77J343q56j557K20R03J33
$$ 811 552 384 370 -754 -1215 428 1556 194 -401 -291 -606 71 1414 558 -999 -779 124 257
5096B57P85k39j417j72J192Q42q65m58L7k48R15R36j667o38M59O12J83J17j35
$$ 257 1042 803 -614 -786 406 1248 383 -75 -38 -286 629 1565 -102 -740 -281 331 514 631 496
5115D96j162mJ609l44p44K8m31J24R43Q20j561l17L67K56K92P34r18j617J053
$$ 496 -666 -670 939 595 -149 -121 -552 -428 515 1335 -226 -543 -176 80 372 1106 188 -1429 -376
5134c76J210l67j08k28o20j55J443K1j401K91J93O8L37L96j059o22Q67O92n53
$$ -376 834 467 359 131 -489 -644 799 820 -581 -290 -97 -29 308 704 -355 -977 -110 582 29
5153B9J12m32n87Q12J159r42j133L13M98J08O83K4j658j48J064L90l93J72n36
$$ 29 141 -291 -878 -66 1093 151 -982 -669 -171 -63 620 644 -1014 -1162 -98 292 -101 71 -465
5172d65m72P38R20q38o44N62l58L50J079q66j000M24J049l25p0p2o15n23J411
$$ -465 -937 -199 721 -117 -761 -199 -557 -207 872 6 -994 -570 479 154 84 12 -603 -1126 285
5191B85O30j203p26L99K92N91Q29p83j321M25J166j09J15n82r93K40J413J73j109
$$ 285 915 -288 -1014 -615 -323 268 1097 314 -1007 -582 584 475 590 8 -985 -745 668 841 -268
5210b68M7K72o33J406n1r36m10M41Q54n90K93k56j029O95J104m35o49Ok38N0J411
$$ -268 -221 51 -582 824 773 -163 -573 -132 722 132 425 169 -860 -165 939 504 -145 -139 -377 -327 1084
5231A084K40j857r2N18L94J96O21q61j557J255Q89k05n55J13o97L64R32L59j436
$$ 1084 1324 -533 -625 -107 287 483 1104 243 -1314 -59 830 625 70 183 -514 -150 782 1141 -295
5250b95j97M81J48L15N83j420n45J231L86l66l18j20p19J281P81j081r88O48j00
$$ -295 -492 -11 137 452 1035 -385 -930 301 687 321 3 -117 -836 445 1226 145 -843 -195 -295
5269b95L46P06l61j170k71J464J74n14l69k19k70J013P42p69o94k74L23M30O66
$$ -295 51 757 396 -774 -1045 419 593 79 -290 -509 -779 234 976 207 -487 -761 -438 -8 658
5288F58n46j268O22J021m66K15l93o27l6J381L60j329m62P61k48O21O54j137j149
$$ 658 112 -1156 -534 487 21 236 -157 -784 -820 561 921 -408 -870 -109 -357 264 918 -219 -1368
5307a368Q32J116j66n72Q6q14J61J418J97j289K1o5k99J024M11j046q22J036M37
$$ -1368 -536 580 414 -158 -72 -886 -725 693 890 -399 -378 -443 -742 282 693 -353 -1175 -139 298
5326B98j55K03n81p12N68J151k17j206L13J2J74J142l25j411l11J261J44O1l4
$$ 298 143 346 -235 -947 -379 772 555 -651 -338 -326 -152 990 665 -746 -1057 204 348 409 375
5345C75p63o19J264R69r42l60L8l55K50J451o94j107l55Q72L05P5K98j180M8R69
$$ 375 -388 -1007 257 1226 284 -76 -38 -393 -143 1308 614 -493 -848 24 329 404 702 -478 -430 539
5365E39K28k89l84j05RM43Q13j099r70M64P32K01K69o48j246L45J098L34n13K09
$$ 539 767 478 94 -11 -2 441 1254 155 -815 -351 381 582 851 203 -1043 -698 400 734 221 430
5385D30o19k88R79R53j568q95R38J59L79J80p80r64R63R03o92Q1l59l55L33O77
$$ 430 -189 -477 502 1455 -113 -1008 -70 89 468 648 -132 -1096 -133 770 78 159 -200 -555 -222 455
5405D55L3r68J04J60N5M68N78j222r79J131P39k44p4n86p20J50J622k22r47q2
$$ 455 488 -480 -376 -216 -161 307 885 -337 -1316 -185 554 310 236 -350 -1070 -920 702 480 -467 -549
5425e49o8M83P31k54p49o68P52Q67o76n1m03m15Q85Q63p75o80L82q2j05J059k19
$$ -549 -617 -134 597 343 -406 -1074 -322 545 -131 -182 -585 -1000 -115 748 -27 -707 -325 -407 -512 547 328
5446C28j330M54P66J38l51K11o67n12J083P03p07l85j95k01O71R57o24j333N88
$$ 328 -1002 -548 218 356 5 216 -451 -963 120 823 116 -269 -464 -665 6 963 339 -994 -406
5465d06O12or1J10r42k9J412p4p22l7M1l09R36K93p40j015R68L05r8M56p82p75
$$ -406 206 200 109 219 -723 -752 660 586 -136 -173 -132 -441 495 788 48 -967 1 306 208 664 -118 -893
5487h93N53J288k9q48L8k75k13J175J81j193k5N61R8K07K51p71r60P89Q54l52
$$ -893 -340 948 919 71 109 -166 -379 796 977 -216 -241 320 418 625 876 105 -855 -66 788 436
5507D36n91J05k57M2J257l02j276J78N33r4M38N61j522o17J480M08n58o8j99o03
$$ 436 -155 -50 -307 -265 992 690 -586 -408 125 31 469 1030 -492 -1109 371 779 221 153 -46 -649
5527f49N09Q25l85j021L74QK37Q40l86j134j04R37M89n88m2M3p01R29N00r18p4
$$ -649 -140 685 300 -721 -347 -339 -102 738 352 -782 -886 51 540 -48 -90 -47 -748 181 681 -237 -311
5548c11O6J42O3L39l56p62M80Q30n8o50J48o59k71J428L30j144k97K77k05M85
$$ -311 -245 -103 -40 299 -57 -819 -339 491 433 -217 -69 -728 -999 429 759 -385 -682 -405 -610 -125
5568a25Q37q68q49Q88N75l65K99n86m27K5J072j7p74K6j15pN57M30q94n54P21
$$ -125 712 -156 -1005 -117 458 93 392 -194 -621 -596 476 459 -315 -289 -404 -411 146 576 -318 -872 -151
5589a51N36q6k07k58n79O25Q27o22n23J9k80L61J142P6j278l31Q20K99q7K51p39
$$ -151 385 299 92 -166 -745 -120 707 85 -438 -419 -699 -338 804 880 -398 -729 91 390 303 554 -185
5610a85o38M71Q61j17m73J28m25K40R54l10r70k55J132RO2J37j311k58J642J10
$$ -185 -823 -352 509 392 -81 47 -378 -138 816 506 -464 -719 413 422 484 621 -690 -948 694 804
5630H04n09j79l86P3K78R46q85o32J79N07K09K71P1j342k5J315k24J0j30p20j53
$$ 804 295 116 -270 -197 81 1027 142 -490 -311 196 405 676 747 -595 -620 695 471 481 351 -369 -522
5651e22R40L37j006l09N07N5k3M63l36p72M72Q76k24o75N12p07m34J472kr67l3
$$ -522 418 755 -251 -560 -53 2 -21 442 106 -666 -194 682 458 -217 295 -412 -846 626 624 -343 -376
5672c76K35l40Q43L98o92q64M14P71j50l11j34m30P8J281n35n32N5K40m58Q33
$$ -376 -141 -481 362 760 68 -796 -382 389 239 -72 -206 -636 -558 723 188 -344 -289 -49 -507 326
5692C26Pq61n21R18N67n99L92r04j82Q76O67k62j243N60k40M63M41L27j591%Q36
$$ 326 333 -528 -1049 -131 436 -163 229 -675 -857 19 686 424 -819 -259 -499 -36 405 732 -859 -859 -23
5713b3O0l8M26o53p97R74N35m03j82l60q7M13P20l47r50O13M00j24J32M0q62p6
$$ -23 37 -1 425 -228 -1025 -51 484 81 -101 -461 -548 -135 585 238 -712 -99 301 177 309 349 -513 -589
5735e89J046J09q55J95J28k21N04R65j042r30P90j22R6N34k36r79K68R85lk64
$$ -589 457 566 -289 -94 34 -187 317 1282 240 -690 100 -22 74 608 372 -607 -339 646 643 379
5755C79p3q00M27O53K55r19l98N51J8R5P18p73q82O06J173m92m75l5l05J54O52
$$ 379 306 -494 -67 586 841 -78 -476 75 93 188 906 133 -749 -143 1030 538 63 28 -277 -123 529
5776E29N04j579k8N79J1M29O6p43o47R08O50l90l4m33j61J51J004n61o86J06K48
$$ 529 1033 -546 -574 5 16 445 511 -232 -879 29 679 289 255 -178 -339 -188 816 255 -431 -325 -77
5797g7J08J00K86q06r8P55L43n55L07m71n29O11Q74p52o72M46m58P31M92j05j560
$$ -77 31 131 417 -389 -487 268 611 56 363 -108 -637 -26 848 96 -576 -130 -588 143 635 530 -1030
5818a030J66J059m73N03J63p67l34J062J17m58k21j12l39O90P9l54m17J16N20
$$ -1030 -864 195 -278 225 388 -379 -713 349 466 8 -213 -325 -664 26 105 -249 -666 -550 -30
5837c0l64N75k54o02k8J070Q8q45K12j28R1P44J61p93p30P19L85j05J31k16r10
$$ -30 -394 181 -73 -675 -703 367 455 -390 -178 -306 -215 529 690 -103 -833 -114 271 166 297 81 -829
5858h29O25J023j71q45j23%K0R71P6p69m57O95k98J39O39o25m83N29O09m97l69
$$ -829 -204 819 648 -197 -320 -320 -300 671 747 -22 -479 216 -82 57 696 71 -412 117 726 229 -140
5879a40J25l8J78O72k32q55k35J036OK2J01j204r1R49N40o25j70J19j49j0P53
$$ -140 -15 -53 125 797 565 -290 -525 511 517 539 640 -564 -655 294 834 209 39 158 9 -1 752
5900G52j69j301P28O1K65J06Q6j113j55J517n88j19J94m96j71Q40O6l18q83N69
$$ 752 583 -718 10 71 336 442 528 -585 -740 777 189 70 264 -232 -403 437 503 185 -698 -129
5920a29J65l60J218q64q96M94P32k60j71K19o09j88R73J16n33j88R1n2M75M68
$$ -129 36 -324 894 30 -866 -372 360 100 -71 148 -461 -649 324 440 -93 -281 -190 -242 233 701
5940G01n36q55L14P02l76R3k76o43N09N96J03r91K80j25K1P61K31p68n41J040
$$ 701 165 -690 -376 326 -50 43 -233 -876 -367 229 332 -659 -379 -504 -483 278 509 -259 -800 240
5960B40Kr4J04l52p83N29P04ml89l37J14j8Q31j44q86K17N07J90l95K27k6r99
$$ 240 242 148 252 -100 -883 -354 350 346 -43 -380 -266 -284 547 403 -483 -266 241 431 36 263 237 -762
5982g62Q80P06r44l1R0j74J74N50L5r91K95N84l45O36k42o83n79J171N01m47m92
$$ -762 118 824 -120 -151 -61 -235 -61 489 524 -467 -172 412 67 703 461 -222 -801 370 871 424 -68
6003f8K64n60M38P55n65p71N39J9j31P63q1p99oQ70o4l88l01j0j2O03N17j139
$$ -68 196 -364 74 829 264 -507 32 51 -80 683 602 -197 -203 667 603 215 -86 -96 -108 495 1012 -127
6025a27k63K73J65M89L4n00o02L62P51k31o1P5o30k65J075Q6n46n44M23L2L98
$$ -127 -390 -117 48 537 571 71 -531 -169 582 351 290 365 -265 -530 545 631 85 -459 -36 -4 394
6046C94No50k96M59L09l63K95J77q70L25R30l81o62j74O20k97O28R7q86k61O17
$$ 394 399 -251 -547 -88 221 -142 153 330 -540 -215 715 334 -328 -502 118 -179 449 546 -340 -601 16
6067A6M66l71Q9k98q18R42M52l63n80K31k15K18P59rj184q8Q36l59N44m46k56
$$ 16 482 111 200 -98 -916 26 478 115 -465 -234 -449 -231 528 519 -665 -753 83 -276 268 -178 -434
6088d34j34Q05K16m68j88l1K4J22N46o20q63Q97M83m43N22m13o20J40R89K93r80
$$ -434 -568 237 453 -15 -203 -234 -210 -88 458 -162 -1025 -128 355 -88 434 21 -599 -459 530 823 -157
6109a57k61K72k71N82M99m14q87K68M65j51L76P9r88K49P09J87l79j33j66O9N60
$$ -157 -418 -146 -417 165 664 250 -637 -369 96 -55 321 400 -588 -339 370 557 178 45 -121 -52 508
6130E08o1o52r4N20j03K74J14j11q82N57O55q23J52j61j77l86J445j55r14K53
$$ 508 447 -205 -299 221 118 392 506 395 -487 70 725 -98 54 -107 -284 -670 775 620 -294 -41
6150d1K57k56K81K58o94o46Q29L90J25n29J79n44O10L79j51o85K22P7n20J072
$$ -41 216 -40 241 499 -195 -841 -12 378 503 -26 153 -391 219 598 447 -238 -16 61 -459 613
6170F13Q6j074j40Q31J08o39K20j98n45J293k7m38n81L68k3J73L69J2j086O2J017
$$ 613 699 -375 -515 316 424 -215 5 -193 -738 555 528 90 -491 -123 -146 27 396 408 -678 -616 401
6191D01m04O8K1l23r5N73J30o10k88N87j52J9N36m56p01K99P54k65M1K7q15N5
$$ 401 -3 65 86 -237 -332 241 371 -239 -527 60 -92 -73 463 7 -694 -395 359 94 135 162 -653 -598
6213e98J127l59l16j48P0j34P41N12j085o44N78K29M5j54k0o17L55P67k22k21
$$ -598 529 170 -146 -294 -224 -358 383 895 -190 -834 -256 -27 18 -136 -156 -773 -418 349 127 -94
6233i4K93m23J67L14R1m86m45M87j90L16K22k08o07M41P61l90o46M23j14k1O96
$$ -94 199 -224 -57 257 348 -138 -583 -96 -286 30 252 44 -563 -122 639 249 -397 26 -88 -109 587
6254E87P0j282J11M64L98j33M04o69m66O69M97m43j80l50Q8K04M94k34m23J37
$$ 587 657 -625 -514 -50 348 215 619 -50 -516 153 650 207 27 -323 -235 -31 463 229 -194 -57
6274e7L94j20L00j67j009J97J076M9o42k80k1N2R05J55p31j97p2K60n0L09k5p69
$$ -57 337 217 517 350 -659 -462 614 663 21 -259 -280 -228 677 832 101 -96 -168 92 42 351 326 -443
6296d43lN31J59k30j34l92q1R67p7k66p8J45k00q7Q82q51o29N68N11j43j61q1
$$ -443 -446 85 244 14 -120 -512 -593 374 297 31 -47 98 -102 -189 693 -158 -787 -219 292 149 -12 -93
6318i3j41J49Q81m47n13m9J67k97Q58j04q17l08R09O5o3mk50m40N62N90n52n82
$$ -93 -234 -85 796 349 -164 -213 -46 -343 515 411 -406 -714 195 260 197 193 -57 -497 65 655 103 -479
6340d79J04J22k5O43N8r78P4M68r9L3L26o06M9L36N75r01j42L65l76O91K35l68
$$ -479 -375 -253 -278 365 423 -555 -481 -13 -112 -79 247 -359 -310 26 601 -300 -442 -77 -453 238 473 105
6362A05o48K84J57q0K33K2n26k00Q87O1m62J71q9l92M00O37n67p49P19J35j27
$$ 105 -543 -259 -102 -182 51 73 -453 -653 234 295 -167 4 -85 -477 -77 560 -7 -756 -37 98 -29
6383b9M55j03r06O23M33k5n58P4J03k08M11M93q04n21N71K45o8N61n73r83O72
$$ -29 426 323 -583 40 473 448 -110 -36 67 -141 270 763 -41 -562 9 254 186 747 174 -809 -137
6404a37P20l10j29J41p35OJ144l92m92j14N56j82N1L79p33l34P45M26m29q3j19
$$ -137 583 273 144 285 -450 -444 700 308 -184 -298 258 76 127 506 -227 -561 184 610 181 98 -21
6425b1n08N39L94j03m80j0L81K13j42j84p67J40M33Q07m02J47q95k27Q95L65m66
$$ -21 -529 10 404 301 -179 -189 192 405 263 79 -688 -548 -115 692 290 437 -458 -685 210 575 109
6446A09l66p3j08M08J62L6p90M47L88j82o1P5k61j34O70q3m63MJ08n12M37Q94
$$ 109 -257 -330 -438 -30 132 168 -622 -175 213 31 -30 45 -216 -350 320 237 -226 -222 -114 -626 -189 705
6468G05p75r29M84P11q7K75p66l63K41Q46j04n36Q5J8l81O83L92n66l36J25M29
$$ 705 -70 -999 -515 196 109 384 -382 -745 -504 342 238 -298 -213 -195 -576 107 499 -67 -403 -278 151
6489A51m02O25l33m32R4M32ql26K00j2j46P25l41o98K96K99p5K26j3l29l00K75
$$ 151 -251 374 41 -391 -297 135 127 -199 1 -11 -157 568 227 -471 -175 124 49 275 262 -67 -367 -92
6511i2L39P6l68L7k29J1Q80k64n82K9P17p93K52N14o47m71L98N73m43r5J38l38
$$ -92 247 323 -45 -8 -237 -226 654 390 -192 -163 554 -239 13 527 -120 -591 -193 380 -63 -158 -20 -358
6533c58L67O73l52n65QL17K75K0J12p55j23N25N80p91L04qo13M45N96p99l50L99
$$ -358 9 682 330 -235 -227 90 365 385 497 -258 -381 144 724 -67 237 229 -384 61 657 -142 -492 -93
6555i3J80J09L07j7r58K80M60j84O1j08o65M84L08L65r08N9J57J90l2M27m52l38
$$ -93 87 196 503 486 -472 -192 268 84 145 37 -628 -144 164 529 -379 -320 -163 27 -5 422 -30 -368
6577c68k5O89k34j58R3n12P6O13M5n66M5J45j30M07M54p78o18O98L75j56J16j3
$$ -368 -393 296 62 -96 -3 -515 -439 174 219 -347 -302 -157 -287 120 574 -204 -822 -124 251 95 211 198
6599A98p28O9P80m97K4K4o4j36N04J16j046K63N95K41j99p6p58O3O91M42k69k59
$$ 198 -530 -461 319 -178 -154 -130 -194 -330 174 290 -756 -493 102 343 144 68 -690 -627 64 506 237 -22
6621b2N3p40M48O50j44o43K72L19k84K18K00m24k25L08N89o30RJ19m10K45P84
$$ -22 31 -709 -261 389 245 -398 -126 193 -91 127 327 -97 -322 -14 575 -55 -46 73 -337 -92 692
6642F92n49p03Q06O3j65J75K43j248M48P67j33l54j07j7r5O75R7o16p0M8J29K15
$$ 692 143 -560 246 309 144 319 562 -686 -238 529 396 42 -65 -82 -177 498 595 -21 -91 -43 86 301
6664C01N24n66p70J75Q50k13j04Mk77q5M92J27q84o6Q15m09L85m7k49j73J32K56
$$ 301 825 259 -511 -336 514 301 197 201 -76 -161 331 458 -426 -492 323 -86 299 252 3 -170 -38 218
6686B18k22M1k82k11N23P66m31o67J03J48j70M70K77p28k28M92R7j30J7k83l08
$$ 218 -4 37 -245 -456 67 833 402 -265 -162 -14 -184 286 563 -165 -393 99 196 66 83 -200 -508
6707e08L79P38o92m65N4N85k54K61k3p72K85P08l4k91M06m21l79K70N21o89m6
$$ -508 -129 609 -83 -548 -494 91 -163 98 75 -697 -412 296 262 -29 377 -44 -423 -153 368 -321 -367
6728c67P2k20K89Q26l25j108M48L16q6M14l78l79J00M87L04o11J73R0m58K87N25
$$ -367 -295 -515 -226 600 275 -833 -385 -69 -155 259 -119 -498 -398 89 393 -218 -45 45 -413 -126 399
6749C99n92l69M58K14J20j17q4m52L97M59m51j81L18o66N14M24K35q43k13M74
$$ 399 -193 -562 -104 110 230 113 29 -423 -26 433 -18 -199 119 -547 -33 391 626 -217 -430 44
6769D4j20L66j2R2r66O23L39p9j54N1l29k29P53M88j183L02j87N28k36J28n60
$$ 44 -76 290 278 370 -596 27 366 287 133 184 -145 -374 379 867 -316 -14 -201 327 91 219 -341
6790c41K4O67L51k67l44k21Q2P6P12l14n35K96l02K46L20j6p49Q5N54o5l5j73
$$ -341 -317 350 701 434 90 -131 -49 27 739 425 -110 186 -116 130 450 434 -315 -230 324 259 224 51
6812E1k25m4J06O65k48l96j43K49r1M60j67m80k07O28K04k93o4j45k46M30M85
$$ 51 -174 -218 -112 553 305 -91 -234 15 -76 384 217 -263 -470 158 362 69 5 -140 -386 44 529
6833E29r00k2K26L2L17K87o01l38J96M59m9j47L49r32K43N08K6l74L0k03J96L06
$$ 529 -371 -393 -167 -135 182 469 -132 -470 -274 185 136 -11 338 -594 -351 157 183 -191 -161 -364 -168 138
6855A38J86l35l11M31J50l31K48k07k03K56P7K75l43j09j72pO90k15m40l90R27
$$ 138 324 -11 -322 109 259 -72 176 -31 -234 22 99 374 31 -78 -250 -257 433 218 -222 -612 315
6876C15j86q7J48l18m31L48M97k00O3L8m94r9O80J38n35j61K97j78L19J12o31
$$ 315 129 42 190 -128 -559 -211 286 86 149 187 -307 -406 274 412 -123 -284 13 -165 154 266 -365
6897c65j6O93j1m96k43L91j96K87N08o38j74m4N03K3J49r1l67k74P50K03n10M4
$$ -365 -381 312 301 -195 -438 -47 -243 44 552 -86 -260 -304 199 222 371 280 -87 -361 389 592 82 126
6919A26q7j32M09J27l85k55K94m27M10l7J44m11J56R6J24l83J15K00k70O79L24
$$ 126 39 -93 316 443 58 -197 97 -330 80 43 187 -224 -68 28 152 -231 -116 84 -186 493 817
6940H17q24m96M70O0j54K67k36l75K27N44j8ok4j121P36R6P90q39l99L82J88m5
$$ 817 -7 -503 -33 27 -127 140 -96 -471 -244 300 282 276 252 -869 -133 -37 753 -86 -485 -103 85 40
6962D0J48k52k84L96J04j98j46M11p71N67N32m17l62J61j12j3O56o8r63k13O56
$$ 40 188 -64 -348 48 152 -46 -192 219 -552 15 547 130 -232 -71 -183 -196 460 392 -571 -784 -128
6983a28O7J02M4j73m06K48L57k13j10N8k38n1O08J88q02J89K97k1J68k71j09m21
$$ -128 -61 41 85 -88 -494 -246 111 -102 -212 -154 -392 -443 165 353 -449 -260 37 16 184 -87 -196 -617
7005f17Q16M39o83k70M79n5L51j7n58k85K35L52K09O0l99m84K15P3N89l51j07
$$ -617 199 638 -45 -315 164 109 460 443 -115 -400 -165 187 396 456 57 -427 -212 -139 450 99 -8
7026hn33J61M24M19k31m70L45m7l2M99o13l52M17L06P9k11j49j85K01J72Q9n05
$$ -8 -541 -380 44 463 232 -238 107 60 28 527 -86 -438 -21 285 364 153 4 -181 20 192 281 -224
7048b24j2K69q0L66K13m37n92P66K40l75J22l74j38j45Q82k11m23j8L39k19N16
$$ -224 -236 33 -47 319 532 95 -497 269 509 134 256 -118 -256 -401 481 270 -153 -171 168 -51 465
7069D65P6j000K52L83R7j77k48J8n3K87N04l71n93N24m4K22j7k98o33L10L91J8
$$ 465 541 -459 -207 176 273 96 -152 -134 -187 100 604 233 -360 164 120 342 325 27 -606 -296 95 113
7091A13k66J25p6m11Q48J82k87n75J20p3J36N29l85l81K97K26j54mK06n56J73
$$ 113 -153 -28 -104 -515 333 515 228 -347 -227 -300 -164 365 -20 -401 -104 122 -32 -36 170 -386 -213
7112b13M88m7k33j64L29m38M39K25l42m68M69K82r1k15K1m08K6N19J25k79rm12
$$ -213 275 228 -5 -169 160 -278 161 386 44 -424 45 327 236 21 42 -366 -340 179 304 25 16 -396
7134c96k07R26r7n07J8N1K55J53K72k58q71N65K33n6j13M07n55k8N24j7n29O2
$$ -396 -603 323 226 -281 -263 -212 43 196 468 210 -661 -96 137 81 -32 375 -180 -208 316 299 -230 -168
7156a68M41j00l6K0r4m42P06R5k35l79K30k96J77P63k26o62n0K84o7L05J46o28
$$ -168 273 173 137 157 63 -379 327 422 187 -192 38 -258 -81 682 456 -206 -256 28 -39 266 412 -216
7178b16j57L59M86m18j05n9nP2N59l39m48RK45K03R8j33l52P6K04J5l32K00j30
$$ -216 -373 -14 472 54 -51 -110 -115 -43 516 177 -271 -262 -17 186 284 151 -201 -125 79 94 -238 -38 -168
7201a68j98P85J34l48m10RO1K73L27m89m44K38M77ok25Q3l05m44J138l74j35J33
$$ -168 -366 419 553 205 -205 -196 -135 138 465 -24 -468 -230 247 241 16 99 -206 -650 488 114 -21 112
7223A12n8j81K36N2l26l7K20mK22j84k07l08M05K79k28q2k88K66q0N35j25n69
$$ 112 54 -127 109 161 -165 -202 18 14 236 52 -155 -463 -58 221 -7 -89 -377 -111 -191 344 219 -350
7245c50j09O30j85K5J36j12m71N58K71o61K99j53j4J60J30K09p28Q9L89J54l94
$$ -350 -459 171 -14 11 147 35 -436 122 393 -268 31 -122 -136 24 154 363 -365 -276 113 267 -127
7266a27N40o20o2L06M19m94j33N8j28P8O01j74m10J66k08J25M0J2l15J67N19k2
$$ -127 413 -207 -269 37 456 -38 -171 -113 -241 -163 438 264 -146 20 -188 -63 -23 -11 -326 -159 360 338
7288C38j82q4k9P1J46q6p0l27K90J05J6Q8m70j33j63Q46O7n67L09l53l43R07P8
$$ 338 156 72 43 114 260 174 104 -223 67 172 188 276 -194 -327 -490 356 423 -144 165 -188 -531 376 454
7311D54p32K51L71k58j29M07l46j31K94R9j55Nk2j29L23j95Q6n30M88j24m80Q50
$$ 454 -278 -27 344 86 -43 364 18 -113 181 280 125 130 108 -21 302 107 193 -337 151 27 -453 397
7333C97l82m91L40M03L85n28j08J51m07J35N54m30m57K59P5K22J79K4m03k19L18
$$ 397 15 -476 -136 267 652 124 16 167 -240 -105 449 19 -438 -179 -104 118 297 321 -82 -301 17
7354A7O4j98J60j21n20N67L92j87j00K02o33M00M18n13l77J04N68o7k18J88m66
$$ 17 81 -117 43 -78 -598 -31 361 174 74 276 -357 43 461 -52 -429 -325 243 176 -42 146 -320
7375c20j01J016l08m63n2M41o70N94P5k46l42K24L07j60J16J99p49Q6L70M04n41
$$ -320 -421 595 287 -176 -228 213 -457 137 212 -34 -376 -152 155 -5 111 310 -439 -353 17 421 -120
7396a20J39k9l84J60M71R4n13J49n7Q9K83j61m96M70M15p70P4R6J78k53L69L40
$$ -120 19 -10 -394 -234 237 331 -182 -33 -90 -1 282 121 -375 95 510 -260 -186 -90 88 -165 204 544
7418E44o50J48l6k54J96L20k46k78L36K66k52K36m79j02J41P99n55l04N7J95k90
$$ 544 -106 42 6 -248 -52 268 22 -256 80 346 94 330 -149 -251 -110 689 134 -170 -113 82 -208
7439b08N64O7l32j75M64J1o03J96j34k21M81L84m29j53j87J47KP36n39m31K18
$$ -208 356 423 91 -84 380 391 -212 -16 -150 -371 110 494 65 -88 -275 -128 -126 610 71 -360 -142
7460a42M48k47j4K9k06l16O42J79m32k36L81k72K40L80k21m61J32J75K16k18k10
$$ -142 306 59 45 74 -132 -448 194 373 -59 -295 86 -186 54 434 213 -248 -116 59 275 57 -153
7481a53N1l38N24j4m31L30L7j45J54J93l20m33L79J41QM25m31o07L41P33m50j24
$$ -153 -102 -440 84 70 -361 -31 6 -139 15 208 -112 -545 -166 -25 -17 408 -23 -630 -289 444 -6 -130
7503a30O8m9l40O55lm62Q4L52K8k08J83l39q0L01K84k72j61Q4k75J49L64j76q10
$$ -130 -62 -111 -451 204 201 -261 -177 175 203 -5 178 -161 -241 60 344 72 -89 -5 -280 -131 233 57 -753
7526g53M55N05l81k8R2j67j13N52L2m88K06J70k66K05N34n09k76P8R4k93P39k67
$$ -753 -298 207 -174 -202 -110 -277 -390 162 194 -294 -88 82 -184 21 555 46 -230 -152 -58 -351 388 121
7548A21n17K19Q52m83j97J89j22k35M1N73l85j48J37Q9J19P5l7m05k20M79N8j56
$$ 121 -396 -177 675 192 -5 184 62 -173 -132 441 56 -92 45 134 253 328 291 -114 -334 145 203 47
7570D7k8k79k62M56O71p51l2J50K58N2M1j42p44N87J25k71J85Q5j91j8M71j25
$$ 47 19 -260 -522 -66 605 -146 -178 -28 230 282 323 181 -563 24 149 -122 63 148 -43 -61 410 285
7592B85n28K76n6r6j05N81p21m3N85K46m68J36M3l97%O90k56n27L28n53N92M14
$$ 285 -243 33 -23 -119 -224 357 -364 -407 178 424 -44 92 135 -262 -262 428 172 -355 -27 -580 12 426
7614D26k88p0m92L59L13l14N37o40m54L90N62m56q5J08m0K6K82l23j80k24P40
$$ 426 138 68 -424 -65 248 -66 471 -169 -623 -233 329 -127 -212 -104 -144 -118 164 -159 -339 -563 177
7635A77n8J15M1q16K60L21L42n46J34j18j68k8O34k84n59L80J95J21JO4l75j24
$$ 177 119 234 275 -541 -281 40 382 -164 -30 -148 -316 -344 290 6 -553 -173 22 143 144 208 -167 -291
7657b91M10ok46j3R3k58L65J18Kp52K73L49J22J54l62l62M06K60k25L04p22L00
$$ -291 119 113 -133 -146 -53 -311 54 172 174 -578 -305 44 166 320 -42 -404 2 262 37 341 -381 -81
7679h1j55N24K30m59m13K94q5K19o2k03N4J22K91j62j10K68n91K2O16k88j25J77
$$ -81 -236 288 518 59 -354 -60 -145 74 12 -191 -137 -15 276 114 4 272 -319 -297 319 31 -94 83
7701H3J17N6K19j87l12n11P02J14m27O62m36m86M35O24l58l39n2r3J02J28L75
$$ 83 200 256 475 288 -24 -535 167 281 -146 516 80 -406 29 653 295 -44 -96 -189 -87 41 416
7722D16m70L3J37j13P2J44k16l58M01K98m23j89K31m9K06q1J02n25jQ19k30k11
$$ 416 -54 -21 116 3 75 219 3 -355 46 344 -79 -268 -37 -86 120 39 141 -384 -385 434 204 -7
7744gR7j90Q3J13K61n35J36j9k79M30Q4j02o70L07J33n8M26j17l19J98M30k05
$$ -7 90 -100 -17 96 357 -178 -42 -61 -340 90 174 72 -598 -291 -158 -216 210 93 -226 -28 402 197
7766A97m04J97n5q0J49L9l14l08L04J93J0R4j89j04R4J66L74p77J66K54l49N99
$$ 197 -207 -10 -65 -145 4 43 -271 -579 -275 -82 -72 22 -167 -271 -177 -11 363 -414 -248 6 -343 256
7788B56k8j38P9j70J42m0J77l65j44K26O6J4J25k0o21O31M38l33n69k3N96k46
$$ 256 228 90 169 -1 141 101 278 -87 -231 -5 61 75 200 180 -441 190 628 295 -274 -297 299 53
7810E3J77J05m91j42N26K29n23r8K6L0M65J30o39J33N2k34K30L21K8l52M1M15
$$ 53 230 335 -156 -298 228 457 -66 -164 -138 -108 357 487 -152 -19 33 -201 29 350 378 26 67 482
7832D82n09l17M51k46O2L73O4m40RK52k79m5M26k37k76R5O77o95M28l0n92K94
$$ 482 -27 -344 107 -139 -77 296 360 -80 -71 181 -98 -143 283 46 -230 -135 542 -153 275 245 -347 -53
7854e3O08j5o19Or5kK00J20l92l21L91M9K49K34l34m47K02M41j28l5j97J33j63
$$ -53 555 540 -79 -73 -168 -170 30 150 -242 -563 -172 -123 126 360 26 -421 -219 222 94 59 -138 -5 -168
7877a68K21J37m08J31L4N6j64K83j71m72N31K09k11n59L07J23J68J60Q1l51l56
$$ -168 53 190 -218 -87 -53 3 -161 122 -49 -521 10 219 8 -551 -244 -121 47 207 288 -63 -419
7898d19K44K19k64L81j39m50N74O5k37L00m35l0L08K63j98p59K51O30l96J74j11
$$ -419 -175 44 -220 161 22 -428 146 211 -26 274 -161 -191 117 380 182 -577 -326 304 -92 82 -29
7919b9k50L9O40k03o08O96p06L23M1O89o17k08N2M48k74J67N4n07K00M15j97k96
$$ -29 -279 -240 400 197 -411 285 -421 -98 -57 632 15 -193 -141 307 33 200 254 -253 -53 362 165 -131
7941a31m5K26j89J36M28l70j10L75j2k17J50m9k27J44K49n81M28n3k13r0M37K01
$$ -131 -176 50 -139 -3 425 55 -55 320 308 91 241 192 -35 109 358 -223 205 152 -61 -151 286 487
7963D87q35L96j12K5K24P4o0r98R62j24K56J5n21k34K27N34j56o01Q5M22l14N05
$$ 487 -348 48 -64 -39 185 259 199 -799 163 39 295 310 -211 -445 -218 316 160 -441 -356 66 -248 257
7985B57j47p23M08N65j39m61K72J20l46O33j0l38k44J63m04N45J23m07k32K39
$$ 257 110 -613 -205 360 221 -240 32 152 -194 439 429 91 -153 10 -394 151 274 -133 -365 -126
8005a26l7J09l4p5k20L77J17L47o27rJ97o74O29K64O1m36K45m6o9M45m67m90M17
$$ -126 -163 -54 -88 -163 -383 -6 111 458 -169 -178 19 -655 -26 238 299 -137 108 62 -7 438 -29 -519 -102
8028a02K49J56l01m64M60j85K08L66o58J33J63M9J00k31j81J7o9N96k69M7r3k62
$$ -102 147 303 2 -462 -2 -187 21 387 -271 -138 25 74 174 -57 -238 -221 -290 306 37 84 -9 -271
8050b71J34J89L25n23L40k08k83L88J65j41l79J17N33k44l06NJ24j4K46j5m59
$$ -271 -137 52 377 -146 194 -14 -297 91 256 115 -264 -147 386 142 -164 -159 -35 -49 197 182 -277
8071b77O7kK59K52J75p60J87N35J40j65P1k29k75K76j13q9j37J12J14j1L46k14
$$ -277 -210 -212 47 299 474 -286 -99 436 576 411 482 253 -22 254 141 52 -85 27 141 130 476 262
8093B62l18j21O38l72k12L74j91k75M57j53Q1l33L20J2j73M68n93j96K08N12l91
$$ 262 -56 -177 461 89 -123 251 60 -215 242 89 170 -163 157 169 -4 464 -129 -325 -117 395 4
8114DL16K8n04O1J74K65k71k97J09J35L5J83l19j92L3O31l71J30j69k11R9K93
$$ 4 320 348 -156 -95 79 344 73 -224 -115 20 55 238 -81 -273 -240 391 20 150 -19 -230 -131 162
8136A62k65j47K2K32J97j59L77n05p9J68j00l4p2J93l68j24R44o94J82N5r0m08
$$ 162 -103 -250 -228 4 201 42 419 -86 -165 3 -97 -131 -203 -10 -378 -502 442 -252 -70 -15 -105 -513
8158e13O35J20m45k9L76r1J23J34n75j6M69j94k08K75j31l41L64M81j60o73M86
$$ -513 122 242 -203 -232 144 53 176 310 -265 -281 188 -6 -214 61 -70 -411 -47 434 274 -399 87
8179H7l8j90K05N9l14J4L03N8o5j71J21m06
$$ 87 49 -141 64 123 -191 -177 126 184 119 -52 69 -337
8191c37
$$ Imaginary data points
##PAGE= N=2
##DATA TABLE= (X++(I..I)), XYDATA
0@%%%%%%%%%%%Qj6J6j6J6j6K4l2L2m0M8n6O4p2Q4r4J06j20J38j57J75j92K15k42
$$ 0 0 0 0 0 0 0 0 0 0 0 0 8 -8 8 -8 8 -8 16 -16 16 -24 24 -32 32 -40 44 -50 56 -64 74 -83 92 -100 115 -127
35a27K69l01L34l68M06m50N01n53O11o79P55q39R34j044J173j325J509j737K023
$$ -127 142 -159 175 -193 213 -237 264 -289 322 -357 398 -441 493 -551 622 -703 806 -931 1092
54A092k402K925l694M940p296J3237n3810j15066J18600J12951k3006o1424J37
$$ 1092 -1310 1615 -2079 2861 -4435 8802 -45008 -160074 -41474 71477 48471 -12953 -12816
67a2816R409n508j7784P51L3143J6659m4719j1368O6870J6229r5558n4602O8262
$$ -12816 -3407 -8915 -26699 -25948 7195 23854 -20865 -32233 34637 50866 -44692 -99294 -31032
80c1032Q8132J1573n9251p1458M48O4890K0552l6730L581K8372k3765k4264K9827
$$ -31032 57100 68673 9422 -62036 -61588 3302 23854 -12876 -9295 19077 -4688 -28952 875
93H75J0043l9630j4008L5262M4111J7405m6510q2882k969Q8799M9062l1137l2670
$$ 875 10918 -28712 -42720 -7458 36653 54058 7548 -75334 -78303 10496 59558 28421 -4249
106d249j5927j2600J9635K6471j3098j0622K2169J305j6634J0893n933m5221N974
$$ -4249 -20176 -32776 -13141 13330 232 -10390 11779 13084 -3550 7343 1410 -43811 -37837
119c7837O9959L0202l5937m5837l0965J1085O2732L1664m3936l4176K0314J4714
$$ -37837 32122 62324 26387 -19450 -50415 -39330 23402 55066 11130 -23046 -2732 11982
131A1982q432n037q932j806K5938J6684j1458n663j9457m6637J4831R2517K8961
$$ 11982 3550 -1487 -10419 -12225 13713 30397 18939 13276 -6181 -52818 -37987 54530 83491
144H3491p7316n4387K4278L4624R899q068j7742O271K5853j0582k9619Q922O418
$$ 83491 6175 -48212 -23934 10690 20589 12521 -5221 1050 26903 16321 -13298 -4376 2042
157B042k4436J8049O1451k959p0534l9217K1825M9536M0299j8644o1012q809M3210
$$ 2042 -22394 -4345 57106 54147 -16387 -55604 -33779 15757 56056 37412 -23600 -32409 10801
170A0801N798k4056O421P641j4518J0751K7573j3162l7720j7455J1923M4743M2942
$$ 10801 16599 -7457 -1036 6605 -7913 2838 30411 17249 -20471 -37926 -26003 18740 61682
183F1682l1412p2626o592M8332J9640o834m339j5829p751K1947O801k5129q855
$$ 61682 30270 -42356 -48948 -616 19024 12190 7851 -7978 -15729 6218 13019 -12110 -20965
196b0965P984M564K6513K7679m0781o4572R018N7023K8419l707k7395m0788j411
$$ -20965 -12981 -8417 18096 45775 4994 -59578 -50560 6463 34882 31175 3780 -37008 -38419
209c8419M0752J5451j7163o482m418n550K3122J6182l5492l0723K4129L1306R865
$$ -38419 2333 17784 621 -5861 -10279 -15829 7293 23475 -12017 -42740 -18611 12695 22560
222B2560J46k7342m2505J1612N1663J2455k2938j4835r033L888K6185L014l1397
$$ 22560 22706 -4636 -47141 -35529 16134 28589 5651 -9184 -18217 -14329 11856 14870 -16527
235a6527p352K4763J1938L789m36l4082l1014L3424M9765o74k6627k2074j7867
$$ -16527 -23879 884 12822 16611 16175 -17907 -48921 -15497 34268 33594 6967 -15107 -32974
248c2974J4598M2010M037l3410p585J3656K144O640L606k5761j2754L2608K5339
$$ -32974 -18376 23634 27671 -5739 -13324 332 2476 9116 12722 -13039 -25793 6815 32154
261C2154j3017j9614j7455j0025K8556L9045j3665l6934m347J1563Q152J5410
$$ 32154 19137 -477 -17932 -27957 599 39644 25979 -10955 -15302 -3739 4413 19823
273A9823m461l1203j389L4010J0223j7031j2672j5348m184L6360L1177k5562l7269
$$ 19823 15362 -15841 -17230 16780 27003 9972 -2700 -18048 -22232 14128 45305 19743 -17526
286a7526m536J1843J9972K1559j4512l4632L272K4906J608n516l180j7395o93
$$ -17526 -22062 -10219 9753 31312 16800 -17832 -14560 10346 11954 6438 3258 -14137 -14830
299a4830L5780J2187l4478k2831Q168J3225K0486J3309k7467l3916J2009K7850
$$ -14830 20950 33137 -1341 -24172 -16004 -2779 17707 31016 3549 -30367 -18358 9492
311I492O036l532j3455k2746R921L5959O34l0006j2411L910R480K6566R089l7129
$$ 9492 15528 11996 -1459 -24205 -14284 21675 22309 -7697 -20108 -16198 -6718 19848 28937 -8192
325h192k7756J9293K4009O319R3j8350k4186J4338L1189m998k1626m329M51R137
$$ -8192 -35948 -16655 7354 13673 13766 -4584 -28770 -14432 16757 11759 -9867 -14196 -13745 -4608
339d608K4530l433l8402j1416K6949J9564L994p170k8760j6658K8550K9781r706
$$ -4608 19922 16489 -21913 -33329 -6380 13184 17178 10008 -18752 -35410 -6860 22921 13215
352A3215j8871r174o447J5892K9488r151l6287l941K2545J2051N816n644k8787
$$ 13215 -5656 -14830 -21277 -5385 24103 14952 -21335 -25276 -2731 9320 15136 9492 -19295
365a9295r352K9898K0086j1086j3719r966n392K2150K2497j9169k7098P193J6084
$$ -19295 -28647 1251 21337 10251 -3468 -13434 -18826 3324 25821 6652 -20446 -13253 2831
378B831P010Q193j1551l0861K285L6457J2274j7125j4500j2269R08K9677J7908
$$ 2831 9841 18034 6483 -24378 -22093 14364 26638 9513 -4987 -17256 -16348 13329 31237
391C1237k4274k3058M527J0288J3472J3071j8695l0635J1164L0111K814j1743
$$ 31237 6963 -16095 -11568 -1280 12192 25263 6568 -24067 -12903 17208 20022 8279
403H279r304j3792L762L0534P690k7270j4723P632R508J4036O915k6133k2155
$$ 8279 -1025 -14817 -11055 19479 27169 -101 -14824 -7192 2316 16352 23267 -2866 -25021
416b5021K0212K4955k291j0695j3244j4858J4250L3297k033k9220j1366N347J1326
$$ -25021 -4809 20146 17855 7160 -6084 -20942 -6692 26605 24572 -4648 -16014 -10667 659
429F59K0483K360l2256j6454K1475J8033j038m238j6247j5925J8200K8042r067
$$ 659 21142 23502 -8754 -25208 -3733 14300 13262 9024 -7223 -23148 -4948 23094 14027
442A4027k3580m330M236J0613J7482o364k9404m278K2510J0771p47o549k2319
$$ 14027 -9553 -13883 -9647 966 18448 12084 -17320 -21598 912 11683 10936 4387 -17932
455a7932q224K9425K1685j7882k0967l030K618J5932K1024j2833l1675r49K0859
$$ -17932 -26156 3269 24954 7072 -13895 -16925 -14307 1625 22649 9816 -21859 -22808 -1949
468a949J0548L992q906k4366k944K9007J2510j6170j1239m489p03J9614J6231
$$ -1949 8599 12591 3685 -20681 -23625 5382 17892 1722 -9517 -14006 -14709 4905 21136
481B1136k1258k4579J0082J8184N306K272j3276k2652P253L0894M779j7872j1212
$$ 21136 -122 -24701 -14619 3565 8871 11143 -2133 -24785 -17532 13362 18141 269 -10943
494a0943o560N338K6206J0178k7582j9226J1057J4312R509M849j8932k3100J3581
$$ -10943 -17503 -12165 14041 24219 -3363 -22589 -11532 2780 12289 17138 -1794 -24894 -11313
507a1313K5732P56j1201q337j0901O341K6552K584k6292r252J2245Q002Q445J801
$$ -11313 14419 15175 3974 -4363 -15264 -8923 17629 20213 -6079 -15331 -3086 4916 13361 15162
521A5162k1435j4539J9618K0152l993j1936j1231q186J6172K5320p655k5349m380
$$ 15162 -6273 -20812 -1194 18958 14965 3029 -8202 -16388 -216 25104 17449 -7900 -12280
534a2280P842Q306J5306j071k8147j0613K3557J5657o117p979j1656q185J7693
$$ -12280 -4438 3868 19174 18103 -10044 -20657 2900 18557 12440 4461 -7195 -15380 2313
547B313K1069j0578j9300k840L900J0097J4805q265k6341J412K1775N711o003
$$ 2313 23382 12804 -6496 -9336 -5436 4661 19466 11201 -15140 -13728 8047 13758 7755
560G755o440j3914k360K5666J3855j9973j8371R02O380J5340J3699j6395k6211
$$ 7755 1315 -12599 -14959 10707 24562 4589 -13782 -12880 -6500 8840 22539 6144 -20067
573b0067L736K0110P111k99q914j8816J465K5682P087j7883j0809m4L859J7188
$$ -20067 -16331 3779 10890 10591 1677 -17139 -15674 10008 17095 -788 -11597 -11641 -7782 9406
587I406R136k1760j9028J1581J5159K271J566j0503j8299P654K5203M52j8379
$$ 9406 18542 -3218 -22246 -10665 4494 6765 8331 -2172 -20471 -12817 12386 12838 -5541
600e541q228L15R203J8867O81k6829j3017J4481J5008P744k14k0187j8739J5542
$$ -5541 -13769 -13454 -4251 14616 15297 -11532 -24549 -10068 4940 12684 12470 -7717 -26456 -10914
614a0914K3137j547j0614o166q327N900K2365n77k5446o544J5878J1467L758n713
$$ -10914 12223 10676 62 -6104 -14431 -8531 13834 13257 -12189 -18733 -2855 8612 12370 6657
628F657k0599p288K0794J6122n992p573r549j0140J3485K4252p751k4215j289
$$ 6657 -13942 -21230 -436 15686 9694 2121 -7428 -17568 -4083 20169 12418 -11797 -13086
641a3086J2594R018O887q236k4509j580K5951J2297p950r049j2063p546J7492
$$ -13086 -492 8526 15413 7177 -17332 -18912 7039 19336 11386 2337 -9726 -17272 220
654B20K0645p885j6862l056K391Q243J1669q940k0765O672K2001J503j0997p651
$$ 220 20865 12980 -3882 -6938 -4547 3696 15365 6425 -14340 -7668 14333 15836 4839 -2812
668b812r645J848K3831J0176j7247j4283K98J341J2362J3910j2174k1665O189
$$ -2812 -12457 -10609 13222 23398 6151 -8132 -7834 -6493 5869 19779 7605 -14060 -7871
681g871J8156K039p257r013j0717R169K3427O48j9341r232j24L327J6526J0494
$$ -7871 10285 12324 5067 -3946 -14663 -5494 17933 18581 -760 -9992 -10116 -6789 9737 20231
695B0231j7769j6814Q506J0239o29o8n510j0313J0270J8954o577k1199o102O563
$$ 20231 2462 -14352 -5846 4393 3764 3696 -1814 -12127 -1857 17097 10520 -10679 -16781 -10218
709a0218J3706J6025n633k6127q056J3955R236M731L100j4094j5669J3096J8414
$$ -10218 3488 19513 13880 -12247 -20303 -6348 2888 7619 10719 -3375 -19044 -5948 12466
722A2466o890j4439l305K631J3380J4785j2072k6217j95J7850P950L356j803j6560
$$ 12466 5576 -8863 -12168 -9537 3843 18628 6556 -19661 -19856 -2006 5944 9300 7497 -9063
736i063j0054J4817J2830m931o928m858j511J5289J1918j9451k2993R547K1039
$$ -9063 -19117 -4300 8530 3599 -3329 -8187 -9698 5591 17509 -1942 -24935 -15388 5651
749E651Q619p54j2561k1588k99K3243J1741m404o322j3059p306J7825J6168j3959
$$ 5651 14270 13516 955 -20633 -20932 2311 14052 9648 3326 -9733 -17039 786 16954 2995
763B995j6789N852J3073P183q25j7156j6269J2571K2362J741o892o337j4340l328
$$ 2995 -13794 -7942 5131 12314 11489 -5667 -21936 -9365 12997 14738 7846 1509 -12831 -16159
777a6159K2383J3400j4681j3051L716O556P673J261j7591j1466J7227K0058k412
$$ -16159 6224 19624 4943 -8108 -4392 2164 9837 11098 -6493 -17959 -732 19326 16914
790A6914j1601j2461j1093R529K5147M778j5890r562l810J84J5119R267j6467
$$ 16914 5313 -7148 -18241 -8712 16435 21213 5323 -4239 -8049 -7865 7254 16521 54
803E4j1252J3781J1039n838p894q808m284J7256J8250q947j7600m703l67N405
$$ 54 -11198 2583 13622 7784 -110 -8918 -13202 4054 22304 13357 -4243 -8946 -9313 -3908
817c908J6855L422j8686q251J0080O005m03k562j1609k865K0501J2981j7125j7154
$$ -3908 12947 16369 -2317 -10568 -488 5517 5114 2552 -9057 -11922 8579 21560 4435 -12719
831a2719n17M906J1473J4737n929k0670m462P806N037N920R89j3082l664J6217
$$ -12719 -13236 -8330 3143 17880 11951 -8719 -13181 -5375 -338 5582 6571 -6511 -10175 6042
845F042M779j5380r817L381Q847J5095M716k1412j8356Q906J3530N428N207n545
$$ 6042 10821 -4559 -14376 -10995 -2148 12947 17663 -3749 -22105 -13199 331 5759 10966 5421
859E421j9224k325J8909O424j0407o964j456O373J5203O54k2369j2137J2725J3318
$$ 5421 -13803 -16128 2781 9205 -1202 -8166 -9622 -3249 11954 12608 -9761 -21898 -9173 4145
873D145O081K026j3551j8262N802J8458K790m996l662p051J810J5514j053k0190
$$ 4145 10226 12252 -1299 -19561 -13759 4699 7489 2493 -1169 -8220 -6410 9104 8051 -12139
887a2139l866J5402J0986L023n910j9384j0995J7724J9672n53p709j1100j0724
$$ -12139 -16005 -603 10383 13406 7496 -11888 -22883 -5159 14513 13960 6251 -4849 -15573
900a5573P570K0513n22j6076k805O283M914O619l846j9307l149J9917J2343n499
$$ -15573 -8003 12510 11988 -4088 -6893 -610 4304 10923 7077 -12230 -15379 4538 16881 11382
914A1382p578j1315q858J4114J9489m365j4831k671K175M379Q195n195j5174L773
$$ 11382 3804 -7511 -16369 -2255 17234 12869 -1962 -4633 -2458 1921 10116 4921 -10253 -6480
928f480J7080L991p491q355j2157l57K2507J4709j3074j5512m076L99J0460J4237
$$ -6480 10600 14591 7100 -1255 -13412 -13769 8738 23447 10373 -5139 -9215 -8816 1644 15881
942A5881o513j7153J705J1735Q65k987m651q563L479J8337L727j4747r227j634
$$ 15881 9368 -7785 -6080 5655 6520 3533 -1118 -9681 -6202 12135 15862 1115 -8112 -9746
956i746K289J4053J0738j3628j5821N139Q954J667K61o415r074Q568J6714m438
$$ -9746 -7457 6596 17334 3706 -12115 -6976 1978 3645 3906 -2509 -11583 -3015 13699 9261
970I261j6427m484J829N933J6311L844j9330j3908O332R938O984L173j1631j2463
$$ 9261 -7166 -11650 -9821 -3888 12423 16267 -3063 -16971 -10639 -701 6283 9456 -2175 -14638
984a4638J0130J3189o456j0045P99J241N888J1529n495j8605l384J1263P798O213
$$ -14638 -4508 8681 2225 -7820 -7021 -5780 108 11637 6142 -12463 -15847 -4584 3214 9427
998I427j79j8012j0730J5805J4678o484r167l200k18J0427R747j0268j5430K924
$$ 9427 9248 -8764 -19494 -3689 10989 4505 -4662 -7862 -8080 2347 12094 1826 -13604 -10680
1012a0680R070O024P243l739k0172o427J8349J1869m023o857o919l323J2058Q721
$$ -10680 -1610 4414 11657 7918 -12254 -18681 -332 11537 7514 657 -6262 -9585 2473 11194
1026A1194j1320r362O318O398K922L366q599j6001M252J9151N645o041q488j0851
$$ 11194 -126 -9488 -3170 3228 6150 9516 917 -15084 -10832 8319 13964 7923 -565 -11416
1040a1416N84J8520Q781j3843r502K895M022O498N411j1441j3864R037J4848R36
$$ -11416 -10832 7688 16469 2626 -6876 -3981 41 6539 11950 509 -13355 -4318 10530 11466
1054A1466m693p628j0953L958J8998M312j2906p083J03K452R607M327j3631r095
$$ 11466 6773 -855 -11808 -7850 11148 15460 2554 -4529 -4426 -1974 7633 11960 -1671 -10766
1068a0766J1793R977l831m503p579p117J0765J7695m033j4831n724J72N552J4311
$$ -10766 1027 11004 7173 2670 -4909 -12026 -1261 16434 12401 -2430 -8154 -7982 -2430 11881
1082A1881J996j8054q520J0423Q886J71k075j0764o368J3552J1966q153j0087
$$ 11881 13877 -4177 -12697 -2274 6612 6783 4708 -6056 -12424 1128 13094 4941 -5146
1095e146j390j519N762J4434k758j7496l973J0253N779J928l487j2190j086J5404
$$ -5146 -6536 -8055 -2293 12141 9383 -8113 -12086 -1833 3946 5874 2387 -9803 -10889 4515
1109D515N822j0468p632m20K27J0297J1749r768j7687K35J0393O956N129n793
$$ 4515 10337 -131 -7763 -8183 -7956 2341 14090 4322 -13365 -13130 -2737 4219 9348 3555
1123C555j6449n0J6639M526q351m176l115j50J1156P415j2167j0548M430O567
$$ 3555 -12894 -12944 3695 8221 -130 -4306 -7421 -7571 3585 11000 -1167 -11715 -7285 -718
1137g18N577M233r356j4654O025J6474K52p940m204m608L026J4521K773j5294
$$ -718 4859 9092 -264 -14918 -8893 7581 7833 -107 -4311 -8919 -5893 8628 11401 -3893
1151c893p281O130O040O728L673j3510j3365R480J4847j11n223o128p209N506
$$ -3893 -11174 -5044 996 7724 11397 -2113 -15478 -5998 8849 8738 3515 -2613 -9822 -4316
1165d316J4706n77j2748k723L783K643P717J370j4632p129J3072R618l356m548
$$ -4316 10390 9813 -2935 -5658 -1875 768 8485 9855 -4777 -11906 1166 10784 7428 2880
1179B880o592n761J0280J3900o114j2856j627L177N907R442l796j6597k693J3360
$$ 2880 -3712 -9473 807 14707 8593 -4263 -5890 -2713 3194 12636 8840 -7757 -10450 2910
1193B910O515j437l496j0113n410J3811J1957q233j0282j060P12O656R266n945
$$ 2910 9425 7988 4492 -5621 -11031 2780 14737 6504 -3778 -4838 -4126 2530 11796 5851
1207E851j4370J186J1211L006j308l810j0319l06J5603N944j0886q239m42J968
$$ 5851 -8519 -7333 3878 6884 5576 1766 -8553 -8859 6744 12688 1802 -6437 -6879 -4911
1221d911J0091P828j1831j3969N436R692L235J367o302j3313K812J6795L284j0219
$$ -4911 5180 13008 1177 -12792 -7356 2336 5571 6938 636 -12677 -9865 6930 10214 -5
1235en513k333J000J1560N867j2822r224O219N503K946K096p743j0754Q040J3213
$$ -5 -5518 -7851 -6851 4709 10576 -2246 -11470 -5251 252 3198 5294 -2449 -13203 -5163 8050
1250H050k253r117k717k499M216J3111J49j6002n495Q227O065M012M91j1637r225
$$ 8050 5797 -3320 -6037 -8536 -4320 8791 8940 -7062 -12557 -4330 1735 5747 6238 -5399 -14624
1265a4624J1034J1728k451n986n486m788P800J3584l755j4202j474O165L210N750
$$ -14624 -3590 8138 5687 -299 -5785 -10573 -2773 10811 7056 -7146 -8620 -2455 755 6505
1279F505m64j2761m651J2666P273m947m498m708k373J0499J0496q744j2620J803
$$ 6505 6041 -6720 -11371 1295 8568 3621 -877 -5585 -7958 2541 13037 4293 -8327 -6524
1293f524N539M734P021n184j4973n94J3982O037l930m359q781j801J4351Q150
$$ -6524 -985 3749 10770 5586 -9387 -9981 4001 10038 6108 1749 -7032 -8833 5518 13668
1307A3668j0174q917K018J911N384P947o848j3954K881J1684K289j941m904q914
$$ 13668 3494 -5423 -3405 -1494 3890 11837 4989 -8965 -6084 5600 7889 5948 1044 -7870
1321g870K226J4649K839j1566n545J952K046Q059N211j2082j0978P060J0266J156
$$ -7870 -5644 9005 11844 278 -5267 -3315 -1269 6790 12001 -81 -11059 -3999 6267 7423
1335G423p11o969j1121N369J6014R98j1225n075m66K914J0248L000j2323p614
$$ 7423 6712 -257 -11378 -6009 10005 11003 -222 -5297 -5763 -2849 7399 10399 -1924 -9538
1349i538O894N557J470J032p765q971Q335J2623m001q772k487q96N075J0484j925
$$ -9538 -2644 2913 4383 5415 -2350 -11321 -2986 9637 5636 -3136 -5623 -6519 -1444 9040 7115
1364G115j4650k806Q662M570K144q16j1065o130J2167R552n131o740l314k777
$$ 7115 -7535 -10341 -1679 2891 5035 4219 -6846 -12976 -809 8743 3612 -3128 -6442 -9219
1378i219P707J1489m822j3267o47N920L321M940j354j2300k035J2288L822o288
$$ -9219 -1512 9977 5155 -8112 -8759 -2839 482 5422 4068 -8232 -10267 2021 5843 -445
1392d45k802j602j646Q222P717q995j0583L627N996M283M084o269j3239L170J3483
$$ -445 -3247 -4849 -6495 1727 9444 449 -10134 -6507 -511 3772 7856 1587 -11652 -8482 5001
1407E001K515n613m018n048O06J2418M410j1085o631L740K924N031N206q247j2218
$$ 5001 7516 1903 -2115 -7163 -6557 5861 10271 -814 -7445 -3705 -781 4250 9456 1209 -11009
1422a1009N296J1842R77l799m035o807L954J3156r17j2108k342N186K540N150
$$ -11009 -5713 6129 7106 3307 -728 -7535 -3581 9575 8658 -3450 -5792 -606 1934 7084
1436G084K051j2456p477R702R644j73l910p151p495P857J4738l002j1675k581
$$ 7084 9135 -3321 -10798 -1096 8548 8375 4465 -2686 -10181 -2324 12414 9412 -2263 -4844
$$ [...]
8191G4
##END NTUPLES=NMR FID
##END=
