##TITLE=1H_CA-8586
 DMSO, 8 sc, 
 30.4.2019
##JCAMPDX= 6.0         $$ Bruker NMR JCAMP-DX V2.0
##DATA TYPE= NMR FID
##DATA CLASS= NTUPLES
##ORIGIN= UXNMR, Bruker Analytische Messtechnik GmbH
##OWNER= root
$$ XWIN-NMR		Version 3.5
$$ Tue Apr 30 14:26:21 2019 Russian Standard Time (UT+4h)  she@DPX200
##.OBSERVE FREQUENCY= 200.1315
##.OBSERVE NUCLEUS= ^1H
##.DELAY= (6, 6)
##.ACQUISITION MODE= SIMULTANEOUS
##.ACQUISITION SCHEME= undefined
##.AVERAGES= 8
##.DIGITISER RES= 18
##SPECTROMETER/DATA SYSTEM= spect
##.PULSE SEQUENCE= zg30
##.SOLVENT NAME= D2O
##.SHIFT REFERENCE= (INTERNAL, D2O, 0, 15.7039)
##AUDIT TRAIL= $$ (NUMBER, WHEN, WHO, WHERE, WHAT)
$$ ##TITLE= Audit trail, XWIN-NMR		Version 3.5
$$ ##JCAMPDX= 5.01
$$ ##ORIGIN= Bruker BioSpin GmbH
$$ ##OWNER= she
$$ F:/spectra/data/she/nmr/H-F/1/audita.txt
$$ ##AUDIT TRAIL=  $$ (NUMBER, WHEN, WHO, WHERE, WHAT)
(   1,<2019-04-30 14:25:07.96 +0400>,<she>,<DPX200>,
      <created by zg, POWCHK disabled, PULCHK disabled
       configuration hash MD5:
       00 E9 B6 7A A2 85 ED C7 34 08 36 98 17 FE 4E 26
       data hash MD5: 16K
       94 47 E8 88 26 46 7B 78 5C 9B F0 E2 37 50 60 04>)
$$ ##END=
$$ 
$$ hash MD5
$$ F3 94 C1 96 56 0E E7 C2 97 1D 99 0E 36 AB 8D E4
##$RELAX= 
##$RELAX= 
##$RELAX= 
##$RELAX= 
##$RELAX= 
##$RELAX= 
$$ Bruker specific parameters
$$ --------------------------
##$DU= <F:/spectra>
##$EXPNO= 1
##$NAME= <H-F>
##$PROCNO= 1
##$TYPE= <nmr>
##$USER= <she>
##$AMP= (0..31)
100 100 100 100 100 100 100 100 100 100 100 100 100 100 100 100 100 100 
100 100 100 100 100 100 100 100 100 100 100 100 100 100 
##$AQSEQ= 0
##$AQ_mod= 1
##$AUNM= <au_zg>
##$AUTOPOS= <>
##$BF1= 200.13
##$BF2= 200.13
##$BF3= 200.13
##$BF4= 200.13
##$BF5= 200.13
##$BF6= 200.13
##$BF7= 200.13
##$BF8= 200.13
##$BYTORDA= 1
##$CFDGTYP= 0
##$CFRGTYP= 5
##$CHEMSTR= <none>
##$CNST= (0..31)
1 1 145 1 1 1 1 1 1 1 1 1 1 1 1 1 1 1 1 1 1 1 1 1 1 1 1 1 1 1 1 1 
##$CPDPRG= <>
##$CPDPRG1= <>
##$CPDPRG2= <>
##$CPDPRG3= <>
##$CPDPRG4= <mlev>
##$CPDPRG5= <mlev>
##$CPDPRG6= <mlev>
##$CPDPRG7= <mlev>
##$CPDPRG8= <mlev>
##$CPDPRGB= <>
##$CPDPRGT= <>
##$D= (0..31)
0 1.2 0 0 0 0 0 0 0 0 0 0.03 0 0 0 0 0 0 0 0 0 0 0 0 0 0 0 0 0 0 0 0 
##$DATE= 1556619907
##$DBL= (0..7)
120 120 120 120 120 120 120 120 
##$DBP= (0..7)
150 150 150 150 150 150 150 150 
##$DBP07= 0
##$DBPNAM0= <>
##$DBPNAM1= <>
##$DBPNAM2= <>
##$DBPNAM3= <>
##$DBPNAM4= <>
##$DBPNAM5= <>
##$DBPNAM6= <>
##$DBPNAM7= <>
##$DBPOAL= (0..7)
0.5 0.5 0.5 0.5 0.5 0.5 0.5 0.5 
##$DBPOFFS= (0..7)
0 0 0 0 0 0 0 0 
##$DE= 6
##$DECBNUC= <off>
##$DECIM= 24
##$DECNUC= <off>
##$DECSTAT= 4
##$DIGMOD= 1
##$DIGTYP= 9
##$DL= (0..7)
0 120 120 120 120 120 120 120 
##$DP= (0..7)
150 150 150 150 150 150 150 150 
##$DP07= 0
##$DPNAME0= <>
##$DPNAME1= <>
##$DPNAME2= <>
##$DPNAME3= <>
##$DPNAME4= <>
##$DPNAME5= <>
##$DPNAME6= <>
##$DPNAME7= <>
##$DPOAL= (0..7)
0.5 0.5 0.5 0.5 0.5 0.5 0.5 0.5 
##$DPOFFS= (0..7)
0 0 0 0 0 0 0 0 
##$DQDMODE= 0
##$DR= 18
##$DS= 0
##$DSLIST= <SSSSSSSSSSSSSSS>
##$DSPFIRM= 0
$$ [...]
##$SUBNAM2= <"">
##$SUBNAM3= <"">
##$SUBNAM4= <"">
##$SUBNAM5= <"">
##$SUBNAM6= <"">
##$SUBNAM7= <"">
##$SUBNAM8= <"">
##$SUBNAM9= <"">
##$SW= 24.9337058887773
##$SWIBOX= (0..15)
0 0 2 0 0 0 0 0 0 0 0 0 0 0 0 0 
##$SW_h= 4990.01996007984
##$TD= 16384
##$TD0= 1
##$TE= 0
##$TE2= 300
##$TE3= 300
##$TEG= 300
##$TL= (0..7)
0 120 120 120 120 120 120 120 
##$TP= (0..7)
150 150 150 150 150 150 150 150 
##$TP07= 0
##$TPNAME0= <>
##$TPNAME1= <>
##$TPNAME2= <>
##$TPNAME3= <>
##$TPNAME4= <>
##$TPNAME5= <>
##$TPNAME6= <>
##$TPNAME7= <>
##$TPOAL= (0..7)
0.5 0.5 0.5 0.5 0.5 0.5 0.5 0.5 
##$TPOFFS= (0..7)
0 0 0 0 0 0 0 0 
##$TUNHIN= 0
##$TUNHOUT= 0
##$TUNXOUT= 0
##$USERA1= <user>
##$USERA2= <user>
##$USERA3= <user>
##$USERA4= <user>
##$USERA5= <user>
##$V9= 5
##$VALIST= <valist>
##$VCLIST= <CCCCCCCCCCCCCCC>
##$VD= 0
##$VDLIST= <DDDDDDDDDDDDDDD>
##$VPLIST= <PPPPPPPPPPPPPPP>
##$VTLIST= <TTTTTTTTTTTTTTT>
##$WBST= 1024
##$WBSW= 4
##$XGAIN= (0..3)
0 0 0 0 
##$XL= 0
##$YL= 0
##$YMAX_a= 239815
##$YMIN_a= -212322
##$ZGOPTNS= <>
##$ZL1= 120
##$ZL2= 120
##$ZL3= 120
##$ZL4= 120
##$ABSF1= 10
##$ABSF2= 0
##$ABSG= 5
##$ABSL= 3
##$ALPHA= 0
##$AQORDER= 0
##$ASSFAC= 0
##$ASSFACI= 0
##$ASSFACX= 0
##$ASSWID= 0
##$AUNMP= <proc_1d>
##$AZFE= 0.1
##$AZFW= 0.1
##$BCFW= 1
##$BC_mod= 2
##$BYTORDP= 1
##$COROFFS= 0
##$CY= 11.3945322036743
##$DATMOD= 1
##$DC= 2
##$DFILT= <>
##$DTYPP= 0
##$F1P= 18.9103706918063
##$F2P= -1.10871071338519
##$FCOR= 0.5
##$FTSIZE= 0
##$FT_mod= 4
##$GAMMA= 1
##$GB= 0.15
##$INTBC= 1
##$INTSCL= 1
##$ISEN= 128
##$LB= 0.24
##$LEV0= 0
##$LPBIN= 0
##$MAXI= 10000
##$MC2= 0
##$MEAN= 0
##$ME_mod= 0
##$MI= 1.114404
##$NCOEF= 0
##$NC_proc= 0
##$NLEV= 6
##$NOISF1= 3.799351
##$NOISF2= 2.8
##$NSP= 1
##$NTH_PI= 0
##$NZP= 0
##$OFFSET= 15.70392
##$PC= 1
##$PHC0= -8858.231
##$PHC1= 17.00026
##$PH_mod= 1
##$PKNL= yes
##$PPARMOD= 0
##$PSCAL= 0
##$PSIGN= 0
##$REVERSE= no
##$SF= 200.130013532006
##$SI= 16384
##$SIGF1= 3
##$SIGF2= 2
##$SINO= 400
##$SIOLD= 16384
##$SREGLST= <1H.CDCl3>
##$SSB= 0
##$STSI= 0
##$STSR= 0
##$SW_p= 3612.71676300578
##$SYMM= 0
##$S_DEV= 0
##$TDeff= 0
##$TDoff= 0
##$TI= <>
##$TILT= no
##$TM1= 0
##$TM2= 0
##$TOPLEV= 0
##$USERP1= <user>
##$USERP2= <user>
##$USERP3= <user>
##$USERP4= <user>
##$USERP5= <user>
##$WDW= 1
##$XDIM= 8192
##$YMAX_p= 0
##$YMIN_p= 0
$$ End of Bruker specific parameters
$$ ---------------------------------
##NTUPLES= NMR FID
##VAR_NAME=  TIME,          FID/REAL,        FID/IMAG
##SYMBOL=    X,             R,               I
##VAR_TYPE=  INDEPENDENT,   DEPENDENT,       DEPENDENT
##VAR_FORM=  AFFN,          ASDF,            ASDF
##VAR_DIM=   8192,          8192,            8192
##UNITS=     SECONDS,       ARBITRARY UNITS, ARBITRARY UNITS
##FACTOR=    0.0002004,     1,               1
##FIRST=     0,             0,               0
##LAST=      1.6414764,     0,               0
##MIN=       0,             -212322,         0
##MAX=       1.6414764,     239815,          0
$$ Real data points
##PAGE= N=1
##DATA TABLE= (X++(R..R)), XYDATA
0@%%%%%%Mj2J6j6K4l2L2m0N2o0P2q8J05j24J47j71J98k29K64l05L48l96M50n08
30b69N73o47P25q11R06j009J125j251J388j540J706j888K093k318K565k844L159
47A663l515L921m390M939n596O392p381Q654j0359J2784j6535K3179l8541J41243
61A16458O7411j66744J6304Q9665J16721j2648q7038r9070L41O3886P7626O646
73A89558n1671q0418l7802K1923P2511N0689k1900r8030q3295J0481J01510Q0479
85A54035l1267j24510r2785K8399J15883P2770m7724j21556p1529L7168R5167
96A4051N1578l7261q4246n5453J0077N7709N4146O143n3986p4455l0452M7913
108i4236Q8077M1021n6902j06269m6051O7504J13890M0806p7263j12528k7671
$$ plain form
0 0 0 0 0 0 0 0 4 -8 8 -8 16 -16 16 -24 28 -32 40 -48 57 -67 80 -91 107 -122 142 -163 185 -211 239 -269
30 -269 304 -343 382 -429 477 -532 593 -658 730 -810 896 -992 1101 -1217 1348 -1496 1663
47 1663 -1852 2069 -2321 2618 -2978 3414 -3967 4687 -5672 7112 -9423 13756 -24785 116458
61 116458 183869 17125 33429 123094 239815 227167 140129 41059 41400 105286 182912 189558
73 189558 137887 57469 19667 41590 114101 164790 142890 44860 -38435 -27954 73556 154035
85 154035 122768 -1742 -94527 -66128 49755 122525 74801 -46755 -118284 -81116 14051
96 14051 65629 28368 -55878 -111331 -101254 -43545 10601 16744 -37242 -111697 -142149 -94236
108 -94236 -6159 34862 -22040 -128309 -174360 -106856 7034 47840 -29423 -141951 -169622
119a69622Q2578J02347J9563p1421q1626j4902N8316P1764K5652l4470n8945l6308
131a07074J8072O3403N9132r63o7630p3476L68Q4570Q8081k086r3854q6088J2932
144a04613R9701Q1897j8595r4773o9766K2710Q4172N8224j6866o6404n1908L349
156g2872M9454N1693J4137l6832o2360l3926L1960P5582M5892l6160q9685n2418
168a15535M3693R8354M8531n4390r8868l9838N8128R1177L0618n3950p6532k4217
180i2829M2420O2300K9448k3114n1675l7013Q830N0829N4180Q697n2376o6489
192f6792j0706O5403Q0726J3405p1410q0424k771Q1329Q0558j121p5142o6918
204e3863R171P0744O0060l187n3491m7879k653M0146M9067K0614k5632n1496l3308
$$ plain form
119 -169622 -87044 15303 34866 -36555 -118181 -133083 -74767 -3003 22649 -11821 -70766 -107074
131 -107074 -89002 -25599 33533 32570 -35060 -108536 -108168 -23598 64483 62397 -31457 -117545 -104613
144 -104613 -4912 76985 58390 -36383 -106149 -83439 733 58957 42091 -24313 -76221 -72872
156 -72872 -23418 28275 42412 5580 -56780 -90706 -58746 16836 62728 26568 -63117 -115535
168 -115535 -71842 26512 75043 20653 -78215 -118053 -59925 31252 61870 7920 -68612 -92829
180 -92829 -50409 11891 41339 18225 -33450 -70463 -61633 -10804 43376 52073 -303 -66792
192 -66792 -77498 -12095 68631 82036 10626 -69798 -72569 8760 89318 88197 13055 -53863
204 -53863 -44692 26052 86112 82925 29434 -18445 -21098 19048 68115 88729 63097 11601 -21707
217b1707J9537O3383M9151k0324p4347n4353K5731Q2584N3308l4358q5805m7507
229d4707L7621P8427L6571l8228o9649l3758K6426N3669K9206j7267m6548l9336
241b7573l229L7329M6007J0696m2794o2944k3139M3540O8273J8775n6300p7205
253f8564j9692N7364P0759R230o2390o7933p152N3006N4133M114m4160m8883j2380
266h2548K9153M2787K1077j7084m5263l5500R660N1990M6845o809n9792n3918
278i9402J1561O9538N6305j5707o9882m8559K3414O9826M3992k0915n6987l4044
290g0860J9618M9450L5721m986l5085l3644l253L2264M6020K0026k7392n1809
302b3930k2850L5432O3638K9309l6582o5286k3319M5167O8177K1493m3508o0060
$$ plain form
217 -21707 -2170 61213 110364 90040 15693 -38660 -12929 69655 122963 88605 2800 -44707
229 -44707 -7086 71341 107912 69684 35 -33723 -7297 46372 75578 58311 11763 -27573
241 -27573 -30802 6527 52534 63230 20436 -42508 -65647 -22107 46166 64941 8641 -68564
253 -68564 -88256 -30892 39867 49097 -13293 -81226 -88378 -35372 18761 22875 -21285 -70168 -82548
266 -82548 -53395 -10608 10469 -6615 -51878 -87378 -77718 -25728 21117 14308 -45484 -99402
278 -99402 -87841 -18303 38002 22295 -47587 -96146 -72732 -2906 41086 20171 -36816 -70860
290 -70860 -51242 -1792 33929 28943 -6142 -39786 -43039 -10775 35245 55271 27879 -23930
302 -23930 -46780 -11348 52290 81599 45017 -20269 -43588 1579 69756 91249 47741 -12319
314a2319j4768M2642N4072J3790l2337m4121j6194K2156L9377K4417j1685l8377
326B6653l4274J833M1703M3372K4m9317n2248p33N3169N2397n805o0031n1494
339c4751P412N4628M2869j2438n1702l9896N640L9521L1810j733l2480l6444j1926
352c9490K1775L7649J8745k2093m8355k9377K0670N2533K9640k6454n9440l1659
364g5856K8080N8472K6481l2036n5869k3586K8976M8024K0280k3446m0563k1218
376f2261J4748L4832K6596m086l2232l2755k165L4070M1503R281l6134m7440p400
389f3443M3664N1859O681m4361m8205j011M6414M6184J078l8877l7934q59L3978
402d832L6373P477k3605l1694j3363J7802L5963K3749j2520l9852k8886J3258
$$ plain form
314 -12319 -27087 15555 69627 83417 51080 6959 -9235 12921 52298 76715 65030 26653
326 26653 -7621 -5788 35915 79287 79311 29994 -22254 -22987 30182 82579 76774 16743 -34751
339 -34751 -27339 27289 70158 57720 6018 -33878 -28238 11283 43093 41360 8880 -27564 -39490
352 -39490 -17715 19934 38679 16586 -31769 -61146 -40476 12057 41697 15243 -44197 -75856
364 -75856 -47776 10696 37177 5141 -50728 -74314 -45338 2686 22966 -480 -41043 -62261
376 -62261 -47513 -12681 13915 9829 -22403 -55158 -57323 -23253 18250 27531 -8603 -56043 -63443
389 -63443 -19779 32080 38761 -5600 -53805 -54816 -8402 37782 38860 -17 -37951 -38810 -4832
402 -4832 31541 39018 15413 -16281 -29644 -11842 24121 47870 35350 -4502 -33388 -20130
414b0130M6094L4024j4231m9507l3354J7325N0644L1327j8935m8671k8638J8791
426a5261M2947K4417j5000l6801k4853P170L0513K6504q53k7543l2456q200K6206
439c210L7648J1950k9164m4038j4765L1606M6654J2479l5435m6516j0437L4484
451h744M2467Q386l1819l8320q428K5671L3714J1201j8486l0627j7210J2567L1778
464A2150K3919p218l4167k9491N961L9128L3425n831m0483l4177Q114M2732L3673
477D7735q880m0814l0348R029L7851K8336o712l1754k6483J479K5969K7461M933
490C7802k2924l0547j1433J9374L4266J5846k1244m0165j9284K1465M1182J7307
502D1645k5282m3338j7893K3715L8233J3618k4049l6869j5881J7001L0564J4610
$$ plain form
414 -20130 25964 59988 45757 -3750 -37104 -19779 30865 62192 43257 -5414 -34052 -15261
426 -15261 27686 52103 37103 302 -24551 -17381 13132 39636 38783 11240 -21216 -29416 -3210
439 -3210 34438 46388 17224 -26814 -41579 -9973 36681 49160 13725 -32791 -43228 -8744
451 -8744 33723 42109 10290 -28030 -36458 -10787 22927 34128 15642 -14985 -32195 -19628 12150
464 12150 36069 28851 -5316 -34807 -28846 10282 43707 37876 -2607 -36784 -28670 14062 47735
477 47735 38855 -1959 -32307 -23278 14573 42909 36197 4443 -22040 -20561 5408 32869 37802
490 37802 14878 -15669 -27102 -7728 26538 42384 21140 -19025 -38309 -16844 24338 41645
502 41645 16363 -26975 -44868 -21153 17080 30698 6649 -30220 -46101 -29100 1464 16074
514A6074j4094l0199k0907N588K6799K3283l652k9803l0320j475L0463L1729m14
527C072l3900l4541l22L3031L3594l85l3688l2121P58L1439K9417J355k5654k7644
541e5589l401K2551K8274R956j6254k8055j2818J6907L2896J9202j2450l2385
553c1166j9967J6610L8992K3143j4440l5134j9079J8212L7699K0855j3305l0649
565h229j6560J3253L0819K0787n885k4763j9723L819K5873K5805L322k3845k7453
578b780l194K6233L1551O362k5948l2314n710K7090L2709N450k5994l1720n906
591d171K4172K9042N719k1534k8291r057J6096K5728J1245j4572k7687j6725R067
604i68K7374J8456r821l1537k2569P490L0253K2357r804l3437k3514Q350L0237
$$ plain form
514 16074 1980 -28219 -49126 -43538 -16739 6544 2892 -26911 -57231 -58706 -28243 3486 3072
527 3072 -30828 -65369 -65691 -32660 934 549 -33139 -65260 -64502 -33063 -3646 -2291 -27945 -55589
541 -55589 -58990 -36439 -8165 1791 -14463 -42518 -55336 -38429 -5533 13669 1219 -31166
553 -31166 -51133 -34523 4469 27612 13172 -21962 -41041 -22829 14870 35725 22420 -8229
565 -8229 -24789 -11536 19283 40070 34185 9422 -10301 -6482 19391 45196 48518 24673 -2780
578 -2780 -5974 20259 51810 58172 32224 -90 -5800 21290 53999 59449 33455 1735 -4171
591 -4171 20001 49043 54762 33228 4937 -4120 11976 37704 48949 34377 6690 -10035 -968
604 -968 26406 44862 35041 3504 -19065 -11575 18678 41035 31231 -2206 -25720 -17370 12867
617A2867K0637q333k9473k1661M918K5151K0850k846k3287k2808j691K0693K4379
630A9396M835j9831k6973p891J9619K9379R777k0027k9906r652K0393L0672J1015
643C0806j9491k9060r839J8745K8191J1778j5455k5948j1914J2886K5487J5380
655C1566q897k4498j6790O303K4985K0757m347k5700k2644L760K6535K3311l244
668C1097k6836k4293K523K5964K2701k357k4503k2828l30K1371K1719J879k0481
681E626k2982n508J6599K3473P554j6849k6074j0416J4957K5617J1503j5365k8226
694b0091j2792J3981K7089J2846j4204k7114j4074J2316K5557J3950j0356k4925
706a7817j4865Q087K3000J6954n855k1873j8169K623K2209K0822r15k1397k2259
$$ plain form
617 12867 33504 25171 -4302 -25963 -21045 4106 24956 22110 -1177 -23985 -25676 -4983 19396
630 19396 24231 4400 -22573 -30464 -10845 18534 28311 8284 -21622 -31274 -10881 19791 30806
643 30806 11315 -17745 -27584 -8839 19352 31130 15675 -10273 -22187 -9301 16186 31566
655 31566 22669 -1829 -18619 -12316 12669 33426 29079 3379 -19265 -15505 11030 34341 31097
668 31097 4261 -20032 -17509 8455 31156 28799 4296 -18532 -18862 2509 24228 26107 5626
681 5626 -17356 -22864 -6265 17208 24762 7913 -18161 -28577 -13620 11997 23500 8135 -20091
694 -20091 -32883 -18902 8187 21033 6829 -20285 -34359 -22043 3514 17464 7108 -17817
706 -17817 -32682 -24595 -1595 15359 9504 -12369 -30538 -27915 -5706 15116 14201 -7196 -29455
719b9455k26K2754K4011J350k2218k3215r96K1494K3685K885j9536k2368l260
732b5095J8025K2435O052j5101k2335p912J3972K2924J0740j2411k3558j2493
744b4757J1384K4468J3891j1039k4321j5121R510K4021J5362q965k4516j6111
756b6194O571K3012J6062o241k2019j7390L145K0011J8081k315k0016j9426r49
769b7668J8569J9455K887j9117k1877m553J8120K2053M799j7607k2846n865J6877
782a6773K2231O256j5551k1753p709J3752K2057R416j2164k0778j0683J0450K2193
795I44J2612p876k1708j3309P810K2578J5650o096k1031j5184N766K1870J7328
808A9354l394k0367j6540L694K0863J8042j030j8208j7655Q74J8439J9174K190
$$ plain form
719 -29455 -29681 -6927 17084 18434 -3784 -26999 -27995 -6501 17184 20069 533 -21835 -25095
732 -25095 -7070 15365 21417 6316 -16019 -23931 -9959 12965 23705 11294 -12264 -24757
744 -24757 -13373 11095 24986 13947 -10374 -25495 -15985 8036 23398 14433 -10083 -26194
756 -26194 -19623 3389 19451 13210 -8809 -26199 -23054 -3043 15038 12723 -7293 -26719 -27668
769 -27668 -9099 10356 13243 -5874 -27751 -32304 -14184 7869 12668 -4939 -27785 -33650 -16773
782 -16773 5458 11714 -3837 -25590 -33299 -19547 2510 11926 -238 -21016 -31699 -21249 944
795 944 13556 5680 -16028 -29337 -21527 1051 16701 10605 -10426 -25610 -19844 2026 19354
808 19354 15960 -4407 -20947 -17253 3610 21652 20622 2414 -15241 -14367 4072 23246 25436
821B5436j6451j8915k466J6266K0720M892j4429k0198o109J4496K1524P832j3414
834A9184k1315p925J2803K1185R254j1186k1046j0098J0194J9810J1189q232k0187
847C630j2538O415J9214J3805n400k0152j5698M266J8959J5434l197j9247j6994
860a1503J367J7884J6765j002j7914j7922j428J6569J7572J140j5778j8798l908
873a6956J4338J8763M076j4617j8830o184J2156J8723P158j2101j9447r201J0545
886a1577J9311R397r809j9923j0991Q887J9199J0678p212j9062j2661O589J7959
899G85J2975n161j8241j3591L668J6873J4918k110j6926j5675N83J6944J5982
912A1024K56j6054j6287j168J5367J6920K200j4423j7048l558J3936J7485M977
$$ plain form
821 25436 8985 -9930 -12396 3870 24590 29482 15053 -5145 -11254 3242 24766 32598 19184
834 19184 -2131 -10056 2747 23932 33186 22000 954 -9144 1050 20860 32049 23817 3630
847 3630 -8908 -2493 16721 30526 25126 4974 -10724 -6458 12501 27935 24738 5491 -11503
860 -11503 -10136 7748 24513 23511 5597 -12325 -13753 2816 20388 21528 5750 -13048 -16956
873 -16956 -2618 16145 20221 5604 -13226 -19410 -7254 11469 18627 6526 -12921 -22122 -11577
886 -11577 7734 17131 7322 -12601 -23592 -14705 4494 15172 7960 -11102 -23763 -17174 785
899 785 13760 8599 -9642 -23233 -19565 -2692 12226 10116 -6810 -22485 -21902 -4958 11024
912 11024 11280 -4774 -21061 -22229 -6862 10058 12258 -2165 -19213 -22771 -8835 8650 13627
925A3627j2765j7788n565J2055J8081P007j0769j7793p855J0010J8250R049q730
938F814j7291r657P695J8218J0902o304j7606j1065N211J7621J3015m722j6204
951c373j2600L137J6682J3960k086j5558j3763J031J5177J5632M86j4375j5224
964a0874r60J3922J6066K464j2862j6138l103J2460J6758M963j1653j6429n767
977a1153J0896J7032O632r955j6463p771R004J6895Q430p994j6011r606O769J6673
991A3378R948n915j6079j1357M617J5747J2421l968j6074j2305K613J4887J2598
1004B0511j745j4651j3856L92J3768J3523Q57j3731j4514k282J2690J4891K289
1017A8142j2375j5366l941J1233J5328L887j0620j5941n656R293J5266O310r164
$$ plain form
925 13627 862 -16926 -22491 -10436 7645 14652 3883 -13910 -21765 -11755 6495 15544 6814
938 6814 -10477 -20134 -12439 5779 16681 10377 -7229 -18294 -13083 4538 17553 12831 -3373
951 -3373 -15973 -12836 3846 17806 15720 162 -13601 -12570 2607 18239 18725 4350 -10874
964 -10874 -11834 2088 18154 20618 7756 -8382 -11485 975 17733 22696 11043 -5386 -11153
977 -11153 -257 16775 23407 13452 -3011 -10782 -1778 15117 23547 15553 -458 -10064 -3295 13378
991 13378 23326 17411 1332 -10025 -5408 10339 22760 18792 2718 -9587 -6974 7913 20511
1004 20511 18766 4115 -9741 -9349 4419 17942 18799 5068 -9446 -11728 962 15853 18142
1017 18142 5767 -9599 -13540 -2307 13021 16908 6288 -9653 -15309 -6016 9250 15560 6396
1030F396j5679p502P672J5145Q398p694j5636r303O465J4712R323n385j5331j0512
1044a8931M266J4358J0518k410j4790j1944J608J3906J2201r82j3795j2376j67
1057a8538J3087J2887N90j2581j3292j558J1554J3734K769j1270j3629m098J0038
1070a0307J4627M760r844j4234n139Q401J4616O293q478j4273o770P347J4300
1083A299P770o063j4618q378N612J4144R368m335j3953j0048L878J3887J0221
1096H784k703j2806j1239J740J3049J1811q44j2296j1884j97J1867J2633J257
1109I172j1479j2609j836J0899J3018L056j0400j2889l114R420J2891M525q004
1122B650j3489n027P861J3412O625p266j3286o694O484J3365P748n266j3432p812
$$ plain form
1030 6396 -9283 -16785 -9113 6032 14430 6736 -8900 -18203 -11738 2974 12297 6912 -8419 -18931
1044 -18931 -14665 -307 10211 7801 -6989 -18933 -17325 -3419 8782 7800 -5995 -18371 -18538
1057 -18538 -5451 7436 8026 -4555 -17847 -19405 -7851 5883 8652 -2618 -16247 -20345 -10307
1070 -10307 4320 9080 -764 -14998 -20137 -11736 2880 9173 695 -13578 -20348 -13001 1299
1083 1299 9069 3006 -11612 -19990 -14378 -234 9134 4799 -9154 -19202 -15324 -1437 8784
1096 8784 6081 -6725 -17964 -16224 -3175 8636 7792 -4504 -16388 -16585 -4718 7915 9172
1109 9172 -2307 -14916 -16752 -5853 7165 10221 -179 -13068 -16182 -6762 6129 10654 2650
1122 2650 -10839 -15866 -8005 5407 12032 4766 -8520 -15214 -8730 4635 12383 7117 -6315 -14127
1136a4127M895J3184Q495l343j2468r553K959J2805J0196k294j2140j0385J410
1149a0366J2021J1031q52j1026j0912l17J0740J1434J419r938j2461j832R456
1162a603J2216L204r347j2246l646Q943J2513M257p918j2648m476P276J1895O059
1176A4479o364j1929o543N585J2499P473n208j1805p645L911J2466Q392l544j1362
1190D05r058L167J1320R663j506j1736r329J617J0490J0730l81j0057j0327j90
1204e192J0116J0735J533r253j0749j955Q843J1194L057p520j1523l634P565J1886
1218A5103M531o981j1642n157O679J1598N747o015j1430o065N217J1036O500m551
1232A4570j0975p534L516J0697P542k437j1303q884K013J0272Q548j230j0626
$$ plain form
1136 -14127 -9232 3952 12447 9104 -3364 -12917 -9958 2847 13043 10749 -1391 -11776 -10366
1149 -10366 1655 12686 11834 808 -10104 -10421 319 11753 13172 3234 -9227 -11059 -1603
1162 -1603 10613 13817 4470 -7776 -11422 -2479 10034 14291 6373 -6275 -10751 -3475 8420 14479
1176 14479 8115 -3814 -10357 -4772 7727 15200 9992 -1813 -9458 -5547 6919 15311 11767 405
1190 405 -8653 -5486 5834 15497 13991 2255 -7074 -5457 5033 15763 15382 5325 -5002 -5192
1204 -5192 4924 15659 17192 7939 -2810 -4765 4078 15272 18329 10809 -714 -4348 3217 15103
1218 15103 19634 12653 1011 -4146 2533 14131 19878 13863 2433 -3632 1585 12621 19121 14570
1232 14570 3595 -3939 -423 10274 17816 15379 4076 -4808 -2795 7477 16025 14795 4169
1245D169j0041N03R939R106l12r643j0361j228R393R473Q11q800j0510k737P926
1260b312R811K751p756j0738l841O217J0546M027o615j0907n449N639J0412N781
1274G566n371j1587n808M175J0462O371l998j0755p029L636R811P011k508r642
1288g666p946J437R878Q286j347q666q976p6R479R204J85q529r511j188Q692R899
1304C155J732q318r681j803P544R703K985p024j0072l098O409R589M174n447j0072
1319a0224m422M779R721N436m152r843o148L980R922O288k688j0076o774K744
1333a1457R666P502k420r200p126J164R107P769j104p952p849J10P951Q498O95
1348E354p387q588j460P699R260K215p275q994k291P319R310L229o155r247l544
$$ plain form
1245 4169 -5872 -5369 4570 13676 13364 3721 -6640 -7868 1525 10998 11809 3009 -7501 -10238 -2312
1260 -2312 7499 10250 2494 -8244 -12085 -5868 4678 8705 2090 -8817 -14266 -8627 1785 7566
1274 7566 2195 -9392 -15200 -11025 -563 5808 1810 -8945 -15974 -12338 -2527 4484 1976 -7666
1288 -7666 -15612 -14175 -4297 3989 2642 -6024 -15000 -15076 -5597 3607 3792 -4737 -14248 -15436 -6744 3155
1304 3155 4887 -3431 -13112 -14915 -7371 2332 5317 -1707 -11779 -14877 -8468 1121 5295 -152 -10224
1319 -10224 -14646 -9867 -146 5290 1138 -8705 -14853 -10873 -951 5337 2649 -7427 -14201 -11457
1333 -11457 -1791 5711 3291 -5909 -13035 -11871 -2764 5005 3901 -4051 -11900 -11790 -3839 4659 5354
1348 5354 -2033 -10621 -12081 -4382 4878 7093 -182 -9176 -11467 -4148 5162 8391 2236 -7011 -10555
1363a0555O545R018M243n043q621m664N145R289M866l747q256n456L078R452O046
1378A1340k269q339o554K164Q928P275j425r017p263J386R023P406m88q397p574
1393c804N2P974P593N91o872p954j539O092Q594K069o338q782k889N735Q919K545
1409A1986n193r345l787M968Q993L715n032q965m111L797Q476M611l858q819m739
1424g303K528Q259N300k584q624n722J721P621N997r44p657p236N94P635P128
1439F713L1p741p790q2P308P534M76o664p377j708O941P592J625n758p854k231
1455h985N194Q261K800m499q123l552M532Q164M588m319q217m187L713Q081M969
1470H420l051q458m843K782P763N528k396p199n960J722P735N642j441o202o583
$$ plain form
1363 -10555 -4010 5008 9251 4208 -4413 -9077 -3932 5357 10223 6476 -1780 -7236 -4158 5294 11340
1378 11340 9071 732 -5822 -3658 5270 12545 11120 2103 -5160 -3774 5249 12655 12167 3770 -3804
1393 -3804 -3752 4222 11815 12406 5534 -2420 -3959 2133 10727 12796 6458 -2324 -5213 522 9441 11986
1409 11986 6793 -2552 -6339 -1371 7622 11337 6305 -2660 -6771 -2974 5502 10113 6255 -2564 -7303
1424 -7303 -4775 3484 8784 6200 -2424 -8146 -6425 1196 7193 6249 -1408 -8644 -8050 -415 6713
1439 6713 6744 -997 -8787 -8869 -1561 5973 6449 -215 -7592 -9300 -2359 5233 6858 1100 -6754 -8985
1455 -8985 -3791 4470 7270 2771 -5352 -8904 -4372 3792 8380 4061 -4156 -8343 -4630 3451 8420
1470 8420 5369 -3089 -7932 -5150 2613 8141 5745 -1454 -7414 -5692 2043 7685 6244 42 -6541
1485f541L62O996O198O38o625p308p90O483P286J190o457p221j513O030P106J991
1501G825n559p557k008M803O936L103m633p482k887L711P121L764l076p678m577
1516h194L399P071M924k669p314n098K423P619N237k020o970n470J486O662N666
1531F752o22p075n812Q94O031O701l8n856o572m85N485O918J142n178o951j931
1547f597N754O919K687n182p727k014M914P491K391l952o985l479M085P104L149
1562H558l080o685m002K751O969M348k065o792m878J583O906N318j728o645n219
1577d661J047O241N579q04o085n844M07O171N624N99o361o172n37N419O372Q67
1593G862m848o837j171M488O500J663m090o492k992M306O630K758l819o844l446
$$ plain form
1485 -6541 -6179 817 7015 7653 1028 -6280 -7070 -587 6699 7889 1432 -5789 -7302 -1272 5834 7825
1501 7825 2266 -5291 -7299 -2496 4440 7543 2910 -4572 -7459 -3748 3373 7137 4061 -3617 -8194
1516 -8194 -4795 2276 7200 4531 -2783 -7881 -5458 2161 7398 5378 -1592 -7062 -5576 1086 6752
1531 6752 6130 -945 -6757 -5863 168 6869 6831 975 -5597 -6082 -597 6321 7463 2285 -4666 -6597
1547 -6597 -843 6076 8763 3581 -4146 -6160 -1246 6245 8636 4684 -2301 -5780 -1695 5409 8558
1562 8558 5478 -1207 -5209 -2458 4511 8859 6794 2 -4876 -3293 3613 8931 7203 558 -4661
1577 -4661 -3614 2627 8206 7402 1317 -4527 -4120 2051 7675 8274 1913 -4259 -4796 623 6995 7862
1593 7862 3014 -3823 -4994 -506 5994 7657 3567 -2925 -5917 -1611 5019 7777 3958 -2886 -6332
1608f332L423O792L233k986o386l677K112O269M172k375o159m393J622N795N097
1623F207j680o300n081O75O015N559n59n808n555m50N944N223N27m986o220j066
1639g555N165N907Q38m484o586j457M510N988J739l674o429k420L213O254L125
1654D134l779o037l318K800O053M237l173o542l465K014O326L971k287n853m282
1669i201J747N438M451r95n779m797N47N530M647q7n291n236j71N173N167L08
1685A451m199n776j169M615N993R18m121n468j967M291N643K130l638n828k466
1700i591L889N617K736k963n868k772L052N659L059k205n334l836K523N454M230
1715C650j459n494m079J737N582M413q61n200m505P98N366M582M64m823m472m95
$$ plain form
1608 -6332 -2909 3883 7116 4130 -2256 -5933 -3821 2448 6620 4245 -1914 -6307 -4685 1110 6207
1623 6207 4527 -1773 -6854 -6179 -164 5395 4836 -972 -6527 -6977 -1033 4190 4717 -269 -6489 -7555
1639 -7555 -2390 3517 4355 -129 -6715 -8172 -3662 2326 4065 391 -6038 -8458 -5245 1009 4134
1654 4134 355 -5682 -9000 -6200 -147 4090 917 -5625 -9090 -7076 -750 3221 934 -4919 -9201
1669 -9201 -7454 -2016 2435 1440 -4339 -9136 -8589 -3059 1588 1501 -3790 -9026 -9197 -4024 1143 1451
1685 1451 -2748 -8524 -9693 -5078 915 1833 -2288 -7756 -9723 -5432 211 2341 -1297 -7125 -9591
1700 -9591 -5702 -85 2651 -312 -6180 -8952 -5900 -241 2818 613 -4721 -8557 -6034 -580 3650
1715 3650 2191 -3303 -7382 -5645 -63 4350 3489 -1711 -6216 -5418 -52 4530 4994 171 -4301 -4796
1731d796M601N659P70m301n132q61M491N431J722m056n011j456L605N425K318
1746H409l120n411k035L230N294K524k421n256l166K866N668L053k198n091l256
1761i10J562M983M215j586m784m372J027N156M236q00m950m384J30N079M153M07
1777I162m683m860n30M654M217Q98l937n161r63L344N164J561l735n157j727L180
1793A427N142K035l233n196k236K852M702K546k445n221k686J974M953K617j597
1808E634m941l640J236N419K835q62m652m123Q60M740L837k26n143m359Q45L705
1824A165M226N25m693m595j98L865M379O10l732m540j567L454M662J262l197n108
1840c482k160L010N191J758k908m991k397K427M864K602k641m967k550J747M237
$$ plain form
1731 -4796 -195 5464 6234 1933 -3199 -4060 431 5862 7584 3528 -1483 -2939 666 6091 8409
1746 8409 5289 -122 -2157 1073 6367 8891 6470 1214 -1952 914 6582 9635 7437 2346 -910
1761 -910 652 5635 9850 8264 3480 -892 135 5291 9527 8727 3777 -607 -477 4602 8755 9162
1777 9162 4479 -381 -911 3743 7960 8858 4921 -240 -1203 2141 7305 8866 5131 -26 -1753 1427
1793 1427 6569 8604 5371 175 -2061 791 5493 8039 5594 373 -2313 -339 4614 7231 5634
1808 5634 693 -2947 -1711 3708 6543 5681 1029 -3094 -2234 2506 6343 6117 974 -3385 -2540 1165
1824 1165 5391 5916 1223 -3372 -3570 295 4674 5284 1552 -2988 -4555 -1101 3561 4823 1626 -3482
1840 -3482 -5642 -2632 2559 4317 1409 -3582 -5979 -3552 1312 3914 1273 -3694 -6244 -4497 -260
1855b60L516k003m670l464J197M508L410j052m649l714N85M569L851o82m205m196
1871g259J43M148M174J10l880m321m12L501M433P47l525m541q78K964M749J565
1887A718k942m844j286K636M454K246k639m690j687K406L825L256k316m504k594
1902f961K165M101L353j774m046l281J475M283L410j013m041l041J71M281L737
1917B819l79m255l565K8L841M043L19l653l550n28L262L581J636l323m600p21
1933e045K804M386J545k750m391j564K943M217J525j886m430k174K175M294K400
1948D049j907l950k543J406M185K945j316l912l041R70M012L367o00l906l453
1963c694N96L609M043m52l727l543M92L445L548O10l561l442o16L160L605J144
$$ plain form
1855 -260 3256 1253 -3417 -6881 -5684 -1176 2234 1182 -3467 -7181 -6596 -2027 1824 1142 -3063 -7259
1871 -7259 -7116 -2968 1206 1316 -2564 -6885 -7297 -3796 637 1384 -2141 -6682 -7560 -4596 153 1718
1887 1718 -1224 -6068 -7354 -4718 -264 1982 -657 -5347 -7034 -4628 -803 2453 137 -4367 -6961
1902 -6961 -4796 -695 2658 884 -3162 -6443 -4968 -685 2725 1712 -2329 -5370 -5199 -918 2819
1917 2819 2440 -1815 -5380 -5352 -1511 2532 2851 -802 -4352 -4880 -1618 1963 3599 276 -4324 -5045
1933 -5045 -2241 2145 3690 940 -3451 -5015 -2072 2145 3670 1784 -2646 -4820 -2645 1649 4049
1948 4049 2142 -1808 -4351 -2945 1240 4185 2869 -1043 -4084 -3114 898 4265 3665 -241 -3694
1963 -3694 -3098 511 4554 4102 375 -3168 -2676 769 4317 4927 1366 -2076 -2692 468 4073 5217
1979E217l215l763p00K714L614J763k528m173j559K266L953J912j635m000k740
1994b874K046M318K198j447m037k705J345M041K369j124m150k294P72L808L048
2009E314l62l750l395K95L200L261J52l647l743l15L685L146O75l283l888k91
2025b946K915L192P83k476l809j169K746L296J594k855l287j458J350M042J742
2040C660j858l586k071J223M053K382j505m346k370J222M148K176q40m046k045
2055c803N44L481K478Ol852k474J55K908L070j75k633k868j091K941L835L33k893
2072c8l416m40K248L934P13k802l531j142K771L295J147j867m012n96J808L103
2088A175J701j436l632j639J129L552J936p46l278k495J061L263K619n83l571
$$ plain form
1979 5217 2002 -1761 -2461 253 3867 5630 3102 -1071 -2630 -364 3589 5501 3866 -134 -2874
1994 -2874 -828 3490 5688 4241 204 -2501 -1156 2885 5254 4130 -20 -2314 -1542 2266 5314
2009 5314 4952 1202 -2193 -1898 1302 4563 4715 1068 -2675 -2990 695 3841 4516 1233 -2655 -2946
2025 -2946 -31 3161 3944 1468 -2341 -3510 -764 2532 4126 1271 -2016 -3474 -2124 1918 3660
2040 3660 1802 -1784 -3855 -2632 1421 3803 2298 -2048 -4418 -3196 952 3128 2288 -1758 -3803
2055 -3803 -3259 222 2700 2706 -1146 -3620 -3465 -557 2513 2338 -295 -3163 -4254 -1313 2522 2855 -38
2072 -38 -3454 -3894 -1646 2288 3001 199 -3332 -4474 -1703 1592 2739 872 -3140 -3736 -1928 1175
2088 1175 2876 1440 -2192 -3831 -2702 850 2786 2040 -1238 -3733 -2672 591 3210 2627 -944
2103i44l092J260L547L001j356k770k903R44K933K858l77k535k446n26K252L037
2119B883Q48k238k883j032K030L541J503k395l670j210K245L738J422k164l510
2134h92j603K331L271J730j570l515j627J554L304J430j066k469k253Q85K570
2149B080K551p6l077k917J0L117L199r6l121l443K95L108L283m08l084k364k64
2166a207K624K418n2j804l008p63J747K965J028j952k568j630J700K985J687j432
2182B738l727k039J701L234K083j863l275k073J662L043J862j531l247j750J022
2197b160K726J703o40k637k312L31K437J982M67k413l361p3K561K823M79k454
2213e41l539m39K667K834N58k825k973k48K762K092O94k242k524o82J308K708
$$ plain form
2103 -944 -4036 -2776 771 3772 2416 -354 -3257 -2313 620 3478 3101 566 -1880 -2406 -154 2883
2119 2883 3731 1493 -1390 -2422 -392 3149 4652 2257 -1413 -2623 -378 3360 4782 2618 -892
2134 -892 -2495 -164 3107 4837 3267 -248 -1875 -321 2983 4413 3347 878 -1375 -490 2080
2149 2080 4631 4555 1478 -1439 -1429 1688 4887 4791 1670 -1773 -1478 1630 4913 4505 1421 -943 -1207
2166 -1207 1417 3835 3783 1979 -1029 -1792 -45 2920 3948 1996 -572 -2202 -502 2483 4170 2738
2182 2738 -989 -3028 -1327 1907 3990 2127 -1148 -3221 -1559 1484 3346 1815 -1432 -3182 -2160
2197 -2160 566 2269 1629 -1008 -3320 -2989 -552 1430 1897 -516 -3877 -3950 -1389 1434 1913 -541
2213 -541 -4080 -4519 -1852 982 1540 -1285 -4258 -4506 -1744 348 1042 -1200 -3724 -4406 -3098 -390
2229c90J179j068k680j886P85L268J810j073l134k250Q08L601K022j022l306j937
2245e273O75L402J761q06l107j563N54K536J778o6k222k291K1J679K555O38j435
2262a164k681j118J716L322R71k134l261o15J875L621Q10k331k845o55K092K750
2278C53N16j337k314o86J095J832J655k47k555j612K85K218L006o39k939k262
2294c631R02K763K607m04l142j934M04L050K686j073k571j695M40K470J204N06
2310B582j571j943k34J152K364J259j210k860j853J986L093J863j900l330j289
2325a891J889L349J330k067k818r08J976K528P34j066k243j098Q55J704J822n68
2341C528j556j829k21J841K629M83k221k731m97K578L161l3l196k679P29K738
$$ plain form
2229 -390 789 -279 -2959 -4845 -4060 -792 1018 -55 -3189 -5439 -4631 -1030 992 -30 -3336 -5273
2245 -5273 -4598 -1196 565 -241 -3348 -4911 -4357 -1821 -43 -109 -2331 -4622 -4601 -2922 -367 271 -1164
2262 -1164 -3845 -4963 -3247 75 1046 -1088 -4349 -4964 -3089 532 1342 -989 -3834 -4489 -2397 353
2278 353 869 -468 -2782 -3468 -2373 -541 1114 867 -1688 -3300 -3015 -797 2209 1570 -1369 -3631
2294 -3631 -2729 34 2641 2237 -905 -2839 -2435 615 3301 2228 -343 -2038 -1598 872 2076 2582
2310 2582 1011 -932 -1166 -14 2350 3609 2399 -461 -2314 -328 2765 4628 2728 -602 -1891
2325 -1891 -2 3347 4677 2610 -208 -1116 860 3388 4122 3056 813 -285 570 2274 4096 3528
2341 3528 1972 143 -78 1763 4392 4875 2654 -77 -574 2004 5165 5132 1936 -743 -14 2724
2357B724K216l82k391j860J76J873J766J73j499j499r20P96J833J710r91k484
2373A241j719Q22K744J701r96l156j802J303L420J540j838l010j197J392K449
2388B894O35j071j779r31N34J361J301J25j408k274n38J180K485J130k232l057
2404a645r02K214L654L9k238l269L9K609J977j34k311k003O7J273J674K46j165
2421A25j405p67J18K045J135n3k238k121J65K730K290q71k913k344R15L135J460
2438A406j200k676j214P29K369Q69n40j669j061K76Q89J310M30o39k325o02J292
2455b356J671J691j439l120j316J753L052J115j983k806p32J966K827k42j631
2470a550j793k42J345J603L29o59j347r03R1J211J786O62k202k172NK092K585
$$ plain form
2357 2724 4940 4558 2167 307 483 2356 4122 4295 2796 1297 377 1173 3006 4716 3725 1241
2373 1241 -478 344 3088 4789 3793 637 -1165 138 3558 5098 3260 250 -947 445 2894
2388 2894 3529 2458 679 -252 282 1643 2944 3069 1661 -613 -1151 29 2514 3644 1412 -1645
2404 -1645 -2547 -333 3321 3360 1122 -2147 -2108 501 2478 2344 33 -1970 -1903 -630 1044 1290 125
2421 125 -1280 -2047 -1929 116 1251 1198 -1040 -3161 -2996 -266 2024 1153 -1760 -4104 -3189 -54 1406
2438 1406 206 -2470 -3684 -2955 -586 283 -257 -1926 -2987 -2711 -1822 -512 -82 -721 -3046 -3648 -2356
2455 -2356 -685 1006 -433 -3553 -4869 -3116 -64 1051 -932 -3738 -4470 -2504 323 81 -1550
2470 -1550 -3343 -3585 -2240 -637 -308 -967 -2314 -3217 -3126 -1915 -129 533 -1669 -3841 -3836 -1744 841
2487H41J84k467l229R03L016K032q48k520j733J244K510P31l89j346j256K88P96
2504a243J081P52j55j613j392M47K361J967n85k917j872J228L157J452j734k647
2520a713j194K081K701L96j747j730n20J521J165N47l87r73p32k14J132R89R10
2537B232q39k487p71J969K804K50k464k587L44K490K455n01k569j622N19K426
2553A649J068m08j778o76J26O02J138L57m21j151j291m0K161J842k48k595j953
2570a618R31K451J706r69k889j605J697K647O69j633j869q44J245J372M07j59
2586A539j056m56o63N17J572N55q76j750j368J458K415J010k067k590p12K235
2602b37K748N7k203k494N79J800J547o59j454q80J12O18R26M51l5q65j827l3J460
$$ plain form
2487 841 1025 -1442 -4671 -3768 -752 1280 432 -2088 -3821 -2577 -67 664 275 -1071 -2327 -2039 -1243
2504 -1243 -162 590 435 -1178 -2570 -2123 238 2205 1620 -1297 -3169 -1941 1216 2668 934 -1713
2520 -1713 -2907 -826 1875 2271 524 -1206 -1726 -205 960 1507 1120 147 -585 -799 333 1322 2232
2537 2232 1393 -1094 -1865 104 2908 3158 694 -1893 -1549 941 3396 2895 326 -1296 -777 1649
2553 1649 2717 2309 531 -145 -19 583 1721 2078 1657 506 -785 -825 1336 3178 2930 335 -1618
2570 -1618 -687 1764 3470 2501 -388 -1993 -296 2351 3020 1387 -482 -1326 -81 1291 1698 1539
2586 1539 483 27 -636 -119 1453 2008 1132 -618 -1986 -528 1887 2897 830 -1760 -2472 -237
2602 -237 2511 2568 365 -2129 -1550 250 1797 1138 -316 -1196 -1084 -466 460 911 876 11 -1816 -1849 -389
2621c89J778J59k301k125N22K637K099j088k411j579Q49K384J351j376j731j243
2637b464J451J249O4J64q19j003n6J51J186J399l94k171j120N30K695J354j446
2654G70k727r67J768L019L04k477j770k63K096J674k12j521q56M82M37J44J072
2671I73l5p20j265m87J020J743J005j928k012m47K367K343p7k733k012O10K643
2688I88J311p13j725j066J031J108O77l59o80n68k63J86P20J426k59j366j567
2705a119L34K142J813q09k702j195R76L047P67j905k071k46J606J755o3j203q59
2722B68l50O37N92J76M19o37j527j02O53K161M27j173k269p76J986K017N46k164
2740H84k220J45K532R69k05j705j378Q30J026M05k9m94n78n32L43O43J002J67
$$ plain form
2621 -389 1389 1548 -753 -2878 -2356 281 2380 1292 -1119 -2698 -1849 535 1886 510 -1221 -2464
2637 -2464 -1013 236 300 464 -355 -1358 -1414 -1263 -77 1322 928 -1243 -2363 -1833 862 2216 770
2654 770 -1957 -2924 -1156 1863 2167 -310 -2080 -2343 -247 1427 1215 -306 -1162 -680 -243 -99 973
2671 973 938 218 -1047 -1534 -514 1229 2234 306 -1706 -2153 214 2557 2480 -253 -2265 -1655 988
2688 988 2299 1586 -139 -1205 -174 934 1611 1252 572 4 -259 -73 647 2073 1814 448 -1119
2705 -1119 -785 1357 3170 2361 -341 -1536 -560 2487 3254 1349 -722 -968 638 2393 2330 1127 268
2722 268 -82 555 1147 1323 1742 1105 -422 -524 129 2290 2717 1544 -725 -1501 485 2502 3048 884
2740 884 -1336 -1191 1341 2310 2105 400 -978 -148 878 1283 1254 760 182 -350 -7 636 1638 1805
2758A805j628j257m11K121J999q29k272j377O06K610J011j533j971o33Q84K197
2774A322k8j025j158l3L93M67K21K66m72o07q61K93J142J235p54k240r93J254
2792a578K285P13j962j925m19J711K119o15j390j558L26J348N54j87j46n64p47
2809b035K34L20J234J37q71j628m57J559K013j50k252j077Q3K289J452j039k152
2826b340r96J111J480P87r12r87l37K09N12N66K49k37r29r12O89J301J017l68
2844i7k302q86J083J910J140j480j970n43J696K011m30r57j729K90J283O97J01
2861a83m65p02j43L5L00R94O83r24j221o17J142K249K26j778j423k02J846K214
2879B031r52j912p52P97J360J092j001r27QJ35M47K72M34j00n23j216N09J327
$$ plain form
2758 1805 177 -1080 -1491 630 2629 1800 -472 -1849 -1243 1367 2378 845 -1126 -1759 -875 1322
2774 1322 1294 269 -889 -922 -529 -62 159 425 -47 -654 -1515 -1222 -80 1155 401 -1839 -2832 -1578
2792 -1578 707 1420 -542 -2467 -2886 -1175 944 329 -1061 -2619 -2293 -945 -391 -578 -724 -1288 -2035
2809 -2035 -1801 -1481 -247 -110 -981 -2609 -3066 -1507 506 356 -1896 -2973 -2890 -601 851 -188 -2340
2826 -2340 -3336 -2225 -745 42 -870 -1857 -2194 -1985 -1473 -907 -658 -895 -1824 -2736 -2047 -746 271 -97
2844 -97 -2399 -3285 -2202 -292 848 -632 -2602 -3145 -1449 562 132 -825 -2554 -2264 -981 -284 -183
2861 -183 -648 -1350 -1493 -1458 -1158 -164 519 -405 -1626 -2243 -1101 1148 1374 -404 -1827 -2029 -183 2031
2879 2031 1079 -833 -1585 -788 572 1664 663 -264 -256 -121 326 598 1032 932 409 -807 -298 1029
2897A029J215o7k163j334J092J934J016o28k685p5J153J859J40r71j392L4R59
2914A116O14K60m78j80l80l46K77J127N64o84j234o40J073J612O59j430k055k79
2932d04J901J778k41j817j166L59J627P35n36j226m96L79M91L10L25j00o59j016
2950B44j43J403J091m3j487j365P0J910J184l95j853j526J051K075L36j434r48
2967A70N0L0Q81M97p18n29M8m82N04P86J64j70j235j138P30J365R50j147j580
2986h24m78J245J557r3j158j259M2R78R72l68r15l37j96M03O02k43L38p28j177
3005a639K02Q42R38K34j100j300Q0J151J198k76j445j206O16J695M89l55j660
3022a536o62O44R29M23k84o87l63m11N48L95R14l62j021n57N5J545O81o14j247
$$ plain form
2897 1029 2244 2177 14 -1320 -228 1706 2722 2094 -591 -666 487 2346 2486 1515 123 157 1116
2914 1116 1730 1990 1512 1332 952 606 883 2010 2574 1890 656 16 1089 2701 3360 1930 -125 -404
2932 -404 1497 3275 3034 1217 51 410 2037 2772 2236 1010 514 893 1384 1694 2019 1919 1260 244
2950 244 101 1504 2595 2552 1065 -300 -230 1680 2864 2469 616 -910 141 2216 2552 1118 170
2967 170 220 250 1131 1628 910 381 429 -53 451 1237 1401 1231 -4 -1142 -412 953 1903 756 -824
2986 -824 -1302 -57 1500 1407 249 -1010 -968 10 982 614 -301 -638 -834 -431 171 -72 266 -462 -1639
3005 -1639 -1437 -595 343 577 -523 -1823 -1743 -592 606 330 -1115 -2321 -1705 -10 479 124 -1536
3022 -1536 -2198 -1554 -625 -202 -486 -1173 -1536 -1947 -1399 -1004 -90 -452 -1473 -2030 -1975 -430 251 -363 -1610
3041a610p49J094J308M79j269j503J14P50J282o0n91o63m67Q58J88L11J42o03
3059i89p57l0P95R07M55j046j319J21J233J117J01j548j264M57J465J059o31j087
3077i61l61J87P06M19K28l30p11m65Q55K76P78j21j128p77N15J180Q75j84j633
3096f52r64J107J136O74m45j588n00J146J112n10J94m75o56J68N88K69J82m27
3114C59j46q72P98P09N05p41j364m12J325J049K59j042j008l6J150J123k48q58
3132E50j239L01R39O44j46j80q56j19J3R71M86j4j245p00K45J048Q83l56j140
3151H5r23M35R94J081o21j044q58J009P63K12o80k79n43K07L15O22l8l47n28n88
3171g26O38N44Q42r87q64m65Q37R31O24q40j377m1P57Q16J74r01n06m54Q37J003
$$ plain form
3041 -1610 -2359 -1265 43 522 -747 -2250 -2136 -1386 -104 -164 -755 -1418 -1885 -1027 -839 -528 -386 -989
3059 -989 -1746 -1776 -981 -74 381 -665 -1984 -1863 -630 487 588 -960 -2224 -1767 -302 757 126 -961
3077 -961 -1322 -1135 -429 -10 218 -112 -823 -1288 -433 -157 621 500 -628 -1405 -890 290 1165 981 -652
3096 -652 -1616 -509 627 1301 856 -732 -1232 -86 1026 516 710 235 -421 -253 335 604 786 359
3114 359 213 -659 139 848 1353 612 -752 -1164 161 1210 1469 427 -581 -617 533 1656 1408 550
3132 550 -689 -388 551 1195 1049 869 13 -106 -93 878 1364 1350 105 -595 -350 698 1581 1225 85
3151 85 -838 -403 591 1672 1051 7 -851 158 921 1133 453 174 -369 -162 153 775 737 390 -138 -726
3171 -726 -88 456 1298 311 -553 -1018 -181 750 1374 534 -843 -884 -127 689 863 -38 -544 -998 -161 842
3191H42j67n10n07m04M2Q20K99O8o29r63K10O24Q90M62j392r18k0J251Q25m08
3211D15q76p26K81P23J026o19p30m38j36R73M72l9m21m55l34J50R63N87n34j050
3231g68n58N38J311K56n31q62n80Q20Q04M10l98j240p5L97J203o8n38l35k92K33
3251b73K47O88m9l36j061j88O97R18O21q84r75J72N14Q22j72l85j072K33Q10R27
3271A254m16m67o61j8P47M68K50l67o51m95N10M22O70k74q90j13j5J104J02nq50
3292C05n85L61P22O14l39p17m27L11M99J04l0k46q92L68M84M73lk38j161n2N26
3313G7R32O84j028j020ON42P08L46r81k53l79O67O90J79o74p33k45O11N38K06
3333H73k1p80n20K44N30Q18m04p05l50n6P96N26k90p26q74K62J073K94P9j209
$$ plain form
3191 842 675 165 -342 -746 -704 116 415 483 -146 -1109 -899 -275 615 1077 -315 -1233 -1253 -2 823 415
3211 415 -461 -1187 -906 -183 843 224 -506 -944 -1080 -107 365 326 -95 -550 -884 -734 229 816 282 -768
3231 -768 -1326 -788 523 779 248 -614 -1194 -374 430 840 442 -798 -873 -476 727 659 121 -214 -506 -273
3251 -273 -26 662 613 277 -784 -972 -275 643 1264 380 -595 -423 91 913 741 356 -716 -483 327 1254
3271 1254 838 371 -290 -308 439 907 1157 790 139 -356 154 576 1246 972 82 -31 -46 1058 1160 1155 305
3292 305 -280 81 803 1417 1078 361 -66 245 744 848 818 572 -320 48 532 1005 1002 764 -397 -449 77
3313 77 1009 1693 665 -355 -349 193 901 1247 266 13 -366 301 991 1170 496 -237 -482 129 667 873
3333 873 852 72 -448 -204 326 1144 740 35 -315 -371 425 951 661 -65 -939 -677 396 690 769 -440
3353d40k62KN67N82R7j048j3j42M20M82J93p25n76j29L46P72M76o08j211J63J14
3374i40J129Q0o49p89j97O18L87M74o08n64l36L06N45N45n28n07o38L31Q07M25
3394a09k8q96p90j3J087N13j54o17o63M3P38O01j39p04n44M06K30P10J29o51n43
3415a394L10L87K23N35n19q22l41M97P21P46m29q23n28L85Q72L06j44q18p57J047
3435e46M49L94j69p70k53M26P32O0N7n92k39M3K60P86j84n71n10J78N64K14J31
3456D60m34m05j97N33O90L0q63J0l70R52M01k45l28k01o56P53O71L24l45p70j02
3477i2M93K62Q8J17p39k24L56N35K66l37j2p84K57P28M53k96q88j17J45O09O43
3498A463N9r31k04l15J099K66J27l53p92q2K95Q55L41n72o83j08M17M66l9j31
$$ plain form
3353 -440 -702 -700 -133 449 546 -502 -515 -657 -237 245 438 -287 -863 -992 -646 126 602 -6 -1217 -1054 -940
3374 -940 189 269 -380 -1169 -1366 -748 -361 113 -495 -1059 -1395 -1089 -544 1 -527 -1034 -1672 -1341 -534 -109
3394 -109 -137 -1033 -1823 -1836 -749 -236 -390 -1007 -1670 -1627 -889 -288 -427 -1131 -1675 -1269 -1039 -329 -200 -851 -1394
3415 -1394 -1084 -697 -474 61 -458 -1280 -1621 -1124 -403 343 -86 -909 -1437 -1052 -180 126 -18 -836 -1593 -546
3435 -546 -97 297 128 -642 -895 -469 263 323 380 -212 -451 -408 -148 638 454 -117 -627 -449 115 329 460
3456 460 26 -379 -576 -43 647 677 -186 -176 -546 406 807 562 234 33 -623 130 801 1125 780 10 -92
3477 -92 401 663 751 868 129 -95 261 796 1062 725 713 -71 186 914 1367 1071 183 66 211 820 1463
3498 1463 1522 591 387 72 1171 1437 1564 1211 419 337 632 1487 1828 1256 573 465 882 1348 1309 1178
3518A178o05M7K13L32N98k08r26l71M04M44M55k66p15k26N79J48N28n01l11o58
3538A39K40O23M45o12m37o18K48P33Q8L42o77r04K21N91M22j70m03p97j4K79J026
3559G65k80m70k12l76M82O08l02k02m41k55L46J59M27j58j109J72L76M99J73m30
3579b28k34m08K68L50N56m48o11L17o44Q11P0M6k95o76M09J94O68J31q30n03M49
3600f08K39L34L34q11k59q5M44M75p9m28n23K05M33K14J89n58l20l24P9R95q0
3621a34L0p15o10N32L99N52j86q15k62K14O50M84l84n17m22K9N33N72k44m42m35
3642a171K46L71M80k01l71n37j29R18L58n2l22m75j64M89M67J39l75l99j50L48
3662e30O58J14k82p61L6P40R3R4j41m33j58K35P81oM2m32l68q5O87K14o8n12k85
$$ plain form
3518 1178 573 620 833 1165 1763 1555 629 258 662 1106 1561 1295 580 354 933 1081 1609 1108 797 139
3538 139 379 1002 1447 835 398 -220 28 761 849 1191 514 -390 -169 422 844 674 271 -526 -540 -261 765
3559 765 485 15 -197 -573 -91 517 215 13 -428 -683 -337 -178 249 91 -1018 -846 -470 29 202 -228
3579 -228 -462 -870 -602 -252 304 -144 -755 -438 -1082 -271 -201 -155 -450 -1126 -717 -523 145 276 -554 -1057 -608
3600 -608 -369 -35 299 -512 -771 -856 -412 63 -16 -444 -967 -762 -329 -115 74 -484 -804 -1128 -1049 -54 -134
3621 -134 -104 -819 -1429 -897 -498 54 -132 -947 -1209 -995 -345 139 -245 -762 -1184 -1155 -622 -50 -294 -736 -1171
3642 -1171 -925 -554 -74 -275 -646 -1183 -1312 -394 -36 -88 -410 -885 -1049 -560 -93 46 -329 -728 -878 -530
3662 -530 128 242 -40 -801 -765 -25 68 162 21 -412 -570 -335 446 440 482 50 -318 -403 284 498 430 -82 -367
3685c67K34P23J02j30k99Q7k65N12J65K7o92K58k04J89L08J5j82m00k31M33L20
3706F03o5j63O8j82MN80j6l54n70qK53N09J14l14m14j15l4P15K31n42k75k80R7
3729a58M82J83m8m16k84J03L94M28J9o37j40j09K03J98J17l41n47K13J93O34k11
3750B76j79k66j31j70O23K58k91l99j98K02O13ok70l18j78M5L91N31n67q3m49
3771e66M54L74r9K19m96m08k5M77O33m21k64p6j12L93L74q7n95j34o3N25K61r5
3793B69o04l65K22M84L47l5k54l22k81K90N76l18p7m40k7M84J98J32L5p45m1K97
3815a75J39K21J1l05l49J03O71j07q9l91m68K60M84J50r3n04m66N45k57J085k29
3836B36k40n91j2P51K31j47n27j45K4K3R11k71j76j89j2J10K53O46p59k16O9L63
$$ plain form
3685 -367 -133 590 692 562 263 350 85 597 762 789 97 355 151 340 648 663 481 81 -150 283 603
3706 603 538 375 443 261 265 845 829 475 -95 -103 150 659 773 459 45 -70 -104 611 842 300 25 -255 -158
3729 -158 324 507 459 43 -241 -138 256 684 703 66 -74 -183 20 218 335 -6 -553 -340 -147 487 276
3750 276 97 -169 -300 -470 153 411 120 -279 -477 -275 338 332 62 -256 -434 -389 2 533 -34 -117 -566
3771 -566 -112 262 163 382 -114 -522 -547 -70 563 142 -122 -198 -310 83 457 370 -225 -359 -422 103 364 269
3793 269 -335 -700 -478 6 353 318 64 -258 -539 -249 327 9 -68 -508 -535 -51 147 279 314 -431 -472 -175
3815 -175 -36 185 196 -109 -458 -355 316 209 120 -271 -739 -479 5 155 62 -442 -908 -363 -620 465 236
3836 236 -4 -595 -607 144 375 228 -299 -444 -420 -397 514 243 67 -122 -134 -24 229 875 116 -100 -31 332
3858C32L79J75l44o82K86K4N23J64j9m13m11K74L69N36m19j55q22M52N52oJ17
3879I12k96o31N76J14J66J04l81j8o3J65J07K8k18l21J01J1L13j51L17q49k81
3900b95M25K02K39j22p53K23J9L26L52q10l07J24j91M92N49n77l31j59K02L09
3920h3J63k15n06j29K98J66K57k11n62R5J38M30Q6Nk70k76L4M18J56J13k61n19
3942f73J21J20M95J49j49n37K05L39J56J41o48j06j71K71M97k7j75k56l55K78
3962c25L28N17j42m78j32J74J68J36k53k48k05J48M8K32J37o03M8j21M90j42R7
3983a26n59k75P3M52K65N1p26J55l25K62N8M33k76o20q7L34K39K52k73l84j4M38
4005f53J3O1n0n87J80K33L43J2J97m46nk95P82o9q6k20K7j75L77K48L45m80n6
$$ plain form
3858 332 711 886 542 -140 146 170 693 857 838 425 14 288 657 1193 774 619 -203 249 801 795 912
3879 912 616 -15 561 675 841 945 564 546 483 648 755 783 565 244 345 356 669 518 835 -14 -295
3900 -295 130 332 571 449 -304 -81 -62 264 616 -194 -501 -377 -568 -76 473 -104 -435 -594 -392 -83
3920 -83 80 -135 -641 -770 -472 -306 -49 -260 -822 -727 -589 -159 -73 -68 -338 -614 -580 -162 -6 107 -154 -673
3942 -673 -552 -432 63 212 63 -474 -269 70 226 367 -281 -387 -558 -287 210 183 8 -248 -603 -325
3962 -325 3 520 378 -100 -232 -58 110 246 -7 -255 -460 -312 -264 -32 105 -498 -450 -571 -81 -223 -126
3983 -126 -685 -960 -887 -435 -170 -119 -845 -690 -1015 -753 -695 -262 -538 -1158 -1245 -911 -672 -420 -693 -1077 -1091 -653
4005 -653 -640 -579 -629 -1216 -1036 -803 -460 -448 -251 -697 -702 -997 -215 -284 -370 -590 -563 -738 -361 -113 232 -248 -304
4028c04r7O06J84j06j07l70n6M51M08k45R3n00L85M10r7L12l62k39J54K94L4K88
4050A136n59l16N52m33O84J81q16L41l78K97J77J85r4n54k01M46P3J32j65m55
4070B33J74j66J68J07K1m14P9k09K92L30l83K46n52q5M79J02q4k86J08o01O77
4091B36R3o5m7j36k95K29MN85k81k15l84L09K84K6ok57J55l56P81n5k10j10j41
4114A44J50m7O19j3k85j88l27N73M8K47j41j67k7K68Mo7q5j81rJ36K78j0j97k80
4138D43k09R6K37J01r9m66j93O45k42K58p17j62p9L71L67k04l82k65k37K36L06
4159a95J7R4m07n88L70J23j27J92j54k72L55J59q0r9O1m03K26k34N68j35l52N1
4181h30j16L36L00l02p4J4l3J48K76N0j39q9J01j82K65K36j22j5l22J89J94J6
$$ plain form
4028 -304 -401 205 389 283 176 -194 -250 201 609 364 457 -43 342 752 655 967 605 366 520 814 848 1136
4050 1136 577 261 813 380 1064 1245 429 770 392 689 866 1051 957 403 202 648 721 853 688 233
4070 233 407 241 409 516 537 123 202 -7 285 615 232 478 -74 -159 320 422 338 52 160 -441 236
4091 236 329 264 217 81 -214 15 19 604 323 108 -276 33 317 343 337 80 235 -121 660 605 395 285 144
4114 144 294 247 866 853 568 380 53 626 674 921 780 613 586 854 858 791 706 525 516 652 930 920 723 443
4138 443 234 330 567 668 569 103 -90 555 313 571 -146 -308 -387 -16 351 147 -235 -500 -737 -501 -195
4159 -195 -178 -84 -491 -1079 -709 -586 -713 -521 -675 -947 -592 -433 -513 -612 -551 -954 -728 -962 -394 -529 -881 -830
4181 -830 -946 -610 -310 -612 -686 -672 -705 -557 -281 -231 -370 -459 -358 -540 -275 -39 -161 -176 -498 -309 -115 -99
4203i9J26r6j35j40L40K98m30j03j5J38L49J08L4m51K5pK50J60j38n10oM35J98
4226C31J3j37l82l02M32j48L00K00l01j06l79L74L11lk52k09l71L12N29P9m24
4247a33l18J04k65L11K66j39k13j33K34J72K91j16m91m33M33J6N90l23J73m93
4267d67J15L23J14J08k57m17K95L79K58K2k59k43k7k13N52K38m06l74K51K1N20
4288E33k41l8j19oPO12k72J15k1m94K59J29K10j16j56k29N59o9j68R9m94L33m10
4311B3J71K38p3j94k10K72k8K2M81m04j43l7j00L37j63l99N3j67J09M52n35K67
4333b8m26L59j74N93l84j08n1l16L11K81r0j60n38N29p0O4J21j03l79J16J25J37
4355a91R7J17Q6o48J00J20K07Q1j29k84p0N04J96m23l08p4k0L98L06O3J61o25
$$ plain form
4203 -99 27 -69 -204 -344 -4 294 -136 -239 -254 -116 233 341 375 -76 -51 -58 192 352 214 -296 -302 133 331
4226 331 344 207 -175 -477 -45 -193 107 307 6 -100 -479 -105 206 203 -49 -258 -629 -317 212 291 -133
4247 -133 -451 -347 -612 -301 -35 -174 -387 -520 -286 -114 177 61 -430 -863 -430 -414 176 -147 26 -467
4267 -467 -352 -29 85 193 -64 -481 -186 193 451 473 214 -29 -56 -269 283 521 115 -259 -8 13 533
4288 533 292 254 135 129 136 748 476 591 570 76 335 464 674 558 402 173 732 663 495 594 100 433 23
4311 23 194 432 359 165 -45 227 199 221 702 298 155 118 18 355 192 -207 -154 -321 -212 240 -295 -28
4333 -28 -454 -95 -269 324 -60 -168 -219 -535 -224 57 -33 -193 -731 -202 -272 -208 -87 -190 -569 -453 -328 -191
4355 -191 -94 23 109 -539 -439 -319 -112 -31 -160 -444 -514 -10 186 -237 -545 -619 -639 -241 65 128 289 -336
4377c36l2K30N33k47m4k91j25L71M2J01j13m23Q3L29O6K78j91O6k79K00L8J02
4399C58Q0j10k75r9L66L70k56m27O4J83J66j23J14j34m24l89P55K32K30n19O6
4420B28j23l7L84j53m94M7J37q0M18j34m0o06J49L44J4l3P5k04j89J45J63R5j44
4443c8J59o27K03N24j6k68l15k22O21k05L78j5k51O9j11K54J63k34k08kJ42K63
4465B64J88k26j32k6j56L16j15N92k24m77L24J25O6lk35l15K20L13K06j76l7k72
4487B20j49J68j79J56N6J75n86N06M9lj25K9k97k2L61j72Q4l41l36M03L9O0l7
4510E9L19n51k68P4K87l53K0Q5j13L76m90J60qJK4j79Q6R9J11l39J7l19M11J87
4534c04l49r3J41j55K06J22k24j50K37k51L96J41R0j16j42J66NL62k97l87L15
$$ plain form
4377 -336 -368 -138 395 148 104 -187 -312 59 101 202 89 -334 -251 78 144 422 231 297 18 218 256 358
4399 358 438 328 53 -46 320 690 434 7 71 254 420 297 411 277 -147 -536 219 451 681 162 228
4420 228 105 68 452 299 -195 -148 -11 -91 327 193 153 -453 -304 40 54 21 96 -108 -297 -152 11 106 -38
4443 -38 121 -506 -303 221 205 -63 -378 -600 21 -184 194 179 -72 -3 -114 140 303 69 -139 -141 1 264
4465 264 452 226 94 68 -88 228 113 705 481 4 328 453 519 516 281 -34 186 499 705 529 492 220
4487 220 71 239 60 216 272 447 -139 367 416 413 288 317 20 -2 359 187 271 -70 -406 -3 36 96 59
4510 59 378 -173 -441 -367 -80 -433 -413 -328 -441 -65 -555 -395 -403 -402 -378 -557 -471 -372 -261 -600 -583 -902 -491 -304
4534 -304 -653 -746 -605 -760 -554 -432 -656 -806 -569 -820 -424 -283 -193 -309 -451 -285 -280 82 -215 -602 -287
4555b87q7N00n45M05j0l97O8K93Q5K44n48L18j41r4L17J86j79l42L74o7n2N0J15
4578B06k8l50K55Mp0N5k31J40j36M98oL1p27N2M01J76l56m22M40j52j25N0JJ14
4602a80J9n3j79J00M37m93P2o02M77J54K99j77j21n9j31K25M53k89k4p4J14K26
4624A94J2o7k70M23k99J58J65J03n6j65j01Q9n4L91L9j20m22K44J84K27l36J71
4646E10m60o9N46K94m9l49j00M03j46J57j38l24K68K35r1J25j09l24K01l68J73
4667C85J19q4Ll41P3o1J12K18J51m31k45M15j72O3j91R2k7K13K17m48J75k14Q2
4690A04l92J84L42m01J89l09K27J45J9K02o77n2M56QK29k98k87N7j3O52l24m2
4712A9J17k52M3R4R6J92n03j28q9L95M03j26k60r2j96O1K35J31q2n7k34L87l1
$$ plain form
4555 -287 -374 126 -419 -14 -24 -421 -353 -60 25 269 -279 39 -102 -196 121 307 128 -214 160 93 41 91 206
4578 206 178 -172 83 87 17 72 -159 -19 -155 343 337 368 -359 -307 94 270 -86 -508 -68 -220 -345 -295 -294 -180
4602 -180 -161 -214 -393 -293 144 -349 -277 -879 -402 -248 51 -126 -247 -306 -437 -212 241 -48 -72 -146 -32 194
4624 194 206 139 -131 292 -7 151 316 419 363 198 97 186 132 523 562 442 20 264 448 675 339 510
4646 510 50 -19 527 821 772 423 323 726 580 737 599 275 543 778 687 812 703 379 580 212 385
4667 385 504 420 423 82 155 94 206 424 575 144 -101 314 142 205 14 106 79 292 509 61 236 22 104
4690 104 -288 -104 238 -163 26 -283 -56 89 108 310 -367 -419 37 45 274 -24 -311 -254 -267 385 61 19
4712 19 136 -116 -73 21 117 309 -194 -322 -411 -16 387 261 1 -91 -287 -226 9 140 58 1 -233 154 123
4735A23p0O0k65J07k46L64J23j22k0l12L74k39J10J80m06j46N00k03r4o2J48k91
4757c87K0K82m35P27m49k97L33K08m20J85l29P6Q7J35%P4O3l16K11l48L68L49
4779A37n7m09k05L30MR9K69k95l34j1K97l19M91j94m6O1k35N93m34K10l86N9M1
4802c34K95k39K91j95j75O08j68j71o3r2k22M45K89l7k87k5k08K94jJ45J84o46
4824c12J53K77O1M7m4k97J11PR9O11l57m90J37N5k7J00L9j99J03j84N87j48k65
4847F4r7K96r6l12L79k15L2k09O4K80j49J04q2j62N7K13J32R4k60m42K86K61j34
4870A04L9l96L50j71K76k6P2j42j82L9k26L63j32K56l23l29M01K59l34K24m29
4891c07J97M6Q0K84q3k28r1j54K03J50Q7k48r5L00j40O7l34K60J60m74Q1K60J88
$$ plain form
4735 123 53 113 -152 -45 -291 73 196 74 54 -258 116 -123 -13 167 -239 -385 115 -88 -182 -244 -96 -387
4757 -387 -367 -85 -520 207 -242 -539 -206 2 -418 -233 -562 -486 -399 -264 -264 -190 -127 -443 -232 -580 -212 137
4779 137 80 -329 -534 -204 -200 -101 168 -127 -461 -472 -175 -494 -3 -197 -243 -182 -417 176 -258 -48 -434 -375 -334
4802 -334 -39 -278 13 -182 -357 251 83 -88 -151 -243 -465 -20 269 232 -55 -80 -288 6 5 150 334 -312
4824 -312 -159 118 179 226 182 -115 -4 3 102 713 356 -134 3 58 31 131 170 -29 74 -110 477 329 64
4847 64 -33 263 167 -145 234 19 51 -158 -94 186 37 141 59 -103 -46 167 299 393 133 -309 -23 238 104
4870 104 143 -253 97 -74 202 176 248 106 -76 -37 -263 100 -32 224 -99 -428 -27 232 -102 122 -307
4891 -307 -110 -64 16 300 217 -11 -102 -256 -53 97 184 -64 -159 141 1 68 -266 -6 154 -320 -239 21 209
4914B09n5k05n6J7K87N2o27K81Q7m00L51K97r1j56k35K03K7k24K42O3j67l2J77
4937D5K61K1l09n7j23j2N10l94k05j00j56N14J09l01r5j26J59K02K19k67j48P
4959b46J72J14k52N38m74J45J10k39K16J95k18l93J54n5K78M50o83K40L8qJ16
4980A98Kr3l42L93j01J7j5M90r13L42Q6k12O14k45NJ24n67L48P1o7K55k42J45
5003B93n39M01J53j52j36j0O0M0l08k8K67k88J86L65lj24j28o2M36j42j01M4j64
5026F0n8O1P4N6k03j38n4K48J41J13j86k11K09n3M45m40J7p7J55k70J07L22Mj11
5050B11R1n11K28K74l11J90j93k2K56oj51K07n6l53kN23K9n37K91j06k53L99j36
5073F2k4J8k30r1N48q6k54k52P3L83l52J56J08k50l5j08K14K46j65l73J53K79
$$ plain form
4914 209 154 -51 -107 -90 197 249 -378 -97 -10 -410 -59 238 147 -9 -244 -41 -14 -238 4 67 -100 -132 45
4937 45 306 327 18 -39 -162 -174 336 -58 -263 -363 -519 -5 104 -197 -292 -418 -259 -57 162 -105 -253 -246
4959 -246 -74 40 -212 326 -148 -3 107 -132 84 279 61 -332 -178 -233 45 495 -188 52 90 82 198
4980 198 200 107 -235 158 57 74 59 549 -364 -22 64 -148 466 221 226 350 -217 131 202 135 390 148 293
5003 293 -246 155 308 156 20 10 70 110 -198 -226 41 -247 -61 304 301 177 49 -13 423 281 180 224 60
5026 60 2 63 137 193 -10 -148 -202 46 187 300 114 -97 112 59 504 64 81 4 159 -111 -4 318 322 211
5050 211 302 -209 19 293 -18 172 -21 -43 213 207 56 263 207 -146 -148 375 404 -133 158 52 -201 198 62
5073 62 38 56 -174 -265 283 197 -57 -309 -236 147 -205 -49 59 -191 -226 -334 -120 126 -39 -412 -259 20
5095B0k70j05O8L31n12M89j09o7j0K74n27j73K79K37j17M1J2k30J53K17r6N4k5
5118f6l66M98r9J38k63k5l0K54m7P9J99n26J41N2Q3K95j16o7l67J69j07K76n5
5141E0R2k26J09k8M26q4l53Qj35lK17p2Qj54M6R9j89K18p2k81o3J54O1J22k30
5166b80j54K58K08QL3k91n4J67K40k00Q0k51Q5q6L03j99l02J95O0j3Q5N2R0Kk74
5191b38k8j06L28J58l1k90K49j01K61k7p0j0PJ37j8n2j0J54k62N32j90j97Q9L05
5215E90j60j14l36J35J15L80m96r6K85J74p2j07m1j63K96M23n56K11j83j50L58
5236D93l19n5l2L64k87qk06m8K03j08K8l7JK87j77r3m25mJ91J20L7J41kj92j32
5261b60O2j21K47j4l1j34J71J00j97K44p3l30j56O39j87J66n74M38J34k17o8P2
$$ plain form
5095 20 -250 -355 -287 44 -468 21 -88 -155 -165 109 -418 -591 -312 -75 -192 -151 -139 -369 -216 1 -95 -41 -66
5118 -66 -432 66 -33 105 -158 -183 -213 41 -6 73 272 -254 -113 -61 22 317 201 134 -233 -64 -171 105 50
5141 50 142 -84 25 -3 423 339 -14 -6 -141 -144 73 1 9 -145 -99 0 -189 29 -43 -324 -387 -233 -172 -50 -280
5166 -280 -434 -176 32 40 73 -218 -272 -105 135 -65 15 -236 -151 -237 66 -133 -435 -240 -180 -193 -108 -56 34 36 -238
5191 -238 -266 -372 -44 114 83 -207 42 -59 202 175 105 95 102 239 221 169 159 313 51 583 393 196 285 590
5215 590 430 316 -20 115 230 610 114 18 303 477 405 298 257 94 390 813 257 468 285 135 493
5236 493 174 119 87 451 164 156 -50 -98 105 -3 25 -12 -11 276 99 6 -419 -423 -232 -112 -75 66 64 -128 -260
5261 -260 -198 -319 -72 -86 -117 -251 -80 20 -177 67 -6 -336 -492 147 -40 126 -448 -10 124 -93 -161 -89
5283h9j33Q3K38k18J31p8L0N45k69j34M7l5J9j17p2O04j15k17K26l59k1L50j56
5306B60J05k01R6R9j8j63j16n1Q7K58j50o0j32N5j6k15j40M04L2m79J00r7J40
5329b02L22N8l28j60m31L40K44k3n4k70K69j52L70k20l24J92J23K7O3L5j77R1
5351b07J8j75J57k07J67r2r6J70K0J55j98n4L04k97N01o1k93n6J58L70K7n23K29
5374A7M4l19M13k18K59k13J65k2M5N2N0j13j01N0j66L04L24m24o4k69L44l2J50
5397B76m51K34r8J19J90j59j10N6m1L19n83K22K50l8q2k28K62rJ31j01j6q0k8
5420C5J39k11j1k34K7O7O2J01l33K62m3Q4k27R5Q3L16m15q5j9L04o3J33k20k37
5444c90L16K65Q8m52L4J80m8L61l95l87L98r7R2o5Q2J74j76J10k36L7l0J89r7
$$ plain form
5283 -89 -222 -139 99 -119 12 -66 -36 509 240 106 153 118 137 20 -52 552 437 220 446 87 66 416 260
5306 260 365 164 260 359 341 178 62 11 98 356 206 146 14 69 53 -162 -302 102 134 -345 -245 -342 -202
5329 -202 120 178 -150 -310 -741 -401 -157 -180 -234 -504 -235 -387 -17 -237 -561 -369 -246 -219 -156 -121 -298 -207
5351 -207 -189 -364 -207 -414 -247 -339 -435 -265 -245 -90 -288 -342 -38 -335 166 105 -188 -244 -86 284 311 -212 17
5374 17 61 -258 155 -63 196 -17 148 126 171 223 273 160 59 109 -57 247 571 147 83 -186 158 126 276
5397 276 -175 59 -39 80 270 111 1 57 16 335 -248 -26 224 186 104 -124 138 129 260 159 143 63 35
5420 35 174 -37 -48 -282 -255 -188 -126 -25 -358 -96 -139 -55 -282 -187 -104 212 -203 -288 -307 -3 -66 67 -153 -390
5444 -390 -74 191 279 -173 -139 41 -7 354 -41 -428 -30 -127 -35 -100 -18 156 -20 90 -146 -109 -139 50 -47
5467d7m2L71j4k31K83r2k55K29m1pj77j95K52OP1J29k09Jq4J84j16j72M73j02
5491B15k80J63j61K50j35q7J73k39J15J59L8m13J39K16k35K6J25j68K5M6j50K89
5513A11j12J53k70J35Pq5J20Q1l6m65K08k85L46rJ85k59J01j43K1J45k20N63m44
5536a52K76j70n7R3j22J24l66L71J21l97M5o5J53L03j07j72j65l1K1J77L44l32
5558a08l24K61K59j65J66R3o9j28j75L81j63j21N30l68R5Kk05M81k86k82o4K98
5580A08k7om9K42p9j66K17J25n22L30o4lm2j69M09l02K66l97J31k03L06J0M4n55
5604c96M00J45k79J14k66P5K84j2o7J90m93J2J88M23m54L4j37J34K3K4m2j33Q9
5627a44K0j68K49Q2k84o9J76J19R5J95l82k15k1N13K16l64l02K8J56J26J95Q1
$$ plain form
5467 -47 -89 282 268 37 320 228 -27 202 161 154 -23 -218 34 40 111 240 31 32 -52 132 16 -156 317 215
5491 215 -65 98 -63 187 52 -35 138 -101 14 173 211 -202 -63 153 -82 -56 69 -99 -74 -28 -178 111
5513 111 -1 152 -118 17 24 -61 59 140 104 -361 -153 -438 -92 -101 84 -175 -74 -217 -196 -51 -271 292 -152
5536 -152 124 -46 -103 -10 -132 -8 -374 -3 118 -279 -234 -299 -146 157 50 -122 -287 -318 -297 -120 224 -108
5558 -108 -432 -171 88 -77 89 182 113 -15 -190 191 28 -93 437 69 164 166 -39 442 156 -126 -190 108
5580 108 81 75 26 268 189 23 240 365 -157 173 109 106 64 -105 304 2 268 -129 2 -201 105 115 159 -396
5604 -396 4 149 -130 -16 -282 -207 77 65 -2 188 -305 -293 -105 318 -136 -102 -239 -105 -82 -58 -100 -233 -144
5627 -144 -124 -292 -43 39 -245 -314 -138 -19 76 271 -111 -326 -347 166 382 18 -284 -256 -100 26 221 302
5649C02k46J67k56j5J90n5j4L16k17K86m46J88M7J24l91L93K1J86k04l03P5L1
5671A79j70J17J84k19rQ7L3j86j08L42j43l96J07N2K85j74K40n13J96K53j25k71
5693b39%n8L06q8m0j39j87k05L75J77l05j4K19q5r5J6J64J72k17J8n9M1J39J65
5717F1l79r0K03J98p0K31m57R3p8K98o0r8K82K19l92M3R8j15L02j13K53k40K08
5740C97k11O9k98J85P2q9k5M31m40K75j46L27k90JL00k96o4j58m9L06o5l1L06
5763E07k84r4J1M9J06l94K38j69J95k39j14Q3J00j13j18J01k24j16L38k57j71
5784e65M30K09m37J69P6k20J44J74n49L1N82j36k1O9J79k44K77n5k16p0j73K58
5806h8K2K33l84O9K05M3J0J10J02n49K93j33K82J50k43J45J9r8M0k52rL31j57
$$ plain form
5649 302 56 223 -33 -48 142 87 73 389 172 458 12 200 247 371 -20 373 394 580 376 73 148 179
5671 179 9 126 310 91 82 169 202 16 -92 250 107 -289 -182 -130 155 -19 221 -292 -96 157 32 -239
5693 -239 -239 -297 9 -79 -119 -258 -445 -650 -275 -98 -403 -417 -198 -283 -378 -362 -198 -26 -243 -225 -284 -243 -104 61
5717 61 -318 -408 -205 -7 -77 154 -303 -210 -288 10 -50 -148 134 353 -39 4 102 -13 289 176 429 189 397
5740 397 186 255 -43 142 214 125 100 531 91 366 220 547 257 258 558 262 198 40 -9 297 232 201 507
5763 507 223 129 140 189 295 -99 139 -30 165 -74 -188 -105 -5 -118 -236 -135 -359 -475 -137 -394 -565
5784 -565 -135 74 -363 -194 -118 -338 -194 -20 -569 -538 44 -92 -113 -44 135 -109 168 113 -103 -173 -346 -88
5806 -88 -66 167 -217 -148 57 100 110 220 322 -227 66 -67 215 365 122 267 286 188 228 -24 -33 298 141
5829A41K68n0R4k97K71m00R9J04m7j76L58m09M43q2J62k36J04n61L33Q1j98qJ21
5852A15k85K21m3j28L3K43k41J0O2l25L08j69j91J3L94n32K00j09J53rl65M08
5874b37L4r0N8L14o60M46N7j08K81n04k3M47j64O1K68l97j53K95j33Q4K05k17
5896a36K72n03M51L0J01K36n46m3L97N4j77M51l62m28M22o6l9J50m71K99j07N20
5918E05m60L0o3K86J05l91L69k72j27P4N8j21k3J70%p1m28K54N1J7L1p1j30%J31
5943g6m0k90J58m4J40K8J89l38K04l92K20K96l26R9J59k27L15j50J50q1k04L8
5965a72O0J5R6k08j51L16J26q4K29l5k84J86n7j76J20J92n18O22rj76J29k36Q7
5988G2j39N8J04P6j53p1j9J96O2l92K10J76l90K56J00k18P0l3l57M05j48K60k17
$$ plain form
5829 141 409 359 453 156 427 27 126 230 183 7 365 -44 399 317 479 243 347 -214 119 200 2 -6 115
5852 115 -170 51 8 -120 -87 156 -85 -75 -13 -338 -30 -199 -390 -377 17 -515 -315 -424 -271 -280 -645 -237
5874 -237 -203 -293 -235 79 -581 -135 -78 -186 95 -409 -432 15 -149 -88 180 -217 -370 -75 -208 -124 81 -136
5896 -136 136 -367 84 114 215 451 -95 -138 259 313 136 587 225 -203 219 153 114 264 -207 92 -15 505
5918 505 45 75 12 298 403 12 381 109 -18 56 114 -7 -30 140 140 69 -359 -105 -54 -37 -6 -77 -207 -207 -76
5943 -76 -116 -406 -248 -292 -152 -124 65 -273 -69 -461 -241 55 -271 -172 -13 -240 75 -75 75 -6 -210 -172
5965 -172 -112 -97 -1 -209 -360 -44 82 -2 227 192 -92 94 37 -139 -19 173 -345 277 268 92 221 -15 72
5988 72 -67 -9 95 171 18 -53 -72 124 186 -206 4 180 -210 46 146 -72 -2 -35 -392 13 -135 125 -92
6011i2L21j62o4O9r7K5P8k81M01nk87j66J92k1N5J85k11p9L22o61L89j85J31L64
6035B21k38j07K31m16K24RO4O0j68N21k75j95L42n92L89m0k42K79P2k05j95P0
6057a91K22m1K6m3M0M1po6j01K27m9L5j88L48m5q5l70K71p9K19j41j09J61J1N7
6082A43K37k17l2r4k13M3O2K06k88K00j76l01J81J19J32R6K64j05j85j89K15j36
6104c8L5J31o3J26j65j07j57q5K99j68M49k27j95R3L75j62j82kp4O7n9J0J27L2
6128F0m03L94j44j55J40L92l08J18o2K32l67ML59j55k46j0J7M23q02L64K84j93
6150e8Nq3L27l45J36pL42m09j07q4mK01j78J18P8o5M16l31NJ60j40k8J46m7j48
6175a00M28m1k68N3P1k30J11m4K46l77K08O5J29m02N60k39l05R8L54m6k43M6J01
$$ plain form
6011 -92 229 67 3 72 -25 0 78 -203 198 193 -94 -260 -68 -89 -34 151 -60 -139 183 -478 -89 -274 -143 221
6035 221 -17 -124 107 -309 -85 -76 -12 48 -120 401 126 -69 273 -319 70 30 -212 67 139 -66 -261 -191
6057 -191 31 -10 16 -27 13 54 47 -19 -120 107 58 93 -95 253 208 123 -247 24 -55 164 23 -86 75 86 143
6082 143 380 163 131 37 -176 -133 -71 135 -153 47 -129 -430 -249 -130 2 98 362 257 72 -117 98 -38
6104 -38 -3 128 65 191 26 -81 -238 -323 -24 -192 257 30 -165 -72 303 141 -41 -43 -117 -50 -109 -99 28 60
6128 60 -343 51 -93 -248 -108 284 -24 94 32 264 -103 -99 260 105 -141 -151 -134 289 -513 -149 135 -58
6150 -58 -53 -136 191 -154 -18 -25 317 -92 -199 -283 -287 -86 -264 -146 -68 -133 283 -48 -43 117 -23 -51 95 48 -100
6175 -100 328 287 19 72 143 -87 24 -20 226 -151 57 122 251 -151 409 170 -135 -37 317 271 28 74 175
6198A75n4J9l29J55J50k46J01l0K03l6r3L7oo3k28K83n1P2j62K52o6J7k16p9J08
6223h7k95M66k18L7k13J76J74k57nK91m9J47j27q4K75k92R1m00J15J02K36l39
6245b56J52J1K79n34O04n66k08M25K40j47J0Q2k39r3L45n9n9j3j71K2L81l04Q8
6268a0p9J27M3j21P7J06J2l61P37n60k20M15k41J26J52k72r2N27j82k32K62k26
6290a2J66rJ89j20l02N0L3j93J52P9o9j18K5J29M7K5J19j28l30K63j15p9M5L29
6314A76l34J47j83L48q5r4J53k75J5J28Mo8n8K14J27m98J75J8P1J76j95K14m26
6337b50L47j9k0l9K2K2ol85J90O7K22j92k50N79k76r8K41j81J03J89o4j81P2k32
6361a39K78k02L64j92l49N64l31J10j02rjL86m03k39O22k38n57O00l17J7j43L50
$$ plain form
6198 175 121 140 -189 -34 116 -130 -29 -59 144 108 15 52 46 -17 -245 38 -13 59 -103 149 83 100 -116 -195 -87
6223 -87 -382 84 -134 -97 -310 -134 40 -217 -222 69 20 167 40 -44 231 -61 30 -370 -255 -153 83 -256
6245 -256 -104 -93 186 -348 256 -310 -518 -93 147 0 10 92 -147 -240 105 46 -13 -26 -197 -175 206 -98 -10
6268 -10 -89 38 81 -40 37 143 155 -206 531 -29 -249 166 -75 51 203 -69 -161 366 184 -48 214 -12
6290 -12 154 145 334 214 -88 -38 -5 -198 -46 33 -36 -154 -129 0 47 72 191 63 -267 -4 -119 -198 -153 176
6314 176 -158 -11 -194 154 69 -25 128 -147 -132 -4 0 -68 -126 88 215 -283 -108 -90 -19 157 -38 176 -250
6337 -250 97 78 58 19 41 63 57 -328 -138 -71 151 -41 -291 288 12 -86 155 -26 77 266 202 21 93 -139
6361 -139 139 -63 301 109 -240 324 -7 103 1 -8 -9 377 -26 -265 357 119 -438 162 -155 -138 -281 69
6383F9k79K81j74m7Qm4M51o04L64j27J04j17J42J39k11j32K45j68j52O9j62L86
6405D1Q7k50L20n4n19L11p7ml06KN55k70j12L65M9k95L32l26K65p0j31q0L95M2
6429B70j72j3j85Q7K5k2K07l92J04J59J51l23P5m1Q5J51l6l11K75k75J94O8j86
6452a05K24j62K32k61R7L24jn81J48J56k61N3J24K20L9l25k29K75K51k39j54o8
6474b43L92O9l58o2K3j9j2k0M42k04r6o0L88j96J42l57K69l90K72L18q7o02P17
6497C26l24k43O11o13Q2K97j84j50L84l07J28R9Q5k57r8J13K6R0K5K41l88L58
6519C01j89m42L60J69k46K93m15M28k35Qp3k8L08j75l3n9q0M07l59L25k80j46
6541a61J00R4K01o66O48k79K17l08K46j1m8l89J35K09K04j94J77m1j44J16j45
$$ plain form
6383 69 -210 71 -103 -150 -142 -186 265 -339 25 -102 2 -115 27 166 -45 -177 68 -100 -252 -183 -345 41
6405 41 128 -122 198 144 -375 -64 -141 -145 -451 -449 106 -164 -276 89 138 -157 175 -151 114 44 -87 -167 228 270
6429 270 98 85 -100 -13 12 -10 197 -195 -91 68 219 -104 -29 -70 15 166 130 -181 94 -181 13 81 -105
6452 -105 119 -43 189 -72 25 349 348 -233 -85 71 -190 -137 -13 207 246 -79 -308 -33 218 -21 -175 -243
6474 -243 149 218 -140 -202 -179 -198 -210 -230 212 8 -88 -148 240 44 186 -171 98 -292 -20 298 211 -391 326
6497 326 2 -241 370 -243 -161 136 -48 -198 186 -121 7 106 191 -66 -164 -51 -25 65 90 331 -57 301
6519 301 112 -330 30 199 -47 246 -169 259 24 32 -41 -69 239 64 31 -28 -108 299 -60 265 -15 -161
6541 -161 -61 33 234 -432 216 -63 154 -154 92 81 33 -356 -221 -12 192 -2 175 134 -10 106 -39
6562c9N9J46n36K32K03k19K32l83j21M19K64k63r3K96m2o4k0R8j79j91Q4K84k88
6585a21K11j68N7k72L25p0O7k60K58k64K35l6j84M74k78j65m5L13J06j57K37k46
6607A7J3l6j21L30m64L07J1k02j45N45j38M2J18k94R1j32L37p3l88J97l60K31
6629a14K56j68J05L0l90N89l20J20l56M08J9j63M6j27%J38r2m3M4k72L10j65J02
6652d3K0M19o19K62n0J87j68l6O5j34J86k11J92l43M46j00j21K04k06J01J7o9
6674an7Q7r3K39o3K23j52j14j15oN5j4o0J6L33j66L11q44L91K27L5j70J1O3k55
6699a19q5L1J46J19k5k67J59j12l9j83L92o0K06j44R9k4j01j5k60K79J69n39M81
6722A08k32L24l18k78K29j28K36K17j01j24k64K24J77P6k26k43N31l54m5K79p4
$$ plain form
6562 -39 20 166 -370 -138 65 -154 78 -305 -426 -7 257 -6 -99 197 155 91 71 169 -10 -201 -117 167 -121
6585 -121 90 -78 -21 -293 32 -38 29 -231 27 -237 -2 -38 -222 252 -26 -191 -236 77 183 26 263 17
6607 17 30 -6 -127 203 -261 46 57 -145 -290 255 117 159 277 -17 74 -58 279 206 -182 15 -345 -114
6629 -114 142 -26 79 109 -281 308 -12 108 -248 160 179 16 62 -65 -65 73 -19 -62 -18 -290 20 -145 -43
6652 -43 -23 396 -223 39 -11 176 8 -28 37 -97 89 -122 70 -273 173 73 -48 156 -50 51 68 -1
6674 -1 -58 29 -64 175 112 335 183 69 -46 -52 3 -11 -71 -55 278 112 423 -421 -30 197 232 62 73 136 -119
6699 -119 -204 -173 -27 92 67 -200 -41 -153 -192 -375 17 -43 163 19 118 94 -7 -22 -282 -3 166 -373 108
6722 108 -124 200 -118 -396 -167 -295 -59 158 57 -67 -331 -107 70 146 -80 -323 208 -146 -191 88 14
6743A4n2L53o53N86k78mj0J35O0p1k13K3L18m48K31q1K92j78L01j82j06j09Q4
6766A2m3j71L28j58R2k15j85K18P6L88m50P8q6K7J36K86j71K46n75J4o2L76K0
6789A81m78K26L8PQ7j35j91K92q2J41O6k20O51m40j67Q7j02L05m50K49r2n6J31
6812D8K29k58n1Ok07L24O2k72J15l7J17k20J31k74N05l8k80J54J71R4j08r7j17
6835cq6L04j74J53Q7j44j73%L56k05p7O3k39j26L04J11O1m06K93j59k0N0N3J45
6859A68j81m18L62K60l70J67k84K09k4J49j16M19k36j07K36m42L63j53k05o0L16
6880E3jr6r5J29m1K39k07j53L80l03j44K81M1j73j01K79n1J83k22n8K14m42K96
6903Hj19J88k03O7p9m1J81l3K01q6j2l07J83L9k0K43k74L0J46l18J24L28n9l08
$$ plain form
6743 14 -38 315 -338 248 -30 -34 -44 91 151 80 -133 -110 208 -240 -9 -90 202 24 325 143 37 -72 12
6766 12 -31 -202 126 -32 60 -155 -340 -122 -46 342 -108 -30 -116 -89 47 333 162 408 -167 -153 -215 161 181
6789 181 -297 -71 -33 -26 61 -74 -265 27 -55 86 152 -68 583 143 -24 63 -39 266 -184 65 -27 -83 48
6812 48 277 19 -32 -26 -233 91 153 -119 -4 -41 76 -144 -13 -287 218 180 -100 54 225 319 211 114 -3
6835 -3 -89 215 41 194 281 137 -36 -36 320 115 38 101 -138 -264 40 151 212 -194 99 -60 -80 -30 23 168
6859 168 -13 -431 -69 191 -179 -12 -296 -87 -111 38 -78 341 105 -2 234 -208 155 2 -203 -263 53
6880 53 52 -44 -139 -10 -51 188 -19 -172 208 -95 -239 42 83 -90 -191 88 37 220 -2 -60 154 -288 8
6903 8 -111 77 -126 -59 -138 -179 2 -31 170 84 72 -235 -52 -13 -33 210 -64 -34 112 -206 -82 246 187 -121
6927a21L7N8J14J09j71M1kk86K94P7m9p7L1pR9l65K92l85k0N40n41l0L28M9q1
6952f6O5l04O8J73K9oM4J46o4r0J78l40K57k4j95M05l89r0M90j96j11j56J5O8
6976i3j26J6O2l2K20M0m7l9qJ49j80K09n9J45m05K57O3m45j00N14j72J43l9R9
7000A72J39o2m60K86K23l61L83m55J13J23J98j22m26M56j76m4J59r3M4o2k39L45
7022A41j22mR5P8q3o8m0j25K85j15m03M67O8j92kQ5J24m23J17K67K9j77j44K19
7046G7k13J96n1l32M78n6k70K25P5M7R2k12J60q3j33K4r6l4J29J89k06m4J40j15
7070a3J82j60J07k29j83L40O6k43j52M82k02j17j36K89K09j81j2J43k3l52N9J55
7092B9j9Ol2K55j44m59K62K61q9Ll7j60N2J11K15l35J26J21j79Q2m7O3k34K66
$$ plain form
6927 -121 -84 -26 88 197 26 67 65 -221 73 150 101 24 55 48 147 -218 74 -311 -331 209 -332 -362 -34 15 -66
6952 -66 -1 -305 -237 -64 -35 -41 3 149 85 -5 173 -167 90 66 -129 276 -113 -203 287 91 -20 -176 -161 -93
6976 -93 -219 -203 -141 -173 47 87 40 1 -7 142 -38 171 112 257 -148 109 172 -273 -373 141 -31 112 73 172
7000 172 311 249 -211 75 298 -63 320 -135 -22 101 299 177 -249 207 31 -13 146 53 97 35 -204 141
7022 141 19 15 110 188 105 37 -3 -128 157 42 -361 106 174 -18 -20 65 189 -234 -117 150 179 2 -142 77
7046 77 -136 60 9 -323 155 99 -171 54 129 176 268 56 216 133 0 24 -72 -106 23 212 6 -38 102 -13
7070 -13 169 9 116 -113 -296 44 110 -133 -285 197 -5 -122 -258 31 240 59 47 190 167 -185 -126 29
7092 29 10 16 -16 239 95 -364 -102 159 70 73 36 -124 -72 39 254 -81 45 166 -13 69 22 85 -149 117
7116A17k88o3L06J5k1K19kl05K05k87m2K97l85N6L63k87j01J20Q5k8j41L6j89
7139c20K93j3j83M04l93K58j05m4J10J33l06K15P4K78m01Q4j56J86j38K73l22
7160g3L5K56k95M55o83J73J71J41J4J79l83J27k45K28J0RNn02L45L6j29r7L66
7183A43j47j71M44j31j65J30m40L31l65L29J30m2n4k32J28j28J70K69p9j11k6
7204a7r5K58j95k1LM2Qr7Q3O0j19Q5O3j21L97m50m1L8K21P7j74k82L33p5J74o9
7230H6k79J16J84q1j40J53k98J26j4J92j11j3K42k11O2Q4K33k69mR5k71j80K52
7253d6r0L16k56pq8J98j66K95j71m7J17k17K85O6k69K03j92K47K5k47J11l49K91
7276Ik37K20j63J63j26LO6%k3J59J40j73J99k42j29J55j24j11L12k73j7K48p9
$$ plain form
7116 117 -171 -234 72 87 66 285 283 -22 183 -104 -146 151 -234 -178 185 -102 -203 -83 2 -26 -167 -131 -320
7139 -320 -27 -40 -223 181 -212 46 -59 -103 7 140 -166 49 123 401 0 84 -72 114 -24 249 -73
7160 -73 -38 218 -77 378 -305 -132 39 180 194 373 -10 117 -128 100 110 119 124 -378 -33 3 -126 -223 143
7183 143 -4 -175 269 138 -27 103 -337 -6 -371 -42 88 46 -8 -240 -112 -240 -70 199 120 9 -17
7204 -17 -112 146 -49 -70 -67 -25 -17 -114 -31 29 -90 -5 58 -63 334 -116 -157 -119 102 179 5 -277 56 -19 155 86
7230 86 -193 -77 107 26 -114 39 -259 -133 -147 45 -66 -79 163 -48 14 98 331 62 58 153 -118 -298 -46
7253 -46 -136 180 -76 -83 -171 27 -139 156 -15 -62 55 -162 123 189 -80 123 -69 178 203 -44 67 -282 9
7276 9 -228 -8 -171 -8 -134 -131 -65 -65 -88 71 211 38 237 -5 -134 21 -103 -214 98 -175 -192 56 -23
7299b3k09o4J35J96M6k7k88K34J35k84J86J37j37j14J47l99L30M76o25J45Qj78
7321a73O9p2J7L30k9l13R9o1l3r3K56m53K18K51K00l06R6k70K88k87M00j10k8
7344dj28P2J92k66K16j30j9J0J09p7K87l09N3J9j02O9l20L55K22j61j09Qm6J95
7368A36j88l0J32jq4J09r2q6j54J73q2K68R6m99K71j1K30k40k18M47n04J62K08
7391D3j1J31j42LkPr0j15L53k00Q6j0K24K0m08K72Qj76K93k17K92n11n3M99k19
7416G7k23K00j66L89j47L8N2n23L02J89K06l48qk24K83J17M6k98j82J35N9k47
7438b73M39K23l16l39J74n4K41K47n09J16j3k66J66K9m9p9O3J32J65l52R4L91
7460B30r4k53RK58j72K23j31J09o2p1L8K70l30J0k6m3j2j07r6L21jn17K18J96
$$ plain form
7299 -23 -232 -296 -161 35 81 54 -234 0 135 -149 37 174 37 -77 70 -329 1 477 -148 -3 5 -173
7321 -173 -104 -176 -159 171 142 -171 -72 -133 -166 -259 -3 -456 -238 13 213 -93 3 -267 21 -266 134 24 -4
7344 -4 -132 -60 132 -134 82 -48 -67 -57 52 -25 262 -47 6 25 -77 -8 -328 27 249 88 -21 -13 -59 136
7368 136 -52 -82 50 49 -35 74 -18 -104 -258 -85 -167 101 197 -302 -31 -42 188 -52 -270 177 -327 -165 43
7391 43 32 163 21 24 22 29 -61 -176 177 -23 63 53 277 297 -111 161 169 -7 286 69 361 -150 -203 296 77
7416 77 -146 54 -112 277 130 168 220 -303 -1 188 394 46 38 -186 97 214 260 -38 -220 -85 -26 -273
7438 -273 166 389 73 -266 -92 -146 95 342 -167 -51 -64 -330 -164 -135 -184 -263 -200 -68 97 -255 -161 230
7460 230 136 -117 -108 150 -22 201 70 179 117 46 84 354 24 34 8 -35 -47 -154 -250 71 70 -447 -229 -33
7484c3K23l41K10Lj85k96J08J06L12j35j47K11k16R6r7Q1k51J51lj31K75K8J62
7507A31j70k13J70L9J68j23r4K99m51N17l13N0%j44L22l81k16M21Q3j51j61Q9
7529a28K59j8j35r7L9O8K32j33j51j56P2J37qL91j48m84P4p2J04J41J55j76L3
7552aJ38m10K26j03J10j3j65K82k0q9J26j73N3k82K52QJ50O0j8mk92K87o3k4j45
7577a10L70n35L10j33J50O6R7l31K64J16l23N6K31k33O0Q0m42K54q3K93k9J7l41
7600a96P8N23l12j84J34k97j2K91r3o3NJ98qj4O0p9L16n6l88L08J57m45j3J95
7624A05m2K87m08J54r8j22J17K08n35J23J60N9K08L3l46M29l43PJ90j59P7P1l03
7647a28j97L49N5O2r8j16K86Ol4jk63K56j70J40k02l65M21k64L79l50O9R3J26
$$ plain form
7484 -33 190 -151 59 62 -123 -419 -311 -205 107 -28 -175 36 -180 -84 -181 -100 -351 -200 -203 -334 -59 -31 131
7507 131 -39 -252 -82 -43 125 2 -92 207 -244 273 -40 10 10 -134 188 -193 -409 12 95 -56 -217 -128
7529 -128 131 113 -22 -119 -80 -12 220 87 -64 -220 -148 -11 -19 372 224 -260 -186 -258 -154 -13 142 -34 -1
7552 -1 137 -273 -47 -150 -40 -53 -218 64 44 -45 81 -92 -39 -321 -69 -61 89 149 131 127 -165 122 59 35 -110
7577 -110 260 -275 35 -98 52 118 215 -116 148 264 -59 -3 228 -5 55 135 -307 -53 -136 157 128 145 -196
7600 -196 -118 405 93 -91 43 -254 -266 25 -68 -131 -126 72 64 50 110 31 347 291 -97 211 368 -77 -90 105
7624 105 63 350 -58 96 -2 -124 -7 201 -334 -211 -51 8 216 249 -97 332 -11 -4 186 27 104 175 -128
7647 -128 -325 24 79 141 43 -73 213 219 185 184 -79 177 7 147 -55 -420 1 -263 116 -234 -165 -72 54
7670E4n8n7J52j70j4J29j0k03M10m16J95r3L3M53j94k59N4Q2J65k82Q0j16J16
7693E1M00n76k5P2o3K73j68J86k69L21k29p9K87k55K02m59PK38M6K69k75m1K1
7716f6K12j86J42L0k03K3j20P3P8j94J89j4j4M1k83J52Q6j23L35k24O7L79l56
7739B4J36j82q7r8M95k6j77J19l13J45p7K19j86j86K57P0r1l62L27N9J23k53J55
7762I1j93l5J23q0O7j23K41j32nJ9M2L10l14ll8k1L06Q5l66J41l82Q7L90l55K27
7787H2j37mp7K4N53o29J79p4K86k41n7M83l29j15Q3J52rk13L27k98j85o8K74R5
7811A02n9j75J20j84R0R1k03K42j86K69k33k2j7K23k02J79j54K58k45R1j15P4
7833e6K0R2J90l07J41j69J63p2j7J30o6k08k07M17p7Q3m8O3L5k50j5J99M6k69
$$ plain form
7670 54 -4 -61 91 -79 -93 36 26 -177 233 -183 12 -81 -48 405 211 -48 6 88 253 -29 51 -65 51
7693 51 451 -125 -150 -78 -141 132 -36 150 -119 202 -27 -106 181 -74 128 -331 -324 -86 -40 229 -46 -87 -66
7716 -66 146 -40 102 132 -71 -48 -168 -95 -17 -211 -22 -36 -50 -9 -292 -140 -54 -177 158 -66 1 380 24
7739 24 160 -22 -109 -207 288 262 85 204 -109 36 -41 178 -8 -194 63 133 42 -320 7 66 189 -64 91
7762 91 -102 -137 -14 -94 -27 -150 91 -41 -46 -27 15 325 11 8 -30 -51 255 340 -26 115 -267 -180 210 -145 82
7787 82 -55 -59 -136 -112 441 -188 -9 -83 203 -38 -95 388 59 -56 27 179 170 -43 284 -14 -199 -267 7 102
7811 102 43 -132 -12 -196 -106 -15 -218 24 -162 107 -126 -148 -165 58 -144 35 -119 139 -106 -15 -130 -56
7833 -56 -36 56 246 -61 80 -89 74 2 -15 115 49 -159 -366 51 -26 57 9 72 107 -143 -158 41 87 -182
7857a82K4l9j15M24k62P5J18l33M63o1k36P2R9r6k04J08L02j17k02K27N8J74l88
7880i1NL37k32j90M79l92K50m6M4m30K19l03M25j26p7k09K09K75k84Q8J49l00
7902b00N06n59M84l01Q2k67J28M0l61L77j94K15K41om42N59l39j09j07L64r2j03
7924h4R7K05m26J85J2K0J56j64Pj2J15j48L4N7M7l1P8j95j08J16P0l4q5K53J02
7949B67m35L33m5o9N5K01k62k32N00l20L23k70M2J49n06N26j07j09r2O2m3K09
7971A77k47j99J64M99j71l86K3J43OK16kk73m9K56l08K66n9j40Q2O6KJ24R0J6
7995B96k74j80N14k45k17J78O8j89K04j15j96K46J36o7m46J41j11L1J81J83r9
8016C9J44M0q6n3m7N3K9L4k86p0J95j0o4L62n08NL01k17L53k18O9K30l39lp4k08
$$ plain form
7857 -182 -158 -197 -312 112 -150 -75 43 -290 173 112 -124 -52 47 -49 -253 -145 157 40 -162 65 123 297 -91
7880 -91 -86 251 19 -171 308 -84 166 120 164 -266 -47 -350 75 -51 -128 -337 -128 147 -137 -49 100 -200
7902 -200 306 -253 231 -70 12 -255 -127 -87 -448 -71 -265 -50 191 185 -257 302 -37 -146 -253 111 19 -84
7924 -84 13 218 -208 -23 -11 9 165 1 8 -4 111 -37 -3 54 101 70 148 -47 -155 -39 31 -3 -88 165 267
7949 267 -168 165 120 51 106 307 45 -187 313 -7 316 46 88 237 -269 257 150 41 -51 11 -32 177
7971 177 -70 -269 -105 394 223 -163 -140 3 9 225 223 -50 -99 157 -151 115 56 -84 -2 64 66 190 280 296
7995 296 22 -158 356 111 -106 72 140 -49 155 40 -156 90 226 159 -287 -146 -257 -226 -45 138 39
8016 39 183 223 137 84 37 90 119 153 -133 -203 -8 -18 -82 280 -228 -223 78 -139 214 -4 65 295 -44 -47 -121 -329
8042c29M7K42o6j96P9M82m1k69K73k00n7K83n35M9J95k70M37j39r5K69n93N16
8064H2J51m68M8K91j81j31K85o6k16j62J68K24j60J88L7n9J48l43n8K88Pl31P6
8087a82J90j92J47m7r7j10K30p1qM3j1J33k33J18L3k15J91J29k79K40o7k01K84
8110B5m24K40r1J71K42m01Q1q6M16k99J72j1j6J26J0k31K9J52l11J40K3k9k67
8133c39M67J8O1j38j63J18k31J5K88P9l88j0L09r7K0k1p3J35j46J36o2J24o3J32
8157A71j55Qj01K59n30J94q2L56j65%j11L04k99K69r6j73J90j5l49N29k00l1M23
8180C96k72k86N62k28j16k48K23J01k53Q5j
$$ plain form
8042 -329 -282 -40 -106 -302 -223 259 218 -51 222 22 -35 248 -287 -238 -43 -313 124 -15 -110 159 -434 82
8064 82 233 -235 -187 104 -77 -208 77 11 -205 -367 -199 25 -135 53 90 31 179 -164 -222 66 73 -258 -182
8087 -182 8 -184 -37 -84 -181 -291 -61 -132 -140 -97 -108 25 -208 -90 -57 -272 -81 48 -231 9 -58 -259 25
8110 25 -399 -159 -250 -79 163 -238 -157 -243 173 -126 46 35 19 145 155 -76 -47 105 -206 -66 -43 -72 -339
8133 -339 128 146 207 69 -94 24 -207 -192 96 175 -213 -223 86 -11 9 -12 -85 50 -96 40 -22 102 39 171
8157 171 16 24 -77 182 -348 -154 -236 120 -45 -45 -156 148 -151 118 22 -151 39 24 -325 204 4 -27 396
8180 396 124 -162 400 172 56 -192 31 132 -121 -36 -37
8191c7
$$ Imaginary data points
##PAGE= N=2
##DATA TABLE= (X++(I..I)), XYDATA
0@%%%%%%%%%Qj6J6j6J6k4L2l5M3n1N9p0Q2r5J10j26J43j62J86k13K39k70L04l38
33a78L78m23M73n27N84o47P19p98Q83r78J082j200J334j480J646j840K063k324
51a233K638l022L503m128M977o206Q153j1723K0452q0128j45605Q0158J25928
64f236P4948o2747j07698n5186N6322R5990N6099l0975p0932n2678J3910O4910
76b4273P2866J6966n3030q4196k7640O8206J11031M1476p3823j15190l1442Q9742
88i307J23159K8806r0346j09071j3372R0617R8929J2658p3858q0198j3201N5543
100B0359O9322K7416l1653o6940m7964J5357P2205O6987q195q7327q5539O575
112d9397R7379Q8573j9132j12842q9439K4306J07855P3083l7042j02638o4151
$$ plain form
0 0 0 0 0 0 0 0 0 0 0 8 -8 8 -8 8 -16 16 -19 24 -27 32 -38 44 -51 59 -67 76 -86 100 -113 126 -144 160 -178
33 -178 200 -223 250 -277 307 -340 379 -419 464 -514 568 -632 702 -778 868 -972 1091 -1233
51 -1233 1405 -1617 1886 -2242 2735 -3471 4682 -7041 13411 -66717 -212322 -132164 -6236
64 -6236 68712 5965 -101733 -156919 -100597 -4607 51492 20517 -50415 -103093 -89183 -24273
76 -24273 48593 65559 12529 -71667 -99307 -31101 79930 121406 47583 -67607 -99049 -9307
88 -9307 113852 142658 52312 -56759 -70131 20486 119415 132073 58215 -21983 -35184 20359
100 20359 89681 117097 85444 18504 -29460 -14103 58102 125089 116894 29567 -55972 -49397
112 -49397 47982 136555 117423 4581 -84858 -60552 47303 120386 83344 -19294 -83445
123h3445K5837P8377M9410j9753o6599n5390m912M4574N6961K0382m3041p7987
135g5586m2263L9194Q8873M6599n2419j05511m9383N9917J05104L8412o7599j01465
147a16127l0723O5921Q8878K2942n6611p3522k2678M1358O2546L1756j9943n2808
159e9011m4332N519N8704O5238Q139o4779p5548n300Q0409Q7568M282q4971q1943
172a06025J0256R1433P7502j1563q0008o1287J6459P0327N5202m075m8724m7929
184c8432p300L8704N4427K7872k6158o1548m1188K7299P7608N2085l0852q6720
196a4203n2050M0316R2822M7973m6370q8688l8505M7168P9210L1748m1306o6561
208h446k8296K7979N3226L2424j1645m5917m3113l840M3614N6600J5012m9318
$$ plain form
123 -83445 -57608 20769 70179 50426 -16173 -71563 -76475 -31901 25060 45442 2401 -75586
135 -75586 -117849 -78655 10218 56817 4398 -101113 -150496 -90579 14525 52937 -14662 -116127
147 -116127 -146850 -80929 7949 30891 -25720 -99242 -121920 -80562 -18016 13740 -6203 -59011
159 -59011 -103343 -97824 -39120 26118 34257 -30522 -106070 -111370 -30961 56607 60889 -24082 -106025
172 -106025 -95769 -4336 73166 61603 -18405 -79692 -63233 7094 62296 58221 9497 -38432
184 -38432 -45732 -7028 47399 75271 49113 -12435 -53623 -26324 51284 103369 72517 -14203
196 -14203 -66253 -25937 66885 114858 68488 -20200 -58705 -11537 67673 99421 58115 -8446
208 -8446 -36742 -8763 44463 76887 65242 19325 -23788 -27628 15986 72586 87598 38280
220C8280p0411j8974N8527P8514J5621o6782p9096p580O9707P3337J215o6101
232B6257o1563R53N5721N2990L573m0584m5814j3937K6910M7244K8721j6973n3041
245A0457m1875J3417O2390N1657j5870p2514n4652K1387P6200N1009k7846p7063
257c303m6034K8899O8328L5998k7926n8744l4825J6128M4618L2356o082l8601
269A0812m2290j2057L1878M9185J8109l7492o3718k7870L9954O8264K2583n1753
281E605p3647k1116N1069O6141J0836n3032o1521j0651M2097M8420R531l2612
293a8880m4070j9345J8371L9820K8212r252m4405m1660M155N1012M9932m147n7478
306d7735n3111Q903O4349N3178j2208o1760m5939J7109O0553M2245j3507m7667
$$ plain form
220 38280 -32131 -51105 7422 85936 101557 34775 -44321 -51901 17806 91143 92358 26257
232 26257 -35306 -34353 21368 74358 77931 37347 -8467 -22404 4506 51750 80471 63498 10457
245 10457 -31418 -18001 44389 96046 80176 7662 -46990 -25603 50597 101606 73760 -3303
257 -3303 -49337 -20438 47890 83888 55962 -2782 -37607 -21479 23139 55495 49413 10812
269 10812 -31478 -43535 -11657 37528 55637 18145 -45573 -73443 -33489 34775 57358 5605
281 5605 -68042 -89158 -38089 28052 38888 -14144 -75665 -86316 -44219 4201 13732 -18880
293 -18880 -62950 -82295 -63924 -24104 4108 -5144 -49549 -91209 -87054 -36042 13890 9743 -47735
306 -47735 -100846 -91943 -27594 25584 13376 -48384 -94323 -77214 -16661 25584 12077 -35590
318c5590l3130J0024M1458L6449M343k9155l5317j1201K7370M7422K5523k3092
330B5104n1853k6735L0931O2566L2092l2432o2500k4518L9942O2721K2526l6105
342D1739n3685j6164L3170M7741J7699k2741l8240k0936J2454L5927K9604l018
354F3550l5879l9210l459M0254M6698M505m6579n1906l396M9009N1033j521n2647
367B0452m8608L353M6972M1225m891m2697l7753r07L1361L3090O116k4556l6443
380a3286j7816J7512L8724K4383j6658m6772l2426J6417N1328L3135k1987n5618
392b3064l2456K3638N3746K7160k5597m9695k3855K0961M1607K2699j5504l6164
404a6524k4298N904L0267K9324K400k9563l7229q911L1439M2509J1092l5317m7505
$$ plain form
318 -35590 -68720 -58696 -17238 19211 23554 -5601 -40918 -52119 -24749 22673 48196 25104
330 25104 -26749 -53484 -22553 40013 72105 39673 -22827 -47345 -7403 55318 77844 41739
342 41739 -11946 -28110 5060 52801 70500 47759 9519 -11417 1037 36964 66568 63550
354 63550 27671 -11539 -14998 25256 71954 76459 29880 -22026 -25422 23587 74620 73099 20452
367 20452 -28156 -24803 22169 63394 58503 15806 -21947 -22854 8507 41597 47713 23157 -13286
380 -13286 -31102 -13590 25134 49517 32859 -13913 -46339 -29922 21406 54541 32554 -23064
392 -23064 -55520 -31882 21864 49024 23427 -26268 -50123 -29162 12445 35144 19640 -16524
404 -16524 -40822 -34918 -4651 24673 27073 -2490 -39719 -48630 -17191 25318 36410 1093 -46412
417d6412j1294L8543M8178P887l9979m7004o301L8147M1467M316l3786l6936o960
430e0134K5331L2876J1445j8764l2651j9143J1734L4495K6424r549l9413l1958
442e9307Q725M3414L4903j0901m6949l3901J4062M6261L1136j4374m2347k7293
454e6571J2776L7707K5757p412l0231k5699J040K7692K9299P147k2960l3479j1813
467d6747K4998M0357J5747k5269m1739j5284K8992M5144J6247k8915m2088j2040
479d0597K9336M0426J2721k4530l3835j1730J9773L2178J6420j1944k8898k0985
491b1665P840L0446K7059k691l2107l1777J713L5827L4908k487l8159l5104M105
504b2092L8636L2515n652l6480l0254L933L1092K7181r42k6989k7654m959K0824
$$ plain form
417 -46412 -57706 -19163 29015 36902 -3077 -50081 -56382 -18235 23232 27548 -6238 -43174 -50134
430 -50134 -24803 8073 19518 754 -31897 -51040 -39306 -4811 21613 12064 -27349 -59307
442 -59307 -50582 -7168 27735 16834 -30115 -64016 -49954 -3693 27443 13069 -29278 -56571
454 -56571 -43795 -6088 19669 12257 -17974 -43673 -42633 -14941 14358 21505 -1455 -34934 -46747
467 -46747 -21749 18608 34355 9086 -32653 -47937 -18945 26199 42446 13531 -28557 -40597
479 -40597 -11261 29165 41886 17356 -16479 -28209 -8436 23742 40162 28218 -680 -21665
491 -21665 -13825 16621 43680 40989 8882 -22895 -21182 14645 49553 47066 8907 -26197 -22092
504 -22092 16544 49059 43407 6927 -23327 -19394 11698 38879 37937 10948 -16706 -21665 -841
517h41K7906R669j8769l2296j5650J6518L4502J8199j8231l9258k0292J9358L8378
530A9193J8626j9730l9028j8955J8790L6282J6872j7568l2956j7188J2832K9207
542F377J8670p723k6732k2495K790K6714K6378R36k6214l0440l164K8792L4210
555B8099L533l0175l3892k408L1646L3236K223k8506k9861k392K6352K8280N533
568C1668k0615k6661p822J7408K7792J3350j3262k8348j6808J2401L1840K0395
580D1338j1425l2850k1526J2276L4945K2384j2296l3626k1458J2317L2334K0932
592D3345j0333k9213j9646P030K6087K0792k291k4000k3037j121K1869K6042M792
605D0316k2088k9232p203K2208L1284Q146k3868l2129q479K3282L1233P234k2549
$$ plain form
517 -841 27065 36734 17965 -14331 -29981 -13463 21039 39238 21007 -18251 -38543 -19185 19193
530 19193 37819 18089 -20939 -39894 -21104 15178 32050 14482 -18474 -35662 -22830 6377
542 6377 25047 17324 -9408 -31903 -29113 -2399 23979 24915 -1299 -31739 -34903 -6111 28099
555 28099 31632 1457 -32435 -34843 -3197 30039 32262 3756 -26105 -28497 -2145 26135 31668
568 31668 11053 -15608 -23430 -6022 21770 35120 21858 -6490 -23298 -10897 20943 41338
580 41338 29913 -2937 -24463 -12187 22758 45142 32846 -780 -22238 -9921 22413 43345
592 43345 33012 3799 -15847 -8817 17270 38062 35771 11771 -11266 -12387 9482 35524 40316
605 40316 18228 -11004 -18207 4001 35285 43431 19563 -12566 -21045 2237 33470 40704 18155
618A8155k9408q789J9861K7264Q655j6205k6403j2574J2244K5397J5272j0069
630B3400k6894j8843O866K6966K0878o831k9230k3409N764K8678K2857n809k9405
643e012k4184M656K6827K1834l953k6093k2309P46K2377K1362J134k0727k4156
656b7498n190J7815K4486P228j7831k7563j0828J6511K8557J0723j7683k9589
668c0862j2885J7014K8331J1574j6340k8277j2033J3775K5642J3011j1408k5138
680b7596j5010Q331K3552J6813n240k4112j9350L666K4357K1458k243k4146k2813
693d2333J694K4771K3927n57k3647k3629L52K3569K3637J364k0368k2112l256
706c6588K0103K2780N383j6261k2288o589J5569K3828J1111j3175k4243j1413
$$ plain form
618 18155 -11253 -20042 -181 27083 35738 19533 -6870 -19444 -7200 18197 33469 23400
630 23400 -3494 -22337 -15471 11495 32373 25542 -3688 -27097 -21333 7345 30202 24393 -5012
643 -5012 -29196 -24540 2287 24121 20168 -5925 -28234 -27488 -5111 16251 17385 -3342 -27498
656 -27498 -32688 -14873 9613 16841 -990 -28553 -39381 -22870 5687 16410 -1273 -30862
668 -30862 -43747 -26733 1598 13172 -3168 -31445 -43478 -29703 -4061 8950 -2458 -27596
680 -27596 -42606 -34275 -10723 6090 850 -23262 -42612 -38946 -14589 6869 4626 -19520 -42333
693 -42333 -40639 -15868 8059 7502 -16145 -39774 -39422 -15853 7784 9148 -11220 -33332 -36588
706 -36588 -16485 6295 11678 -4583 -26871 -33460 -17891 5937 17048 3873 -20370 -31783
718c1783J3034K6508J4745j2036k5558j3878J2496K7042J4851j0175k4597j4618
730b3969J0111K4253J5958o374k1754j5930M813K1602J8795k082j9993j9555O9
743a4056K1106K1897J756k0107k2005k413K0168K3501L633j9234k2418m350J8054
756E532K3190N821j6969k2481o558J5347K1614Q831j2896k2749j0088J1541K1547
769B1682J2575r796k2743j4195P932K3241J4879p714k3658j6377O647K2931J6059
782C1463o183k2537j7138M033K0722J7089l198k0157j7789j25J7876J8793R86
795B3835j8194k0457l302J7062K0494L781j7133k1359n854J5819K1242N849j4762
808G021k2304p937J3761K1220Q277j2601k1521j0618J1151K1513J0769j0099k0994
$$ plain form
718 -31783 -18749 7759 22504 10468 -15090 -28968 -16472 10570 25421 15246 -9351 -23969
730 -23969 -13858 10395 26353 19979 -1775 -17705 -12892 8710 27505 25423 5430 -14125 -14056
743 -14056 7050 28947 30703 10596 -11409 -13822 6346 29847 33480 14246 -8172 -12522 5532
756 5532 28722 34543 17574 -4907 -11465 3882 25496 34327 21431 -1318 -11406 135 21682
769 21682 34257 24461 1718 -12477 -4545 18696 33575 25861 2203 -14174 -7527 15404 31463
782 31463 25280 2743 -14395 -10362 10360 27449 24251 4094 -13695 -13820 4056 22849 23835
795 23835 5641 -14816 -18118 -1056 19438 23219 6086 -15273 -21127 -5308 15934 21783 7021
808 7021 -15283 -23220 -9459 11761 20038 7437 -14084 -24702 -13551 7962 18731 8632 -12362
821a2362j2444Q435K0091J3801o437k0840j4752N142K0226J6116l446k0714j6427
834b3611L040J9661J7679j728j9053j7487J202J7890J7993J211j6428j8300k539
847b0470J6400J9012M265j4739j9231n477J4163K0055O875j3065j9724p807J1865
860g878K0575R504j1303j9757j0470J0125K0270J1055q648j9625j1847P106J9481
873H588J3183o076j9379j3470M642J8526J4365l003j8371j5287J444J7530J6286
886A8978n03j7189j7187j69J6325J7312J134j5583j7744l316J5365J7882L536
899A8841j3554j8175n656J2670J8364O741j2063j8399q163J0607J9261Q593r844
912I223j9305r587Q867J8739J0029o629j9094j1547O714J7832J2310n138j7797
$$ plain form
821 -12362 -24806 -16371 3720 17521 11084 -9756 -24508 -19366 860 16976 13530 -7184 -23611
834 -23611 -20571 -910 16769 15041 -4012 -21499 -20297 -2407 15586 16797 369 -17931 -20470
847 -20470 -4070 14942 19207 4468 -14763 -20240 -6077 13978 20853 7788 -11936 -19743 -7878
860 -7878 12697 22201 10898 -8859 -19329 -9204 11066 22121 13473 -6152 -17999 -10893 8588
873 8588 21771 15695 -3684 -17154 -12512 6014 20379 17376 -995 -16282 -14838 2692 18978
886 18978 18475 1286 -15901 -16070 255 17567 18701 3118 -14626 -17942 -2577 15305 18841
899 18841 5287 -12888 -18544 -5874 12490 19231 7168 -11231 -19394 -8787 10474 19067 9223
912 9223 -10082 -19669 -10802 7937 17966 11337 -7757 -19304 -12590 5242 17552 12414 -5383
925e383j3204M136J7406J3845l063j6699j4588J635J6029J5086o64j5176j5530
938a6170p10J4558J6395K181j4528j7244k461J3180J7239M005j2516j7541n226
951a8838J2182J6760O350j0898j6981p004R416J7317Q399q638j7472r165P972
964a0600J7166J0230o898j6752j0957N853J6830J1590m670j6142j1942L203J6138
977C049J3174k329j5409j3651J092J5319J4416k43j4388j4727r73J4267J4943
990A4540K028j2948j5451k566J1991J5544M395j1429j6015n531J1011J6425N579
1003A7573r617j6032p333Q860J6314P343p746j6142q807O779J5912R539n817j6362
1017e536j0336N066J5185J1138m527j4973j2261K924J4556J2299k289j4216j3088
$$ plain form
925 -5383 -18587 -14451 2955 16800 13737 -2962 -17550 -15915 114 15200 14536 -640 -16170
938 -16170 -16880 -2322 14073 16254 1726 -15518 -17979 -4799 12440 16445 3929 -13612 -18838
951 -18838 -6656 10104 16454 5556 -11425 -18429 -9013 8304 16703 8065 -9407 -18572 -10600
964 -10600 6566 16796 9898 -6854 -17811 -11958 4872 16462 11792 -4350 -16292 -13089 3049
977 3049 16223 13894 -1515 -15166 -14074 1245 15661 15418 1030 -13697 -14670 -403 14540
990 14540 16568 3620 -11831 -14397 -2406 13138 17533 6104 -9911 -15442 -4431 11994 17573
1003 17573 7956 -8076 -15409 -6549 9765 17108 9362 -6780 -15587 -8808 7104 16643 10826 -5536
1017 -5536 -15872 -10806 4379 15517 10990 -3983 -16244 -13320 1236 13535 11246 -2970 -16058
1030a6058M53J3572J3150L66j3401j4573j092J2389J4170J499j1589j4568l664
1043a9346J1250J4157M208j0586j4673n643R551J5165N368q705j4863p358Q133
1056a3342J5178P409p375j5009p933N888J4859R165n495j4808r321M309J4033
1069b442J0490k877j4235j1367K709J4048J1871j836j2963j2012J014J2675J2431
1082G506P16j2035j2904j062J1781J3469K460j0694j3084l518J1090J4092L954
1095A1771r398j3410l990Q581J4035O225p451j4036n835O877J4328P676n930j3401
1109c958q101O109J4007R122m295j3527q896M242J3244J0095k350j2541r999J985
1123d863J2684J0908n75j1316j1218K22J1718J2189J036j0988j1794j629J0582
$$ plain form
1030 -16058 -15605 -2033 11117 11483 -1918 -16491 -17583 -5194 8976 10475 -1114 -15682 -19346
1043 -19346 -8096 6061 10269 -317 -14990 -20633 -11082 4083 9451 746 -14117 -21475 -13342
1056 -13342 1836 9245 1870 -13139 -21072 -15184 -325 8840 3345 -11463 -20784 -16475 -2442
1069 -2442 8048 5171 -9064 -20431 -17722 -3674 8197 6361 -6602 -18614 -17600 -4925 7506
1082 7506 8222 -3813 -16717 -17779 -5998 7471 9931 -763 -13847 -17365 -6275 7817 11771
1095 11771 2373 -11037 -15027 -6446 7589 13814 6363 -7673 -13508 -6631 7697 15373 9443 -3958
1109 -3958 -12059 -5950 8057 17179 12884 -643 -9539 -5297 7947 18042 15692 3151 -6848 -4863
1123 -4863 7821 18729 18154 6838 -4380 -4158 7560 19749 20785 9797 -1997 -3626 6956
1136F956J2924K279r928j2302k918Q734J2831M452q819j2860m917Q331J2660N635
1150B3058p376j2922o203O075J2578O789n486j2844q098M817J2223Q081l958j2846
1164C888r219L092J1906R326l021j2123r784J230J1392R863j178j1421j0678j35
1178f862R839J0898O49j0549j1468j781Q991J1192K618r473j1961l461Q127J1447
1192H206L829p603j2661n006P503J1530M888o415j2520n841N825J1488O218n092
1206D349j1423p525M232J1239P586l356j1366q407K368J0910R108j853j0966r788
1220a4892J000J0629R895m73j0819j0164M34R567J0120P13r506j0210j683Q412
1234f977J0280K840p945j1129l723P896J0627M404o905j1271m979O139J1748M780
$$ plain form
1136 6956 19880 22159 12231 -71 -2989 5745 18576 23028 14209 1349 -3568 4763 17423 23058
1150 23058 15682 2760 -3443 2632 15210 21999 16513 3669 -4429 388 12611 20692 16734 3888
1164 3888 -5331 -2239 9667 18993 15972 3849 -5935 -4705 6687 16550 15372 3951 -6727 -6862
1178 -6862 2977 13875 14524 3975 -7493 -9274 -283 10909 13527 4054 -7907 -11368 -3241 8206
1192 8206 12035 4432 -8229 -13235 -5732 5798 10686 4271 -8249 -14090 -8265 3223 9441 4349
1206 4349 -7074 -14599 -10367 872 8458 5102 -6264 -14671 -12303 -1393 7715 5862 -5104 -14892
1220 -14892 -13892 -3263 6632 6159 -4660 -14824 -14390 -4823 5297 6010 -3496 -13706 -15389 -6977
1234 -6977 3303 6143 -1802 -12931 -16654 -8758 1869 6273 -632 -11903 -16882 -10743 1005 5785
1248E785n693j1159n665M685J1343O327m412j1003o617L680J0686P314k933j0408
1262h070p478J797J0069Q345j031r921q706Q03R542R461K65r371r821l20R787
1277d649R455J425q268j0169j297Q081R807K353p124r641k720O454J0402M068
1291H177n996r763m774N678J0649N434m910j0402n722M928J0110O546l608j0490
1305d143o326L491R832P407k498j0070p139J990R848P537j245r202p792P40Q821
1320A251Q325L21q010q833j165Q075R576J242p528r744j946P460R920K128p168
1335C904r446k561O353R765L051n728r235m263N106R118N059m058r569n656M051
1350d109R338O309l288r542o493K926R608O749k239r147p054J349R047P665j080
$$ plain form
1248 5785 92 -11067 -16732 -12047 -704 5623 1211 -9792 -16409 -12729 -2043 5271 2338 -8070
1262 -8070 -15548 -13751 -3682 4663 3632 -6289 -14995 -14192 -4650 4811 5076 -4295 -14116 -14436 -4649
1277 -4649 4806 6231 -2037 -12206 -13503 -5422 4385 6738 -386 -10027 -12747 -6293 4109 8177
1291 8177 2181 -7582 -12356 -6678 3971 9405 4495 -5907 -11629 -6701 3409 9955 6347 -4143
1305 -4143 -10469 -6978 2854 10261 7763 -2307 -9446 -7456 2392 9929 8684 -518 -8310 -7570 1251
1320 1251 9576 9897 1887 -6946 -8111 -36 9540 10782 3254 -6490 -8436 -976 8944 11072 3904
1335 3904 -5542 -8103 -1750 8015 11066 5338 -3897 -8160 -3054 6064 11123 7065 -2504 -8160 -4109
1350 -4109 5229 11538 8250 -1292 -7785 -4859 4749 11498 9259 112 -6942 -5593 3454 11119 10039
1365A0039q336p767P94Q054Q119j4p414q114p76P058Q630J799o921q606k164O512
1381H93Q955L342o889q721l231N665R310M049n823r330l953N382Q659M272m295
1396H285q798m611K806Q910N417l079p827o446K014Q317O404j615q743o586J101
1411d451P620P410r87p983p850J29P594P457P5p072q158j021O741P563J600o772
1427A895q104j957N404P697K882n468q323l678M584Q301L621m442q528m678M059
1442f735Q837M306m123q604m636L138Q224N041k681q223n248J759P503O184j606
1457C136p262o337M94P475O772j38o966p264r7P318P242M75o397p785l44O269
1473c409P381J889n681p649k082N723P812K533m640p484k722M437P604L868l901
$$ plain form
1365 10039 1703 -6064 -5270 2784 10903 10889 3475 -4639 -5415 1643 10273 12072 5151 -3455 -5619 893
1381 893 9848 13190 6301 -2420 -5651 14 9324 13373 7550 -1780 -5733 -351 8308 12580 8285
1396 8285 -513 -5124 -2318 6592 12009 8930 1103 -5343 -3329 4988 11392 9777 1034 -5552 -4451
1411 -4451 3169 10579 9592 1609 -6241 -6112 1482 8939 9014 1942 -6216 -7237 -496 7067 8667 1895
1427 1895 -6209 -8166 -2762 4935 7817 2349 -5974 -9652 -5068 3233 6854 2412 -6116 -10794 -6735
1442 -6735 2102 6408 2285 -6319 -10955 -7817 407 5448 2767 -5456 -10704 -8945 -1442 4742 3136
1457 3136 -4126 -10463 -9969 -2494 4278 4140 -2826 -10090 -10187 -2869 4373 4848 -1549 -9334 -9678 -3409
1473 -3409 3972 5861 180 -7469 -9551 -3828 3984 6517 1877 -5607 -8329 -3892 3712 7580 3679
1488C679p383l982L302Q388M775l133p757n296L194P842N528k583p326n626K097
1503d281P331N537j050o729n734P05O199O660k48o139o961l04O297O758R83n858
1519C166p357j283N451P506J683n738p128k054M615P702K532m977p209l166M566
1534a691O764L360l592p263l839L082O736M555k269p536m806K188P154N260k021
1549F082p284n343J604P021N608j363o671n589N26O246O110l17n873o060m94N673
1565a24O446O78n466o285j425M823O876K004n526o446k272M897O529K278m210
1580B777p008k972L766O584L472l361p200m209K999P005L604k391o990m534J760
1595f698O349M796j820o514n165P05O134N399r43o172o045M20N586N961L19o202
$$ plain form
1488 3679 -3704 -7686 -4384 4004 8779 5646 -2111 -7407 -4213 3629 9157 6574 -752 -6378 -4281
1503 -4281 3050 8587 7537 808 -4926 -4221 1978 8638 8390 2251 -4710 -5014 1283 8041 9024 3166
1519 3166 -4191 -5474 -23 7483 9166 3428 -3700 -5754 -1139 6563 9095 4118 -3091 -6257 -1691
1534 -1691 5073 8433 4841 -2422 -6261 -3179 3557 8112 5843 -1693 -6499 -4311 2843 8103 6082
1549 6082 -1202 -6545 -4941 2080 7688 6325 -346 -5935 -5409 837 6947 6630 757 -5303 -5797 -124
1565 -124 6322 7000 1534 -4751 -6176 -1353 5523 7527 2001 -4445 -6717 -1820 4709 6987 2777
1580 2777 -4231 -7203 -3437 3147 6619 3258 -3942 -8151 -5152 1853 5457 3066 -3924 -8458 -6698
1595 -6698 -349 4447 2627 -3887 -9052 -8347 -2213 3186 2243 -3929 -9974 -9554 -3968 1993 2312 -3890
1611c890o267j74N597N697O14m845o238j560M738O165J967m267o379k264M191
1626f915O216K918l498o627l309M055O388L253k657o255l556K736O648M117k324
1641A190o170l995K123O133M932j251n857m140R43N602N255k16n599m782J55N808
1657A31N177Q44n299n379o26N375N836J277m667n722j372M750N671J712l813n990
1673b095k412M189O144K453l520n821k723K592O159L595k993o026l628K566N798
1688D278L843j680o205l911J314N743M520j229n918m707Q60N595M804k67m964
1703B076n452n7N510M904N1m395n453q01N030N093J546m318n574j501L976O000
1719F635J805l797n609k074L299N991K495k726n838k622K979N401L266k047n811
$$ plain form
1611 -3890 -10157 -10331 -4734 963 1577 -3268 -9506 -11066 -6328 -163 1804 -2463 -8842 -11106 -6915
1626 -6915 -699 2219 -1279 -7906 -11215 -7160 -772 2481 -176 -6431 -9987 -7251 -603 3514 1190
1641 1190 -4980 -8975 -6852 -719 4213 2962 -2895 -7035 -6092 -490 4765 4549 -1050 -5832 -5677 131
1657 131 5308 6152 853 -4526 -5152 223 6059 7336 2669 -3053 -4425 325 5996 7708 3895 -2095
1673 -2095 -4507 -318 5826 8279 4759 -1062 -3785 -1193 4966 8561 5568 -458 -4086 -1520 4278
1688 4278 8121 6441 236 -3675 -2361 3382 7902 6673 755 -3952 -3092 2503 7307 7040 2076
1703 2076 -3376 -3433 2077 6981 7032 2637 -2816 -3617 1413 6506 8052 3734 -1840 -3341 635 6635
1719 6635 8440 4643 -966 -3040 259 6250 8745 6019 181 -2441 538 5939 9205 7158 1347
1734A347l624K214N637L785j279n648m270J781N206M065p50m793m723P29M838
1749D515M141J89m596m866p36M440M758L68m289n121r13M108M837J187m130n206
1765a314j832L358N122J548l195n542j938K678N271J887k519n872k794K290N017
1780B165K955k266n180l449J741M597L693j901m899l990Q75M911L968j124m805
1795b709m417N52M378M646n73m231m608l66M326M506Q34m060n072p03L877M510
$$ plain form
1734 1347 -2277 -63 5574 9359 8080 2432 -1838 -57 5149 9214 8464 3671 -1052 -323 4515
1749 4515 8656 8845 4249 -617 -1353 3087 7845 8213 3924 -1197 -2110 1998 6835 8022 3892 -1314
1765 -1314 -3146 212 5334 6882 3687 -1855 -3793 -1115 4156 6043 3524 -2348 -5142 -2852 2165
1780 2165 5120 2854 -2326 -5775 -4034 563 4256 2355 -2544 -6534 -5659 -748 3220 2096 -2709
1795 -2709 -7126 -6574 -2196 2450 1877 -2354 -6962 -7328 -3002 1504 2338 -1722 -6794 -7497 -3620 890
$$ [...]
8191A86
##END NTUPLES=NMR FID
##END=
