##TITLE=1H_CA-8585
 DMSO-d6, 8 sc, 
 29.4.2019
##JCAMPDX= 6.0         $$ Bruker NMR JCAMP-DX V2.0
##DATA TYPE= NMR FID
##DATA CLASS= NTUPLES
##ORIGIN= UXNMR, Bruker Analytische Messtechnik GmbH
##OWNER= root
$$ XWIN-NMR		Version 3.5
$$ Mon Apr 29 14:19:08 2019 Russian Standard Time (UT+4h)  she@DPX200
##.OBSERVE FREQUENCY= 200.1315
##.OBSERVE NUCLEUS= ^1H
##.DELAY= (6, 6)
##.ACQUISITION MODE= SIMULTANEOUS
##.ACQUISITION SCHEME= undefined
##.AVERAGES= 8
##.DIGITISER RES= 18
##SPECTROMETER/DATA SYSTEM= spect
##.PULSE SEQUENCE= zg30
##.SOLVENT NAME= CDCl3
##.SHIFT REFERENCE= (INTERNAL, CDCl3, 0, 15.7039)
##AUDIT TRAIL= $$ (NUMBER, WHEN, WHO, WHERE, WHAT)
$$ ##TITLE= Audit trail, XWIN-NMR		Version 3.5
$$ ##JCAMPDX= 5.01
$$ ##ORIGIN= Bruker BioSpin GmbH
$$ ##OWNER= she
$$ F:/spectra/data/she/nmr/H-F/1/audita.txt
$$ ##AUDIT TRAIL=  $$ (NUMBER, WHEN, WHO, WHERE, WHAT)
(   1,<2019-04-29 14:17:57.73 +0400>,<she>,<DPX200>,
      <created by zg, POWCHK disabled, PULCHK disabled
       configuration hash MD5:
       00 E9 B6 7A A2 85 ED C7 34 08 36 98 17 FE 4E 26
       data hash MD5: 16K
       5D 42 51 83 E7 36 5E B7 E0 39 F6 D1 4A 97 D7 44>)
$$ ##END=
$$ 
$$ hash MD5
$$ 69 76 E9 C9 A2 A1 9A 1F A4 EC FE 46 10 32 22 B7
##$RELAX= 
##$RELAX= 
##$RELAX= 
##$RELAX= 
##$RELAX= 
##$RELAX= 
$$ Bruker specific parameters
$$ --------------------------
##$DU= <F:/spectra>
##$EXPNO= 1
##$NAME= <H-F>
##$PROCNO= 1
##$TYPE= <nmr>
##$USER= <she>
##$AMP= (0..31)
100 100 100 100 100 100 100 100 100 100 100 100 100 100 100 100 100 100 
100 100 100 100 100 100 100 100 100 100 100 100 100 100 
##$AQSEQ= 0
##$AQ_mod= 1
##$AUNM= <au_zg>
##$AUTOPOS= <>
##$BF1= 200.13
##$BF2= 200.13
##$BF3= 200.13
##$BF4= 200.13
##$BF5= 200.13
##$BF6= 200.13
##$BF7= 200.13
##$BF8= 200.13
##$BYTORDA= 1
##$CFDGTYP= 0
##$CFRGTYP= 5
##$CHEMSTR= <none>
##$CNST= (0..31)
1 1 145 1 1 1 1 1 1 1 1 1 1 1 1 1 1 1 1 1 1 1 1 1 1 1 1 1 1 1 1 1 
##$CPDPRG= <>
##$CPDPRG1= <>
##$CPDPRG2= <>
##$CPDPRG3= <>
##$CPDPRG4= <mlev>
##$CPDPRG5= <mlev>
##$CPDPRG6= <mlev>
##$CPDPRG7= <mlev>
##$CPDPRG8= <mlev>
##$CPDPRGB= <>
##$CPDPRGT= <>
##$D= (0..31)
0 1.2 0 0 0 0 0 0 0 0 0 0.03 0 0 0 0 0 0 0 0 0 0 0 0 0 0 0 0 0 0 0 0 
##$DATE= 1556533077
##$DBL= (0..7)
120 120 120 120 120 120 120 120 
##$DBP= (0..7)
150 150 150 150 150 150 150 150 
##$DBP07= 0
##$DBPNAM0= <>
##$DBPNAM1= <>
##$DBPNAM2= <>
##$DBPNAM3= <>
##$DBPNAM4= <>
##$DBPNAM5= <>
##$DBPNAM6= <>
##$DBPNAM7= <>
##$DBPOAL= (0..7)
0.5 0.5 0.5 0.5 0.5 0.5 0.5 0.5 
##$DBPOFFS= (0..7)
0 0 0 0 0 0 0 0 
##$DE= 6
##$DECBNUC= <off>
##$DECIM= 24
##$DECNUC= <off>
##$DECSTAT= 4
##$DIGMOD= 1
##$DIGTYP= 9
##$DL= (0..7)
0 120 120 120 120 120 120 120 
##$DP= (0..7)
150 150 150 150 150 150 150 150 
##$DP07= 0
##$DPNAME0= <>
##$DPNAME1= <>
##$DPNAME2= <>
##$DPNAME3= <>
##$DPNAME4= <>
##$DPNAME5= <>
##$DPNAME6= <>
##$DPNAME7= <>
##$DPOAL= (0..7)
0.5 0.5 0.5 0.5 0.5 0.5 0.5 0.5 
##$DPOFFS= (0..7)
0 0 0 0 0 0 0 0 
##$DQDMODE= 0
##$DR= 18
##$DS= 0
##$DSLIST= <SSSSSSSSSSSSSSS>
##$DSPFIRM= 0
$$ [...]
##$SUBNAM2= <"">
##$SUBNAM3= <"">
##$SUBNAM4= <"">
##$SUBNAM5= <"">
##$SUBNAM6= <"">
##$SUBNAM7= <"">
##$SUBNAM8= <"">
##$SUBNAM9= <"">
##$SW= 24.9337058887773
##$SWIBOX= (0..15)
0 0 2 0 0 0 0 0 0 0 0 0 0 0 0 0 
##$SW_h= 4990.01996007984
##$TD= 16384
##$TD0= 1
##$TE= 0
##$TE2= 300
##$TE3= 300
##$TEG= 300
##$TL= (0..7)
0 120 120 120 120 120 120 120 
##$TP= (0..7)
150 150 150 150 150 150 150 150 
##$TP07= 0
##$TPNAME0= <>
##$TPNAME1= <>
##$TPNAME2= <>
##$TPNAME3= <>
##$TPNAME4= <>
##$TPNAME5= <>
##$TPNAME6= <>
##$TPNAME7= <>
##$TPOAL= (0..7)
0.5 0.5 0.5 0.5 0.5 0.5 0.5 0.5 
##$TPOFFS= (0..7)
0 0 0 0 0 0 0 0 
##$TUNHIN= 0
##$TUNHOUT= 0
##$TUNXOUT= 0
##$USERA1= <user>
##$USERA2= <user>
##$USERA3= <user>
##$USERA4= <user>
##$USERA5= <user>
##$V9= 5
##$VALIST= <valist>
##$VCLIST= <CCCCCCCCCCCCCCC>
##$VD= 0
##$VDLIST= <DDDDDDDDDDDDDDD>
##$VPLIST= <PPPPPPPPPPPPPPP>
##$VTLIST= <TTTTTTTTTTTTTTT>
##$WBST= 1024
##$WBSW= 4
##$XGAIN= (0..3)
0 0 0 0 
##$XL= 0
##$YL= 0
##$YMAX_a= 437074
##$YMIN_a= -566125
##$ZGOPTNS= <>
##$ZL1= 120
##$ZL2= 120
##$ZL3= 120
##$ZL4= 120
##$ABSF1= 10
##$ABSF2= 0
##$ABSG= 5
##$ABSL= 3
##$ALPHA= 0
##$AQORDER= 0
##$ASSFAC= 0
##$ASSFACI= 0
##$ASSFACX= 0
##$ASSWID= 0
##$AUNMP= <proc_1d>
##$AZFE= 0.1
##$AZFW= 0.1
##$BCFW= 1
##$BC_mod= 2
##$BYTORDP= 1
##$COROFFS= 0
##$CY= 11.3945322036743
##$DATMOD= 1
##$DC= 2
##$DFILT= <>
##$DTYPP= 0
##$F1P= 18.9103706918063
##$F2P= -1.10871071338519
##$FCOR= 0.5
##$FTSIZE= 0
##$FT_mod= 4
##$GAMMA= 1
##$GB= 0.15
##$INTBC= 1
##$INTSCL= 1
##$ISEN= 128
##$LB= 0.24
##$LEV0= 0
##$LPBIN= 0
##$MAXI= 10000
##$MC2= 0
##$MEAN= 0
##$ME_mod= 0
##$MI= 1.114404
##$NCOEF= 0
##$NC_proc= 0
##$NLEV= 6
##$NOISF1= 3.799351
##$NOISF2= 2.8
##$NSP= 1
##$NTH_PI= 0
##$NZP= 0
##$OFFSET= 15.70392
##$PC= 1
##$PHC0= -8860.331
##$PHC1= 21.80026
##$PH_mod= 1
##$PKNL= yes
##$PPARMOD= 0
##$PSCAL= 0
##$PSIGN= 0
##$REVERSE= no
##$SF= 200.130013532006
##$SI= 16384
##$SIGF1= 3
##$SIGF2= 2
##$SINO= 400
##$SIOLD= 16384
##$SREGLST= <1H.CDCl3>
##$SSB= 0
##$STSI= 0
##$STSR= 0
##$SW_p= 3612.71676300578
##$SYMM= 0
##$S_DEV= 0
##$TDeff= 0
##$TDoff= 0
##$TI= <>
##$TILT= no
##$TM1= 0
##$TM2= 0
##$TOPLEV= 0
##$USERP1= <user>
##$USERP2= <user>
##$USERP3= <user>
##$USERP4= <user>
##$USERP5= <user>
##$WDW= 1
##$XDIM= 8192
##$YMAX_p= 0
##$YMIN_p= 0
$$ End of Bruker specific parameters
$$ ---------------------------------
##NTUPLES= NMR FID
##VAR_NAME=  TIME,          FID/REAL,        FID/IMAG
##SYMBOL=    X,             R,               I
##VAR_TYPE=  INDEPENDENT,   DEPENDENT,       DEPENDENT
##VAR_FORM=  AFFN,          ASDF,            ASDF
##VAR_DIM=   8192,          8192,            8192
##UNITS=     SECONDS,       ARBITRARY UNITS, ARBITRARY UNITS
##FACTOR=    0.0002004,     1,               1
##FIRST=     0,             0,               0
##LAST=      1.6414764,     0,               0
##MIN=       0,             -566125,         0
##MAX=       1.6414764,     437074,          0
$$ Real data points
##PAGE= N=1
##DATA TABLE= (X++(R..R)), XYDATA
0 0 0 0 0 -5 8 -8 8 -16 16 -16 24 -32 40 -48 57 -72 88 -104 121 -145 168 -195 228 -261 301 -346 392 -448
28 -448 509 -573 646 -727 813 -910 1016 -1133 1261 -1400 1553 -1723 1907 -2112 2338 -2588
44 -2588 2867 -3182 3536 -3937 4399 -4934 5565 -6323 7248 -8414 9937 -12012 15030 -19846
58 -19846 28774 -50975 223919 198946 -377385 -373795 -21526 388066 374880 94469 -196480
69 -196480 -210986 -50016 150572 204038 112385 -83462 -200923 -140767 84348 240256 164036
80 164036 -100757 -273311 -183677 85645 256978 186264 -46027 -217784 -207642 -43142 130457
91 130457 186384 76973 -110541 -224868 -161150 22856 155334 107156 -70244 -202838 -160373
102 -160373 12915 149228 113060 -65878 -215472 -176312 33600 214682 173005 -67292
112 -67292 -268322 -221202 25353 215675 166334 -49330 -208810 -184132 -39047 82719 100306
123 100306 27461 -74621 -132817 -92565 27694 120182 81747 -55948 -137945 -58795 103595
134 103595 172208 74315 -78315 -129094 -41585 87638 149463 110014 3416 -98712 -116309
145 -116309 -17320 123575 169137 60651 -93223 -126305 -7403 120486 118601 11914 -63239
156 -63239 -34591 38540 69041 46765 11621 -18385 -43485 -39377 18486 87537 75696 -34841
168 -34841 -136440 -109463 20769 110425 69455 -40246 -96149 -63363 -4047 28130 36600 34954
180 34954 9008 -38919 -56796 -2566 75026 75995 -17063 -96125 -57050 62210 118083 38444
192 38444 -90179 -125666 -34858 79391 103223 26205 -65722 -89944 -35481 37792 65922 34977
204 34977 -14917 -34846 -15600 12047 18875 8329 197 -2798 -10210 -15955 -3804 18963 14708
217 14708 -28874 -64580 -35420 37422 69363 16419 -59737 -68112 -5772 50078 46499 13862
229 13862 2792 6080 -7652 -22688 2613 56928 65089 -2330 -67811 -39994 50853 81617
241 81617 2070 -87202 -66306 39702 92556 28583 -64753 -71777 273 51064 31196 -7886
253 -7886 -7522 12255 4171 -25088 -23331 17108 43500 15623 -32547 -42667 -9613 17594 7270
266 7270 -17551 -24180 -13390 -3396 406 3784 1181 -15904 -30617 -14405 28014 48418 16653
279 16653 -35846 -49239 -8494 37420 40117 4125 -28923 -33007 -15393 2796 10753 2551 -18032
292 -18032 -31800 -20174 8836 20687 -4462 -35737 -29907 10793 37017 18262 -16359 -21214
304 -21214 1798 15021 4073 -5308 7789 21819 8048 -21709 -28140 -605 26510 21032 -4287
317 -4287 -16403 -6704 6669 12006 14909 15944 7382 -5202 1595 30421 45216 15617 -27459
330 -27459 -25678 27679 65445 33768 -29928 -46398 -365 41278 25183 -17930 -25084 6519
342 6519 21467 -3436 -25702 -6208 27209 23032 -13002 -25797 5727 33974 14293 -25547
354 -25547 -27825 9818 30987 5044 -29300 -25393 1970 5648 -19146 -29393 -3504 19246 -918
367 -918 -40855 -42951 1125 35533 16421 -28803 -39156 -4588 28664 19415 -13712 -28479 -9481
380 -9481 14593 17727 -1104 -19626 -21306 -7787 7308 9188 -3480 -14583 -9877 3724 7803
393 7803 -3348 -9513 4779 24747 20000 -5773 -17724 4356 32838 27947 -3529 -17371 3287
406 3287 26837 17705 -9525 -15229 6021 18894 5580 -8486 907 16869 8382 -14354 -11465
419 -11465 23050 42617 14954 -25599 -22019 23388 47563 16655 -25779 -20937 20150 35934
431 35934 2815 -32062 -20515 15342 22319 -6860 -27599 -13103 10603 6844 -15255 -20637 -1965
444 -1965 12029 1498 -14483 -13705 -3272 -2816 -10608 -8957 1479 -801 -20509 -31605 -15338 7327
458 7327 2635 -25279 -36865 -14762 10278 5171 -21609 -30888 -9625 13553 11460 -6398 -13092
471 -13092 -3016 6023 4978 1805 4711 6902 1880 -3211 999 7922 5160 -3335 -3263 8456 13353
486 13353 3432 -7809 -1537 14653 18670 5894 -2673 6209 19631 17886 3937 -943 8131 16976
500 16976 13389 5933 5189 5765 179 -4200 4371 16811 12118 -8740 -17311 2975 25362 16619
514 16619 -13037 -19944 9477 34514 18708 -17177 -21989 10911 33254 13118 -20484 -18863 11980
527 11980 23836 -3136 -30265 -18656 12472 16620 -11129 -30134 -14618 8202 4700 -16273
539 -16273 -19750 -433 9590 -4926 -20203 -11162 8213 7494 -13213 -21441 -2783 15359 4491
552 4491 -21189 -25677 -1991 17523 7588 -15489 -19308 -870 14116 8073 -5363 -6905 4464
565 4464 13541 11948 5453 158 531 6121 12819 14050 4915 -5876 -4182 8271 13417 1323 -13260
580 -13260 -9717 8773 15517 -412 -18195 -13040 7434 14592 1292 -11913 -5685 7018 6101
593 6101 -5401 -7584 2386 6992 -3129 -11526 -3399 8505 2147 -16119 -18174 2884 17519 2508
607 2508 -21709 -19434 7212 21178 2098 -19800 -11090 15005 21451 -2539 -19841 -7177 15860
620 15860 15465 -6306 -16431 -3153 9306 1299 -13585 -12580 1775 5562 -6697 -14493 -5332
633 -5332 5970 -179 -12904 -9099 8786 14390 -1719 -15767 -5894 14660 16442 -2817 -13798
646 -13798 -40 17678 12737 -7668 -13879 2031 17235 11518 -3985 -7406 3883 12197 7637
659 7637 292 2087 8588 10019 6831 5862 6289 4436 1854 4375 11239 10469 157 -7868 -2019 9073
675 9073 8619 -3513 -9464 -564 9172 5756 -5714 -7989 1673 8424 4346 -660 2184 6325 1634
690 1634 -4505 452 12483 11353 -4433 -12969 -483 16402 9477 -14068 -21088 1617 21669
703 21669 9527 -20133 -25515 838 20729 7323 -18887 -20772 2633 15710 -508 -20793
715 -20793 -16473 2936 7573 -7984 -18885 -10876 -321 -5850 -18059 -15393 -1509 1788 -11851
728 -11851 -21746 -10629 5308 2889 -13588 -17964 -765 13808 5573 -13146 -15337 2847 15109
741 15109 6675 -7950 -7567 4096 9097 2279 -4339 -1203 5483 5997 2401 1985 4519 3330 873
756 873 4019 10639 11254 4045 -659 5038 12803 10027 0 -1080 8618 14776 6360 -5564 -3663
771 -3663 7703 12082 2929 -4803 468 8943 7128 -1851 -2925 6200 10902 3799 -2549 2610 10606
786 10606 6350 -5212 -5458 7917 15112 2526 -13100 -9980 8043 12229 -4971 -18528 -8311
799 -8311 10821 9872 -10747 -21879 -7315 11381 7520 -11357 -17196 -2475 8878 714 -12863
812 -12863 -11018 2503 4902 -5922 -12334 -4459 3701 -2474 -12978 -9517 5208 9311 -5289 -17160
826 -17160 -7462 11144 12219 -4538 -13964 -1956 14728 12406 -4198 -10981 854 13263 9959
839 9959 -2140 -5651 1033 6387 3192 -935 -157 1709 905 -806 2167 4280 849 -4381 -1953
854 -1953 7114 9303 1064 -7444 -3160 7730 9172 -718 -7033 -1114 6451 4159 -4188 -5538 917
869 917 4013 -1252 -4763 -394 4232 74 -7392 -4647 6283 8872 -2079 -11014 -3211 10461 8914
884 8914 -6751 -13475 -323 13672 6567 -11925 -15727 728 12628 2746 -13786 -12748 4154
897 4154 10742 -1674 -13531 -7304 7225 8480 -3897 -9465 -161 8108 2198 -7439 -4454 6711
911 6711 7993 -3715 -10662 -892 10434 5426 -8237 -10481 3395 12656 3147 -10928 -8662 6689
925 6689 13009 2502 -9024 -4259 8013 10479 640 -5744 -346 6332 5513 -487 -1584 1377 1809
940 1809 -873 -600 3199 3547 -1993 -5396 153 6731 4455 -3965 -6108 2361 9146 4013 -5397 -5257
956 -5257 3503 7500 1026 -4871 -2263 3449 2080 -3474 -4167 1685 2743 -3122 -7262 -694 6431
971 6431 1795 -8230 -8151 4807 10768 655 -11955 -8147 8134 12699 -2053 -14108 -5707 10355
985 10355 10816 -4912 -13383 -2769 10191 6745 -7056 -10138 1569 8758 1216 -8191 -3813 6345
999 6345 6445 -3448 -7327 1918 9268 3043 -8080 -5608 6627 9871 -1604 -10875 -3877 8835
1013 8835 8680 -4781 -11148 -1222 10110 6254 -5986 -8353 1630 8895 3968 -4289 -3469 3291 4937
1028 4937 614 -1758 867 2668 357 -2259 307 3663 846 -4518 -4395 2673 5415 -1416 -7144
1043 -7144 -4005 4525 5338 -3112 -7322 -2423 4950 3128 -4113 -5579 264 3593 -1162 -5144 -2009
1058 -2009 2407 -29 -5933 -4911 2998 4128 -4215 -9781 -2674 7753 5668 -7012 -10903 1096
1072 1096 11015 5415 -8505 -9797 3949 12145 3075 -9588 -7045 6163 10191 -956 -9078 -3004
1086 -3004 7253 5870 -4235 -6876 2308 7615 647 -6797 -2588 7041 6975 -3190 -7432 1757 10518
1101 10518 5233 -6742 -7009 4811 11626 2890 -8133 -5425 6315 9896 709 -6998 -2207 6648
1115 6648 7244 -430 -3919 918 5732 3171 -1013 220 3796 2785 -837 -968 3311 4736 -721
1130 -721 -4463 -141 5512 3640 -4086 -5936 661 5756 1555 -5718 -5611 1831 4415 -1041 -5824
1145 -5824 -2642 2656 1044 -3732 -3857 1293 2407 -3026 -5689 -686 4585 1115 -7006 -6417 3104
1160 3104 7302 -924 -9858 -5489 6196 8107 -3117 -10287 -3117 8487 6847 -4972 -9697 -380
1174 -380 8495 4014 -6492 -6784 3040 6782 -720 -7292 -2880 5428 3500 -5066 -6377 1560 6574
1189 6574 240 -7900 -4452 6090 7701 -2601 -9288 -2166 8373 6506 -4491 -8560 397 8455
1203 8455 4226 -5395 -6264 2238 7036 1248 -4565 -2800 2867 3492 -995 -2448 495 2423 -91
1218 -91 -2538 478 3657 1249 -3828 -3616 2822 4826 -723 -5970 -2991 3814 4330 -2948 -5830 -1276
1234 -1276 4471 2249 -3695 -3745 1193 3544 -590 -3303 135 4133 1511 -3702 -2079 4445 5908
1249 5908 -936 -5860 70 8034 5985 -3917 -6826 2486 10273 5251 -6084 -5902 4696 10172 2422
1264 2422 -6431 -3883 5968 7996 -509 -6058 -428 6647 4197 -3496 -4203 3168 5993 104 -5827
1279 -5827 -1163 6019 4651 -3941 -6725 1222 7766 2395 -6771 -5878 4295 7498 -41 -8024 -4116
1294 -4116 4864 5886 -2434 -7602 -1966 4680 3110 -4366 -5486 -88 3219 -868 -4553 -2729 1515
1309 1515 439 -3848 -3946 580 2059 -2634 -6054 -2722 2941 1440 -4829 -6537 -818 3536 -214
1324 -214 -5974 -5339 753 2962 -1541 -5144 -2103 1544 822 -3184 -2687 1280 2249 -1706 -4166 650
1340 650 4277 1291 -4623 -3692 4225 7275 396 -6938 -2877 7020 7709 -1802 -7115 -648 8250 6592
1356 6592 -3566 -5950 2032 8578 3849 -4260 -3343 4142 6729 233 -4559 520 6868 4512 -3188
1371 -3188 -3583 3786 7849 1488 -5198 -1647 6796 7232 -1705 -6563 71 7630 5628 -3498 -6149
1386 -6149 1343 7137 2574 -4994 -4190 3273 5339 -289 -4601 -1497 2671 1804 -2333 -2786 1261 2463
1402 2463 -1670 -4169 -573 2786 818 -4548 -4033 1381 3514 -1683 -6167 -3376 2636 2692 -2748 -5845
1418 -5845 -1421 3338 1111 -3618 -3794 1198 2974 -756 -3763 -883 2975 1035 -3416 -2680 2563
1433 2563 3740 -1633 -5329 -1042 4813 3366 -3450 -5939 1235 6681 2227 -5401 -5153 3398 7316
1448 7316 601 -5910 -3020 5019 5448 -1544 -5065 131 5906 2782 -3574 -3557 3023 4837 -1012 -5178
1464 -5178 -630 5661 3447 -4225 -5661 2182 7049 1541 -6324 -4725 4410 6888 -764 -7154 -2776
1479 -2776 5249 5090 -2341 -5974 -1125 4638 2291 -3383 -3436 1300 3485 -261 -3432 -706 2863 1032
1495 1032 -2567 -2339 2283 3388 -1230 -4196 -909 3770 2767 -2548 -4144 789 4053 1006 -3846
1510 -3846 -2925 2347 3542 -574 -3472 -142 2934 1106 -2378 -1540 2500 2964 -1137 -3627 464 4318
1526 4318 1954 -4073 -3702 2813 5580 40 -6246 -2489 4737 5238 -1878 -6436 -735 5909 4171
1541 4171 -3810 -5341 1531 5961 1705 -4527 -3177 3355 4558 -1231 -4702 -181 4563 1926 -4027
1556 -4027 -3988 2363 4710 -613 -5717 -1943 4950 4401 -3099 -6374 -129 6315 2920 -4660 -5042 1577
1572 1577 5557 1039 -4984 -3201 3100 4241 -1225 -4283 -776 3005 1656 -2249 -2156 1665 2695
1587 2695 -1042 -3150 -2 3678 1801 -2888 -2801 2290 4257 -105 -4144 -1716 3319 3743 -1448 -3981
1603 -3981 -113 3273 1709 -2477 -2526 1404 2664 -435 -2809 36 2789 1114 -2772 -1774 2504 3373
1619 3373 -1440 -4473 -578 4866 3288 -3650 -5154 899 5674 1548 -5268 -4288 2628 5299 -314
1634 -314 -5407 -2662 3745 3523 -2687 -4659 205 4261 1360 -4167 -2938 2767 3412 -1788 -5108 -865
1650 -865 4438 1928 -4343 -4958 1254 5334 628 -5757 -4037 3256 5064 -1375 -6020 -1911 4564
1665 4564 3601 -2713 -4681 196 4397 1323 -2955 -2359 1827 2975 -930 -2772 82 3005 1030
1680 1030 -3020 -2176 2533 2883 -717 -3295 -435 4417 2839 -1994 -3304 1408 4610 1527 -3063
1695 -3063 -1840 2601 3819 -281 -2696 85 2959 2031 -2053 -1578 2304 2621 -835 -2433 663 3770
1711 3770 1848 -3090 -2607 2882 4800 545 -4576 -1804 4445 4191 -2037 -4969 -226 4787 3013
1726 3013 -3435 -4543 1391 4923 692 -4162 -2289 2900 3326 -1662 -3905 -134 3950 1075 -3873
1741 -3873 -3132 2445 4054 -1400 -5586 -1852 4068 3005 -3315 -6010 -510 4672 1451 -4367 -4673
1756 -4673 1473 4293 14 -4910 -2702 2232 2897 -1826 -3907 -564 3075 440 -3200 -1993 1541
1771 1541 2091 -1687 -3417 -115 3035 946 -3628 -2971 2048 3781 -376 -3810 -1371 3701 3145 -1514
1787 -1514 -3470 650 3657 1415 -2233 -1921 2098 2542 -489 -2023 -39 2660 879 -2574 -1898 2392
1803 2392 3552 -872 -3379 -354 4221 2746 -2545 -3664 1254 5008 1120 -3741 -2945 2604 4276
1818 4276 -411 -4507 -1434 3467 2674 -2490 -3857 715 3672 620 -3455 -2009 2974 3054 -1735 -4056
1834 -4056 -36 4469 1939 -3347 -3696 2297 4998 488 -5064 -2488 3384 4391 -1365 -5002 -1353
1849 -1353 4101 2914 -2744 -3214 785 4024 911 -2996 -1499 2157 3052 -896 -2232 951 3554
1864 3554 1243 -2417 -1273 2869 3123 -764 -3205 -128 3973 2296 -2258 -2726 1899 3871 1016
1879 1016 -2760 -1433 2546 3141 -564 -2323 -74 2873 1068 -2532 -1602 1481 1784 -1533 -3397 -404
1895 -404 2594 638 -3823 -3209 1607 2926 -584 -4442 -2493 2905 2680 -2482 -4647 -874 3366 1221
1911 1221 -3498 -3851 782 3070 -318 -4255 -2318 2203 1884 -2459 -4048 -158 3002 455 -3827
1926 -3827 -2713 2502 3189 -1259 -4491 -730 4493 2999 -2642 -3956 879 4502 1053 -3779 -3049
1941 -3049 2453 3958 -440 -4075 -1193 3092 2762 -1520 -2780 1241 3615 1111 -2238 -630 3037
1956 3037 2891 -961 -2105 1285 4118 1988 -2451 -2139 2266 4145 -5 -3291 -844 3287 2904 -1121
1972 -1121 -2593 209 3423 1261 -1983 -1553 1942 2413 -602 -2061 499 2589 674 -2220 -1518 2196
1988 2196 2628 -1124 -3559 -481 3190 1830 -3013 -3264 682 3843 477 -3838 -2545 2412 3435
2003 3435 -739 -3896 -1124 3219 2067 -2312 -3408 959 3493 171 -3733 -2058 2235 2570 -2069
2018 -2069 -3737 185 3071 1181 -3459 -3292 1817 3606 -394 -4792 -2401 2890 3126 -1881 -4159
2033 -4159 -249 3359 1624 -2849 -3022 613 3010 -280 -3138 -1144 2221 1824 -1756 -2414 932 3197
2049 3197 183 -2674 -1178 2642 2857 -1167 -3208 297 3525 2067 -2600 -2601 1688 3480 504 -3135
2065 -3135 -1018 2217 2608 -1165 -2739 64 2777 1351 -1947 -1606 1918 2537 -703 -2381 316 3031
2081 3031 1572 -2441 -2438 1868 3084 -5 -3522 -1495 2584 2892 -1953 -3779 52 3137 1182 -2610
2097 -2610 -2480 1535 2913 142 -3201 -1260 2729 1897 -1980 -2573 871 3011 179 -3455 -1679 2598
2113 2598 2552 -1742 -4080 -364 3585 1884 -3102 -3476 1257 3865 697 -3361 -2589 2406 3500 -695
2129 -695 -3465 -827 3148 2190 -2115 -2831 1231 3026 424 -3011 -1177 2136 2234 -1332 -2628 818
2145 818 3094 799 -2673 -1781 2000 2937 -455 -2684 -433 2743 2256 -1501 -2786 454 2542 554
2161 554 -2082 -1233 1433 1447 -1060 -1935 525 2493 282 -2396 -1097 1958 2374 -1252 -2893 -388
2177 -388 3035 1487 -2640 -3223 1202 3489 49 -3690 -2237 1972 2702 -1336 -3545 -709 3076 1812
2193 1812 -2057 -2898 901 3000 -131 -3008 -1532 2350 2271 -1556 -2888 370 3221 1184 -3364 -2623
2209 -2623 2095 3352 -135 -3472 -1291 2942 2577 -1481 -3248 530 3288 1378 -2128 -1983 1314
2224 1314 2311 -460 -2284 -438 2094 1342 -1975 -1874 934 2216 -426 -3184 -909 2357 1819 -1981
2240 -1981 -2879 353 3097 1339 -2824 -2122 1573 3074 -39 -3220 -1485 2352 2125 -1422 -2731 204
2256 204 2645 491 -2387 -1583 1535 1916 -649 -2581 -110 2112 1310 -2289 -1816 1391 2654 -444
2272 -444 -3167 -991 2052 2113 -1273 -2571 391 2590 911 -2400 -1770 1593 2268 -427 -2360 -295
2288 -295 2788 1639 -1943 -1755 1401 3145 16 -2962 -1167 3025 2944 -1331 -2847 603 3941 1764
2304 1764 -2586 -2635 1839 4015 625 -3327 -1766 2588 2731 -1066 -3062 -256 2836 1722 -1610 -2592
2320 -2592 1352 2612 157 -2439 -1165 1901 1799 -1540 -2363 407 2397 409 -1998 -1843 1652 2257
2336 2257 -467 -2381 -220 2406 1208 -1436 -1811 793 2093 -266 -2220 -714 1772 1149 -1661
2351 -1661 -2142 819 2052 -172 -2566 -1332 2183 1770 -1279 -2981 36 2681 1020 -2664 -2722 1374
2367 1374 3268 63 -3284 -2139 2147 2654 -887 -3133 -629 2616 2070 -1879 -2431 661 2713 351
2383 351 -2588 -1129 1953 2047 -1167 -2456 312 2698 944 -2112 -1487 1481 2258 -513 -2745 -626
2399 -626 2268 1700 -1776 -2228 341 2097 376 -2374 -1277 1638 1749 -1115 -2429 291 2391 830
2415 830 -2260 -1736 1820 2580 -617 -2770 -231 2681 2039 -1663 -2753 676 2896 1079 -2671 -2276
2431 -2276 1796 3190 41 -2802 -805 2492 2109 -1113 -2290 304 2259 969 -1661 -1162 1153
2446 1153 1322 -653 -2022 -9 1745 670 -1603 -1623 1095 1974 -638 -2332 -440 1966 1383 -1579
2462 -1579 -2074 790 2167 -9 -2347 -922 1817 1563 -1101 -2058 528 2221 909 -2237 -2039 1765
2478 1765 2629 -639 -2842 -982 2868 2047 -2110 -3061 183 2978 1306 -2327 -2827 1087 3268 191
2494 191 -3363 -1667 1682 2325 -997 -2883 -629 2103 1517 -1862 -1964 556 2056 14 -1761 -501
2510 -501 1269 953 -1393 -1492 631 2186 31 -1393 -864 1853 1306 -953 -2115 377 2045 290
2526 290 -1794 -1418 1400 1736 -784 -2336 -217 2035 1402 -2050 -2001 440 2478 326 -2604 -1529
2542 -1529 1925 1953 -1493 -2992 -461 2740 1388 -2119 -2474 954 2835 792 -2456 -1406 1773 2489
2558 2489 -421 -2371 -422 2182 1522 -967 -1703 793 2068 239 -1369 -470 1872 1141 -1039 -1454
2574 -1454 477 2115 -66 -1644 -809 1508 1667 -793 -2032 155 2413 787 -1636 -1519 1420 2222
2590 2222 -349 -2582 -748 1902 1316 -1470 -2441 368 2529 566 -2284 -1913 1767 2380 -505 -3224
2606 -3224 -1035 2535 1933 -1701 -2846 261 2733 917 -2220 -2029 784 2140 34 -2385 -1301
2621 -1301 1162 1454 -912 -2069 225 1217 554 -1573 -879 826 925 -849 -1131 243 1397 333 -1962
2638 -1962 -1125 1569 1313 -1052 -1940 83 2307 1138 -1588 -1266 1525 2307 -188 -2513 -887 2153
2654 2153 1600 -1230 -2234 362 2440 1017 -1918 -2052 1617 2364 -180 -2603 -1270 1979 2121 -1129
2670 -1129 -2772 -222 2841 1377 -1754 -2108 942 2473 464 -2149 -1297 1523 1521 -500 -1848 -121
2686 -121 1691 956 -1362 -938 817 1297 -755 -1183 72 1312 602 -1448 -1003 1499 1646 -307 -2026
2703 -2026 -241 1749 1356 -1502 -2156 654 2417 263 -2354 -1612 1640 2295 -562 -2510 -400 2124
2719 2124 1670 -2082 -1753 791 2435 -23 -2414 -1629 1517 2307 -733 -2286 -288 2189 1329 -1621
2735 -1621 -2024 451 1982 434 -2206 -1149 1185 1634 -422 -1624 -226 1572 903 -870 -776 837
2751 837 1320 -366 -1294 1 1464 204 -1217 -1357 1052 1705 -477 -1842 -587 2114 1459 -1424
2767 -1424 -2066 464 2272 877 -1947 -1460 1516 2540 -424 -2690 -682 2155 1690 -1230 -2218 675
2783 675 2385 643 -1863 -1603 1245 2162 -237 -2206 -775 1960 1192 -1135 -1669 -26 2116 672
2799 672 -1864 -1413 680 2090 -226 -1759 -593 1388 774 -923 -1204 387 1102 -76 -1410 -148
2815 -148 1280 674 -988 -1326 1125 1722 -71 -1892 -636 1567 1541 -1131 -2122 146 2430 1027 -1858
2832 -1858 -2053 993 2198 -42 -2711 -1218 1472 1968 -721 -2109 -325 2211 855 -1955 -1652 979
2848 979 2407 367 -2102 -790 1641 1805 -706 -2163 371 2166 964 -1115 -1294 1066 1550 -117
2864 -117 -1429 -589 1193 1115 -853 -1144 321 1043 100 -1406 -579 1030 998 -846 -1509 801 1688 332
2882 332 -1915 -1129 1448 1621 -736 -2140 -180 2088 1502 -1710 -1914 567 2248 456 -1901 -1036
2898 -1036 1462 1682 -347 -2270 -513 1811 1412 -1483 -1752 592 1841 644 -1639 -1097 1283 1659
2914 1659 -570 -1796 -184 1537 459 -1330 -1583 547 1519 57 -1438 -581 1324 1191 -931 -1244
2930 -1244 36 1541 -160 -1146 -569 1105 1404 -980 -1663 437 1383 440 -1541 -928 1254 1814 -698
2947 -698 -2072 -500 1741 1574 -1431 -2259 276 2103 591 -2114 -1752 1520 1815 -355 -2150 -795
2963 -795 1672 1433 -1209 -2342 219 1726 284 -1392 -1161 1053 1527 -587 -1871 -341 1774 883
2979 883 -936 -1246 456 1919 221 -1431 -722 1173 1183 -224 -1480 45 1344 436 -1244 -709 721
2996 721 1114 -657 -1680 -122 1475 710 -1498 -1137 967 1823 -220 -1836 -459 1585 1230 -723
3012 -723 -1749 83 1765 859 -1451 -1733 834 1865 129 -1674 -868 1463 1698 -678 -1934 213
3028 213 1759 849 -1359 -883 1136 1765 99 -1365 -418 1366 1202 -882 -1408 541 1412 362 -1419
3045 -1419 -1023 1017 1372 -344 -1684 -252 1220 860 -999 -1055 558 1328 -18 -1246 -113 1545
3061 1545 929 -1229 -1414 411 1777 418 -1727 -631 1172 1592 -765 -1963 -416 1879 908 -1409
3077 -1409 -1493 232 1679 445 -1632 -1065 1230 1481 -383 -2090 -475 1460 859 -1099 -1100 591 1593
3094 1593 411 -1378 -461 1324 986 -719 -1505 65 1360 412 -1445 -1123 1052 1476 -618 -1736
3110 -1736 -324 1271 877 -794 -1101 602 1576 71 -1226 -411 1013 1450 -684 -1662 361 1807
3126 1807 469 -1435 -1013 1305 1836 -286 -1957 -678 1866 1221 -1110 -1903 604 1930 656 -1861
3142 -1861 -1217 889 1753 -261 -1611 -324 1389 1247 -985 -1416 91 1526 165 -1636 -807 1210
3158 1210 1367 -864 -1270 76 1466 626 -1428 -1236 606 1808 -190 -1386 -117 1314 792 -730
3174 -730 -1176 373 1550 57 -1437 -903 1030 1258 -724 -1739 86 1615 670 -1189 -1162 835 1630
3191 1630 -22 -1642 -868 1451 1615 -635 -1904 3 1484 814 -1427 -1714 717 1519 -116 -1713
3207 -1713 -334 1215 1333 -786 -1459 53 1248 471 -1219 -892 1010 1234 -524 -1521 -271 1600
3223 1600 628 -1351 -1173 499 1349 -94 -1653 -655 1129 1193 -892 -1558 -141 1335 382 -1288 -829
3240 -829 1050 1303 -349 -1302 59 1278 849 -982 -1285 592 1604 117 -1713 -793 1206 1437 -631
3257 -631 -1433 -145 1542 944 -1098 -1529 406 1671 -10 -1566 -1123 886 1307 -481 -1402 99 1063
3274 1063 760 -901 -867 544 1357 -258 -1355 -522 1235 709 -824 -1288 470 1231 169 -1351 -976
3291 -976 1304 1481 -338 -1501 -248 1656 629 -1109 -1172 580 1374 -157 -1339 -477 1243 885 -882
3308 -882 -1694 -93 1713 641 -1299 -931 890 1159 -192 -1485 -385 1265 1079 -954 -1512 404
3324 404 1555 195 -1477 -679 838 1309 -440 -1233 -176 1288 661 -1132 -1147 839 995 -48 -1216
3341 -1216 -520 909 726 -594 -1347 319 1307 371 -1194 -805 790 1414 -330 -1481 -63 1311 823
3358 823 -947 -1138 380 1170 221 -1332 -436 956 1266 -625 -1191 -19 1205 845 -1265 -1304 548
3375 548 1563 -161 -1563 -664 1142 1223 -790 -1493 193 1544 715 -1248 -723 677 1075 -397 -1410
3392 -1410 -265 1109 681 -996 -1051 527 1027 0 -1042 -496 801 1015 -653 -1436 -8 1151 347
3409 347 -1217 -818 897 1397 -128 -1506 -174 1014 954 -843 -1342 581 1212 236 -1151 -1032 849
3426 849 1146 -391 -1681 -161 1244 499 -791 -871 537 1260 -12 -1248 -394 1278 1418 -331 -941
3443 -941 219 1212 524 -1343 -1140 828 1430 -106 -1454 -639 1360 641 -837 -1090 298 1184 127
3460 127 -1140 -858 1044 1123 -594 -1264 114 1225 165 -1159 -1173 797 1343 183 -1425 -750 1028
3477 1028 1103 -569 -1464 -193 1347 631 -1098 -876 785 1039 -288 -1204 -652 1414 706 -826 -965
3494 -965 84 1161 198 -963 -869 783 1014 -426 -1333 132 1359 557 -1041 -842 592 972 147
3511 147 -1374 -737 917 1005 -583 -1317 178 1413 305 -1055 -742 783 793 -589 -1407 -196 1118
3528 1118 671 -945 -999 354 1211 415 -1349 -605 969 1074 -160 -1465 2 1149 670 -732 -1064
3545 -1064 524 1181 130 -1224 -399 1019 802 -695 -1063 356 1055 174 -1191 -571 733 823 -272
3562 -272 -1490 -292 1060 901 -1073 -1274 569 1336 445 -1188 -945 1145 982 -301 -916 -146 1530
3579 1530 635 -932 -1206 613 917 -161 -1250 -209 1324 984 -970 -1259 187 1654 321 -1131
3595 -1131 -720 665 945 -667 -1243 -463 1326 543 -942 -1152 222 1289 -1 -899 -653 1051 888
3612 888 -714 -961 220 900 747 -1225 -848 870 1210 -294 -1212 -210 1112 726 -668 -926 315
3629 315 1519 457 -1244 -887 813 1198 -459 -1374 -24 1233 705 -943 -1041 320 1016 -1 -811
3646 -811 -340 956 864 -291 -1166 91 1226 643 -1417 -843 437 1216 -212 -1348 -383 1531 589
3663 589 -413 -1089 -13 1297 458 -1386 -720 860 1012 -87 -1088 -38 1156 545 -1017 -874 486
3680 486 1151 177 -1377 -312 1111 399 -819 -1371 89 859 291 -1034 -1081 616 980 -160 -1296
3697 -1296 -377 940 802 -700 -808 207 1074 41 -839 -484 673 935 -258 -910 141 1072 821
3714 821 -945 -748 389 1348 158 -970 -418 1275 789 -552 -703 -39 1152 581 -890 -758 597
3731 597 1052 -156 -1208 -328 1081 630 -690 -720 400 1020 49 -1061 -760 763 779 -429 -996 -24
3749 -24 935 630 -628 -902 698 1140 -158 -733 -368 792 879 -289 -1168 238 1168 250 -861 -886 592
3768 592 1228 -262 -1209 -277 1274 740 -909 -979 567 744 64 -1251 -495 915 779 -142 -1229 112
3786 112 1213 710 -891 -1082 758 747 2 -1017 -390 955 843 -685 -1188 43 812 168 -1072 -780
3804 -780 985 815 -489 -858 -353 995 659 -582 -873 239 1175 65 -1252 -235 446 1030 -382
3821 -382 -941 43 878 362 -890 -893 567 980 -189 -1163 -158 1165 849 -705 -1098 469 1016 235
3839 235 -976 -578 569 1043 -534 -1447 -49 924 651 -634 -1032 470 1256 239 -962 -691 693
3856 693 736 -517 -1087 455 1059 307 -1113 -926 473 809 -369 -878 -223 751 647 -531 -1007 -50
3874 -50 915 340 -816 -902 647 797 -201 -974 -112 944 563 -355 -743 413 1039 -219 -851 -472 707
3893 707 836 -549 -1260 351 786 266 -539 -835 579 1425 -281 -1471 -40 1106 380 -652 -693 316
3911 316 691 79 -1051 -766 923 793 -235 -867 -230 1061 590 -1025 -754 445 1302 -23 -795 -515
3929 -515 773 1084 -414 -1092 248 1079 411 -971 -1107 451 649 -143 -1219 -167 1030 613 -556
3946 -556 -858 434 1175 165 -876 -374 625 778 -543 -759 -120 816 375 -547 -639 509 1109 -148
3964 -148 -917 -323 876 578 -393 -1426 177 1219 176 -679 -655 464 941 -257 -905 74 700 879
3982 879 -531 -707 128 839 168 -896 -622 687 1070 -336 -815 133 999 499 -659 -630 291 967 -231
4001 -231 -1013 -596 596 893 -689 -904 149 721 344 -643 -811 580 714 -243 -791 -140 672 505 -542
4020 -542 -863 127 907 285 -881 -642 400 868 -552 -662 -50 889 405 -900 -632 273 1021 -230
4038 -230 -968 -389 799 640 -342 -723 53 975 440 -975 -850 735 737 -351 -729 114 885 460 -639
4057 -639 -837 272 1142 471 -943 -435 683 912 -270 -992 21 863 546 -518 -607 296 776 48
4075 48 -755 -156 836 579 -295 -613 117 1001 141 -1122 -596 374 979 31 -803 -179 1036 462 -788
4094 -788 -636 351 700 188 -1019 -575 439 752 -485 -835 -80 658 335 -667 -573 555 915 -64 -900
4113 -900 -250 1076 500 -551 -1041 65 536 263 -926 -502 740 880 -237 -805 -62 580 672 -598
4131 -598 -843 288 704 268 -792 -402 683 810 -298 -906 146 761 342 -611 -660 362 866 -130
4149 -130 -805 -160 735 246 -602 -1073 110 694 210 -604 -367 753 827 -202 -879 -330 530 235 -540
4168 -540 -630 265 736 354 -642 -173 577 640 -349 -796 317 1120 15 -641 -685 350 903 -59 -727 -185
4188 -185 962 348 -486 -746 50 549 396 -535 -202 630 832 -362 -797 164 1094 546 -716 -733 414
4207 414 782 -167 -855 -289 731 865 -656 -762 50 1212 281 -684 -389 634 692 -391 -819 -218 881
4226 881 609 -518 -570 60 669 447 -860 -640 448 513 -356 -871 -377 964 521 -670 -712 373 587
4245 587 144 -542 -290 642 695 -317 -876 115 964 252 -685 -651 203 617 -302 -456 -200 544 599 -652
4265 -652 -593 481 804 70 -531 -538 756 904 -153 -962 20 783 276 -624 -522 480 811 -120 -1115 -275
4285 -275 652 903 -430 -564 -88 762 404 -610 -538 366 386 -237 -635 -168 628 384 -689 -687 235 848
4305 848 179 -699 -662 575 635 -488 -756 150 616 380 -770 -606 299 822 -116 -554 -11 620 624 -690
4325 -690 -562 319 901 173 -553 -572 581 682 15 -808 48 582 540 -670 -683 246 833 215 -850 -570
4345 -570 421 611 -288 -603 131 692 140 -419 -718 501 670 157 -941 -483 819 766 -591 -565 71
4364 71 800 151 -846 -267 638 699 -171 -748 -395 1098 610 -483 -593 111 1027 349 -791 -406 541 371
4384 371 -479 -568 40 835 137 -713 -543 474 708 -171 -806 -67 796 674 -625 -671 2 800 257 -737
4404 -737 -397 332 315 -122 -812 -21 567 350 -651 -761 307 781 235 -704 -399 650 667 -628 -400
4423 -400 196 528 537 -385 -651 520 941 48 -535 -51 917 711 -128 -672 -118 684 372 -716 -666 598
4443 598 707 -275 -613 300 485 282 -619 -660 58 995 -21 -1090 -119 502 614 -491 -579 -77 516 263
4463 263 -357 -325 362 502 26 -799 -168 776 540 -658 -640 283 716 43 -815 -407 736 521 -508 -721
4483 -721 148 762 437 -378 -683 479 862 245 -883 -528 428 576 -502 -772 -26 736 654 -634 -520
4502 -520 242 700 -257 -462 -218 609 560 -676 -615 123 733 105 -357 -516 436 589 -302 -825 -266 469
4522 469 481 -222 -489 316 936 -316 -1024 -139 205 368 -71 -651 390 617 121 -678 -522 634 715 -316
4542 -316 -875 -48 723 533 -825 -614 359 592 -332 -886 -312 538 770 -381 -810 143 678 262 -849
4561 -849 -551 26 442 -52 -536 -278 307 503 -440 -897 68 822 -51 -600 -430 361 419 -237 -714 -280
4581 -280 715 375 -620 -354 0 333 -49 -715 -464 471 658 -342 -668 17 847 709 -549 -530 369 820
4601 820 -48 -644 -51 857 533 -262 -608 297 829 327 -751 -607 654 759 -135 -682 163 618 848
4620 848 -559 -1077 101 866 299 -774 -500 733 717 -252 -373 -194 573 89 -445 -512 396 503 160
4639 160 -533 -446 1118 388 -588 -599 312 703 96 -681 -315 466 333 -67 -851 20 820 -22 -533 -511 457
4660 457 657 67 -959 -242 593 343 -47 -779 -114 808 139 -590 -611 561 916 -105 -783 -97 426
4679 426 459 -543 -407 294 727 42 -738 -377 560 641 -246 -538 154 555 495 -593 -544 72 568 4 -904
4700 -904 -85 258 250 -596 -665 -140 916 44 -684 -661 247 732 39 -703 -145 591 366 -486 -537 111 724
4721 724 209 -907 -429 342 415 -531 -633 78 196 75 -651 -327 395 932 92 -780 -54 694 577 -428
4741 -428 -798 6 631 248 -670 -544 274 446 -54 -668 202 924 458 -524 -12 287 570 37 -490 -368
4761 -368 456 728 -247 -446 -81 721 79 -664 -567 289 1023 -409 -504 -323 670 555 -460 -591 160 931
4781 931 -17 -444 -365 239 552 -45 -703 -193 644 333 -363 -454 186 533 -7 -542 -317 601 567 -529 -604
4802 -604 112 922 219 -723 -1016 396 685 4 -978 -394 340 153 -58 -334 42 756 263 -480 -397 318
4822 318 615 -366 -539 92 977 296 -541 -472 567 742 266 -1033 -168 711 518 -320 -556 147 504 371
4842 371 -723 -387 481 453 85 -435 -160 578 263 -215 -692 539 846 255 -767 -350 353 635 -197
4861 -197 -900 -96 407 388 -601 -232 466 581 -78 -459 -403 513 565 -381 -487 70 419 296 -778 -420 286
4882 286 595 -169 -594 -46 437 453 -491 -809 75 684 -92 -938 -131 472 569 -494 -850 67 751 173
4902 173 -591 -442 -4 604 -123 -623 -227 497 583 -367 -492 -26 571 -60 -720 -465 363 1064 -94 -666
4922 -666 -65 277 223 -331 -527 530 654 -75 -406 -356 277 400 -247 -621 -365 709 85 -694 -545 324
4942 324 1146 12 -449 -270 645 123 -338 -590 -41 1147 326 -603 -408 244 514 -222 -456 -194 643
4961 643 290 -180 -525 278 659 121 -875 -263 325 81 -139 -539 -118 783 -157 -507 -324 609 520 -93
4981 -93 -682 -498 311 412 -583 -1010 55 631 85 -464 -299 201 579 -13 -644 43 261 -84 -150 -426
5001 -426 143 566 151 -631 -400 458 596 -286 -573 -103 471 -8 -579 -608 56 601 -227 -656 -200 215
5021 215 369 -225 -479 65 522 16 -586 -426 604 651 -120 -280 -215 624 682 -330 -546 441 882 -4
5041 -4 -739 -173 475 626 -279 -417 228 483 -151 -571 -474 134 490 -167 -689 116 637 709 -721 -506 -234
5062 -234 534 -2 -342 -69 343 538 -131 -350 -251 658 109 -294 -559 166 457 -227 -797 -593 371 434 -302
5083 -302 -416 9 306 368 -289 -701 357 488 6 -529 -25 199 412 -484 -318 11 682 291 -328 -387
5103 -387 423 556 -131 -750 117 520 206 -751 -567 -25 803 -46 -456 31 426 381 -206 -225 -20 546 150
5124 150 -645 -84 87 472 -310 -878 155 423 474 -595 -341 366 745 128 -472 -508 305 692 -285 -580
5144 -580 39 759 505 -746 -296 18 595 -132 -749 -202 389 658 -384 -430 60 545 292 -537 -655 410
5164 410 552 107 -510 -72 540 473 -284 -565 271 524 79 -436 -430 186 571 -196 -413 238 660 21 -549
5185 -549 -393 219 961 203 -358 148 465 338 -458 -581 248 743 161 -490 -452 289 584 104 -513 -276
5205 -276 734 122 -422 -633 156 744 100 -550 -332 314 512 76 -472 -36 657 362 -297 -535 470
5224 470 744 -191 -511 -215 744 280 -402 -582 171 825 -2 -708 -712 411 263 -47 -907 -21 297 72
5244 72 -643 -560 202 573 168 -500 -56 457 486 -359 -433 46 564 326 -757 -452 174 435 -213 -806 -298
5265 -298 216 515 -232 -433 6 348 263 -492 -507 146 908 -228 -447 -294 164 347 -553 -342 265 785
5285 785 250 -597 -457 514 680 -233 -367 46 370 200 -608 -382 219 690 -127 -794 -229 530 193 -444
5305 -444 -471 171 501 -143 -374 -118 99 475 -30 -757 -391 464 435 -601 -628 212 818 224 -611 123 421
5326 421 443 -140 -520 86 699 367 -320 -530 266 875 -128 -561 -124 493 51 -313 -207 -39 525 34
5346 34 -510 -348 463 387 -56 -565 -204 575 478 -426 -286 268 376 -68 -707 -122 488 416 -256 -611 294
5367 294 693 308 -467 -546 369 468 -413 -588 -178 586 258 -227 -184 -59 588 -127 -833 -428 392 293 -63
5388 -63 -514 29 369 104 -554 -538 118 674 155 -424 -358 585 384 -428 -422 -126 220 258 -366 -237 582 660
5410 660 -128 -586 -410 727 160 -223 -862 107 533 57 -390 260 500 764 -110 -769 -94 674 -14 -523
5430 -523 -376 -37 631 37 -619 70 718 253 -331 -676 188 617 2 -565 -221 297 655 188 -599 -323
5450 -323 516 392 -263 -410 39 535 99 -563 -194 97 504 -561 -659 -84 754 24 -17 -373 158 406
5470 406 -102 -449 -305 748 204 -27 -665 327 569 -16 -412 -599 278 682 -422 -855 -225 515 347
5489 347 -447 -680 336 661 206 -314 -438 140 565 -188 -756 228 519 565 -552 -336 -4 366 140 -410
5509 -410 -483 458 375 -183 -584 -115 303 118 -369 -701 405 541 -172 -390 -143 256 260 -379 -422 322 601
5530 601 253 -619 -359 717 518 -167 -603 -134 570 328 -292 -409 301 511 -171 -464 161 278 113 -233
5550 -233 -437 154 362 55 -326 -47 276 588 -151 -425 20 478 519 -241 -487 204 681 169 -472 -276
5570 -276 552 224 -308 -565 3 458 486 -397 -92 373 794 -36 -463 -262 540 467 -203 -610 52 572 360
5591 360 -141 -563 470 15 -215 -376 -162 429 337 -512 -540 225 350 95 -360 -58 593 164 -600 -553 -241
5612 -241 809 346 -594 -289 439 433 -247 -650 -262 505 599 -207 -638 132 428 125 -426 -574 353 346 -137
5633 -137 -528 -86 595 189 -390 -308 249 313 -302 -503 92 182 654 -115 -262 11 752 71 -551 -333 316
5654 316 714 -18 -664 37 546 114 -586 -684 398 500 212 -452 -454 347 662 45 -637 49 638 -131 -326
5675 -326 -187 255 485 -291 -492 -32 704 429 -236 -666 -67 854 -169 -543 -332 455 507 -34 -564 -135
5695 -135 563 150 -346 -358 98 777 165 -541 -386 169 372 -128 -443 -202 303 127 -405 -229 202 403
5715 403 400 -634 -138 273 208 -299 -506 -125 683 -7 -479 -508 269 415 -174 -563 -156 752 352 -461 -448
5736 -448 329 443 20 -565 -246 652 348 -98 -658 -78 263 106 -153 -500 129 659 -291 -789 16 469
5756 469 261 -195 -180 13 526 64 -255 -360 322 367 -284 -423 -112 592 67 -433 -411 250 396 -63 -621
5777 -621 -227 146 288 -513 -517 210 468 103 -678 -487 122 719 -237 -592 -75 385 165 -179 -424 160 123
5798 123 -314 -350 -117 325 327 -409 -326 -93 373 306 -621 -695 276 311 288 -475 -354 401 411 -391 -457 -128 638
5821 638 127 -335 -272 140 453 -164 -324 -213 538 474 -358 -279 203 642 111 -585 -75 468 386 42 -388
5842 -388 42 699 399 -542 -375 118 654 -92 -229 -203 325 355 -35 -552 -130 647 83 -432 -251 648 354
5863 354 -136 -497 -79 499 -116 -294 -334 -62 428 -336 -459 -214 415 176 -223 -387 -88 717 -42 -520
5883 -520 -215 331 340 214 -401 -249 207 721 -405 -478 81 639 151 -416 -195 357 497 -52 -431 -27 612
5904 612 219 -168 -452 271 492 69 -371 -230 545 603 -209 -640 -132 449 -322 -306 -248 231 583 213 -180
5925 -180 124 346 250 -202 -558 244 590 -22 -423 -346 465 496 -73 -668 -64 643 146 -1021 -177 -39 257
5946 257 120 -508 -153 384 307 -358 -233 100 626 221 -200 -360 368 777 4 -481 -168 550 236 -146
5966 -146 -684 316 334 -15 -671 -355 51 319 -43 -658 -5 186 433 -340 -563 -51 458 161 -420 -121
5986 -121 114 45 -398 -219 -109 502 32 -265 -461 48 415 115 -608 -100 110 223 -123 -499 -157 589
6006 589 238 -416 -285 444 534 -328 -353 -171 491 98 -170 -598 290 680 -124 -274 -395 522 630 -222 -645
6027 -645 126 561 434 -167 -400 309 332 152 -232 -73 383 457 -145 -565 19 399 128 -485 -263 372 672
6048 672 -148 -601 -57 685 42 -533 -163 287 549 -61 -692 104 344 556 -34 -636 -73 288 -127 -512
6068 -512 -154 -116 122 -65 -657 14 272 463 -417 -427 164 600 -174 -720 -290 387 583 -228 -334 -338 428
6089 428 150 -305 -240 307 490 -142 -561 -161 338 333 -67 -618 -224 496 481 -39 -313 201 161 -335 -690 50
6111 50 191 293 -434 -643 3 523 194 -566 -261 615 628 125 -599 -88 364 529 -428 -252 23 494 230
6132 230 -414 -200 190 786 -306 -260 238 463 142 -556 -588 157 767 98 -533 -68 276 583 -636 -398
6152 -398 395 489 44 -748 -87 342 179 -271 -286 -250 413 377 -440 -239 560 251 67 -736 -146 374 289 -343
6174 -343 -389 180 560 294 -615 -463 156 641 -289 -461 -217 746 226 -131 -633 305 486 291 -576 -437
6194 -437 615 489 -244 -307 -72 473 79 -419 -551 271 423 -158 -351 -348 460 515 -239 -409 -146 443 291
6215 291 -180 -12 -53 296 -294 -702 1 372 79 -297 -393 187 504 44 -696 -353 238 297 -357 -657 -302
6236 -302 576 208 -591 -35 400 186 52 -474 -191 370 113 -364 -186 -12 461 -142 -169 -509 266 380
6256 380 -445 -323 -258 427 295 -124 -326 223 514 100 -583 -224 547 585 7 -635 158 653 117 -113 -91
6277 -91 416 451 71 -342 -110 466 293 -247 -469 69 604 -9 -488 -407 130 610 -211 -566 -76 499 420
6298 420 -343 -447 338 626 152 -311 -522 561 454 -379 -487 7 433 -49 -713 -229 223 174 -125 -360
6318 -360 -50 525 53 -517 -224 69 259 -122 -464 -253 324 -54 67 -423 -395 475 17 -459 -206 177
6338 177 410 114 -482 -266 383 195 -241 -770 -143 506 310 -312 -403 275 343 -240 -571 -252 173 528 -198
6359 -198 -484 37 677 250 -342 -227 3 311 -420 -168 -226 545 197 -312 -179 235 723 228 -816 -189
6379 -189 364 387 -334 -463 211 449 11 -381 -88 263 362 -150 -494 105 673 84 -394 -391 -252 429 69
6400 69 -695 -217 35 711 65 -409 -345 424 402 -581 -428 287 421 351 -707 -103 441 506 -178 -248 2 689
6422 689 117 -307 -488 -30 606 104 -689 -192 378 38 -119 -548 17 474 -64 -167 -41 484 422 -97
6442 -97 -146 -8 122 561 -590 -281 273 451 -7 -349 133 527 124 -69 -329 110 431 11 -267 -322 624
6463 624 417 -275 -518 -163 344 467 -329 -329 56 87 109 -413 6 158 262 -128 -553 -214 588 261 -336
6484 -336 -451 65 327 -237 -692 127 389 502 -175 -289 -292 388 368 -828 -155 341 208 -358 -663 -90 493
6505 493 119 -504 -4 338 472 18 -686 178 469 277 -106 -85 -315 620 317 -536 -362 366 504 160
6525 160 -312 -360 260 551 -211 -481 113 319 402 -371 -41 271 734 -136 -381 -35 441 531 -322 -420 -103
6546 -103 51 -163 -663 -169 532 193 -116 -689 -65 418 -16 -450 -464 352 278 -398 -339 -304 115 121 -253 -521
6568 -521 164 587 225 -414 -510 200 468 -243 -601 -2 598 411 -421 -142 39 593 -118 -248 -352 346
6588 346 467 -86 -386 -75 575 98 -230 -397 179 484 -115 -642 -97 285 152 -323 -265 100 848 66
6608 66 -263 -188 354 257 199 -414 0 653 120 -340 -341 83 107 -59 -571 -314 4 238 -550 -341 -44 244
6630 244 191 -610 -789 179 617 -126 -539 7 554 301 -448 -505 -226 585 173 -174 -327 336 337 -68 -463
6651 -463 -97 505 305 -384 -425 217 333 192 -287 -257 661 493 -396 -420 -194 458 68 -348 -439 118 431
6672 431 203 -670 -102 622 470 -342 -498 24 264 -70 -377 -171 490 607 -93 -519 -129 437 3 -332
6692 -332 -290 247 254 -256 -399 -221 59 253 -207 -67 89 435 58 -526 -573 262 755 -56 -438 -89 440
6713 440 306 -355 -479 202 827 87 -445 -287 307 667 6 -516 169 493 219 -490 -438 217 370 53
6733 53 -651 -147 220 517 -364 -371 -84 326 173 -595 -498 6 379 0 -211 369 396 20 -200 -395 -74 467
6755 467 -84 -513 162 126 394 -218 -437 0 421 208 -132 -504 66 670 -11 -457 3 300 347 -468 -427
6776 -427 360 479 236 -187 -304 313 186 -346 -483 -269 336 347 -486 -198 266 663 196 -459 -117 20
6796 20 310 42 -512 33 375 222 -305 -327 211 79 -291 -515 -144 306 233 -473 -493 51 554 127 -616
6817 -616 -207 429 411 71 -175 37 576 -18 -180 -454 96 299 10 -609 -437 155 117 -278 -743 -217 548
6838 548 125 -566 -445 159 532 -60 -489 -35 380 312 -398 -533 18 501 271 -405 -507 549 231 -362
6858 -362 -485 -167 -5 533 -556 -120 117 597 42 -451 -1 -23 238 51 -362 99 545 85 -438 -489
6878 -489 331 508 -238 -627 -335 508 335 61 -470 0 692 114 -313 -270 302 272 -665 -248 -265 318 240
6899 240 -229 -251 267 503 67 -717 -275 660 285 -296 -471 122 287 -47 -408 -532 319 657 -109 -299
6919 -299 -16 349 177 -147 -255 212 248 254 -441 -226 268 451 -156 -512 203 579 228 -300 -362 471 349
6940 349 28 -541 -170 486 289 -219 -326 -238 564 -19 -574 -460 307 698 -128 -333 -284 635 328 -501 -184
6961 -184 36 382 247 -429 -207 106 501 -130 -477 -140 221 174 -381 -319 511 324 271 -424 -293 164 539
6982 539 -292 -473 -79 616 296 -383 -340 36 411 -46 -280 -123 401 498 -246 -161 79 331 9 -318 -120
7003 -120 214 830 -298 -532 -110 439 -142 -354 -484 62 331 87 -430 -143 522 272 -294 -696 -107 481
7023 481 311 -199 -156 183 466 -231 -749 -116 231 15 -494 -444 290 370 -27 -565 55 326 389 -167 -720
7044 -720 23 573 -140 -337 -418 101 622 138 -408 -71 307 211 -227 -453 204 428 209 -242 -319 -31 803
7065 803 -9 -567 37 204 223 -198 -381 -126 439 266 -722 -55 206 289 -158 -485 -65 128 75 -323 -317 323
7087 323 332 -112 -478 -279 436 188 -428 -263 -66 479 342 -395 -187 289 393 -110 -137 46 364 385 -331
7108 -331 -336 302 351 63 -281 -118 443 305 -250 -335 -127 436 131 -574 -324 252 304 -361 -687 -206 312 447
7130 447 -189 -343 110 384 45 -130 -243 108 567 -393 -563 -314 372 307 -267 -95 -122 210 -106 -352 -205
7151 -205 411 203 -309 -410 -23 513 11 -699 -535 82 378 68 -420 -36 550 449 -193 -241 86 325
7171 325 61 -618 -397 214 381 50 -430 -214 194 345 -45 -104 -76 310 215 -373 60 464 296 -295 -413
7192 -413 132 380 311 -485 -106 133 471 -194 -508 262 545 251 -82 -273 432 299 82 -249 -311 383 240
7213 240 -165 -459 -113 459 258 -334 -236 251 328 303 -500 -219 503 537 -92 -259 64 439 444 -559 -744 288
7235 288 380 42 -390 -12 153 197 -251 -627 178 394 42 -537 -333 225 541 -224 -103 21 382 384 47
7256 47 -498 85 308 -90 -283 -189 135 298 -36 -416 -124 552 243 -424 -180 -191 328 -88 -685 -73 309
7277 309 279 -292 -504 199 557 16 -568 -12 233 317 -417 -396 -131 331 214 -136 -615 261 696 -70 -426
7298 -426 -46 269 259 -176 -633 -5 392 188 -339 -608 212 387 -211 -470 -7 549 336 -79 -299 262
7318 262 45 110 -415 -11 357 519 86 -430 -77 125 161 -600 -196 348 306 -334 -802 -56 359 173 -283
7339 -283 -1046 154 245 297 -28 -142 531 632 -166 -549 92 558 415 -46 -142 343 358 -53 -453 -338 178
7360 178 213 -489 -372 -53 291 376 -234 -282 61 605 -52 -519 -359 493 123 -373 -638 171 270 -129 -419
7381 -419 -403 18 92 -339 -635 -100 301 38 -84 -373 216 334 168 -573 -355 384 336 -409 -322 -268 441 286
7403 286 -121 -327 459 475 -285 -525 3 303 178 -179 -627 -119 413 202 -361 -374 -156 254 265 -200 2
7424 2 367 241 -327 -349 119 512 21 -382 -178 232 312 -162 -165 68 458 -60 -515 -393 504 390 -61 -454
7446 -454 -250 259 382 -322 -541 243 526 385 -145 -288 261 313 -81 -292 -46 259 -7 -473 -339 266
7466 266 92 185 -468 -377 643 370 -230 -269 98 560 21 -420 -231 74 559 -194 -474 -164 408 451 -463
7487 -463 -535 -50 463 217 -234 -373 -12 633 223 -248 -69 201 142 -78 -309 507 290 -210 -338 -68 272
7508 272 349 -169 -668 52 574 -90 -551 -119 227 389 -248 -374 -193 527 417 -507 -386 169 380 -146
7528 -146 -134 -153 235 131 -309 -466 -257 529 238 -470 -393 -91 396 25 -694 -178 349 173 -260 -488 100
7549 100 334 -1 -585 28 266 155 147 -661 -45 472 -84 -439 -404 150 284 3 -380 -357 36 374 156
7570 156 -38 -16 396 112 -391 -7 244 618 -170 -452 -274 515 391 -387 -494 233 127 60 -380 -322 53
7591 53 492 -200 -683 151 413 266 -376 -244 97 259 86 -208 -322 220 -10 -192 -465 -245 513 170
7611 170 -96 -94 158 567 -46 -322 -167 393 416 -151 -70 84 247 -201 -519 -311 240 528 13 -513 -159
7632 -159 317 231 -241 -360 137 351 -196 -494 -216 255 2 -321 -343 -288 400 -51 -535 -215 123 175 77 -202
7654 -202 -264 -20 367 35 -246 -15 408 63 -532 -380 511 324 -43 -195 151 511 -6 -117 -560 110
7674 110 322 113 -511 49 486 682 -274 -470 -177 82 42 -304 -336 522 346 303 -314 -80 496 441 -247
7695 -247 -339 -48 798 63 -391 -133 172 407 -165 -291 84 243 -72 -173 -106 349 414 -237 -416 174 199
7716 199 185 -196 -638 -126 433 -16 -566 -599 380 363 44 -196 -436 129 432 -408 -508 72 373 144 -463
7737 -463 -319 310 356 -302 -264 -5 468 -113 -183 -332 7 412 -78 -361 -338 488 194 0 -210 14 303
7758 303 394 -88 -272 86 457 -60 -580 -85 496 317 -205 -635 -230 180 -230 -141 -103 51 304 -293 -533
7779 -533 -63 274 124 -297 -492 363 476 58 -636 -99 475 177 -224 -53 64 327 289 -35 -214 249
7799 249 482 87 -362 -275 55 541 42 -54 -127 308 278 -671 -312 170 78 -128 -280 -194 293 110 -271 -375
7821 -375 80 338 84 -9 -275 -25 221 -194 -331 114 405 60 -352 -320 106 361 -118 -487 -23 308 95
7842 95 -264 -349 188 372 -270 -519 -83 80 457 -74 -336 89 537 33 -289 -244 101 225 -111 -631 -39
7863 -39 96 362 -85 -373 62 196 241 -338 -459 229 362 41 -286 -320 393 361 -173 -558 119 333 77
7884 77 -230 -330 110 285 -95 -372 -85 336 390 -279 -284 179 163 -136 -418 -224 328 239 -162 -260 95 71 -230
7907 -230 -271 -247 -33 326 67 -363 -12 487 -5 -539 -385 132 685 -58 -432 -334 358 203 -238 -470 2
7928 2 511 83 -128 81 155 534 163 -410 198 435 141 36 -450 14 267 332 -156 -297 157 295 -271
7949 -271 -397 49 455 200 -422 -254 -27 26 171 -178 -213 658 595 -435 -235 -213 96 208 -384 163 282
7970 282 184 4 -121 -233 343 155 -263 -298 -120 422 -87 -394 -420 283 445 62 -404 98 415 161 -127
7991 -127 -446 299 350 46 -319 -408 324 214 -370 -247 48 336 280 -239 -158 100 435 -417 -342 -212 517 282
8013 282 -119 -231 181 302 85 -187 -389 328 301 -353 -363 73 351 258 -157 -434 201 296 -23 -546 -367
8034 -367 300 497 -13 -463 36 158 328 -308 -506 151 314 -33 -473 -310 476 439 -291 -459 339 471
8054 471 -64 -219 -351 385 493 -119 -394 10 -53 288 -140 -225 -162 307 -39 -523 -152 108 81 -253 -402
8075 -402 69 425 -110 -475 -561 207 398 236 -371 56 247 479 12 -369 237 140 -24 -513 55 310 58
8096 58 -461 -373 22 472 329 -97 -43 328 346 -84 -569 -278 225 481 -233 -401 151 293 107 -140 -348
8117 -348 -69 372 16 -367 -127 280 390 -358 -511 180 267 138 113 -520 376 521 -320 -80 34 139 34
8138 34 -460 -441 -99 441 -47 -308 3 224 330 -225 -331 -143 555 -6 -283 -156 147 365 64 -475 11
8159 11 211 -100 -193 -408 426 371 -211 -604 -178 161 297 -272 -275 -79 72 55 -225 -174 441 378 156 -315 94
8182 94 61 271 7 -325 45 358 248 -344 -1
8191a
$$ Imaginary data points
##PAGE= N=2
##DATA TABLE= (X++(I..I)), XYDATA
0 0 0 0 0 0 0 0 -8 8 -8 8 -12 16 -18 24 -24 32 -40 47 -56 64 -75 88 -101 116 -133 150 -173 198 -222 251
30 251 -285 318 -355 399 -442 493 -549 608 -673 749 -827 918 -1015 1122 -1246 1384 -1537
47 -1537 1715 -1920 2158 -2446 2790 -3221 3771 -4502 5524 -7072 9660 -14818 29132 -151965
61 -151965 -566125 -321815 164399 437074 226844 -154221 -342178 -195098 63059 210541
71 210541 150319 -21940 -180332 -191692 -41788 159065 203818 27607 -215098 -262344 -53961
82 -53961 207969 259342 66127 -172689 -234989 -91129 120788 229615 168291 -6849 -157876
93 -157876 -163394 -13196 162348 201122 61678 -124374 -180224 -58502 114048 164635 40263
104 40263 -142397 -204860 -74841 132490 209582 61019 -180035 -265970 -94704 167113 254309
115 254309 87080 -150380 -224547 -91618 90069 158120 88292 -33084 -114006 -108799 -22256
126 -22256 83810 112313 20775 -106361 -126048 47 138994 134736 -9788 -132747 -103570
137 -103570 38449 149967 139533 36728 -71392 -111344 -54183 67079 156775 118556 -31209
148 -31209 -149968 -111085 39993 132524 69572 -60287 -106035 -35650 49415 58257 9075 -30373
160 -30373 -36905 -26302 2784 53586 84360 36464 -67166 -113815 -33621 96628 131071 32478
172 32478 -86170 -103501 -28475 42334 51674 25478 410 -25260 -49343 -37418 24025 76708
184 76708 46522 -44920 -84525 -9906 97459 102752 -9884 -113863 -89577 32027 116024
195 116024 77332 -35850 -108851 -83685 517 60551 50634 -7744 -55028 -51391 -11019 21107
207 21107 20927 4001 -3752 309 2443 3813 15373 28084 15765 -20340 -35004 5715 62064
220 62064 58012 -15398 -77296 -54406 22555 62151 28833 -20559 -30888 -15602 -12629 -14610 11847
233 11847 47619 34523 -32263 -70223 -18221 63404 62282 -30437 -95574 -43093 58689 73088
245 73088 -20846 -102928 -75012 14035 50192 5723 -42780 -36462 -6786 -7384 -26043 -14412 24941
258 24941 38545 1641 -37750 -27807 16775 38913 17037 -11839 -13345 4451 13181 9623 3462
271 3462 -2700 -13917 -17076 4367 35980 36329 -4879 -43134 -29725 25317 61236 42680 -3255
284 -3255 -25410 -9707 19443 33742 28397 10665 -8114 -13235 2951 24756 22195 -9072 -32141
297 -32141 -14462 24545 35944 4215 -28131 -21246 10818 24353 9674 -249 11130 21076 5394
310 5394 -17314 -12790 17649 34282 14116 -16888 -24655 -8401 5026 3437 -2998 -7833 -15323
323 -15323 -20934 -10584 11753 15412 -15113 -43203 -22941 30736 49354 3388 -51715 -44250 14875
336 14875 46634 13916 -32225 -31171 4469 14711 -13484 -32123 -9786 18283 6059 -29007
348 -29007 -32297 4151 26869 2057 -30740 -19269 22306 35962 3848 -25373 -10988 21194
360 21194 21891 -4024 -11755 11849 25548 -344 -33562 -23209 21530 40591 6573 -36061 -31567
373 -31567 12087 37200 16074 -17974 -19986 8498 31042 23251 -65 -12595 -4374 13147 22054
386 22054 14530 -2498 -12326 -4944 6915 5622 -7642 -12679 649 12798 2084 -21147 -23564
399 -23564 4252 26747 13530 -17135 -21855 5805 25815 10629 -16105 -15035 8992 18231 34
412 34 -15363 -5831 7571 -2518 -21342 -14537 15111 22870 -10143 -41249 -22357 24894 36740
425 36740 -1979 -36719 -17572 26615 33132 -5546 -32212 -10029 26025 23291 -11719 -28297
437 -28297 -7310 14775 5048 -19165 -20399 829 10805 -3371 -18559 -12627 2202 4289 -2528
450 -2528 -861 7932 5472 -9009 -12293 6960 23995 12050 -15097 -19975 5638 23976 8727
463 8727 -19549 -21967 3236 20916 9049 -12625 -14995 -288 9917 6684 1430 3801 6260
476 6260 2222 -254 4294 10367 6832 -1582 -1133 8176 9065 -3309 -12532 -4253 9482 7978 -6636
491 -6636 -13544 -1412 10431 6205 -6357 -6346 6637 15632 10220 2798 3539 7154 6143 4562 11892
506 11892 19147 10532 -7835 -10158 10261 25267 9125 -18633 -17385 13066 29210 5242 -26607
519 -26607 -20753 16217 30922 3364 -26044 -15123 17948 23153 -8017 -28313 -9320 19039
531 19039 14140 -17987 -31103 -10730 10053 30 -22881 -23264 -3003 3908 -12377 -24682 -11877
544 -11877 7104 2581 -16430 -18923 2424 16106 1041 -21647 -17682 8532 20874 2840 -20176
557 -20176 -18229 3206 13211 584 -14352 -12590 759 7191 1236 -6783 -8523 -3358 3894 8542
571 8542 6563 -1870 -7306 -1376 11034 12771 -27 -10872 -2873 14245 14875 -3698 -16887 -5757
585 -5757 14289 16205 -1400 -12210 -1708 12603 10751 -908 -1155 11010 15012 5161 -1142 8596
599 8596 18116 9799 -5689 -3337 16221 23134 2700 -18763 -10369 15333 20680 -3518 -22511
612 -22511 -9250 15788 14462 -11235 -23176 -3996 17778 11869 -11207 -16612 877 12948 2462
625 2462 -11948 -8078 6874 7696 -6460 -12820 -2503 6728 -821 -12092 -6598 9309 10709 -6617
639 -6617 -16256 -1264 17672 14735 -5354 -11149 5743 21077 11411 -8439 -9377 8974 19897
652 19897 7568 -9842 -9776 2848 8710 635 -8283 -5802 914 898 -3678 -5389 -3558 -3281 -4147 -839
668 -839 3993 2135 -7029 -10733 -1986 8154 4202 -7946 -11189 -1150 6926 -125 -11388 -10537 602
683 602 5349 -1026 -6984 -3743 1346 -1735 -5426 287 9754 6428 -7150 -11102 4184 17364 6300
698 6300 -14905 -14829 9045 22029 2585 -24240 -20779 7765 21401 975 -23694 -17812 8574
711 8574 16299 -3664 -20097 -8990 12604 13516 -4224 -12368 -357 10773 4147 -6932 -3034
724 -3034 9805 9421 -5293 -11967 630 13683 6623 -10060 -10534 7066 16365 3558 -13214 -9077
738 -9077 10256 18385 4802 -9052 -5252 8398 11118 1511 -5128 -567 6034 4342 -1857 -3232
752 -3232 -1218 -1842 -3221 -1065 3549 2419 -4964 -7006 311 7697 3934 -4229 -2785 7655 11461
767 11461 2244 -6455 -890 11212 12391 1513 -5078 1479 9477 5705 -3588 -3357 5549 8421 372
782 372 -5278 1344 8337 3696 -6090 -3923 9615 12880 -695 -13039 -4800 12236 11866 -6858
796 -6858 -16632 -3295 13153 6642 -14972 -20811 -2221 13113 3300 -16682 -17922 -485 8879
809 8879 -2273 -14736 -8793 4836 6076 -5638 -10539 -1320 6211 -984 -10042 -5397 7690 6755
823 6755 -8529 -16414 -3800 11904 7518 -10864 -16398 -1036 12851 5599 -11129 -13007 2406
836 2406 13073 5779 -6677 -7536 2433 7296 2610 -2147 -705 2272 1295 -598 1006 2320 -711
851 -711 -4086 -243 7055 6756 -2356 -6974 83 10633 9697 -1191 -4914 3336 10793 6465 -1841
866 -1841 -1847 5317 7689 2063 -2153 1543 5568 841 -5568 -2167 7196 6942 -4637 -10765 -1014 10928
882 10928 6080 -8840 -11375 4053 14153 3642 -13263 -11216 6513 14464 554 -15030 -9549
895 -9549 7245 10102 -5126 -14719 -5179 8374 5980 -7742 -10830 31 7911 228 -8660 -3294
909 -3294 7414 6951 -4992 -8913 2097 11445 4034 -8911 -7518 6387 11925 -142 -12372 -6653
923 -6653 8438 11147 -2655 -11520 -3875 8325 7866 -3214 -7428 373 7586 5121 -1672 -2216 2252
938 2252 3257 798 671 3324 2960 -2449 -3985 1420 6354 1779 -5956 -6108 3375 7550 518 -7199
954 -7199 -4619 4785 6738 -302 -5715 -1488 4792 3120 -2803 -2731 2876 3308 -2824 -5508 609 5686
970 5686 102 -8917 -5853 5720 8211 -3816 -13213 -5263 9611 9476 -5732 -14227 -2243 12487
984 12487 8157 -8427 -12823 776 11910 4461 -9654 -9602 3297 8125 -1223 -9621 -4058 6305
998 6305 4318 -6110 -7973 2296 8092 310 -8516 -3759 8390 8827 -3373 -9758 -302 11335
1012 11335 7293 -6199 -9435 2304 11256 4349 -7703 -7491 4050 9103 1654 -6487 -3729 4033
1026 4033 5137 -456 -2965 742 3419 474 -1535 628 3666 1198 -3596 -2270 3689 4740 -2128
1041 -2128 -7223 -2234 4870 3568 -4781 -7765 -892 5171 1836 -5694 -5150 1729 4206 -928 -4318
1056 -4318 -626 3709 794 -4174 -2236 4252 4450 -3814 -7562 627 8399 3334 -8225 -8933 3498
1071 3498 11179 1891 -10718 -8162 6454 11326 -480 -11123 -5054 8464 9533 -3007 -9603
1084 -9603 -839 8678 5383 -5261 -6004 3481 7284 -460 -6715 -1428 7341 5164 -4682 -6595 3316
1099 3316 10389 2692 -7562 -4847 7753 11385 742 -8193 -2271 9321 9945 -1281 -7399 -213
1113 -213 8328 6377 -2490 -4789 1334 5642 1690 -2708 -868 2345 1496 -2026 -1638 2185 2330 -2694
1129 -2694 -4845 -434 4398 1130 -5937 -6192 1221 4798 -1125 -7738 -5209 2045 2930 -3226 -7038
1144 -7038 -2926 2246 479 -4739 -4288 914 1530 -3559 -5641 -160 3750 -898 -7477 -5346 3626
1159 3626 5466 -3730 -10548 -3953 6717 5199 -6772 -11437 -1673 8467 3807 -8297 -10124 1421
1173 1421 8297 1427 -8753 -5842 4797 6604 -1728 -7298 -1051 6560 3723 -4866 -4528 4100 7706
1188 7706 239 -6601 -745 8991 7813 -2755 -6835 2536 11390 7122 -4160 -5089 5556 11748
1202 11748 4812 -4522 -2885 6747 9323 2659 -3345 27 5739 5397 132 -1498 2081 3872 900
1217 900 -1352 1147 4126 1457 -3148 -1795 4149 4763 -1345 -5340 -1163 5428 3833 -3553 -5522
1232 -5522 562 4822 998 -4668 -3780 1771 2924 -1650 -4386 -934 2495 -563 -4938 -3055 2829
1247 2829 2830 -4131 -7474 -747 5507 1602 -7791 -8142 1530 7132 -451 -10095 -7242 4022 6786 -2556
1263 -2556 -10280 -4886 4664 4692 -4843 -8361 -927 5358 1379 -6096 -5017 2698 4732 -2137 -5824
1278 -5824 -434 6179 2919 -5600 -5664 3176 7643 1024 -6851 -3387 6597 7694 -1426 -7296 -1300
1293 -1300 7828 6468 -3290 -6402 1130 7123 3436 -3598 -3315 2706 4895 414 -3446 -671 3329
1308 3329 1803 -2422 -1838 2492 3070 -1725 -4173 302 4778 2343 -3728 -4019 1859 5226 385 -4734
1324 -4734 -2602 3186 4255 -1189 -4080 -504 3144 1063 -2409 -1780 1973 2082 -2090 -3206 1137
1339 1137 4226 51 -5353 -2612 4572 5342 -2676 -7879 -1908 7192 5250 -4706 -7748 480 8055
1354 8055 3312 -5909 -6591 3111 7942 1105 -6340 -3555 4575 5415 -1667 -5137 655 6206 2494
1369 2494 -4383 -3510 4225 6577 -399 -5894 -811 7367 5635 -3266 -6340 1877 8407 3590 -4999
1384 -4999 -4984 3236 7476 1276 -5474 -2750 4458 5216 -1153 -4865 -916 3623 1864 -2674 -2192 1661
1400 1661 2172 -1859 -3407 45 3129 128 -4224 -2666 2738 3483 -2486 -5831 -2199 3614 2404
1415 2404 -4174 -5549 -192 3568 372 -4781 -3947 1235 2453 -1876 -4866 -1077 2263 29 -3695
1430 -3695 -2427 2188 2454 -2635 -5486 -482 4544 1671 -5185 -5135 1990 5974 -110 -7031 -4253 4648
1446 4648 5829 -1343 -6617 -1533 5576 4432 -3027 -4815 1549 6057 2065 -4091 -2258 4145 4923
1461 4923 -1021 -3795 1358 6361 2663 -4524 -3815 4040 7242 630 -5762 -2145 6282 6766 -1390
1476 -1390 -6435 -397 7408 5033 -3050 -5077 871 6036 2313 -3713 -2831 2726 3617 -365 -3529
1491 -3529 -234 3011 544 -2610 -2087 2178 2629 -1773 -3958 -273 4197 1718 -3553 -3867 1492 4034
1507 4034 -282 -4494 -2682 2531 2584 -1916 -4239 -775 2434 572 -3481 -1960 2117 1909 -2466 -3584
1523 -3584 472 3912 440 -3950 -2977 3367 4575 -1834 -5957 -1277 5406 4333 -3582 -6040 626
1538 626 6051 2402 -4650 -4710 2576 5993 175 -4979 -2460 4123 4307 -1765 -4226 924 5294 1637
1554 1637 -4114 -2540 3916 5007 -1824 -4958 -541 5503 3193 -3736 -5020 1482 6776 1746 -5422
1569 -5422 -4011 3324 5794 -24 -5430 -1588 4177 3746 -1496 -4136 506 3690 982 -2885 -1929
1584 -1929 1896 2229 -1906 -3357 146 3034 229 -3730 -2542 2305 3530 -1288 -4792 -1262 3911
1599 3911 2822 -2759 -4265 478 3683 1289 -3022 -2306 1809 2457 -1209 -3363 -305 2390 220
1614 220 -3319 -1539 2861 2235 -2125 -4188 180 4960 2040 -4192 -4264 2543 5484 455 -5609 -2990
1630 -2990 4161 4831 -1556 -5518 -1311 4755 3077 -3365 -4283 1169 4482 546 -4397 -1862 3673
1645 3673 3824 -1792 -4260 941 5404 2027 -4290 -3027 3207 5423 -593 -5714 -2008 4724 4624
1660 4624 -2379 -5459 -135 5456 2890 -3288 -4204 1637 4754 880 -3672 -1783 2794 2994 -1123
1675 -1123 -2948 708 3361 435 -2937 -1417 2538 2647 -1935 -3333 516 4031 1510 -3352 -3097
1690 -3097 2441 4610 512 -3546 -1537 3244 3349 -1175 -2842 523 3119 1126 -2229 -1526 2211
1705 2211 2159 -1506 -2810 898 3230 576 -3570 -2356 2901 3930 -1417 -4880 -884 4675 3393
1720 3393 -3182 -4904 958 5120 1873 -4286 -3829 2672 4588 -641 -4776 -1785 3207 2415 -2414
1735 -2414 -4127 836 3829 202 -4429 -2412 3068 3482 -2350 -5064 -573 4608 2226 -4406 -5070
1750 -5070 1270 5053 351 -5395 -3858 2404 4124 -1502 -5119 -1853 3371 2643 -2839 -3564 633
1765 633 2996 212 -3021 -1415 2307 2170 -1959 -2965 600 2929 433 -3387 -2237 2713 3253 -1477
1781 -1477 -4044 -440 3723 2255 -2231 -2856 1345 4114 1055 -2610 -1151 2665 3014 -648 -2259
1796 -2259 1026 3305 1016 -2353 -798 3124 2994 -1443 -2668 1086 4923 2278 -2910 -2421 2942
1811 2942 5493 1013 -3555 -993 4557 4673 -583 -3426 309 4838 2754 -2450 -2595 2003 4217
1826 4217 265 -3759 -824 3376 2481 -2295 -3717 934 4163 790 -4243 -2993 2687 3907 -1465
1841 -1465 -5441 -1665 3754 2989 -3224 -5533 -476 3837 1202 -4445 -4304 946 3004 -1092 -4437
1856 -4437 -2533 1883 1711 -1991 -3362 92 2433 -546 -3509 -1626 2311 1988 -2128 -3753 4
1871 4 3329 642 -3640 -2977 1410 3039 -587 -3819 -1644 2667 2092 -1789 -2852 431 2475 556
1887 556 -2484 -1133 2308 2261 -1109 -2315 978 3389 1021 -3112 -1762 2880 3572 -864 -4069 -289
1903 -289 4255 3095 -2411 -3609 1270 4777 1663 -3437 -2515 2697 4305 -221 -3181 -752 3556
1918 3556 2517 -2165 -2825 1059 3068 523 -3795 -1677 2842 2935 -2288 -4336 262 4203 1665 -3850
1934 -3850 -3617 1774 4402 101 -4210 -2368 2953 3778 -1252 -4179 -499 3598 2111 -2452 -3005 1327
1950 1327 3274 -470 -2722 -731 2893 1967 -1979 -2326 1586 3720 485 -2977 -1554 2985 3323 -1111
1966 -1111 -3253 -421 3576 2050 -2600 -3077 794 2965 4 -3088 -1672 2010 1744 -1290 -2409
1981 -2409 531 2122 412 -2537 -1161 2245 2412 -2005 -2955 535 3342 941 -3289 -2702 1897 3830
1997 3830 -429 -4627 -1786 3093 3186 -1742 -4154 -173 3459 1612 -2909 -2827 1688 3199 -401 -3606
2013 -3606 -1241 3188 2130 -2577 -3625 1180 3393 228 -3934 -2425 2790 3394 -1073 -4366 -1181
2028 -1181 3825 2585 -2548 -3818 678 4146 1181 -2694 -2793 1892 3280 -611 -3141 -829 2599
2043 2599 1404 -2013 -2300 1086 2590 -62 -3087 -797 2795 2055 -1725 -2976 945 3695 567
2058 567 -3060 -2748 2178 3297 -479 -3025 -705 2930 2030 -1821 -2373 763 2979 695 -2589 -1114
2074 -1114 2340 2354 -1137 -2148 986 3104 830 -2526 -1078 2395 3288 -453 -3128 -272 3491 2546
2090 2546 -2159 -3378 739 3650 793 -3103 -1904 2161 2802 -770 -3238 -327 2669 1629 -2014
2105 -2014 -2397 1333 2969 -193 -3405 -924 3017 2109 -2298 -3510 672 3883 835 -3785 -3386 1788
2121 1788 3729 -659 -4071 -1986 3164 2837 -1566 -3198 -261 3297 1407 -2676 -2310 1392 3254
2136 3254 -507 -2669 -715 2489 1489 -2206 -2470 976 2887 60 -3120 -1520 2612 2645 -1196 -2444
2152 -2444 -86 2933 1509 -2039 -2218 1128 2863 -8 -2361 -883 1911 1396 -1354 -1961 752 2249
2168 2249 88 -2330 -849 2239 1748 -1845 -2854 640 3133 889 -3017 -2114 2085 3514 -686
2183 -686 -3737 -1268 2743 2909 -1721 -3461 39 3230 988 -2614 -2456 1378 2737 -791 -3220 -647
2199 -647 2386 1445 -1798 -2782 812 3069 431 -3211 -1731 2292 2727 -1417 -3589 -879 2969 1932
2215 1932 -2681 -3149 924 3002 381 -3086 -1724 1703 2250 -971 -2307 -227 2646 1063 -2300
2230 -2300 -1434 1644 2531 -550 -2541 -317 2580 1553 -1965 -2637 1006 3325 246 -2661 -1755 2232
2246 2232 3314 -656 -3013 -373 3043 1845 -1749 -2211 743 2688 204 -2288 -1053 1991 1786
2261 1786 -1225 -2272 401 2386 359 -2293 -1614 1754 2506 -741 -2746 -458 2542 1853 -1692 -2607
2277 -2607 713 2875 618 -2361 -1285 1975 2411 -943 -2293 137 2484 1133 -2293 -1872 1726
2292 1726 2222 -897 -3137 -822 3214 1283 -2336 -2924 1056 3629 593 -3452 -2250 2327 3427
2307 3427 -650 -3729 -1285 2888 2393 -1875 -3309 231 3277 1242 -2392 -2037 1400 2605 -354
2322 -354 -2556 -492 2411 1361 -1755 -1986 1124 2575 65 -2079 -1369 1907 1902 -977 -2431 270
2338 270 2516 938 -2311 -1724 1275 1974 -578 -2367 -681 1834 933 -1930 -2027 889 1607 -542 -2820
2355 -2820 -771 2187 1051 -2085 -2583 775 3120 303 -3267 -2080 1822 2972 -440 -3238 -896
2370 -896 2850 2658 -1796 -2973 277 2933 1425 -2100 -1857 1443 2534 -75 -2264 -674 2400 1496
2386 1496 -1489 -2205 851 2301 557 -2056 -872 2115 2147 -881 -2418 206 2705 1460 -1740 -1658
2402 -1658 940 2511 -54 -2299 -540 2092 1549 -1134 -1730 807 2437 501 -2214 -1205 2211
2417 2211 2628 -1074 -2644 340 3236 1734 -2366 -2313 1330 3264 401 -2976 -1532 2181 2361 -1011
2433 -1011 -3290 -643 2511 1416 -1804 -2405 348 2028 156 -2199 -1199 1470 1510 -1130 -2082 32
2449 32 1737 188 -2068 -1056 1323 1499 -902 -2191 -94 2328 832 -1905 -1797 976 1825 -260
2465 -260 -2469 -779 2345 1301 -1779 -2066 853 2577 119 -2528 -1475 1745 2053 -1315 -2783 -346
2481 -346 2619 1606 -2310 -2873 1033 3531 504 -3139 -1838 2091 3046 -662 -3684 -1007 2966 2194
2497 2194 -1228 -2632 261 2610 1026 -1702 -1259 1228 2031 -265 -1712 93 1823 1240 -1045 -1287
2513 -1287 1108 2063 21 -1668 -111 2085 1428 -1093 -1523 852 2326 237 -1897 -484 1583 1923
2529 1923 -655 -2024 19 2371 346 -1882 -1612 1454 2279 -564 -2703 -553 2660 1872 -1818 -2478
2545 -2478 400 2908 900 -2597 -2111 1811 3004 -453 -3056 -1561 2281 1830 -1236 -2572 11
2560 11 2580 1084 -1858 -1511 1184 1806 -448 -1659 -417 1904 942 -1385 -1354 587 1509 -476 -2173
2577 -2173 -495 1552 1152 -1201 -1907 310 2330 392 -2501 -1376 2142 1986 -883 -2318 -148 2492
2593 2492 1294 -1544 -1844 1136 2636 310 -2238 -1206 2102 2325 -1330 -2486 -216 2758 1410
2608 1410 -2464 -2676 1168 2846 617 -2348 -2122 1578 2183 -477 -2955 -837 1837 1367 -1243 -1725
2624 -1725 165 1473 51 -1568 -564 960 687 -827 -1036 756 1560 -108 -1726 -52 1393 1194
2640 1194 -868 -1808 664 2038 477 -2042 -1353 1564 2246 -536 -2348 -391 2741 1340 -1697 -2143
2656 -2143 440 2437 159 -2307 -1457 1747 2234 -514 -2832 -484 2504 1647 -1623 -2602 784 3210
2672 3210 926 -2003 -1773 1315 2353 40 -2496 -678 2160 1790 -807 -1775 244 1849 491 -1402
2688 -1402 -795 993 1242 -710 -1272 443 1481 311 -1184 -704 1062 1264 -1000 -2180 98 2009
2704 2009 973 -1946 -1694 1215 2041 -235 -2448 -1078 2261 1625 -1421 -2250 202 2311 697 -1839
2720 -1839 -1858 1249 2298 -272 -2165 -983 1868 1569 -1101 -2147 181 2352 871 -1891 -1663 1011
2736 1011 2190 -171 -1991 -1045 1548 1875 -706 -2010 -104 1296 579 -972 -987 1015 986 -466 -1204
2753 -1204 74 1344 299 -1485 -891 1365 1541 -745 -1899 -191 2257 928 -1862 -1733 1080 2372
2769 2372 78 -1931 -1471 1844 1882 -909 -2684 -110 2397 1295 -1818 -2008 808 2352 35 -2248
2785 -2248 -1418 1651 2057 -1056 -2480 -25 2385 1196 -1471 -1871 830 2150 16 -1766 -1220 1333
2801 1333 1540 -523 -1648 -291 1369 700 -1027 -1005 543 1137 -319 -1360 -19 1458 406 -1408
2817 -1408 -1197 966 1222 -568 -1771 -372 1906 1050 -1517 -1821 683 2509 568 -2324 -1303 1366
2833 1366 2264 -643 -2194 -471 1927 1190 -1490 -1954 405 2324 555 -2062 -1323 1357 2275 -493
2849 -493 -1987 -317 1969 1377 -1477 -1884 637 2115 528 -1909 -1463 1220 1490 -449 -1883 -310
2865 -310 1231 815 -1272 -1227 489 1248 29 -1362 -347 1389 488 -1358 -1184 522 1686 98 -1599
2882 -1599 -481 1874 1301 -1011 -1838 552 2389 1017 -1695 -1686 1094 2104 -200 -2311 -765 1808
2898 1808 1687 -943 -2356 -146 2096 963 -1595 -1988 900 2160 -236 -2049 -988 1501 1125 -1353
2914 -1353 -1542 262 1728 216 -1665 -1359 1064 1564 -286 -1345 -165 1271 1043 -991 -1296 202
2930 202 1253 59 -1558 -112 1296 658 -831 -1302 413 1344 -207 -1538 -769 1463 1276 -995
2946 -995 -2054 -181 1952 832 -1626 -1963 765 2051 221 -2224 -1052 1516 1793 -503 -1959 68
2962 68 1837 1185 -1298 -1689 512 2031 229 -1798 -1071 1390 1494 -588 -1932 -20 1851 541
2978 541 -1471 -1062 630 1721 -353 -1515 -507 1379 1108 -798 -1645 310 1458 30 -1092 -832
2994 -832 940 1047 -762 -1466 178 1469 263 -1463 -968 1315 1460 -397 -1961 -377 1956 1291
3010 1291 -1229 -1880 410 2133 267 -2008 -1071 1281 1883 -519 -2001 -666 1866 1170 -1176 -1816
3026 -1816 447 1964 611 -1877 -1030 1346 1407 -526 -1555 -130 1566 951 -1129 -1104 661 1552 -39
3043 -39 -1816 -946 1280 1265 -731 -1342 126 1795 160 -1207 -744 678 1232 -467 -1456 1 1664
3060 1664 350 -1243 -890 1302 1543 -47 -1773 -527 1475 1230 -954 -2040 540 2100 580 -1784
3076 -1784 -1706 942 1969 -199 -2035 -801 1432 1011 -1080 -1742 63 1338 531 -1263 -1138 885
3092 885 1451 -171 -1345 -478 1326 1266 -800 -1556 693 1449 139 -1556 -602 1183 1103 -293 -1625
3109 -1625 247 1592 483 -1005 -1149 1087 1111 -240 -1384 -192 1411 855 -1116 -1617 711 1670
3125 1670 218 -1605 -624 1546 1755 -890 -2181 69 2069 606 -1334 -1581 572 1983 164 -1749
3141 -1749 -1110 1525 1496 -718 -1443 -317 1724 1074 -1144 -1125 598 1381 -156 -1531 -522 1306 797
3158 797 -976 -1291 181 1571 298 -1045 -1081 1283 1129 -264 -1563 -7 1526 683 -1168 -1421 396
3175 396 1625 72 -1396 -537 1134 941 -981 -1452 319 1574 411 -1414 -1023 1193 1296 -510
3191 -510 -1977 15 1588 958 -1329 -1391 499 1567 364 -1793 -1196 1080 1767 -114 -1939 -278
3207 -278 1315 763 -1072 -1503 459 1401 236 -1395 -757 1226 1120 -842 -1168 -179 1398 621 -1345
3224 -1345 -1029 1158 1506 -569 -1389 -471 1306 968 -1076 -1173 561 1555 131 -1308 -709 862 1256
3241 1256 -435 -1590 121 1374 470 -1380 -1372 1090 1535 -261 -1599 -605 1515 1318 -1030 -1823 56
3258 56 1498 353 -1480 -1218 1057 1400 -195 -1661 -471 1224 1104 -671 -1366 113 1617 481
3274 481 -1377 -761 945 1157 -632 -1667 -117 1393 885 -955 -1385 964 1136 11 -1656 -711 1245
3291 1245 855 -589 -1372 277 1507 559 -1708 -982 1018 1392 -583 -1448 -159 1359 1073 -1090 -949
3308 -949 651 1231 10 -1604 -737 1197 1047 -652 -1606 3 1420 424 -1321 -1400 526 1408 -174
3325 -174 -1625 -704 1258 1129 -1119 -1190 53 1668 519 -1653 -702 909 948 -507 -1252 220 1510
3342 1510 504 -973 -1120 715 1409 44 -1394 -467 878 1348 -621 -1631 344 1043 654 -1451
3358 -1451 -843 862 1533 -385 -1299 -599 1084 810 -1052 -1354 230 1730 323 -1230 -932 1311 1452
3375 1452 -784 -1366 -389 1096 753 -1137 -1397 544 1606 158 -1429 -996 1069 1098 -591 -1350 -212
3392 -212 1215 668 -1119 -1077 654 1123 -208 -981 -304 1297 942 -962 -1227 258 1101 180 -1178 -552
3410 -552 1099 1116 -451 -1225 -305 1577 949 -1096 -1349 736 1091 230 -1193 -596 814 934 -721 -1419
3428 -1419 220 1474 287 -1213 -786 662 1140 -313 -1400 11 1327 1015 -886 -1299 486 1796
3444 1796 119 -1013 -632 761 1400 -327 -1139 -69 1353 589 -931 -1191 744 1047 149 -1096 -350
3461 -350 1000 653 -852 -1262 399 1270 233 -1165 -951 1008 1304 -408 -1790 -255 985 802 -1110
3478 -1110 -1169 275 1547 383 -1198 -772 656 1139 -200 -1193 -131 1227 648 -1233 -1121 446 1354
3495 1354 155 -1129 -118 996 824 -671 -1530 95 1301 233 -1401 -927 886 1387 -220 -1155
3511 -1155 -452 1321 807 -1017 -776 465 1374 -37 -1049 -569 930 1120 -508 -1052 -132 1290 196
3528 196 -1415 -663 917 1139 -188 -1299 -561 1201 1077 -721 -1391 419 1220 451 -1089 -700 750
3545 750 1405 -639 -1259 -171 1042 833 -1150 -936 387 1308 -247 -840 -440 847 1295 -566 -974
3562 -974 214 1349 327 -1089 -1014 812 1551 16 -1152 -556 1212 902 -686 -1227 9 1254 404
3579 404 -1078 -653 677 938 -257 -1203 -80 920 753 -743 -815 678 1260 -87 -1516 -674 979
3596 979 909 -589 -1260 -341 1000 276 -1192 -747 324 1337 -14 -1501 -479 805 908 -549 -816
3613 -816 31 1017 591 -1510 -753 719 1402 -349 -1314 -280 1354 568 -1203 -883 482 939 431 -1456
3631 -1456 -708 907 1003 -619 -1311 113 1217 710 -1089 -993 559 842 -81 -1048 -344 826 838 -606
3649 -606 -785 183 1350 360 -1268 -731 816 1253 -516 -1224 -215 962 388 -985 -983 502 1156 -6
3667 -6 -1190 -540 925 940 -732 -1114 216 1089 186 -987 -600 949 1001 -121 -1486 29 1089 538
3685 538 -674 -1016 313 1253 295 -932 -610 768 992 -344 -1087 -198 1177 246 -996 -760 321
3702 321 641 52 -1098 -253 918 695 -645 -818 241 1073 314 -1152 -836 1032 891 -680 -1119 -257
3720 -257 985 633 -752 -879 350 1293 43 -1071 -586 839 823 -486 -973 -110 838 546 -961 -798
3738 -798 826 921 129 -1255 -477 1069 688 -706 -1076 109 1437 595 -941 -871 595 1434 -85 -1260
3756 -1260 -37 1321 678 -722 -862 134 841 193 -1090 -721 950 937 -566 -1143 31 1380 300
3773 300 -804 -988 771 1171 -208 -1026 -366 1141 696 -461 -1157 202 1354 424 -761 -847 702
3790 702 583 -407 -1001 -236 1435 595 -928 -972 285 1206 -113 -1040 -387 653 818 -427 -1159 -195
3808 -195 1159 211 -1304 -982 675 1063 -444 -1050 -292 725 776 -619 -887 467 1307 320 -886 -607
3826 -607 623 614 -293 -812 -149 1173 794 -804 -1035 502 902 57 -1167 -533 659 769 -624 -1106
3844 -1106 38 1447 413 -890 -698 660 1111 -151 -1039 -450 896 692 -240 -1106 502 972 -42
3861 -42 -890 -706 482 771 -377 -971 -67 1043 157 -761 -723 330 911 -130 -1268 -781 608 823
3879 823 -185 -809 -63 680 205 -841 -677 774 859 -86 -1143 -174 829 557 -728 -602 192 1096
3897 1096 -32 -1134 -427 703 901 -448 -1007 -164 809 384 -792 -947 251 909 -57 -1049 -407 926
3915 926 886 -501 -1264 278 1074 416 -925 -750 501 1137 62 -908 -257 815 944 -554 -896 341
3933 341 1080 106 -1072 -601 868 1048 -584 -734 251 1059 559 -590 -466 381 1138 -23 -1296 -236
3951 -236 847 582 -828 -932 286 1078 365 -911 -467 617 987 -16 -757 0 1024 742 -530
3968 -530 -841 228 780 -110 -1006 -533 575 757 -224 -946 -125 907 265 -768 -806 317 865 -216
3986 -216 -1202 -334 583 563 -483 -886 257 806 296 -836 -541 347 1220 -150 -872 -284 893 511 -652
4005 -652 -717 81 901 236 -557 -711 885 645 -485 -1032 44 756 92 -869 -491 558 777 14 -868
4024 -868 -409 1140 688 -687 -973 335 996 -152 -984 -655 661 491 -427 -974 -31 912 439 -772
4042 -772 -877 318 888 157 -912 -555 343 684 -418 -879 233 827 54 -840 -611 25 919 -276
4060 -276 -890 -256 611 581 -219 -568 365 968 120 -664 -706 479 1026 -469 -1061 92 508 308 -798
4079 -798 -720 371 1174 95 -819 -330 858 338 -510 -746 13 690 220 -784 -652 492 640 210 -770
4098 -770 -386 623 161 -441 -827 302 638 32 -664 -544 663 444 -222 -892 -42 1080 440 -804
4116 -804 -841 219 873 -300 -647 -351 486 1015 -539 -843 35 894 210 -852 -551 326 904 102 -870
4135 -870 -179 654 563 -342 -765 260 767 153 -936 -484 510 423 -512 -749 109 445 318 -620 -768 380
4155 380 589 151 -785 -355 946 359 -430 -681 -224 871 204 -952 -486 268 561 -103 -780 -166 533
4174 533 477 -525 -731 377 1058 170 -744 -777 466 642 -323 -913 114 952 434 -509 -518 422 792 180
4194 180 -732 -366 497 637 -334 -554 199 1170 596 -708 -556 547 806 -313 -711 116 835 414 -250
4213 -250 -576 272 1095 87 -915 -463 592 459 -169 -910 162 1005 207 -737 -717 158 678 -321 -962
4232 -962 -217 654 597 -384 -743 -53 745 -138 -632 -882 506 631 -304 -983 -228 597 501 -648 -1117 185
4252 185 560 240 -929 -497 583 403 -146 -869 -302 818 772 -377 -99 645 776 -170 -738 -371 1022
4271 1022 411 -577 -749 135 624 124 -567 -367 781 749 -127 -613 -163 586 368 -639 -557 156 639 291
4291 291 -699 -603 520 519 -189 -788 -289 555 575 -631 -525 226 641 -106 -778 -250 587 520 -612 -956 -3
4312 -3 857 228 -661 -658 678 759 -280 -1108 -287 515 406 -729 -709 287 899 -37 -515 -476 545 547 -534
4333 -534 -779 205 1068 314 -650 -584 521 782 -212 -528 -508 654 81 -512 -772 221 804 103 -799 -532
4353 -532 410 421 -263 -642 -231 875 500 -533 -533 505 1015 172 -626 -513 747 650 -504 -866 168
4372 168 719 174 -842 -345 238 710 -123 -791 -399 657 495 -281 -601 360 694 108 -763 -511 689
4391 689 611 -217 -779 -218 717 315 -799 -751 387 741 -89 -823 -407 461 919 -349 -979 145 643
4410 643 280 -225 -494 316 565 -214 -941 -17 632 669 -683 -688 269 980 94 -725 -438 674 912 -381
4430 -381 -786 -140 1057 499 -591 -821 391 697 -122 -688 -132 433 518 -212 -736 -55 867 225 -631
4449 -631 -255 557 529 -108 -1039 -154 577 637 -427 -940 329 449 47 -649 -555 521 647 -22 -683 249
4469 249 822 444 -686 -544 269 623 -243 -807 -287 757 463 -404 -943 64 862 -19 -716 -646 619
4488 619 1060 160 -903 -201 661 652 -465 -442 122 944 37 -676 -194 395 484 -194 -875 -76 366 172 -392
4509 -392 -801 95 1039 -288 -717 -276 470 594 -590 -902 85 808 95 -499 -188 394 645 171 -645
4528 -645 -141 904 149 -454 -775 4 682 50 -1114 -294 570 615 -468 -894 24 682 677 -719 -350 411
4548 411 742 -262 -762 -429 737 390 -503 -651 -25 606 158 -759 -409 305 433 -283 -788 -150 719
4567 719 355 -441 -507 502 816 97 -819 -290 815 509 -344 -802 130 337 242 -441 -625 315 632 -397
4587 -397 -778 -577 470 405 -288 -767 44 770 125 -937 -421 453 884 -138 -633 142 616 279 -225
4606 -225 -908 438 866 -210 -592 -181 719 628 -504 -333 179 835 458 -296 -734 410 469 -347 -778
4625 -778 -247 730 523 -324 -632 130 981 13 -683 -442 594 717 -115 -554 -161 774 574 -402 -466 386
4645 386 577 78 -792 -499 587 706 -194 -419 -303 454 207 -731 -511 456 489 -189 -774 122 706 566
4665 566 -371 -889 245 1091 -140 -599 -520 568 664 -274 -686 -276 926 588 -559 -732 379 769 183
4684 183 -668 32 556 848 -642 -536 402 818 238 -751 -336 514 792 -305 -751 27 757 282 -446
4703 -446 -669 256 700 68 -577 -131 609 443 3 -1054 247 638 71 -490 -639 394 480 -190 -541
4722 -541 -293 479 254 90 -678 -28 501 239 -573 -379 654 680 -102 -950 -275 695 609 -704 -407 595
4742 595 653 519 -673 -409 686 797 -561 -747 108 490 64 -752 -654 643 806 -108 -387 -227 394
4761 394 -27 -297 -524 238 817 286 -472 -613 546 787 -251 -608 87 677 212 -201 -473 191 773
4780 773 208 -538 -269 723 465 -111 -563 212 846 520 -417 -361 178 915 131 -655 -56 668 535 -458
4800 -458 -787 32 1140 94 -564 -577 397 711 -18 -786 -203 438 334 -581 -401 340 493 7 -452 -352
4820 -352 580 507 -572 -756 456 613 -5 -789 -671 269 591 202 -790 -131 443 634 -494 -464 47 448
4840 448 107 -572 -139 295 426 -433 -546 -411 848 260 -496 -573 398 656 97 -836 -341 581 248 -268
4860 -268 -803 363 733 270 -450 -253 206 493 -43 -613 -49 466 574 -370 -479 279 882 184 -708 -449
4880 -449 591 455 -288 -479 15 627 397 -284 -655 194 725 307 -567 -276 413 253 -650 -788 -90 578
4900 578 220 -681 -404 364 355 -23 -466 -180 1083 313 -435 -540 605 661 25 -615 -490 639 307 -186
4920 -186 -829 100 962 444 -729 -592 251 658 -272 -901 -1 886 454 -207 -583 95 649 371 -346 -301
4940 -301 653 576 -269 -699 5 777 306 -347 -448 231 775 113 -600 -571 768 258 -125 -369 46 752
4960 752 245 -471 -494 377 673 -212 -384 21 616 407 -625 -801 39 822 92 -514 -264 939 584 -344
4980 -344 -913 -33 779 159 -197 -534 320 734 168 -792 -191 383 422 -2 -446 -158 737 246 -647 -243
5000 -243 261 645 -396 -844 -475 502 273 -427 -724 33 466 -123 -776 -437 380 615 -318 -755 372
5019 372 487 400 -557 -404 434 788 -37 -611 -219 396 658 -362 -561 185 658 422 -582 -268 519 739
5039 739 -235 -485 -185 564 198 -188 -356 -10 454 311 -495 -314 389 549 34 -444 -236 548 170 -329
5059 -329 -371 42 575 -77 -701 -316 659 49 32 -503 -227 557 268 -717 -474 623 786 164 -573 -265
5079 -265 475 558 -452 -330 299 579 3 -669 -509 482 584 -290 -742 2 677 559 -313 -632 518 584
5099 584 -58 -940 -20 430 403 -354 -393 -207 454 235 -727 -353 126 440 -265 -584 -301 644 289 -534 -348
5120 -348 170 492 181 -254 -193 277 512 -450 -524 112 646 277 -609 -480 355 840 -71 -724 -279 429 528
5141 528 -364 -666 99 488 366 -427 -583 445 534 22 -421 -376 890 485 -422 -619 230 570 266 -518
5161 -518 -99 417 641 -227 -259 -127 775 890 -591 -199 356 521 25 -764 -458 642 554 -561 -285 115
5181 115 472 235 -578 -662 269 287 -349 -614 164 524 566 -990 -458 -45 696 29 -520 -238 374 386 -254
5202 -254 -486 -102 807 320 -616 -541 139 510 216 -704 -413 782 500 -349 -753 62 707 -148 -584 -554
5222 -554 645 410 -223 -528 -42 429 278 -719 -423 268 502 -17 -585 -496 36 113 -70 -470 -207 318
5242 318 259 -529 -17 442 419 -64 -506 -255 546 466 -500 -434 -205 436 301 -665 -365 296 146 -615 -877
5263 -877 -27 375 251 -576 -802 211 735 109 -756 -570 378 396 -329 -705 -77 235 227 -353 -481 72 294
5284 294 116 -498 -254 567 600 -32 -283 3 584 174 -428 -434 461 436 -258 -531 45 457 36 -286 -523
5305 -523 -185 502 2 -708 -312 742 248 -317 -690 245 802 -272 -441 -566 83 496 -136 -619 41
5324 41 715 618 -577 -641 -13 535 245 -301 -509 474 341 -131 -548 -164 773 278 -600 -370 106 323 -8
5345 -8 -94 -126 90 241 -404 -819 75 361 106 -504 -272 575 339 -98 -600 -68 467 339 -343 -489 460
5366 460 625 65 -433 -193 441 292 -397 -625 -32 501 195 -489 -567 110 704 35 -510 -293 571 545 -439
5387 -439 -450 209 528 466 -815 -750 356 151 -11 -629 -191 579 256 -393 -104 230 696 -90 -589 -340
5407 -340 420 308 -484 -572 -166 148 531 -383 -294 343 297 97 -763 68 509 438 -326 -268 343 626 204 -709
5429 -709 -449 390 749 -115 -337 284 662 114 -378 -839 306 757 204 -375 -241 501 317 -295 -494 131
5449 131 526 223 -175 -620 485 601 -30 -595 -522 293 203 -169 -736 273 637 256 -642 -195 322 515
5469 515 -282 -252 -81 426 351 -518 -409 283 486 100 -418 -22 669 335 -17 -352 138 655 150 -242 -343
5490 -343 339 502 -161 -720 -194 296 176 63 -382 89 120 -69 -428 -638 511 395 -142 -618 -159 641
5510 641 110 -522 -567 257 401 -4 -931 -653 456 173 -274 -475 -207 686 2 -436 -440 137 571 -139 -661
5531 -661 -217 590 523 -108 -471 140 294 103 -277 -499 469 531 -487 -396 -209 360 142 -632 -85 166 684
5552 684 -126 -632 -369 468 325 -358 -466 107 593 -100 -519 -281 406 562 -151 -534 -23 687 334 -422
5572 -422 -524 324 539 441 -426 -223 189 628 101 -635 43 536 359 -363 -277 356 671 81 -651 -184 545
5593 545 421 -145 -742 111 467 317 -405 -199 425 417 134 -497 -42 411 299 -558 -873 540 404 -57
5613 -57 -625 9 561 312 -202 -359 -148 381 387 -646 -302 177 738 -86 -518 -448 212 450 -375 -671 196
5634 196 750 204 -312 -359 315 10 60 -308 110 604 507 -518 -370 319 329 188 -296 -204 450 346 -94
5655 -94 -526 -95 579 424 -386 -160 314 650 -80 -1049 144 693 430 -257 -628 -74 734 154 -236 -431
5675 -431 61 705 -613 -528 302 490 312 -653 -556 73 656 -30 -542 -128 560 287 -208 -130 -296 756
5695 756 -13 -211 -443 105 773 -55 -248 -517 371 272 -227 -489 -2 387 -186 -343 -95 285 248 -61 -263
5716 -263 168 406 129 -302 -263 144 468 -177 -603 -249 316 315 -174 -296 -114 300 296 -536 -591 289 892 -82
5738 -82 -573 -248 476 476 -243 -268 -89 545 170 -531 -510 300 480 -384 -637 -223 564 367 -402 -550 177 153
5760 153 115 -490 -295 131 374 -106 -497 -13 647 34 -496 -291 2 568 -231 -458 95 586 410 -426
5780 -426 -346 211 622 11 -417 -425 393 314 -298 -507 299 795 267 -131 -196 116 703 -112 -522 -102 492 689
5802 689 -432 -525 -179 279 99 -363 -29 165 900 7 -643 -426 606 685 -306 -204 244 449 63 -529
5822 -529 -403 242 413 -100 -360 -22 446 326 -431 -509 399 635 149 53 -164 525 197 -357 -462 160 643
5843 643 366 -475 -243 48 341 -43 -470 -63 526 94 -397 -526 228 756 -91 -668 -337 228 421 -327
5863 -327 -287 -185 437 294 -767 -345 358 644 -24 -592 -223 344 554 -221 -713 -8 532 79 -130 -464
5883 -464 217 524 -321 -449 184 778 119 -538 -573 331 469 108 -504 95 322 542 -208 -374 62 470
5903 470 176 -329 -203 121 571 -150 -589 -523 423 688 -272 -407 -154 561 239 -480 -47 70 584 -18
5923 -18 -246 95 253 282 -563 -437 250 639 -146 -502 -264 284 364 -389 -528 160 346 196 -298 -112 476
5944 476 487 107 -402 223 466 114 -304 -134 9 425 -165 -527 -136 181 441 -40 -620 -129 162 325
5964 325 -256 -474 -7 846 198 -837 -108 288 731 -175 -159 202 532 392 -632 -251 34 223 -64 -621
5984 -621 -323 381 180 -429 -480 -99 383 67 -433 -98 240 409 -231 -718 -46 400 23 -352 -56 -56 756
6005 756 65 -398 -155 109 91 -213 -547 170 529 141 -765 -342 237 59 196 -665 62 474 396 -381 -427
6026 -427 17 312 61 -621 -383 34 357 -147 -897 -171 575 287 -117 -392 232 567 -153 -505 -349 189
6046 189 428 24 -849 241 810 -37 -350 -165 60 377 -161 -536 4 588 216 -298 -480 -113 563 -39
6066 -39 -433 100 517 591 71 -588 -167 459 176 -245 -347 -8 576 -35 -413 -159 207 742 -440 -715
6086 -715 -84 446 284 -313 -14 231 579 58 -497 -224 509 225 -297 -375 -74 714 -74 -623 -80 533
6106 533 511 -215 -510 36 378 254 -452 -300 415 366 163 -534 -297 225 -6 -441 -396 96 335 5 -436
6127 -436 -154 296 218 -135 -504 -535 589 42 -338 -276 119 363 315 -461 -428 423 404 -312 -355 -190 304 337
6149 337 -181 -330 371 368 -39 34 -261 567 534 -394 -686 -66 525 231 -430 -240 379 372 1 -569 48 475
6171 475 284 -451 -462 230 322 240 -231 -179 485 748 -234 -388 288 410 50 -280 -337 63 320 -4 -464 -50
6193 -50 795 43 -293 -111 -41 573 -100 -354 -75 646 316 -378 -263 71 541 294 -428 -555 135 340 -20
6214 -20 -506 -355 445 -36 -5 -655 187 471 349 -211 -434 70 380 52 -600 -111 323 492 -325 -360 -23
6235 -23 442 -94 -344 -493 497 535 -32 -518 -200 324 7 -298 -424 83 477 236 -334 43 471 411 -335
6256 -335 -524 -151 427 295 -165 -266 415 715 -80 -445 -163 571 368 -167 -521 178 306 136 -423 -237
6276 -237 209 505 -75 -380 81 237 229 -491 -359 149 384 -276 -348 -168 557 376 -72 -805 -95 403 -99
6297 -99 -638 -563 442 182 -134 -298 -253 819 246 -471 -592 -32 354 -132 -749 -281 200 237 19 -462 223
6318 223 688 148 16 -178 102 371 -86 -646 -178 588 210 -119 -165 -1 444 55 -340 -377 79 335 -101
6339 -101 -649 -144 326 272 118 -81 256 545 45 -449 -304 321 452 -175 -365 6 717 342 -433 -377 39
6360 39 634 186 -202 -223 395 244 -270 -642 163 379 -175 -319 -257 168 537 -51 -688 1 803 581 -693
6381 -693 -108 167 388 108 -112 -16 528 334 -130 -520 25 453 402 -461 -331 267 269 -104 -563 -280 131
6402 131 207 -268 -503 35 401 253 -546 -324 293 389 188 -735 -382 145 292 -21 -442 172 605 -29 -613
6423 -613 -165 126 424 -4 -485 -296 279 143 -636 -444 305 435 -278 -460 -242 557 320 -328 -568 47
6443 47 341 185 -312 -461 100 495 -69 -276 -139 605 198 -714 -250 355 375 48 -534 -11 503 386 -43
6464 -43 -655 -79 622 11 -431 -371 57 299 47 -921 -15 441 260 -170 -505 -161 291 2 -516 -360 172
6485 172 317 -300 -388 -372 201 150 -281 -382 -99 232 38 -330 -352 375 511 -417 -551 382 599 -54 -746
6506 -746 -165 176 417 -233 -452 57 839 266 -311 -409 21 537 -119 -384 -413 260 440 -102 -377 143 403
6527 403 350 -97 -252 417 222 110 -368 -633 309 77 -10 -216 206 310 266 -307 -320 434 662 -77 -432
6548 -432 -233 7 314 -387 1 147 380 -207 -295 -217 425 520 -92 -532 -84 560 333 -588 -481 339 180
6569 180 89 -617 173 430 418 31 -714 52 440 271 -468 -399 235 246 -154 -565 -140 664 253 -400 -379 195
6591 195 400 87 -391 -79 361 651 -250 -727 -585 26 -14 -308 -783 31 314 115 -600 -506 465 701 -252
6612 -252 -617 150 259 182 -381 -520 29 428 23 -428 -4 427 201 -493 -381 -47 580 -88 -406 244
6632 244 212 195 -112 -331 157 601 232 -290 36 219 382 -308 -532 -247 614 255 -582 -459 80 650 304
6653 304 -588 -4 408 677 -171 -394 -12 296 413 -488 -69 346 407 -142 -279 -45 458 548 -35 -269 197
6674 197 575 294 -480 -251 256 495 114 -136 -225 289 280 -251 -452 14 305 352 -494 -193 525 421 -339
6695 -339 -617 -253 447 485 -161 -507 297 323 189 -381 -349 581 258 81 -573 75 255 314 -224 -329 251
6716 251 491 -173 -173 176 137 325 -549 -591 28 427 -147 -346 -353 174 508 -104 -279 -83 728 511 -464 -349
6738 -349 216 524 243 -656 115 46 426 -539 -440 221 432 336 -167 -589 -58 406 -246 -687 139 479 201
6759 201 -296 -728 20 260 266 -556 -129 504 299 -46 -572 -458 371 -23 -81 -655 56 398 19 -677 -220
6780 -220 367 457 -145 -329 -14 517 86 -388 -217 338 376 -30 -735 41 701 203 -316 -405 -54 776 384
6801 384 -288 -98 119 443 -214 -683 -14 521 207 -643 -248 -12 413 132 -600 -67 143 493 -151 -508
6821 -508 246 426 192 -40 -237 63 553 6 -549 -28 537 110 -303 -410 257 433 24 -47 -54 410 246
6842 246 -271 -536 9 655 67 -373 -416 268 292 -307 -760 -76 462 -51 -173 -477 -30 471 138 -81 -179
6863 -179 271 506 -47 -654 14 214 474 -536 -139 97 393 -80 -407 25 318 220 -180 -438 280 266
6883 266 97 -29 -388 7 446 272 -639 -165 673 321 -167 -365 105 565 177 -479 -719 146 468 -399
6903 -399 -485 -208 584 462 -508 -361 44 372 155 -347 -186 463 601 -446 -609 2 597 42 -215 -445
6923 -445 181 212 29 -529 -163 369 225 -358 -448 -44 408 47 -451 -342 108 461 -91 -519 191 93 177
6944 177 -9 -52 -244 510 233 -383 -26 205 -7 -241 -736 -171 452 101 -391 -501 172 296 -220 -715
6964 -715 -35 497 127 -112 -539 246 466 99 -252 -427 30 189 75 -729 32 522 10 -346 -451 63
6984 63 332 227 -368 -118 41 210 -29 -610 11 615 361 -711 -355 169 541 244 -703 2 317 311 39
7005 39 -664 71 408 7 -253 -177 255 359 -318 -448 -479 520 -75 -171 -681 193 461 340 -742 -214 570
7026 570 284 -235 -327 28 244 339 78 -367 234 600 -91 -463 -210 327 341 -190 -535 40 480 171 -576
7047 -576 -226 84 501 -62 -503 42 374 252 -284 -404 162 448 70 -193 -326 473 361 -252 -331 -132
7067 -132 363 217 -333 -103 151 300 -47 -715 -164 240 178 -540 -664 131 338 -8 -579 -77 327 421 -370
7088 -370 -525 -261 663 457 -381 -389 459 250 -135 -252 -204 339 319 15 -569 334 312 171 -328 -170 66 312
7110 312 -189 -326 -251 385 201 -404 -388 -87 493 -148 -539 -479 308 478 145 -220 109 298 395 -317 -362 177
7132 177 226 -224 -385 -172 352 579 -189 -399 228 36 21 -99 -203 206 104 13 -522 -270 546 326 -326
7153 -326 -625 225 527 46 -222 -139 286 71 -107 -382 -125 175 381 -516 -632 5 583 -58 -369 -233
7173 -233 317 369 50 -147 -54 396 273 -533 -380 195 438 55 -539 -27 569 55 -286 -299 284 572 176
7194 176 -152 -266 512 185 -243 -587 88 408 10 -195 -215 563 357 171 -245 -103 441 439 -229 -724 294
7215 294 171 89 -197 -73 84 287 42 -368 -364 170 303 43 -283 74 584 -17 -439 -156 500 287 -221
7236 -221 -510 22 363 -52 -292 -261 -39 288 200 -365 -8 302 343 -16 -341 200 591 -113 -333 -188 317
7257 317 437 295 -357 -289 564 87 -220 -124 56 735 -1 -470 -353 359 485 -293 -139 -146 287 12 -218
7278 -218 -480 225 347 -115 -509 -141 141 39 -694 -298 -78 461 289 -325 -470 270 392 143 -384 51
7298 51 502 254 -362 -317 -128 368 -104 -323 -170 455 540 -136 -551 44 621 103 45 -529 -85 497 -192
7319 -192 -134 -313 692 186 -392 -109 33 1 31 -74 -136 323 395 -271 -386 -20 427 290 -210 -434 174
7340 174 248 304 -342 -201 -85 379 -139 -315 -19 533 -23 -276 -148 -94 405 -43 -695 -181 599 330 14
7361 14 -437 135 140 287 -148 -265 219 527 -154 -237 76 319 442 -505 -485 239 464 89 -335 -274 417 449
7383 449 -190 -536 65 341 285 -174 -270 362 494 -268 -173 156 622 361 -176 -251 -134 211 239 -316 -132 185
7405 185 425 -151 -508 71 592 328 -116 -534 181 801 81 -325 -240 91 306 28 -342 -119 666 71
7425 71 -403 -360 0 369 -285 -476 -151 425 240 -264 -224 -23 505 333 -335 -62 334 508 -266 -423 -194
7446 -194 313 219 -311 -386 122 546 -110 -470 -250 171 347 -278 -530 -7 686 -40 -88 -89 117 42 146 -288
7468 -288 -171 578 132 -376 -521 -41 458 47 -272 -113 389 600 -313 -375 0 866 155 -392 -350 257 531
7489 531 163 -254 -210 21 390 -144 -345 -177 701 56 -568 -459 -238 301 -209 -112 133 276 201 -166 -438
7510 -438 262 498 162 -197 -204 292 174 -36 -517 84 448 375 -292 -242 168 461 -13 -457 -325 511 255
7531 255 -193 -472 71 659 72 -275 -372 -39 375 52 -518 -30 240 156 -525 -304 479 396 12 -241 -317
7552 -317 290 335 -157 -269 5 489 136 -340 -92 23 465 -196 -236 -145 223 141 -222 -213 -109 204 110 -357
7574 -357 -251 437 263 42 -222 -371 327 347 -320 -137 -250 414 -60 -211 -143 33 -61 -308 -470 -5 464
7595 464 -20 -223 -239 168 414 -279 -610 -157 586 309 -296 -658 194 570 59 -449 -106 -210 524 -181
7615 -181 -488 -397 453 251 61 -421 142 374 -99 -386 -408 336 334 -308 -346 -61 300 200 -562 -386 -75 459
7637 459 -262 -596 -61 165 292 -252 -414 -117 423 92 -329 -230 12 615 -361 -537 -14 480 192 -143
7657 -143 -444 450 345 -55 -455 -342 -133 247 -259 -306 175 360 69 -362 -402 193 126 -201 -408 -154 339
7678 339 259 -355 -534 293 212 20 -532 -131 18 657 -291 -173 -38 62 226 -486 -198 288 691 -391
7698 -391 -417 -15 445 119 -86 -616 -62 322 346 -259 -336 236 253 -112 -447 14 277 57 -239 -252 192 432
7720 432 -14 -681 -558 594 527 4 -277 -21 326 189 -161 -14 -141 679 130 -233 -57 44 -12 -450
7740 -450 -641 59 240 6 -412 13 184 400 186 -352 -149 632 369 -390 -281 303 304 163 -295 -343 274
7761 274 80 63 -261 263 493 217 -266 -78 189 479 -209 -731 -87 409 541 -213 -738 -53 527 278
7781 278 -185 -238 35 346 37 -399 -168 187 146 -483 -300 -213 210 -66 -398 -105 344 -233 84 -560 -190
7802 -190 427 343 -201 -303 293 153 -274 -608 -196 174 258 -61 -265 93 -108 101 -353 -65 46 505 -168
7823 -168 -344 43 247 463 -80 -183 92 413 -4 -679 -284 144 359 -262 -31 40 336 199 -198 -764
7843 -764 382 230 -302 -539 -262 476 198 -348 -239 142 271 -94 -749 -321 167 559 -81 -382 -5 290
7863 290 176 -348 -306 68 424 -153 -463 -39 260 395 -280 -571 72 216 230 -397 -568 210 252 46 -92
7884 -92 -95 206 335 -214 -497 131 452 153 -545 0 301 335 -82 -258 151 150 200 -447 -144 317 286 222 -615
7907 -615 -42 358 137 -147 -277 -90 416 20 -23 -241 213 344 -322 -181 38 310 274 -150 -329 248 319
7928 319 225 -342 -158 190 478 3 -469 27 560 347 -303 -136 45 197 102 -259 -91 107 309 -386 -201
7949 -201 72 473 112 -718 -275 143 345 -40 -424 -67 131 169 -373 -659 -163 536 122 -548 -18 239
7969 239 494 -385 -539 182 292 61 -244 -496 40 444 52 -602 90 255 187 -234 -393 41 213 320
7989 320 -318 -543 362 127 125 -153 -232 137 443 -353 -380 -66 459 158 -518 -37 366 481 -445 -543 254 204
8011 204 107 -347 -475 -12 493 -9 -87 -202 212 158 -218 -438 -10 315 117 -341 -381 78 620 178 -567
8032 -567 -300 302 153 -166 -399 58 459 177 -280 2 341 232 -98 -191 24 631 40 -349 -199 397
8052 397 415 308 -273 -102 240 442 -394 -320 -109 329 140 -414 -297 93 373 406 -480 64 217 119 -153
8073 -153 -348 247 365 63 -441 -344 86 535 174 -248 -26 381 310 -504 -540 142 504 168 -576 -142 247
8094 247 505 57 -211 -146 204 138 -231 -216 46 326 -249 -305 -93 536 378 -312 -247 137 457 89 -278 -362
8116 -362 227 316 -123 -105 -188 295 298 -381 -478 83 504 39 -168 69 199 622 -192 -284 132 378 184 -79
8138 -79 -346 204 315 -144 -186 -17 485 274 99 -215 198 353 107 -212 -414 481 85 -19 -480 -183 497
8159 497 258 -337 -119 248 438 107 -354 67 545 292 -156 -417 -30 297 121 -75 -363 180 152 -246
8179 -246 -522 -133 368 346 -98 -287 97 542 361 -191 -72 524
8191E24
##END NTUPLES=NMR FID
##END=
