##TITLE=1H_CA-8584-2-3
 CDCl3, 8 sc, 
 6.5.2019
##JCAMPDX= 6.0         $$ Bruker NMR JCAMP-DX V2.0
##DATA TYPE= NMR FID
##DATA CLASS= NTUPLES
##ORIGIN= UXNMR, Bruker Analytische Messtechnik GmbH
##OWNER= root
$$ XWIN-NMR		Version 3.5
$$ Mon May  6 15:02:18 2019 Russian Standard Time (UT+4h)  she@DPX200
##.OBSERVE FREQUENCY= 200.1315
##.OBSERVE NUCLEUS= ^1H
##.DELAY= (6, 6)
##.ACQUISITION MODE= SIMULTANEOUS
##.ACQUISITION SCHEME= undefined
##.AVERAGES= 8
##.DIGITISER RES= 18
##SPECTROMETER/DATA SYSTEM= spect
##.PULSE SEQUENCE= zg30
##.SOLVENT NAME= CDCl3
##.SHIFT REFERENCE= (INTERNAL, CDCl3, 0, 15.7039)
##AUDIT TRAIL= $$ (NUMBER, WHEN, WHO, WHERE, WHAT)
$$ ##TITLE= Audit trail, XWIN-NMR		Version 3.5
$$ ##JCAMPDX= 5.01
$$ ##ORIGIN= Bruker BioSpin GmbH
$$ ##OWNER= she
$$ F:/spectra/data/she/nmr/H-F/1/audita.txt
$$ ##AUDIT TRAIL=  $$ (NUMBER, WHEN, WHO, WHERE, WHAT)
(   1,<2019-05-06 15:01:15.03 +0400>,<she>,<DPX200>,
      <created by zg, POWCHK disabled, PULCHK disabled
       configuration hash MD5:
       00 E9 B6 7A A2 85 ED C7 34 08 36 98 17 FE 4E 26
       data hash MD5: 16K
       E5 C1 2C A7 D2 7D 1B 64 BC 91 76 70 CB B5 60 86>)
$$ ##END=
$$ 
$$ hash MD5
$$ 60 CB 14 69 67 0E C1 68 86 58 5F D7 FB 53 1F 39
##$RELAX= 
##$RELAX= 
##$RELAX= 
##$RELAX= 
##$RELAX= 
##$RELAX= 
$$ Bruker specific parameters
$$ --------------------------
##$DU= <F:/spectra>
##$EXPNO= 1
##$NAME= <H-F>
##$PROCNO= 1
##$TYPE= <nmr>
##$USER= <she>
##$AMP= (0..31)
100 100 100 100 100 100 100 100 100 100 100 100 100 100 100 100 100 100 
100 100 100 100 100 100 100 100 100 100 100 100 100 100 
##$AQSEQ= 0
##$AQ_mod= 1
##$AUNM= <au_zg>
##$AUTOPOS= <>
##$BF1= 200.13
##$BF2= 200.13
##$BF3= 200.13
##$BF4= 200.13
##$BF5= 200.13
##$BF6= 200.13
##$BF7= 200.13
##$BF8= 200.13
##$BYTORDA= 1
##$CFDGTYP= 0
##$CFRGTYP= 5
##$CHEMSTR= <none>
##$CNST= (0..31)
1 1 145 1 1 1 1 1 1 1 1 1 1 1 1 1 1 1 1 1 1 1 1 1 1 1 1 1 1 1 1 1 
##$CPDPRG= <>
##$CPDPRG1= <>
##$CPDPRG2= <>
##$CPDPRG3= <>
##$CPDPRG4= <mlev>
##$CPDPRG5= <mlev>
##$CPDPRG6= <mlev>
##$CPDPRG7= <mlev>
##$CPDPRG8= <mlev>
##$CPDPRGB= <>
##$CPDPRGT= <>
##$D= (0..31)
0 1.2 0 0 0 0 0 0 0 0 0 0.03 0 0 0 0 0 0 0 0 0 0 0 0 0 0 0 0 0 0 0 0 
##$DATE= 1557140474
##$DBL= (0..7)
120 120 120 120 120 120 120 120 
##$DBP= (0..7)
150 150 150 150 150 150 150 150 
##$DBP07= 0
##$DBPNAM0= <>
##$DBPNAM1= <>
##$DBPNAM2= <>
##$DBPNAM3= <>
##$DBPNAM4= <>
##$DBPNAM5= <>
##$DBPNAM6= <>
##$DBPNAM7= <>
##$DBPOAL= (0..7)
0.5 0.5 0.5 0.5 0.5 0.5 0.5 0.5 
##$DBPOFFS= (0..7)
0 0 0 0 0 0 0 0 
##$DE= 6
##$DECBNUC= <off>
##$DECIM= 24
##$DECNUC= <off>
##$DECSTAT= 4
##$DIGMOD= 1
##$DIGTYP= 9
##$DL= (0..7)
0 120 120 120 120 120 120 120 
##$DP= (0..7)
150 150 150 150 150 150 150 150 
##$DP07= 0
##$DPNAME0= <>
##$DPNAME1= <>
##$DPNAME2= <>
##$DPNAME3= <>
##$DPNAME4= <>
##$DPNAME5= <>
##$DPNAME6= <>
##$DPNAME7= <>
##$DPOAL= (0..7)
0.5 0.5 0.5 0.5 0.5 0.5 0.5 0.5 
##$DPOFFS= (0..7)
0 0 0 0 0 0 0 0 
##$DQDMODE= 0
##$DR= 18
##$DS= 0
##$DSLIST= <SSSSSSSSSSSSSSS>
##$DSPFIRM= 0
$$ [...]
##$SUBNAM2= <"">
##$SUBNAM3= <"">
##$SUBNAM4= <"">
##$SUBNAM5= <"">
##$SUBNAM6= <"">
##$SUBNAM7= <"">
##$SUBNAM8= <"">
##$SUBNAM9= <"">
##$SW= 24.9337058887773
##$SWIBOX= (0..15)
0 0 2 0 0 0 0 0 0 0 0 0 0 0 0 0 
##$SW_h= 4990.01996007984
##$TD= 16384
##$TD0= 1
##$TE= 0
##$TE2= 300
##$TE3= 300
##$TEG= 300
##$TL= (0..7)
0 120 120 120 120 120 120 120 
##$TP= (0..7)
150 150 150 150 150 150 150 150 
##$TP07= 0
##$TPNAME0= <>
##$TPNAME1= <>
##$TPNAME2= <>
##$TPNAME3= <>
##$TPNAME4= <>
##$TPNAME5= <>
##$TPNAME6= <>
##$TPNAME7= <>
##$TPOAL= (0..7)
0.5 0.5 0.5 0.5 0.5 0.5 0.5 0.5 
##$TPOFFS= (0..7)
0 0 0 0 0 0 0 0 
##$TUNHIN= 0
##$TUNHOUT= 0
##$TUNXOUT= 0
##$USERA1= <user>
##$USERA2= <user>
##$USERA3= <user>
##$USERA4= <user>
##$USERA5= <user>
##$V9= 5
##$VALIST= <valist>
##$VCLIST= <CCCCCCCCCCCCCCC>
##$VD= 0
##$VDLIST= <DDDDDDDDDDDDDDD>
##$VPLIST= <PPPPPPPPPPPPPPP>
##$VTLIST= <TTTTTTTTTTTTTTT>
##$WBST= 1024
##$WBSW= 4
##$XGAIN= (0..3)
0 0 0 0 
##$XL= 0
##$YL= 0
##$YMAX_a= 352715
##$YMIN_a= -515407
##$ZGOPTNS= <>
##$ZL1= 120
##$ZL2= 120
##$ZL3= 120
##$ZL4= 120
##$ABSF1= 10
##$ABSF2= 0
##$ABSG= 5
##$ABSL= 3
##$ALPHA= 0
##$AQORDER= 0
##$ASSFAC= 0
##$ASSFACI= 0
##$ASSFACX= 0
##$ASSWID= 0
##$AUNMP= <proc_1d>
##$AZFE= 0.1
##$AZFW= 0.1
##$BCFW= 1
##$BC_mod= 2
##$BYTORDP= 1
##$COROFFS= 0
##$CY= 11.3945322036743
##$DATMOD= 1
##$DC= 2
##$DFILT= <>
##$DTYPP= 0
##$F1P= 18.9103706918063
##$F2P= -1.10871071338519
##$FCOR= 0.5
##$FTSIZE= 0
##$FT_mod= 4
##$GAMMA= 1
##$GB= 0.15
##$INTBC= 1
##$INTSCL= 1
##$ISEN= 128
##$LB= 0.24
##$LEV0= 0
##$LPBIN= 0
##$MAXI= 10000
##$MC2= 0
##$MEAN= 0
##$ME_mod= 0
##$MI= 1.114404
##$NCOEF= 0
##$NC_proc= 0
##$NLEV= 6
##$NOISF1= 3.799351
##$NOISF2= 2.8
##$NSP= 1
##$NTH_PI= 0
##$NZP= 0
##$OFFSET= 15.70392
##$PC= 1
##$PHC0= -8856.101
##$PHC1= 17.20026
##$PH_mod= 1
##$PKNL= yes
##$PPARMOD= 0
##$PSCAL= 0
##$PSIGN= 0
##$REVERSE= no
##$SF= 200.130013532006
##$SI= 16384
##$SIGF1= 3
##$SIGF2= 2
##$SINO= 400
##$SIOLD= 16384
##$SREGLST= <1H.CDCl3>
##$SSB= 0
##$STSI= 0
##$STSR= 0
##$SW_p= 3612.71676300578
##$SYMM= 0
##$S_DEV= 0
##$TDeff= 0
##$TDoff= 0
##$TI= <>
##$TILT= no
##$TM1= 0
##$TM2= 0
##$TOPLEV= 0
##$USERP1= <user>
##$USERP2= <user>
##$USERP3= <user>
##$USERP4= <user>
##$USERP5= <user>
##$WDW= 1
##$XDIM= 8192
##$YMAX_p= 0
##$YMIN_p= 0
$$ End of Bruker specific parameters
$$ ---------------------------------
##NTUPLES= NMR FID
##VAR_NAME=  TIME,          FID/REAL,        FID/IMAG
##SYMBOL=    X,             R,               I
##VAR_TYPE=  INDEPENDENT,   DEPENDENT,       DEPENDENT
##VAR_FORM=  AFFN,          ASDF,            ASDF
##VAR_DIM=   8192,          8192,            8192
##UNITS=     SECONDS,       ARBITRARY UNITS, ARBITRARY UNITS
##FACTOR=    0.0002004,     1,               1
##FIRST=     0,             0,               0
##LAST=      1.6414764,     0,               0
##MIN=       0,             -515407,         0
##MAX=       1.6414764,     352715,          0
$$ Real data points
##PAGE= N=1
##DATA TABLE= (X++(R..R)), XYDATA
0 0 0 0 0 0 8 -8 8 -14 16 -16 24 -32 40 -48 62 -72 88 -104 126 -146 173 -200 233 -270 308 -354 404 -458
28 -458 520 -584 664 -744 834 -932 1042 -1159 1291 -1433 1593 -1766 1953 -2164 2397 -2652
44 -2652 2936 -3259 3622 -4031 4503 -5052 5697 -6469 7417 -8609 10158 -12268 15334 -20202
58 -20202 29170 -51222 218620 166097 -291208 -17992 275082 207693 -65236 55980 352459
69 352459 352715 -34528 -201660 48039 286909 134437 -20722 125519 282486 99881 -131589
80 -131589 -66007 164354 182596 14212 -30978 139774 198080 -7955 -160811 -9290 153003
91 153003 61724 -55900 44145 150967 38067 -131619 -102246 53507 80968 -32869 -32051
102 -32051 126214 125562 -135483 -256401 -14945 203630 78712 -114380 -38780 128781 49333
113 49333 -189480 -193813 99406 263570 50888 -175987 -61485 128203 32685 -141818 -44616
124 -44616 177673 165616 -50534 -134957 20953 145143 35391 -95046 14013 177488
134 177488 95866 -86132 -55114 107816 120648 -7961 -53950 44617 128173 71658 -29269
145 -29269 -8626 73138 43752 -34852 11265 106965 77928 -13792 -19118 24692 15253 -18582
157 -18582 5609 80738 97494 -7487 -101678 -37121 73924 43881 -38029 1538 76672 24748
169 24748 -83369 -82639 23215 88303 28207 -58795 -29861 49095 10315 -82414 -39598 80070
181 80070 71751 -39652 -72449 2871 60930 24849 -42948 -26628 58616 63578 -27762 -47406
193 -47406 42417 82771 16873 -35624 -8839 47341 68981 36684 -1155 17247 47405 16743
205 16743 -12913 33249 83375 61278 14905 -3574 1306 23610 45179 41038 39205 51017 26522
218 26522 -21926 -16497 31224 47429 36535 27563 6479 -11207 -3797 916 -1333 18968 30711
231 30711 -485 -26335 -17595 -14280 -17668 653 6486 -19512 -34921 -29983 -24989 -12782 -6346
244 -6346 -31735 -47536 -22570 -16563 -46513 -40822 -332 -1744 -45040 -68784 -50422 -10186 7859
257 7859 -25217 -54211 -22954 -2676 -50836 -72358 -6851 41014 -2117 -59432 -53882 -7212
269 -7212 13883 -19269 -43315 4988 48205 -10368 -79339 -31007 54050 40506 -26378 -33629
281 -33629 12255 32707 -3093 -36430 4100 67186 36667 -46192 -35069 44837 52059 -2706
293 -2706 -10402 27060 33934 -1193 -23941 9606 62192 45694 -22907 -26421 31843 34437 -11954
306 -11954 936 50710 37203 -20417 -33012 10477 47193 28317 -13926 -1890 40352 12961
318 12961 -49464 -17384 67812 56490 -26708 -41496 16656 39461 -3622 -34388 10635 69711
330 69711 31314 -63099 -52329 51405 67245 -19684 -43103 26175 53096 -8904 -55991 -9617
342 -9617 64674 48981 -41133 -55587 33394 63572 -16493 -52862 15982 54174 -2417 -48829
354 -48829 -10456 51314 40202 -33377 -55797 10235 45604 -9377 -35931 23476 46433 -23062
366 -23062 -66597 -18740 35992 25308 -15986 -19191 13991 5939 -55092 -58809 26625 63023 -10083
379 -10083 -58835 -14084 16768 -26283 -57421 -12329 47011 29568 -49490 -72505 -917 39306
391 39306 -24035 -63434 2297 49023 -9368 -68097 -32629 30047 22725 -40574 -58472 7004
403 7004 51123 -4917 -62431 -17467 36685 -4673 -57786 -21144 43374 38095 -20306 -49153
415 -49153 -14530 21997 -878 -29428 12062 56033 11096 -54010 -34398 19883 21983 -1333
427 -1333 4754 26605 20203 -21670 -43426 160 51144 26801 -19692 84 34558 5065 -33259
440 -33259 -5319 41316 37387 -4531 -22588 11238 44981 16236 -29052 -4040 46827 26231
452 26231 -22927 -4158 46039 40050 -9454 -29545 1695 40735 31432 -7084 752 40417 23288
465 23288 -33060 -26704 32893 49744 15785 -6758 291 11480 3141 -15513 -2049 40855 39883
478 39883 -12215 -29995 4498 15928 -5340 -4447 16020 16407 -4710 -22743 -15865 12405 17866
491 17866 -13725 -24916 4407 10109 -20335 -21999 7176 9089 -17934 -33058 -19728 5355 11545
504 11545 -15482 -31765 -8950 1036 -29878 -37992 867 20575 -7230 -35563 -34188 -14691 -1436
517 -1436 -10669 -20859 -2159 11846 -20144 -48516 -20946 15250 7822 -13059 -14194 -8193 -7354
530 -7354 -13140 -17562 21 21796 4942 -27467 -17939 10744 7651 -7290 1254 9664 1460 -7401
544 -7401 -7801 4684 21194 14278 -11483 -9217 14446 11109 -4953 8390 24596 10548 -9521
557 -9521 -9714 5943 23045 21973 973 -4354 12942 7411 -16143 -3987 30511 28369 -1830
570 -1830 -15415 -7712 5655 11530 2699 286 16876 13949 -18407 -25228 9062 24666 4964
583 4964 -6874 -1801 735 -1579 -5047 -4575 9292 15521 -7161 -21660 306 15361 -283 -7809
597 -7809 2920 1990 -8733 -8365 593 10865 12938 -3998 -19622 -5734 10080 -981 -4799 14449
611 14449 15285 -11324 -23377 -10355 7050 15373 6873 -7793 -4369 2404 -15273 -25692 3331
624 3331 26010 5601 -19653 -18243 -8338 -4485 -7294 -11812 -4366 7155 -8120 -32628 -21210
637 -21210 5316 -2158 -23465 -20891 -10931 -11589 -14270 -16766 -16746 -11288 -16372 -33250 -28497 -4315 -3500
652 -3500 -20993 -22079 -18143 -28767 -32179 -18255 -6753 -3969 -10716 -27990 -34631 -20758 -14550 -20519
666 -20519 -8280 7238 -8865 -34007 -30405 -13687 -4802 -2864 -6861 -10201 -4573 -7746 -24617
679 -24617 -18252 10423 13545 -10358 -15604 -1105 4039 163 -3103 -2969 4893 9395 -4336 -9819
693 -9819 11065 21224 1367 -10573 -338 5989 4697 7985 8993 6839 6186 -2533 -12474 -655
707 -655 17474 12541 1857 4354 -819 -13164 -7342 7301 9745 7000 1699 -8870 -11744 -3633
721 -3633 -4054 -5022 6966 7639 -13403 -21578 -7170 -60 -4081 -5745 -8425 -10711 -7863 -11902 -18855
736 -18855 -6405 6899 -8075 -26018 -17685 -5195 -7216 -9238 -8521 -10620 -10140 -12293 -21203 -15766
750 -15766 3129 2094 -15996 -18184 -10211 -12417 -12011 -4672 -4412 -7415 -7686 -14700 -19587 -7362 1700
765 1700 -6236 -10322 -6774 -13840 -17789 -6318 -261 -6173 -8239 -9395 -16182 -14065 -5742 -6893 -6919
780 -6919 -1113 -9717 -23782 -16946 -2336 -3547 -8863 -8136 -10918 -14470 -12215 -14012 -12253 424 1595
795 1595 -17203 -23264 -9623 -5279 -10305 -7771 -5933 -9399 -9730 -12020 -16909 -6738 5643 -3574
809 -3574 -16293 -11603 -5222 -7645 -3462 1077 -3835 -5487 -4370 -9494 -8689 5240 8562 -1268 -2939
824 -2939 -1624 -6750 -3339 8698 8244 2622 4449 2641 -4269 400 8575 7433 9014 11038 1095
839 1095 -4801 6381 12663 5507 5542 9570 5039 1419 4658 3924 6593 13829 7562 -6167 -1457
854 -1457 10097 7078 2055 5477 3541 -1814 -312 -1379 -2057 7600 10940 -3917 -12108 -4449 -815
869 -815 -2281 2526 2019 -5602 -6456 -6897 -12932 -8335 4750 2519 -8126 -9524 -10216 -13298 -6384 41
885 41 -5203 -7808 -4182 -10009 -16650 -9042 -2202 -5423 -4555 -5845 -14140 -13085 -2689 -3551 -10219 -5145
901 -5145 -3383 -10635 -10666 -5341 -5335 -2740 43 -8556 -14943 -4751 1564 -4300 -4318 -159 -5481 -8351 -4003
918 -4003 -4554 -2996 5712 3731 -10140 -10423 -843 21 -92 3973 596 -4434 -2445 -3563 -7587 1983
934 1983 12119 3863 -5486 -3234 -2719 -2576 4718 7129 1541 3423 4868 -4226 -5923 5513 9470
949 9470 4713 4556 2767 -2202 2711 8583 3608 1894 8415 6240 -532 4156 8944 6341 7432
964 7432 7368 -426 -443 10819 12202 5913 7547 7444 639 2015 7213 6840 9664 16126 7843 -4523
980 -4523 -630 7429 7594 8795 11498 6369 2660 3701 -1270 -2320 10633 16168 4367 -1290 2731
995 2731 1245 574 5093 3976 2365 6257 3814 -6231 -3088 7147 3160 -3919 -1630 -997 -2551
1010 -2551 2037 2137 -5461 -4522 -787 -6641 -7728 1719 3735 -2189 -3348 -6051 -12773 -8126 2510
1025 2510 1615 -2158 -930 -5044 -12722 -9043 -4454 -3985 2090 5873 -6372 -15151 -7798 -3151 -5301
1040 -5301 -2230 561 -3153 -4063 -4431 -10698 -7814 4554 2668 -8387 -5950 688 -2096 -3553 -1280
1055 -1280 -3275 -3183 1027 -2786 -6090 3065 7881 -2292 -7609 -2154 -769 -408 5191 4547 -11 1122
1071 1122 -128 -6309 -1472 9065 7731 2971 4311 -106 -5430 1265 8800 5900 5111 7125 2379
1086 2379 -1587 2815 4024 4248 11001 10290 -1718 -2657 7819 8691 3791 5541 6718 4241 4659 3891
1102 3891 1110 8237 14416 4139 -4556 3128 9566 5667 4342 6311 3875 3060 2893 -2120 816
1117 816 11730 9684 -2805 -2588 3001 532 324 5277 4338 525 1212 -2776 -5921 1178 6493 53
1133 53 -2413 103 -4979 -7862 635 3565 -2205 -3101 -1927 -6643 -6741 -2096 -2538 -1910 2337 -4282 -14201
1150 -14201 -7129 2367 -2288 -6947 -2759 -2782 -6242 -6617 -6815 -5365 2560 1460 -11239 -12018 -448
1165 -448 -285 -6396 -4249 -1206 -4421 -5315 -6207 -7389 -82 6158 -2641 -10779 -4589 -54 -3921 -1336
1181 -1336 3540 -238 -4129 -2729 -5118 -3946 4158 5309 -1253 -1051 -267 -5560 -3283 6176 5326 -1341
1197 -1341 1314 2087 -2878 -1668 3285 3123 4740 5717 -2095 -5014 5400 8392 341 174 6386 3748
1213 3748 -248 2059 3401 5618 9452 3412 -5233 1908 10849 6332 1833 6732 6588 1296 1300 2790
1229 2790 4642 10822 10856 454 -2395 5464 5959 2289 7429 9626 3576 1935 3323 844 3412
1244 3412 9676 7377 1492 3504 2953 -667 4215 9651 3722 119 4190 2438 -1948 2307 5982
1259 5982 3756 3320 899 -4680 -2375 7239 4482 -3335 197 2717 -2754 -4527 -387 1196 2421
1274 2421 2460 -5541 -9408 -95 3755 -3476 -4404 1106 -1689 -6274 -4815 -4011 -1872 2831 -1413 -9591
1290 -9591 -6681 800 -3177 -5579 -480 -484 -5554 -4771 -3802 -5319 -536 2893 -3315 -6745 -2047 -2703
1306 -2703 -4677 1622 3448 -3487 -3796 136 -2729 -3881 2811 3789 90 -112 -1934 -5274 1433 8073
1322 8073 1849 -2922 2917 3726 -2202 -385 4557 5298 5501 3293 -3627 -1124 9340 7367 15
1337 15 3917 8386 2549 -688 2937 5480 7550 9496 3317 -1508 5516 8195 2366 3561 10003
1352 10003 6918 2116 3900 4658 3892 8126 8231 2939 3404 7036 3704 3446 8824 6158 596 3876
1368 3876 7242 3128 3614 8294 5611 1807 2260 947 2166 9745 9204 -438 -279 6181 2475 -2111
1384 -2111 3562 7696 5955 3354 -1486 -4699 2322 7989 1213 -1968 5253 4833 -4637 -4774 1034
1399 1034 2499 3066 1772 -3875 -3604 2498 -228 -5268 111 3806 -2202 -4629 -419 -742 -1993 772
1415 772 -1501 -5639 -2117 283 -2771 -716 2015 -3523 -7180 -910 -115 -3925 -424 3425 -1297
1430 -1297 -4760 -3890 -4405 -1093 4734 821 -4841 -475 2895 -4711 -5990 2258 5071 1524 -507
1445 -507 -2956 -2514 3673 3660 -3341 -278 7476 2388 -4359 146 4980 3238 2662 764 -1155 3244
1461 3244 7355 2162 -337 5698 4840 -1594 1309 6371 5201 4083 5671 1495 -1338 3825 5354
1476 5354 3897 7266 6729 296 331 5489 3017 1090 7660 9416 2679 791 2443 2535 5601 7879
1492 7879 2712 1601 8035 4822 -2913 1184 9565 6825 1423 1469 1449 3345 6500 2480 -1224 4485
1508 4485 7342 -1005 -2800 5372 6429 1342 777 73 -788 3161 4171 -936 244 4789 -322 -4551
1524 -4551 444 2865 -465 454 1412 -3501 -3912 638 11 -1743 579 -1257 -5782 -2227 -83 -4918
1540 -4918 -3851 2982 -230 -7748 -5918 -2455 -2443 -1293 -1647 -5787 -3868 -255 -5883 -8903 -593 3233
1556 3233 -4307 -7861 -4571 -3954 -2587 -1096 -4795 -5544 308 -1884 -8813 -4179 2662 -480 -4577
1571 -4577 -2995 -3398 -3806 512 -222 -3434 -187 2233 -3452 -4666 1405 1613 -888 2219 1098 -3547
1587 -3547 -1415 3085 781 590 3555 1364 -1537 1801 1945 -1504 3510 6847 1035 -2626 2262
1602 2262 3991 1870 3068 2673 314 3410 4598 -629 -10 7356 5195 -2061 -558 3873 3457 4087
1618 4087 3875 -280 695 4168 148 -2599 4102 7500 1330 -1189 499 -1047 180 4375 2076
1633 2076 -85 2860 1794 -4504 -2854 2543 1738 720 2712 -700 -4772 -717 1105 -2078 -449
1648 -449 2507 -1097 -2557 -88 -1705 -3530 1287 1430 -4997 -3745 1726 -39 -3245 -1961 -2831 -3840
1664 -3840 -197 -852 -5187 -1234 2362 -4207 -8435 -3086 -391 -2039 -1139 -1804 -5432 -3341 -2115 -6881
1680 -6881 -5376 2555 1286 -5214 -5808 -4022 -5475 -3110 -187 -2625 -3060 -182 -4229 -8703 -3885
1695 -3885 681 -2403 -2077 -502 -4635 -5742 -1083 -1601 -4496 -1218 554 -3261 -2902 -198 -3072 -2582
1711 -2582 1687 -773 -4876 -279 3542 -442 -2124 -546 -1297 -874 2377 113 -1023 4053 4255 -3300
1727 -3300 -3558 3412 4124 2023 3431 1985 -156 2011 1347 -1722 3310 9402 4528 -1280 458 1987
1743 1987 930 4186 5608 2762 3696 4812 -364 -1625 4829 6123 2445 3205 4060 697 1630 4576
1759 4576 2052 367 4823 4102 410 2037 3164 252 1509 3661 -566 -1264 4277 4230 -1353 -758
1775 -758 843 -806 -178 1542 -408 327 3672 -691 -6828 -2802 2474 429 -491 717 -1868 -3729
1791 -3729 -2003 -3622 -4293 1848 4001 -3605 -6325 -2309 -2431 -3631 -815 -878 -2537 -630 -1262 -6282
1807 -6282 -4822 780 -1138 -4171 -1267 -1175 -4085 -1802 -693 -4341 -3582 695 -1105 -3425 -478 -497
1823 -497 -2617 -1027 -886 -4641 -1939 4081 732 -3163 -638 149 -2573 -1028 960 562 2972 3551
1839 3551 -2739 -5208 1302 3875 133 970 3751 930 -655 644 -950 934 6339 4328 -1594
1854 -1594 229 3849 1357 300 3168 2795 1703 3812 1960 -830 2316 5042 1457 361 3693
1869 3693 2481 1294 4362 3430 -623 1799 4195 936 522 4601 4131 1419 2031 440 -1282 3859
1885 3859 6316 1579 196 3556 1999 -1051 1225 3008 2430 3998 2657 -2297 -1222 4638 2627
1900 2627 -1202 1570 3211 1 -157 970 -487 1683 3834 -527 -3374 1353 2851 -1236 -696
1915 -696 1906 -783 -1126 663 -1610 -2538 1791 1795 -2944 -2870 -382 -1928 -1392 932 -1676 -3828 -945
1932 -945 -951 -5193 -3117 1038 -1176 -3483 -2758 -4585 -4081 162 -1264 -5276 -3293 -455 -4316 -6023
1948 -6023 -2549 -1706 -3308 -2035 -3573 -6214 -2481 745 -3947 -4876 -1108 -1158 -4195 -2484 -1933 -2790
1964 -2790 -385 275 -4278 -3912 779 86 -2479 -703 448 -1929 -1059 893 -1695 -264 3856 1340
1980 1340 -3114 -339 2217 1072 2238 3164 144 -22 3330 963 -745 3576 5440 1549 274
1995 274 1770 884 2095 4626 2297 342 3816 4021 -651 -103 3690 3107 2087 3126 1106 -434
2011 -434 3245 3023 -888 502 4215 2154 -762 937 995 -155 1995 611 -2865 -485 3434 247
2027 247 -2136 45 -674 -2188 -187 -320 -1947 423 1969 -3278 -5326 -525 448 -1501 -456 -402
2043 -402 -2996 -1827 -711 -3638 -3255 1811 628 -3507 -2822 -1440 -3187 -1333 -343 -2829 -2673 773
2059 773 -1617 -5398 -2357 167 -1736 -1834 -1351 -2873 -2490 351 -1524 -4853 -1083 580 -3088 -3443
2075 -3443 -669 -1128 -1905 -543 -3546 -4917 -432 1443 -2975 -3354 -686 -2108 -3483 -1660 -1581 -2021
2091 -2021 766 427 -4678 -3736 499 -835 -2575 -490 -863 -2213 -614 -1273 -4047 -1283 2641 -484
2107 -484 -2917 -337 138 -1688 253 452 -1398 487 2340 -1008 -2555 1957 2835 -319 274 1095
2123 1095 106 1996 3455 99 -1121 3055 2639 -603 1079 3890 2161 1505 1815 -353 513 4531
2139 4531 4055 -211 1419 3273 952 249 2256 1885 2249 4507 1179 -1849 1031 3735 905 383
2155 383 2617 1757 -20 547 -561 -1770 2165 3350 -1504 -2105 1112 94 -1275 -95 -6 -1624
2171 -1624 525 179 -3773 -2368 1538 -362 -3369 -1969 -1373 -2230 -487 -1138 -4256 -3181 173 -2149
2187 -2149 -4746 -1322 -523 -3041 -3181 -3144 -4598 -2046 599 -2751 -4725 -1513 -1197 -4302 -3610 -1760
2203 -1760 -1990 -1043 -413 -3974 -5147 -657 -219 -3167 -2003 374 -1488 -2540 -1545 -2864 -1476 1951
2219 1951 352 -3982 -1719 1245 -698 -1515 328 -540 -1298 1223 -138 -1991 973 2790 -770 -2245
2235 -2245 1137 1046 527 2214 1012 -951 1754 2934 -611 -740 3559 2857 430 1291 770 -104 2620
2252 2620 3639 161 676 4276 1967 -852 1189 2779 1987 2825 2346 -916 782 4245 2196 -803
2268 -803 1976 3169 1072 1237 1921 877 2077 3418 303 -1562 2385 4071 787 751 2067 368
2284 368 899 1739 100 -162 3476 2818 -1544 -819 1681 367 604 1900 241 -380 1595 410 -2643
2301 -2643 -154 2647 878 -982 -75 -1065 -1003 1726 516 -1890 -90 1741 -952 -2768 118 694
2317 694 -447 56 -1161 -2825 317 1991 -2049 -3031 512 5 -2501 -725 -331 -1560 -28 -340
2333 -340 -3684 -2402 1110 295 -2986 -1245 -116 -2062 -1397 -718 -2237 -841 1938 -865 -3823 -1476
2349 -1476 380 -1289 -961 699 -1419 -1190 677 -1690 -2821 1053 2350 -1264 -1256 -396 -672 -104 1779
2366 1779 -164 -1494 1981 2615 -1173 -438 2576 1868 669 1178 389 644 3838 2962 -396 1006 4079
2383 4079 2221 620 2856 2823 2126 3448 1882 -465 2466 5466 2502 545 3598 3155 841 2443
2399 2443 2584 1553 3829 4558 738 -298 2674 2460 916 2351 2722 792 1380 2193 -760 -352 3106
2416 3106 1821 -1200 -478 1365 -284 302 528 -1858 -1358 1892 -101 -3012 -667 884 -1308 -2203
2432 -2203 -972 -1903 -752 821 -1783 -4530 -1161 465 -2871 -3199 -321 -960 -1707 -1184 -3211 -4020
2448 -4020 -479 560 -2793 -2227 -34 -1481 -3227 -1566 -1057 -1556 342 -126 -3542 -2573 727 -717
2464 -717 -2014 -353 -318 -1517 -408 -33 -2625 -1240 1969 -867 -2742 146 657 -897 -87 -264 -1955
2481 -1955 -151 2019 -1369 -2303 1292 1312 -1391 -1329 -201 -923 630 1073 -1689 -1421 1560 299 -2646
2498 -2646 -485 1807 231 -427 -146 -1490 -821 2260 696 -2074 611 2255 -520 -873 1018 558
2514 558 716 2050 77 -1518 1450 3123 350 110 2048 1452 918 2006 1215 -28 2821 3636 100
2531 100 0 3070 2622 1159 2395 1863 1010 3077 2916 -110 1180 4500 2720 -217 1307 2361
2547 2361 1415 2401 2007 48 922 3233 742 -1516 1736 2641 -197 -154 282 -840 1092 1957 -814
2564 -814 -2330 616 1037 -2001 -1607 244 -1120 -974 -360 -2791 -2937 -228 -674 -3451 -2147 -709 -2407
2581 -2407 -2703 -1467 -2929 -2400 225 -1289 -3949 -2104 278 -1947 -2547 -1050 -1835 -2311 -401 -1360
2597 -1360 -3186 -271 1317 -2141 -2983 -220 8 -573 92 -499 -1490 707 1395 -1640 -962 2383 1865
2614 1865 -329 723 1013 346 1653 1815 -423 454 3571 1620 -1040 1701 2254 907 1606 2042 223
2631 223 1637 3390 1246 -407 2010 2541 677 1275 2247 939 1258 3075 235 -1017 2590 3106
2647 3106 836 633 1771 705 371 2060 226 96 2979 2335 -1466 -516 2483 1111 739 1435 478
2664 478 606 2580 1138 -1295 853 3212 1280 -379 1424 1298 401 2157 1187 -386 1811 3103
2680 3103 -15 -474 2047 1759 374 1062 885 -45 1906 2543 -394 -875 2148 916 -339 670 1224
2697 1224 -251 573 696 -1683 -1077 1960 658 -1527 -103 405 -1384 -828 -7 -1816 -834 1510 -850
2714 -850 -3221 -1065 396 -1990 -1927 -813 -1484 -1274 -72 -2534 -3406 -181 166 -2884 -2384 -369 -1622
2731 -1622 -1662 -707 -2064 -2000 222 -113 -2688 -1304 1087 -541 -1819 -354 -801 -855 1600 243 -1905
2748 -1905 -296 1902 -184 -891 1141 1468 499 1560 685 -1169 1449 3326 912 132 2249 2385
2764 2385 395 1413 1751 1079 2902 3857 536 128 3457 2825 580 1698 2679 1454 2266 2728 282
2781 282 732 3852 2389 -115 1744 3200 1280 1460 2007 461 1174 3239 1502 -392 2029 3010
2797 3010 -37 -160 1227 517 1070 2503 404 -1152 1177 1712 -948 -570 1867 1019 89 754 -449
2814 -449 -966 1432 1316 -1312 -184 1700 51 -1541 109 -264 -901 1206 560 -2452 -811 1536
2830 1536 -675 -1973 45 306 -719 -82 -133 -1916 -405 1165 -1444 -2554 736 555 -1308 -633
2846 -633 -552 -2086 -585 395 -1736 -2035 839 55 -2681 -1780 -67 -1203 -503 216 -1625 -1936 917
2863 917 -279 -2838 -608 891 -784 -1180 -404 -1603 -1140 1109 -526 -2263 503 976 -1204 -1263 599
2880 599 1 -68 953 -499 -1693 1273 2110 -867 -357 1789 922 -165 686 366 -25 1827 2003 -834
2898 -834 -173 3007 1303 -167 1270 1142 584 1938 1827 -315 1198 3270 1048 -513 1215 2066
2914 2066 716 1334 1628 -256 796 2571 247 -406 2007 2375 318 265 1031 -17 988 2035 -298
2931 -298 -833 1831 1496 -1112 -25 1363 658 520 861 -930 -849 1833 742 -2102 -201 1416 -231
2948 -231 -905 378 -749 -454 738 -491 -2464 -353 1609 -1109 -1700 32 -581 -1392 -222 -1089 -2118
2965 -2118 -18 443 -2613 -2720 -125 -785 -1757 -394 -945 -2316 -482 -422 -2811 -2055 609 -773 -2407
2982 -2407 -1422 -1062 -1891 -762 -751 -2772 -1333 755 -1550 -3315 -886 275 -1497 -1368 -989 -1684 -587
2999 -587 781 -1463 -2538 -378 392 -1804 -953 334 -732 -40 717 -1277 -1261 1942 1303 -1336 -241
3016 -241 1275 -7 -75 1160 166 514 2324 1338 -1442 260 2305 872 322 1777 968 873 1937
3033 1937 679 -751 1713 3318 679 -317 1863 1549 978 1915 699 -139 1532 2905 -287 -350 2446
3050 2446 1435 -260 709 631 -83 1526 1691 -631 -584 1539 1128 -1080 414 1253 -287 635 192 -1507
3068 -1507 -568 2042 18 -1256 99 873 -661 -722 -99 -1267 -282 974 -1088 -2335 217 1035 -1341
3085 -1341 -1405 -124 -812 -732 348 -1420 -2042 625 401 -2319 -1727 229 -250 -1101 -684 -1341 -1790 431
3103 431 -118 -2345 -658 964 -1083 -1754 -684 -1218 -1191 374 -472 -2383 -792 958 -1759 -2344 -352
3120 -352 -365 -1279 -597 -1163 -2322 -546 519 -1811 -2273 278 -361 -1753 -1096 -509 -1467 93 146 -2120
3138 -2120 -1387 1268 136 -1999 -486 517 -579 -288 453 -1015 -336 1641 331 -1667 523 1439
3154 1439 -59 -78 737 -125 497 1882 83 -833 1965 2463 -131 -262 1579 1170 1218 2035 876 64
3172 64 2333 2373 -319 598 2444 1415 795 1944 748 479 2458 1763 -990 673 2469 891 -587
3189 -587 1202 1121 90 1239 772 -1330 338 2269 -382 -1341 392 622 -664 11 -42 -1410 100
3206 100 923 -1798 -2122 452 284 -1867 -859 -524 -1498 -436 -225 -2315 -1998 671 -453 -2609 -1450
3223 -1450 -167 -1688 -1241 -701 -1888 -1501 123 -972 -2880 -1093 291 -1430 -1510 -802 -1334 -1095 498
3240 498 -1296 -2372 -171 589 -1466 -1386 33 -116 -886 -77 -927 -1474 501 1151 -1543 -1238 909 -455
3258 -455 -1100 -107 -169 -710 910 683 -2050 -678 1308 -155 -1366 366 639 -263 412 194 -1548 -153
3276 -153 1863 -324 -1544 772 1084 -731 418 554 -577 736 1873 -222 -613 1546 1586 -611
3292 -611 112 982 319 982 1603 -500 -264 2250 1282 -592 621 2025 644 639 946 -241 585 2576
3310 2576 1390 -817 1419 2619 565 -10 1190 753 1052 1905 594 -778 1414 2095 -297 -394 1458
3327 1458 894 30 519 -62 -592 717 1391 -1155 -1042 1121 475 -1114 -49 -255 -1281 399 383 -2040
3345 -2040 -1288 698 -871 -2216 -877 -676 -1277 -591 -871 -2354 -789 364 -1403 -2920 -546 -277
3361 -277 -1726 -1637 -1156 -2082 -1509 -176 -2254 -2603 -219 -482 -2476 -1611 -668 -1066 -896 -642 -1904 -2076
3379 -2076 75 -497 -2326 -926 572 -1059 -1465 -354 -1286 -1051 743 -298 -2347 -224 1113 -576
3395 -576 -1236 -86 -493 -556 605 -190 -1650 147 1265 -784 -1128 861 422 -82 594 -108 -1012 782
3413 782 1408 -702 -702 1865 899 -867 117 348 18 1034 1340 -676 129 2172 372 -1316 512 1407
3431 1407 293 538 413 -816 145 1916 196 -1177 1083 1966 -43 137 592 133 525 1262 -240
3448 -240 -616 1699 1563 -922 -691 630 183 -69 801 -417 -951 1377 665 -1833 -1076 941 28 -860
3466 -860 541 -702 -1336 267 -535 -2146 -576 863 -923 -2318 -1011 -956 -1271 -103 -1196 -2213
3482 -2213 -411 155 -1781 -2637 -282 -456 -1883 -1059 -1195 -2124 -869 -445 -2487 -2648 93 -508 -2084
3499 -2084 -1309 -1115 -1818 -1046 -533 -2287 -1541 377 -821 -2400 -806 -103 -1270 -894 -33 -1476 -661
3516 -661 513 -1303 -2219 -357 703 -1091 -748 -46 -875 -432 800 -620 -1475 597 1343 -928 -669
3533 -669 673 345 56 465 -46 -837 1315 1053 -1250 -126 1895 692 -362 663 235 -214 1070
3550 1070 691 -898 358 2354 427 -995 797 1186 203 882 565 -672 846 2075 -230 -714
3566 -714 1294 1084 -271 531 1255 229 1017 1265 -702 -512 1743 1480 -395 542 928 99 1001 1131
3584 1131 -593 108 1932 781 -1050 189 1213 259 -66 268 -703 149 1547 148 -1500 209
3600 209 1060 -790 -965 -166 -361 -292 59 -928 -1867 292 510 -1468 -970 197 -470 -1247 -441 -1383 -1730
3619 -1730 119 14 -2280 -1764 -61 -1091 -1827 -1089 -844 -1475 -560 -749 -2607 -1223 266 -942 -2348
3636 -2348 -599 -472 -1114 -571 -881 -1806 -563 877 -1163 -1595 -97 262 -1236 -741 -394 -908 207
3653 207 796 -956 -1108 1438 728 -982 -175 812 127 489 933 -379 -297 1603 1060 -929 610 1716
3671 1716 615 373 879 266 531 1624 481 -464 1098 1973 208 55 859 810 572 1265 264 -370
3689 -370 1103 1689 -129 -288 1162 866 -31 858 -113 -151 1392 1430 -713 -379 1531 770 -495 533
3707 533 268 -134 743 408 -976 -8 1440 -88 -1219 352 1229 -220 365 84 -916 291 1399
3724 1399 -251 -1485 685 721 -881 -637 243 -760 139 626 -902 -1041 548 690 -1624 -937 418
3741 418 -408 -373 -23 -922 -1133 701 -218 -1953 -555 581 -806 -1298 -411 -1164 -1505 311 -980 -2224
3759 -2224 -528 198 -1333 -1800 -379 -953 -1254 -385 -1025 -1765 -289 612 -1636 -1634 197 -483 -988 -378
3777 -378 -898 -1339 -12 208 -1605 -869 851 -375 -987 -89 64 -515 272 428 -1013 249 1435 -110
3795 -110 -818 669 1555 61 673 617 -52 310 1484 417 -439 1811 1629 235 287 1389 774 1033
3813 1033 2057 812 -46 1756 1859 40 337 1561 1176 786 1476 394 357 1772 1132 -569 601
3830 601 1912 763 200 917 621 527 1433 322 -629 910 1473 186 -412 880 637 -247 603 89
3848 89 -1005 584 867 -885 -1026 1127 477 -622 -136 -581 -731 523 522 -1312 -842 596 -22 -1134
3866 -1134 -265 119 -841 191 -135 -1371 -491 845 -280 -1530 52 377 -630 -693 -329 -1099 -372 442
3884 442 -855 -1659 136 438 -944 -880 -180 -631 -486 -90 -1000 -1382 516 301 -1796 -1020 448 -228
3902 -228 -691 -41 -881 -710 200 82 -1022 -487 803 -185 -1083 -92 -77 -218 787 144 -1109 -152 1206
3921 1206 -175 -687 436 347 75 441 350 -502 711 1546 -400 -429 1168 976 -83 307 831 325 1013
3940 1013 1257 -316 282 1796 1090 -302 513 1271 480 563 1021 78 925 1617 582 -395 1089 1392
3958 1392 596 175 598 -53 448 1437 -34 -336 1067 1575 -184 -179 955 566 269 1114 -453 -434 994
3977 994 1169 -766 -490 1133 253 -497 294 -523 -724 591 -211 -1353 -499 942 -381 -1521 -207
3994 -207 -22 -353 49 -615 -1772 -337 683 -1102 -1591 -63 -27 -952 -637 -690 -1205 -255 223 -1181 -1262
4013 -1262 413 -94 -1293 -1128 -314 -1140 -522 97 -1404 -1297 739 -516 -1782 -671 300 -809 -710
4030 -710 -74 -893 -731 751 -417 -1881 -584 484 -609 -653 7 -782 -474 205 -866 -1321 285 981
4048 981 -863 -892 731 -34 -503 251 -15 -506 1171 979 -700 -542 1375 601 38 558 422 -32 1156
4067 1156 807 -496 214 1704 810 -262 964 1106 629 1151 1046 -146 643 2063 493 -96 1267
4084 1267 1519 700 981 556 55 1194 1602 52 -255 1581 1181 -224 -53 1071 241 740 804 -391
4102 -391 -234 1192 717 -776 -149 606 -31 -438 447 -346 -167 918 -134 -1291 57 744 -785 -698
4120 -698 32 -396 -620 112 -546 -1511 115 476 -1223 -1169 -198 -233 -910 -445 -842 -1123 157 7 -1570
4139 -1570 -1114 396 -483 -824 -555 -331 -657 43 -78 -1593 -617 864 -318 -1364 -97 130 -551 -285
4157 -285 -92 -1103 -251 582 -410 -1299 -68 528 -954 -256 -33 -466 127 505 -921 -1240 641 471
4175 471 -1094 -476 628 115 -35 202 -789 -497 906 466 -840 63 823 69 -349 373 -102 -50 1343
4194 1343 338 -791 269 1573 9 -178 816 420 692 1007 392 -362 931 1539 -120 -219 1101
4211 1101 1212 344 952 547 88 1132 1401 -45 169 1494 1221 -153 314 519 77 1118 974 -329
4229 -329 13 1689 504 -774 582 923 248 257 530 -609 276 1149 68 -1124 435 1042 -447 -253
4247 -253 177 -519 -342 462 -790 -1393 569 269 -1307 -1053 207 -677 -948 -230 -1525 -1130 94 -223
4265 -223 -1952 -826 285 -718 -1183 -407 -478 -911 149 -582 -1664 -675 663 -904 -1513 -365 -377 -563
4283 -563 -328 -434 -1200 -70 759 -796 -864 40 245 -542 -142 -228 -593 416 809 -840 -1101 493 470
4302 470 -700 122 347 -93 600 437 -602 -157 1287 316 -607 93 832 169 94 398 -180 105 1137
4321 1137 271 -438 688 871 81 108 785 222 545 1111 -206 -696 1325 1331 -312 -77 1164 700 191
4340 191 751 524 -379 1419 1190 -592 26 1445 788 224 778 449 460 1129 700 -460 825 1881
4358 1881 228 -438 629 658 177 749 566 -249 406 1503 -126 -554 1090 703 -370 123 101 -43
4376 -43 369 760 -740 -650 1302 801 -924 -21 448 -535 -21 255 -1049 -539 592 -324 -1383 -499 500
4395 500 -600 -490 -582 -715 -508 357 -398 -1680 -52 619 -1111 -929 -459 -870 -557 -103 -833 -1437 261
4414 261 299 -1229 -1243 432 -182 -888 -311 -643 -941 253 379 -1235 -662 716 -289 -734 -143 167 -586
4433 -586 576 -208 -844 -99 1380 -39 -921 627 572 -157 983 483 -578 766 1231 21 -716 1299
4451 1299 1077 88 392 500 138 866 1329 -161 -213 1290 1214 -147 474 1047 355 674 1005 124 504
4470 504 1313 857 -495 587 1331 438 345 554 438 579 1379 590 -815 788 1435 39 24 842 505
4489 505 375 925 142 -597 637 906 -369 -458 736 332 -238 -45 -13 -322 562 492 -821 -428 621
4508 621 60 -1037 -9 -195 -388 367 -44 -959 -326 645 -439 -1359 -171 493 -820 -678 -294 -840
4526 -840 -493 279 -962 -1493 164 209 -784 -654 113 -888 -485 108 -1167 -1523 234 69 -1415 -619
4544 -619 109 -512 -624 -206 -791 -998 598 -134 -1272 -280 728 -719 -436 114 -6 -236 766 -200
4562 -200 -884 -95 776 -279 -761 377 288 -221 335 105 -395 679 1168 -543 -408 1441 621 -46 288
4581 288 343 55 839 985 -288 -291 1343 572 -208 624 797 255 910 778 -438 22 1272 401 -510 850
4601 850 1436 194 487 567 -170 605 1330 116 -257 1352 1360 -367 361 846 253 478 843 -24 -446 1152
4621 1152 956 -390 24 907 -24 213 216 -47 -224 854 240 -826 95 755 56 -627 156 360 -384
4640 -384 624 22 -1403 126 936 -753 -935 228 286 -522 -162 -435 -845 -170 408 -1054 -968 289
4658 289 -153 -916 -597 -231 -992 -146 70 -1222 -1242 219 -444 -1541 -627 -294 -837 -176 -583 -1301 -719
4677 -719 527 -155 -1194 -192 202 -1015 -475 -505 -860 -383 655 -609 -1403 345 501 -655 -428 462
4695 462 60 240 861 -450 -939 720 644 -686 -217 1127 346 26 642 -146 -22 1126 707 -422
4713 -422 399 1473 272 -215 899 721 282 894 539 -342 689 1534 341 -296 762 803 605 800
4731 800 874 -107 852 1021 -317 -398 1159 843 88 501 453 348 875 984 -693 11 1159 486 -309 372
4751 372 771 -283 35 330 -522 -29 1207 118 -1049 -35 714 -354 -303 84 -237 -217 652 -628
4769 -628 -1000 343 565 -406 -822 174 -347 -372 244 -577 -844 632 180 -1013 -726 395 -280 -687 -266
4788 -266 -446 -627 403 82 -1258 -676 166 5 -711 -46 -214 -305 13 -136 -917 -363 921 -428 -1041
4807 -1041 250 19 -842 -25 -200 -578 26 482 -440 -871 265 492 -825 -478 -87 -243 194 316 -518
4826 -518 -529 853 585 -1055 -257 663 -124 211 153 -655 -283 948 321 -776 376 1092 203 135 658
4845 658 256 404 986 255 -567 952 1317 64 -358 1079 638 147 960 340 58 1180 1051 50
4863 50 9 1382 607 151 791 703 133 1055 638 -45 218 1254 658 -539 983 652 77 550 551 -491
4883 -491 264 970 -299 -446 469 779 173 -41 44 -275 335 701 -558 -984 393 619 -796 -546 274
4902 274 -202 -258 317 -895 -1052 260 116 -1211 -505 182 -355 -781 -129 -680 -484 269 -587 -1433 -374
4921 -374 701 -824 -983 -312 -371 -396 76 -418 -1123 13 463 -1101 -965 241 -162 -646 235 -665 -524
4940 -524 285 431 -886 -797 251 -94 -514 -74 -76 -447 233 131 -603 -255 697 119 -757 157 213 62 -55
4961 -55 246 -394 144 950 -70 -818 668 730 -126 527 663 -103 374 1076 248 -24 731 981 -23 299
4981 299 454 351 169 560 -60 44 1006 236 -474 330 854 190 170 691 42 176 986 390 1 463
5001 463 979 465 -77 658 399 126 656 -8 -358 337 1274 -293 -354 381 493 -69 226 -57 -283 599
5021 599 446 -203 -448 1003 186 -618 36 47 -481 303 -66 -405 -572 684 48 -831 45 52 -536 -340
5041 -340 -203 -843 -397 451 -649 -1156 325 -218 -449 -805 117 -537 -598 171 -765 -1304 221 244 -883
5060 -883 -791 100 -253 -321 -73 -879 -614 94 62 -935 -762 330 -343 -272 -195 -432 -471 229 -183 -874 100 560
5082 560 -126 -798 -10 318 -66 344 -227 -441 652 955 -413 -238 611 435 64 27 90 79 385 884
5102 884 -90 103 1131 576 -197 400 844 320 259 535 -40 214 1061 360 -464 548 1003 402 461 728
5122 728 28 382 1239 129 -410 616 991 -200 -241 485 329 457 576 301 -7 723 696 -210 -129 511
5142 511 337 -63 631 -98 -398 709 196 -1040 -294 766 -160 -597 -274 -323 -96 170 -45 -912 -372
5161 -372 619 -325 -793 -188 -2 -194 -289 -381 -677 208 375 -861 -826 31 -58 -967 -34 -330 -701 -186 220
5182 220 -586 -529 90 107 -1136 -719 -227 -676 -300 -257 -820 -552 245 -213 -1180 -241 250 -487 -564 36 -297
5203 -297 -463 228 -360 -714 97 659 -496 -482 76 -173 -114 340 -52 -827 310 381 -345 -558 99 6 37
5224 37 301 -423 -149 634 464 -1049 144 910 164 -369 418 249 180 617 242 -79 410 926 363 -299
5244 -299 493 849 301 750 319 -350 446 1293 174 -527 1130 883 -31 200 516 341 464 668 -327
5263 -327 -160 1124 724 -185 346 761 556 303 735 -181 -126 1058 180 -751 -204 562 281 -111 27 -146
5283 -146 89 840 68 -752 198 256 -196 -682 179 -141 -192 -84 -502 -729 190 303 -1039 -769 47 -246
5303 -246 -619 -157 -437 -716 199 -61 -1144 -649 546 -326 -1172 -392 -386 -630 115 -334 -1091 -271 162 -801
5323 -801 -972 -300 -237 -434 -292 -244 -721 -62 354 -690 -1059 -59 225 -824 16 -135 -564 41 357 -320
5343 -320 -362 515 415 -444 -326 614 159 421 385 -110 61 821 203 -605 322 662 -167 -301 449 160 -77
5364 -77 876 172 -429 422 903 32 -367 456 630 289 493 472 -217 615 1000 -54 -213 874 639 204
5384 204 -76 47 4 651 166 -569 16 721 149 -344 590 140 -252 254 228 -416 -90 660 -79 -675 342
5405 342 379 -43 -66 65 -309 444 383 -232 -1038 357 614 -695 -563 -218 -279 -10 95 -603 -784 347
5425 347 -44 -1013 -464 68 -124 -472 -145 -430 -722 471 -316 -956 -499 338 -485 -981 -409 -469 -653 226
5445 226 -638 -1003 -215 182 -984 -933 -260 -177 -324 -45 -704 -1310 -90 -194 -1005 -908 447 -100 -873 -722
5465 -722 -393 -364 104 22 -967 -659 659 -264 -947 -384 -13 -382 126 211 -503 -178 888 -14 -854 160
5485 160 625 -43 -191 248 -55 102 611 -9 -410 795 493 56 1 500 85 336 765 -136 -301 959
5505 959 927 -374 36 744 522 44 645 222 -17 915 688 -322 360 949 339 -92 283 203 244 531
5525 531 178 -241 394 725 -325 -72 381 680 -276 178 -52 -530 -142 463 -405 -731 96 379 -506 -264
5545 -264 156 -127 -73 40 -701 -521 467 -453 -929 -380 144 -526 -90 -391 -1082 -687 278 -453 -1295 -247
5565 -247 -22 -610 -391 -78 -761 -136 -10 -827 -677 70 265 -730 -718 -373 -306 -390 -165 -630 -704 107 186 -616
5587 -616 -686 656 -203 -602 -215 -178 -132 138 -41 -726 77 646 151 -530 114 -20 -281 -67 -199 -322 354
5608 354 584 -334 -520 493 284 218 -337 58 -277 535 506 -285 -345 635 997 -280 135 300 -52 559
5628 559 436 -105 14 588 449 -278 470 719 270 126 404 60 199 1279 337 -121 187 848 -174
5647 -174 -193 483 199 114 414 -362 -450 374 780 133 -558 591 522 241 401 -124 -218 462 682 -302 -147
5668 -147 588 -23 -306 34 20 -86 427 350 -566 -347 657 22 -618 -107 267 -230 -67 -60 -939 -142 263
5689 263 -458 -846 -388 356 -386 -379 -545 -759 18 -26 -627 -1159 141 -48 -952 -798 -92 -483 -203 -257 -866
5710 -866 -816 -117 -108 -1231 -264 106 -482 -480 -496 -806 -533 63 -533 -844 -129 495 -429 -584 265 -196 -13 253
5732 253 -96 -557 178 585 -324 -499 297 -56 45 242 92 -175 339 783 -634 -58 661 240 -343 206
5752 206 381 -81 381 514 -282 53 997 387 -73 193 548 59 437 338 -259 583 793 71 -486 451
5772 451 431 158 49 138 -35 562 485 -374 -241 479 599 -534 62 355 159 107 207 -192 -114 701 443
5793 443 -490 -292 163 -18 -214 -255 -207 -5 703 153 -1073 99 592 -306 -504 182 -277 -141 130 -399
5813 -399 -858 -70 359 -744 -713 152 -120 -392 -471 -212 -727 -114 -70 -911 -464 -148 -142 -937 -296 -307 -330 -62
5835 -62 -283 -784 -810 199 -556 -1126 57 -324 -349 -347 10 -691 -422 316 -625 -1236 -14 -53 -688 -376 -33
5856 -33 -379 201 160 -677 -814 295 76 -492 -363 362 300 29 101 -360 -210 658 428 -396 -285 641 100
5877 100 -196 66 -222 61 592 249 -816 185 1266 50 -2 485 243 -27 410 -161 -311 423 963
5896 963 175 -569 698 388 -109 -302 306 -224 672 876 -214 -163 736 468 -214 353 -16 439 250 437
5916 437 -677 55 619 -150 -451 184 170 -219 149 391 -163 -214 575 -355 -668 190 411 -328 -463 -11
5936 -11 -155 -111 344 -630 -723 82 357 -1055 -400 56 19 -789 -67 -496 -505 -123 -203 -720 -662 29 -680 -601 -347
5959 -347 -219 -544 -126 -449 -631 -507 311 -462 -909 -274 -158 -370 -345 -544 -689 -138 -38 -560 -1071 372
5979 372 -132 -263 -296 -170 -377 28 111 -746 -801 376 285 -508 -243 153 -230 -75 -283 -530 -33 320 161
6000 161 -518 384 626 247 60 276 -193 38 533 424 -370 367 734 -167 -254 553 137 98 114 -233 79
6021 79 641 544 -280 56 407 222 -155 411 -15 5 540 343 -552 -133 1043 278 -174 49 171 77 567
6042 567 183 -298 133 639 -120 -517 473 179 -519 96 267 -234 306 426 -232 -550 291 222 -542 -172
6062 -172 -61 -482 10 329 -350 -477 87 -34 -954 -44 496 -350 -323 12 -470 -332 98 -148 -1058 -269
6082 -269 407 -516 -177 -3 -268 -418 -18 -471 -853 -106 136 -580 -802 -42 -250 -544 283 -632 -818 65
6102 65 70 -1021 -815 63 -193 -271 -293 -525 -486 -39 -229 -668 -254 417 -71 -628 -154 -61 -348 169 -192 -528
6124 -528 7 579 -87 -496 262 320 -293 -82 45 128 93 463 -11 -574 738 276 -168 68 681 106 492
6145 492 550 -253 136 1146 406 -202 147 943 181 387 499 -159 184 672 321 -209 301 803 576 148
6165 148 520 165 227 791 220 -332 174 657 -27 -296 541 -31 -144 243 52 -279 418 399 -371 -211 378
6186 378 349 -588 448 -193 -442 84 -101 -679 -325 345 -349 -872 92 -92 -279 -201 -207 -476 -410 192 -274
6207 -274 -742 56 67 -331 -272 -252 -447 -125 -38 -658 -603 413 -7 -816 -263 -10 -432 -364 119 -664 -519 25
6229 25 158 -644 -360 -84 -283 -500 -103 -370 -547 169 29 -884 -311 416 -372 -410 -17 -164 -350 -149 -180
6250 -180 -502 -76 493 -191 -558 276 207 -176 -173 -370 -356 229 382 -408 -295 580 104 -213 115 144 8 269
6272 269 430 -135 -236 915 483 -320 287 227 20 57 273 -70 166 664 224 89 307 595 106 9 482
6293 482 46 459 687 43 -14 876 806 -341 -118 279 477 377 289 -52 -167 690 294 -207 176 528 -135
6314 -135 -75 -86 -61 69 328 339 -578 -285 469 -249 -339 77 -352 87 195 -58 -718 -307 179 -591 -780 -50
6336 -50 -503 -819 162 -436 -544 -199 133 -519 -524 68 -318 -942 -363 230 -307 -311 -179 -401 -555 80 -173 -893
6358 -893 -221 210 -251 -377 -50 -555 174 165 -492 -826 70 577 -535 -132 -37 -83 -22 130 -313 -576 462
6379 462 455 -279 -485 196 -31 68 501 172 -283 709 478 -165 25 828 40 49 380 240 -75 521 309 -171
6401 -171 154 374 14 -255 300 67 290 546 212 -56 505 905 0 -267 646 837 181 516 364 -187
6421 -187 618 508 155 3 825 573 -52 459 210 282 577 631 151 -117 958 231 -214 28 634 80
6441 80 178 186 0 166 572 -117 -515 401 372 35 -322 -30 -210 -135 15 -155 -740 285 259 -527 -464 248
6463 248 -35 -339 -57 -194 -705 211 -316 -656 -416 363 -288 -179 -98 -491 -546 9 -304 -997 -268 282 -169
6484 -169 -573 -354 110 -552 -382 -240 -243 -29 399 -547 -580 99 563 -400 -341 24 -486 -176 260 -441 -116
6505 -116 556 130 -429 -155 -96 -47 93 57 -278 -123 225 86 -24 22 394 -151 134 161 195 299 569 123
6527 123 -390 415 703 -48 -65 139 117 327 207 321 -128 405 635 227 307 586 253 162 290 281 178 429
6549 429 673 -135 -134 623 271 -160 295 192 131 372 713 1 135 955 103 -407 332 306 -95 179 212 -387
6571 -387 486 464 -194 -605 280 240 -198 -140 28 -251 120 121 -477 -517 571 147 -678 -488 342 -199 74 -15
6593 -15 -220 -536 265 -113 -739 -130 133 -322 -265 -168 -301 -222 105 -186 -740 -200 197 -748 -614 -64 -327
6614 -327 -290 17 -120 -863 174 -116 -896 -221 216 -291 -367 -164 -111 -536 48 180 -483 -286 376 22 -459
6635 -459 -217 -24 -248 11 79 -308 174 453 -41 -364 71 215 -49 -43 316 -127 -256 547 -24 -321 582
6656 582 643 -107 264 471 -59 201 375 16 -71 435 675 -410 -8 491 191 99 475 -125 -172 599 93
6677 93 -282 106 585 -11 -160 382 -15 37 640 261 -369 354 467 -21 -322 416 92 -55 329 -147 -200
6698 -200 409 625 -473 -135 -123 61 -24 278 33 -282 302 252 -365 10 510 220 -606 127 149 -338 214
6719 214 -104 -490 -155 277 -10 -647 -352 188 -155 -40 -99 -513 107 312 -268 -490 -104 83 -533 -329
6739 -329 -42 -207 -260 -54 -188 -613 -14 88 -552 -519 100 -160 -320 -177 -620 -553 170 82 -770 -19 370
6760 370 5 -50 365 -330 -292 354 -276 -394 -45 479 -423 -377 469 -67 124 41 57 -356 326 442 -222 -372
6782 -372 263 327 -302 85 108 117 536 455 -8 295 892 213 -526 478 366 178 126 91 74 63 273 180 -150
6805 -150 368 277 119 469 24 154 502 611 267 -231 352 677 -100 41 447 129 356 524 24 -104
6825 -104 616 268 -161 -197 365 330 174 249 -123 69 475 217 -267 -104 308 -86 -569 153 82 -111 12
6846 12 -101 -71 -100 611 91 -306 68 4 -210 97 273 -594 123 -96 -525 -147 183 154 -242 -440 -135 -509
6868 -509 117 169 -232 -338 570 -189 -827 -142 -15 -230 -265 196 -559 -389 2 -121 -659 -5 465 -166 -510
6889 -510 -15 -213 -275 -81 -241 -479 339 422 -277 -186 308 31 55 170 -146 -84 423 652 -134 224 561 194
6911 194 86 134 -173 -92 551 117 -391 71 771 203 -280 312 227 266 555 351 75 380 824 -61 -281
6932 -281 320 477 -75 213 206 -80 353 606 318 43 538 433 -171 167 101 309 336 581 -158 -231 272 365
6954 365 -229 -489 516 -9 -70 188 -18 202 515 -133 -491 61 539 114 -144 -366 54 -316 -246 -279 -452
6975 -452 -71 280 -292 -489 27 -176 -211 169 -695 -624 -58 305 -524 -492 134 -117 -407 -66 -37 -213 -152 -20
6997 -20 -480 -169 205 -139 -531 -310 -66 -391 24 -22 -424 -60 275 -154 -544 70 -23 -391 -87 95 -119
7018 -119 53 248 -348 -129 349 640 -153 -17 116 -145 92 216 -225 -13 308 400 -547 247 583 -132
7038 -132 -79 -6 -427 140 492 99 -386 155 436 -36 -146 215 90 358 352 115 -109 342 556 138 -48
7059 -48 534 362 13 475 -45 219 722 411 -73 -202 635 596 44 229 -44 92 195 112 -311 15 330
7080 330 105 -349 388 201 307 329 338 -322 -229 408 -394 -430 190 426 -280 -156 163 214 -3 449 -266 -628
7102 -628 282 -22 -503 -184 133 -30 -28 -278 -320 -140 251 -24 -482 -128 383 203 5 -373 -568 -694 356
7123 356 8 -391 -344 275 -673 -435 -82 -64 -137 160 -255 -402 -203 290 -479 -463 -52 83 -244 -65 -11 -353
7145 -353 488 358 -676 -332 49 -300 -256 15 -76 -83 131 128 -259 6 548 114 -710 -133 336 -327 -309 12
7167 12 8 25 510 348 -434 208 214 -10 248 89 221 -33 414 -91 -139 445 179 -100 -48 264 165 113 435
7190 435 146 -90 489 306 -364 -20 620 447 134 296 -37 175 310 337 -386 258 703 265 174 257 367
7211 367 123 381 266 279 78 528 260 -526 122 334 -92 199 -252 -259 -112 147 -618 -230 271 93 -612
7232 -612 -328 -75 11 189 13 -498 -256 316 106 -590 -211 116 -124 -367 -250 -210 -117 212 -384 -358 20
7253 20 131 -511 -223 -479 -239 -75 93 -435 -565 306 35 -258 -563 2 -284 -176 -72 -381 -329 340 242
7274 242 -489 -317 461 88 -518 -21 -14 -391 133 -257 -273 180 290 -159 -95 213 553 -327 98 -48 -296
7295 -296 147 700 -108 -282 119 -9 4 -123 373 -228 225 140 154 89 399 201 -135 91 289 -93 35
7316 35 235 252 -106 785 60 34 222 537 402 -241 582 63 -173 603 2 -12 462 411 -391 -63 257 89
7338 89 115 493 -93 -127 376 756 -207 -166 362 274 -159 -40 -52 -315 249 275 -308 -162 302 -218 -491 -58
7360 -58 -50 -314 323 -48 -479 -357 74 -530 -388 -89 481 -82 -514 -528 -305 232 429 -489 -573 59 347 -264
7382 -264 -289 -59 -390 -63 234 -402 -555 182 144 -694 -189 129 -87 -197 -141 -330 -547 244 -99 -438 -110
7403 -110 145 -24 -192 -119 -87 -290 326 -190 -272 -267 209 -16 -189 53 141 -288 244 -540 -596 248 382 -341
7425 -341 -103 491 208 -295 124 -14 18 321 284 -168 -306 729 349 -276 200 57 205 227 289 -108 134
7446 134 456 131 -144 -155 447 -286 307 266 320 -51 463 -284 -84 217 142 -297 24 357 65 -67 -37 -327
7468 -327 -194 351 406 -469 -85 329 -9 98 169 -129 -96 320 129 -335 -169 508 -6 146 -19 -204 -161
7489 -161 55 123 -456 136 -3 -317 -132 321 243 -563 9 -68 -174 7 21 -510 -394 40 -134 -515 -255
7510 -255 -199 -141 -47 271 -331 -361 22 44 -386 -504 -176 -708 -200 -233 -597 -380 402 -266 -804 -164 -169 -332 -109
7533 -109 -274 -182 21 335 -568 -362 15 241 -215 -517 -89 -62 -100 293 -419 -215 421 519 -293 -112 332
7554 332 271 -120 297 -101 -312 296 -3 -83 161 369 151 -98 173 172 -140 506 36 -290 37 834 27
7575 27 -143 579 445 -160 160 -93 115 215 617 120 -140 664 362 -73 -329 523 -135 206 277 -229 31
7596 31 526 85 158 85 253 354 330 73 -336 -92 384 80 -434 -31 389 -156 -124 -272 -204 -23 445 -61
7618 -61 -368 304 352 -420 -321 -286 -341 -13 -34 -374 -321 -188 99 -305 -276 591 -16 -211 332 -271 -400 -215 -339
7641 -339 -714 -93 613 -419 -528 -114 -285 -278 13 -469 -331 -477 262 -474 -551 -24 212 -221 229 -146 -149
7662 -149 37 92 -357 -361 383 70 -63 -4 -175 75 219 144 -474 -254 375 53 -513 -338 92 -48 118 322
7684 322 179 -297 334 47 -21 406 220 -66 128 171 -83 112 430 -10 69 301 505 -195 -251 245 130
7705 130 -111 397 67 -41 621 458 35 -269 376 298 -224 196 -154 110 397 332 -196 101 488 190 -335
7726 -335 44 42 107 114 -124 -1 102 531 126 -123 342 79 -459 -90 98 -349 144 638 -379 -223 463
7747 463 132 -218 -221 -4 -230 11 -138 -430 -523 30 105 -358 -159 175 -441 -137 -26 -650 -34 290 -322
7768 -322 -498 -380 284 -106 -364 86 -214 -237 157 -301 -586 -9 172 -345 -410 -91 -208 4 -31 -108 -39 176
7790 176 157 -467 -244 391 74 -343 -160 16 -187 -14 42 -601 -528 384 -56 -361 -174 -263 -169 69 -2 -345
7812 -345 78 170 77 -566 276 -177 45 103 210 80 15 260 -31 -146 508 573 -137 -155 372 34 148 289
7834 289 300 -53 403 342 4 172 670 78 55 268 36 435 563 217 159 279 211 63 -215 111 178 167
7856 167 226 14 -93 387 388 -420 -401 401 102 -221 191 72 -326 181 94 -494 -126 261 416 10 50 -227
7878 -227 -264 19 -99 -158 -270 450 -118 -427 -129 219 -146 -215 -233 -380 -128 176 -425 -612 -169 244 -30
7899 -30 -443 54 -27 87 216 -366 -627 397 24 -326 -314 -295 -33 -367 -41 -209 -587 155 23 -534 71
7920 71 288 12 -255 259 -185 -98 181 52 -328 29 272 -193 -193 108 -200 -77 131 85 -734 -37 208 15
7942 15 -323 416 349 -373 201 83 25 -84 271 -327 -36 521 194 -93 145 97 -193 232 228 -312 225 665
7964 665 215 -82 42 277 130 376 108 -141 172 697 189 -453 216 508 160 173 373 109 108 239 131
7985 131 -91 170 283 -299 -157 281 11 360 394 -170 -7 371 143 -49 -91 203 -114 -440 -341 58 -293
8006 -293 276 183 -266 73 126 -346 -226 -95 -232 -74 159 -414 -509 125 89 -266 -212 358 26 -221 -150 -117
8028 -117 -506 -23 -10 -500 -484 187 -77 -335 -335 -26 -279 -305 68 -685 -225 99 -50 -307 -223 443 -113 -4
8050 -4 -441 -324 -149 64 -198 -458 239 351 -284 -91 31 -323 272 211 71 -294 254 465 -204 -57 242
8071 242 188 120 214 -190 -290 227 298 -87 172 507 352 -199 95 90 59 351 258 -346 53 585 231 -269 308
8094 308 -66 74 339 317 5 326 387 -85 5 267 191 -26 -36 225 -78 -39 591 -38 -69 257 143 -267
8116 -267 63 340 57 90 137 7 -55 487 135 -145 126 106 -100 -133 250 -368 -118 376 -312 -370 -76 354
8138 354 -644 -308 244 -48 60 144 -90 -323 292 242 -287 -222 41 152 -74 -27 -397 -282 288 230 -645 -416
8160 -416 159 -31 -563 -169 -177 -378 213 -17 -613 -145 55 -238 -49 19 112 -279 -84 -196 -211 111 300 -170
8182 -170 -459 235 261 -236 -55 190 -41 -9 114
8191A14
$$ Imaginary data points
##PAGE= N=2
##DATA TABLE= (X++(I..I)), XYDATA
0 0 0 0 0 0 0 0 -8 8 -8 8 -13 16 -16 24 -31 32 -40 48 -56 64 -72 87 -101 115 -132 152 -172 195 -220 248
30 248 -280 312 -351 394 -435 485 -541 599 -664 736 -817 904 -1000 1107 -1227 1365 -1516
47 -1516 1691 -1896 2133 -2415 2761 -3189 3737 -4466 5497 -7053 9663 -14875 29275 -149689
61 -149689 -515407 -145283 218171 101614 -179959 -71352 191713 121102 -241404 -318465
71 -318465 15777 251777 63328 -131730 2795 146520 -30997 -222113 -87218 161849
81 161849 148246 -47118 -87374 72426 112741 -80757 -187081 2272 172252 58302 -85425
92 -85425 465 98004 -19602 -161638 -84343 87413 96215 -36724 -59752 58158 39159
103 39159 -179476 -232694 35304 217209 30267 -189555 -105823 61132 -21298 -217858 -165598
114 -165598 112104 196588 -71166 -285282 -130043 82780 -12238 -184714 -81372 115958
124 115958 52904 -176286 -216729 -26883 87192 -36922 -161291 -51706 94199 -3932
134 -3932 -179249 -119645 59243 55718 -87284 -113168 2500 69947 -6551 -101498 -64527 31032
146 31032 13464 -60567 -18548 69618 27063 -71920 -62313 7459 11328 -18212 3429 54195
158 54195 41316 -57458 -115685 -25817 85249 42574 -56484 -27728 42592 -10694 -102974 -72226
170 -72226 41025 74254 -13519 -97895 -60826 19507 -13386 -97174 -54933 50961 19445 -103772
182 -103772 -119014 -25201 21635 -34101 -98243 -74725 455 -5793 -95906 -108557 -15758 14303
194 14303 -65978 -112917 -63618 -5396 -5876 -50555 -84143 -59932 -22874 -42553 -67354 -24118
206 -24118 17063 -20534 -72296 -69799 -39538 -11274 5344 -5316 -19401 -15077 -28314 -56430
218 -56430 -34498 22430 32837 3618 -12251 -20482 -25146 -6885 10973 9853 19084 25030 -4056
231 -4056 -25061 -3521 14164 10228 19076 22117 -3326 -15835 934 12558 15631 15290 -6026
244 -6026 -19776 4721 16549 -10859 -11607 22239 14497 -31216 -42506 -9878 23360 23132 -16212
257 -16212 -45333 -16484 8288 -30537 -49103 9992 42580 -17195 -73475 -49784 3973 14586
269 14586 -22643 -45994 -7826 23243 -32428 -88778 -31215 50006 18913 -59085 -57399 -1910
281 -1910 13760 -24646 -49206 -10155 38576 1245 -73090 -50288 35302 35969 -31689 -40578 4496
294 4496 11379 -22579 -33917 2954 41267 14622 -48878 -43978 23045 29610 -20919 -15818 30345
307 30345 13841 -41297 -39433 13852 40518 9786 -32397 -20400 19842 913 -49611 -17083
319 -17083 57799 33093 -55649 -59050 12248 32302 -15403 -40610 1638 43317 -2041 -80196
331 -80196 -53982 49379 53429 -43373 -65330 11236 35203 -30889 -65052 -8801 52394 20508
343 20508 -63633 -64075 27478 51523 -33772 -67401 7536 45043 -16897 -57948 -8840 45204
355 45204 19247 -50093 -55819 16747 49736 -8874 -40894 14416 36861 -28949 -60043 3198
367 3198 56073 27888 -21783 -22016 12061 9581 -33839 -26873 49912 69542 -14576 -61875 -4330
380 -4330 36831 -4124 -30270 15725 58567 23181 -49536 -53967 23605 58576 -7162 -47587
392 -47587 16256 57537 -7244 -60971 -12794 48946 27597 -35919 -40926 23912 54869 -7735
404 -7735 -61621 -11804 45150 2634 -49466 -7823 50432 26144 -39543 -53762 -6647 29601
416 29601 5553 -26777 3609 36580 -11272 -68661 -33644 30923 25770 -12157 -12692 5172 -5120
429 -5120 -37202 -42468 4159 43430 8604 -43763 -25028 14660 -10755 -45148 -13939 30028
441 30028 12264 -34044 -41847 -4287 21734 -8046 -48747 -21625 27444 5316 -45027 -24716
453 -24716 24544 10117 -40796 -46679 -4515 28212 9527 -30689 -25012 11739 -681 -47809
465 -47809 -31755 30103 35886 -13482 -36271 -17905 -615 -5342 -16153 -2510 28331 18948 -32014
478 -32014 -41243 3432 21544 -4156 -7842 12619 10202 -12011 -20610 -5375 19209 19507 -11100
491 -11100 -20136 10180 19081 -10107 -13691 16184 16788 -12587 -20107 1412 22445 18957 -8256
504 -8256 -22303 1003 15079 -10772 -17966 17853 30332 -6934 -33280 -18700 6528 14528 1202
517 1202 -12101 -657 9509 -17384 -38814 -6242 28464 9926 -20767 -19758 -7612 -5864 -9679
530 -9679 -11178 537 13366 -5577 -34588 -21013 11736 6575 -15045 -9483 898 -8280 -16035
543 -16035 -10411 461 8812 -1237 -23451 -19135 7598 6374 -12941 -4211 10803 -4003 -22291
556 -22291 -13560 6256 16179 8211 -12789 -16936 2128 3147 -15865 -5011 24815 16036 -19369
569 -19369 -26387 -7067 7769 8784 -1755 -7777 2515 932 -24810 -25495 10044 21577 -6449
582 -6449 -22319 -12000 -5504 -8418 -9604 -8426 -800 992 -18843 -29499 -6903 9195 -9939
595 -9939 -22442 -10079 -7582 -18068 -15767 -5449 -1588 -5736 -20638 -30387 -13113 4985 -6336
608 -6336 -15700 -1584 -1177 -25490 -30310 -7206 10166 8834 -4128 -18171 -14089 -2544 -10842 -16530
622 -16530 9321 26590 27 -26035 -15365 4194 7131 3397 184 4637 11529 152 -18119
635 -18119 -3792 23821 14528 -9765 -4874 10692 9562 3708 2561 2911 5832 3216 -7443 -2089
649 -2089 19358 16458 -6565 -9349 410 -4699 -6757 7633 14813 6471 -5028 -17459 -18891 -1424
663 -1424 7058 -1578 707 8396 -9009 -31363 -20688 2567 6517 -322 -8521 -13816 -10943 -10971 -21497
678 -21497 -15087 8801 7203 -20681 -25581 -6019 -944 -9578 -12599 -10539 -5004 -1993 -12059 -16625
692 -16625 891 9279 -11701 -23096 -7067 3857 -102 -359 267 -4415 -5597 -8390 -11697 1284
706 1284 16749 7814 -7768 -5431 -3161 -9881 -2302 13064 11665 1962 -3119 -8593 -7714 3933
720 3933 6853 2249 7658 7631 -10632 -15512 3795 12475 3349 -1647 -2337 -3975 -1481 -1811 -6363 2476
736 2476 12004 -2852 -20263 -8040 7849 2983 -3971 -3333 -5183 -6073 -5109 -9171 -4643 10061 6100
751 6100 -14235 -14935 -1564 -527 -2484 2816 2550 -3970 -4327 -6099 -7442 3924 12003 1732 -5172
766 -5172 92 -1226 -3574 7128 13092 4049 -245 2216 -10 2995 11825 10713 6005 9128 3978
781 3978 -5778 3405 19826 15775 4990 5420 5548 2851 6491 8679 9075 16248 15146 -2289 -6948
796 -6948 10352 15960 7117 5601 7932 3581 2122 3024 1092 7397 15460 4716 -9491 -2669 7386
811 7386 3599 3239 6381 127 -4749 -2040 -3129 -3056 7337 8667 -4944 -9130 -3479 -5178 -2944
826 -2944 6705 4519 -5597 -5261 -3725 -7595 -3283 5353 2221 -1572 -450 -6668 -10263 2033 8948
841 8948 -304 -3312 1801 -882 -4301 573 3219 2715 6876 2114 -9016 -2874 11283 7583 -883
856 -883 2579 3496 -1258 1584 4555 4309 9214 10522 -2329 -8686 3790 10551 6573 7411 7120 -852
872 -852 -1777 2248 626 3847 14023 10108 -3803 -4329 871 426 5182 10297 4010 -1485 2054 260
888 260 -4800 2918 9953 4232 722 642 -3859 -2708 7879 7057 -2027 924 4193 -2259 -2553 4575
904 4575 4968 2917 3991 -1862 -6730 3408 10727 2579 -1157 3956 880 -2348 3108 5420 4053
919 4053 8401 5655 -6270 -4802 8003 9591 4695 6034 3511 -2470 339 3444 1053 7105 14213
934 14213 3833 -7107 -2500 3038 2919 6836 8353 561 -533 2308 -3088 -4707 6637 9892
948 9892 1091 -1934 -1178 -3438 -181 5801 714 -3769 2047 1178 -5945 -2255 4367 0 -2615 -1378
964 -1378 -5869 -5957 4244 5095 -3995 -4632 -2145 -6458 -5109 2653 1798 208 2985 -3930 -14033 -6888
980 -6888 5019 3736 439 1484 -3686 -7523 -4376 -3949 -3738 6408 9644 -3545 -10017 -2516 193
995 193 -1393 2376 3069 -458 1404 1111 -6144 -2784 7674 3983 -4470 -1596 2926 820 2964 3608
1011 3608 -2683 -2975 3006 330 -2303 6526 8013 -1028 -3200 -1723 -4202 875 11039 7351 -558
1026 -558 32 -943 -5602 -331 6754 5894 6176 6861 -3394 -10186 121 8081 4157 3064 5691 963
1042 963 -1858 -9 -2074 300 10030 7530 -4789 -2935 5974 3386 -737 1712 1519 458 3866
1057 3866 1875 -1753 4540 8434 -2373 -7765 742 4699 2234 4875 3563 -2887 -2361 -870 -4180
1072 -4180 -461 9316 6038 -3318 -3161 -2927 -6214 -307 7606 2914 -2404 -150 -2917 -6314 -638
1087 -638 2105 646 2624 1814 -7931 -8430 3491 4361 -3865 -2799 583 -2601 -3107 -1781 -3097 771
1103 771 5539 -3962 -11924 -2140 6172 134 -3325 -308 -1983 -3745 -2024 -3623 -1474 7073 3799
1118 3799 -8816 -7957 1633 944 -1236 2779 1820 -3528 -2728 -2334 -3721 2244 7308 -333 -5210 -860
1134 -860 -1715 -4184 3511 7120 -1047 -3043 -131 -2157 -2525 2806 3063 910 2613 -1598 -8646 -1367
1150 -1367 9130 3410 -4321 -48 1806 -2150 -1870 544 1567 6088 4375 -6718 -6750 6240 7344
1165 7344 -1665 -708 3549 250 -1561 337 600 4418 8091 -228 -8092 276 7218 2454 1367
1180 1367 5787 1779 -3094 -165 1220 2083 7627 7516 -612 -2016 2024 -537 975 9299 7343
1195 7343 -716 337 3658 -463 231 5662 4879 3198 3067 -1644 -3775 5563 8718 -1016 -2950 3983
1211 3983 2738 -2255 375 3260 3212 3930 -981 -7397 -641 8756 3112 -4334 360 1976 -3438 -2776
1227 -2776 1358 1928 4247 3272 -6460 -7887 1993 4033 -1483 802 3602 -2741 -5020 -1130 -909 -15
1243 -15 5099 1854 -4898 -2550 422 -2379 683 5754 -187 -4833 364 1359 -2823 669 5193 1513
1259 1513 -798 -314 -3227 -62 8333 5437 -3443 -822 4105 24 -1910 4063 5447 3911 2842
1274 2842 -2421 -4303 4822 9720 787 -1328 4979 3429 -1957 566 3906 4396 6063 2473 -4373
1289 -4373 -610 8258 4532 -241 3816 4830 -733 14 3170 2608 4412 6719 567 -3256 2273
1304 2273 4237 1107 4608 6592 -478 -2085 3651 2355 217 5620 5986 440 -337 552 -695 4297
1320 4297 9331 2238 -3687 2026 4438 -1066 276 5888 4865 2162 143 -3770 -839 8544 6741
1335 6741 -2739 -117 5460 -43 -3522 1979 4843 3885 3290 -2059 -5177 1405 5742 -436 -1612
1350 -1612 4624 1826 -4240 -1552 1516 -1 1951 2493 -3023 -2982 2074 251 -1804 2450 1162 -4941
1366 -4941 -1825 3263 -366 -2389 2040 291 -4478 -2965 -1323 -775 3916 2323 -6508 -6805 1569
1381 1569 82 -4852 116 4758 622 -3907 -5147 -5509 1363 6504 -97 -5212 1742 2508 -6155
1396 -6155 -5557 2852 4313 1764 -171 -3893 -3090 3134 1764 -3905 532 4778 -1140 -4200 1607
1411 1607 2383 -378 1159 643 -3168 187 4351 598 172 3293 -1191 -4545 2087 4433 -16 1236
1427 1236 4742 55 -4051 -736 1481 2963 6254 2184 -4423 -43 4834 -1277 -3139 5725 7506
1442 7506 604 -2248 -1789 -484 4708 4528 -2039 -640 6471 2699 -5336 -457 6025 2792 -424
1457 -424 -224 -790 1960 5605 330 -3598 2116 3296 -2923 -811 5592 2915 -638 444 -1902 -3629
1473 -3629 1546 4029 509 1141 1260 -4226 -4704 1892 780 -2791 2237 3457 -4105 -6218 -1931 -581
1489 -581 249 1878 -2957 -5251 793 -88 -7123 -3616 4776 983 -6101 -4722 -2268 -1151 621 -2273
1505 -2273 -5979 -979 2147 -5141 -7116 1488 2710 -4181 -5361 -2557 -2654 -268 1000 -3418 -3487 989
1521 989 -1366 -6069 -564 3263 -1454 -1859 -438 -3210 -3952 1670 1897 -1319 -116 -96 -4013 -1030
1537 -1030 2336 -1411 -1666 3997 1327 -5623 -3467 2828 2187 924 715 -2423 -1171 2784 -1009 -3688
1553 -3688 3562 6821 -1804 -5506 57 2247 1665 2055 -1057 -2080 2309 1306 -4930 -1456 6022
1568 6022 2109 -4325 -1664 165 -892 1508 1417 -2323 -718 2394 -2123 -3582 2692 3419 -1008 33
1584 33 560 -3424 -1581 3524 1358 -1571 1219 27 -3186 -204 1606 -1479 942 4278 -1691 -5204
1600 -5204 720 3121 -450 -722 282 -1686 132 1929 -2471 -2637 3933 1746 -5803 -3391 2167
1615 2167 1471 -382 -296 -3278 -2722 1345 -1058 -4241 1261 4028 -2662 -6406 -2241 -1389 -1311 1758 33
1632 33 -3750 -1569 -1130 -6116 -4043 2362 849 -2750 -1274 -3657 -6424 -2002 1431 -2418 -2482 311
1648 311 -2617 -5297 -1533 -1566 -3437 265 976 -4868 -3966 2100 452 -3777 -2053 -636 -2011 1007
1664 1007 1187 -2574 -700 3227 -2488 -6110 602 4679 1611 391 523 -1832 -441 2403 -528
1679 -528 -266 6310 5035 -2905 -2819 1745 1296 2734 5399 2577 670 2910 631 -2444 2267 7387
1695 7387 3348 1192 2876 612 -386 4164 4308 986 2644 4611 981 -83 3216 1656 690 4009
1711 4009 2889 -1450 2516 5877 1047 -1670 1430 1907 1008 3446 2309 -429 2795 3448 -3474 -3064
1727 -3064 4710 5168 779 652 171 -2102 -39 1296 -1503 1813 6483 932 -5848 -2226 1416 403
1743 403 1407 2929 -511 -1070 606 -2463 -3493 3170 4343 -881 -1397 562 -1860 -1538 2103 -14
1759 -14 -2172 1551 1694 -2686 -1451 1010 -1123 -1012 1556 -1171 -2604 2255 2581 -3430 -3157 831
1775 831 -253 -994 1274 -24 -1255 1404 -1391 -6004 -1449 4973 2234 -1456 -43 -1259 -2989
1790 -2989 -674 -37 -724 3260 4716 -3263 -5822 -10 1761 -947 1362 1715 -1147 -185 306 -3211
1806 -3211 -1896 3762 2148 -1893 103 1410 -1693 -155 1912 -1349 -978 3126 1466 -1981 555
1821 555 2106 -1012 -164 1452 -1131 388 5244 2108 -3084 -459 2073 -143 620 3157 2002 1740
1837 1740 1929 -2445 -4092 2765 5942 854 -292 2434 361 -1618 704 824 1738 4991 2400 -3424
1853 -3424 -1579 3727 1090 -1231 1829 2085 -189 1222 563 -2450 352 3395 -739 -2520 1191
1868 1191 823 -1511 173 543 -3343 -1679 1364 -1555 -2814 1074 460 -3213 -2813 -2307 -3580 38
1884 38 2662 -3121 -5438 -1154 -1181 -4944 -2624 298 -1536 -1942 -2644 -6057 -4525 1333 -173 -5468
1900 -5468 -3172 -571 -3753 -4193 -2171 -2606 -2211 67 -3102 -6066 -1404 1424 -3316 -3524 -412 -1962
1916 -1962 -2977 -901 -1536 -2697 511 1236 -3909 -3569 401 10 -980 1104 -452 -2780 -113 1040
1932 1040 -2318 -613 3370 1496 -2260 -738 -64 59 2839 2447 -2269 -681 3105 -148 -2201 1344
1948 1344 2777 118 401 97 -2067 968 3882 -630 -2640 1470 2020 -1380 -475 1553 -87 689
1964 689 1474 -2152 -2150 2632 2236 -2151 -497 1242 -954 -998 1268 -622 -1189 2333 -92 -4510 -1684
1981 -1684 2395 359 -159 722 -1678 -2202 1059 -168 -2264 1293 3063 -1732 -3319 -226 -66 187
1997 187 2066 334 -2640 338 1738 -2850 -2358 1877 1520 -1192 -341 -678 -2419 1151 1385 -2863
2013 -2863 -1729 2550 -64 -3208 -834 236 -1623 -43 -629 -3452 -1796 2435 -848 -3948 -1842
2028 -1842 -577 -2577 -1630 -409 -2642 -1724 -184 -4154 -5947 -952 1038 -2358 -2859 -1761 -4066 -3450
2044 -3450 -1387 -2859 -3212 847 -313 -5035 -4263 -966 -2144 -2113 -169 -2217 -2922 194 -1147 -4806
2060 -4806 -1870 1787 -897 -2413 -482 -1403 -1502 1583 39 -3165 22 2610 -784 -1764 1731 1531
2076 1531 -244 630 -173 -1201 2557 4592 -229 -1354 2205 1723 -185 1838 2865 1390 2751 2301
2092 2301 -1829 -953 4392 3070 -103 1926 2221 425 1096 1425 -384 1225 4689 1343 -2087 781
2108 781 2192 -115 642 1191 -529 213 2379 -822 -2530 1669 2577 -1416 -1652 509 -479 92 1320
2125 1320 -1554 -3092 826 1197 -2505 -1528 1739 -465 -2179 -912 -1923 -1882 1724 825 -3715 -2524
2141 -2524 625 -1762 -2701 -313 -153 -1146 -54 -1860 -4506 -1218 2422 -800 -2369 367 -441 -2435
2157 -2435 -1233 -1017 -1519 1482 2432 -2582 -3729 674 569 -1524 -382 541 -1115 157 435 -2656
2173 -2656 -1820 2205 355 -2988 -1052 856 -340 65 230 -2332 -1519 2079 322 -2313 713 2072
2189 2072 -878 -1428 -239 -676 656 3107 -11 -2455 534 1873 -1193 -1144 1996 1434 885 1144 -1344
2206 -1344 -2199 2310 3334 -587 -203 2716 791 -556 809 727 820 3557 2092 -1860 14 3770
2222 3770 1624 -363 1957 2145 870 2380 1971 -100 2015 4514 614 -839 2236 3357 1732
2237 1732 2315 1700 -522 1788 3365 293 -102 3896 3357 -42 385 1226 405 2319 3160 -148 -441
2254 -441 2949 1657 -1743 82 2570 1211 649 813 -1638 -278 2876 781 -2476 -287 1626 -927
2270 -927 -1421 317 -464 -533 883 -1531 -3540 513 2301 -1621 -2339 -439 -1180 -1718 -357 -1588 -2515
2287 -2515 645 258 -3885 -3424 222 -493 -1647 -802 -1527 -2872 -540 -787 -3533 -1660 1557 -651
2303 -651 -3518 -1617 -1262 -2231 98 270 -2850 -1389 1106 -1368 -3322 220 1015 -947 -865 -509 -1567
2320 -1567 823 2423 -1233 -2834 1632 2136 -877 63 1671 465 520 1327 -1307 -691 3671 2925 -1071
2337 -1071 339 2077 386 563 1993 704 1235 3262 972 -1969 1002 3462 1432 525 2041 716
2353 716 -8 1847 619 -917 2341 3250 -254 -1130 1120 683 307 1335 380 -1234 1422 2187 -1358
2370 -1358 -1499 1845 1307 -992 -94 -293 -419 1668 869 -2935 -1628 2031 -62 -2332 74 736 -1061
2387 -1061 -528 -673 -2476 -165 2429 -862 -2681 29 388 -2064 -961 495 -618 629 710 -2389
2403 -2389 -3435 466 1209 -1332 -468 488 -1507 -1099 103 -1442 -1756 1651 790 -3219 -1649 547
2419 547 -727 -1088 -346 -1932 -1946 1219 -696 -3333 -1670 780 -1635 -2847 -720 -1163 -1064 410 -1929
2436 -1929 -4512 -1043 752 -2402 -3139 260 -363 -2400 -2134 -2465 -2832 272 1084 -2486 -2706 56 -1019
2453 -1019 -2869 -1057 22 -982 241 47 -2496 -2091 1860 453 -2157 197 791 -419 57 875
2469 875 -832 336 2989 528 -1567 1565 2669 728 711 1566 646 1726 3553 846 -257 3009
2485 3009 3805 424 663 2303 2173 2321 2860 571 259 3242 2986 -300 1184 3716 2098 206 1023
2502 1023 310 610 3015 1513 -1451 276 2409 -453 -1524 1241 791 -270 441 -516 -2106 -238
2518 -238 1853 -1304 -2128 161 -480 -1884 -645 -641 -2259 -500 154 -3051 -3174 83 -236 -2837 -1644
2535 -1644 -1102 -2252 -830 -438 -2986 -2059 1229 -666 -3739 -1414 123 -961 -425 -299 -1950 -1012
2551 -1012 1476 -845 -2410 270 1668 -852 -1742 -337 -46 92 1705 -679 -2300 546 1636 -1294
2567 -1294 -898 1435 461 -738 453 -680 -1277 1563 1448 -1766 -702 1716 -118 -1326 520 -18
2583 -18 -930 1267 195 -2464 -672 2175 36 -1425 227 -62 -1086 348 -14 -1513 560 2173
2599 2173 -1319 -2326 1024 1279 -42 185 -56 -1082 638 1675 -1147 -822 2923 1801 -844 -297
2615 -297 952 230 1478 1569 -13 402 3162 1683 -712 1110 2936 1094 900 2015 728 1442 3212
2632 3212 1395 -600 1666 3236 818 875 2506 902 1008 2088 808 -720 2145 3457 4 -475
2648 -475 1098 446 -446 1271 177 -743 1647 1453 -2718 -1976 1445 442 -1365 -414 -893 -1461 -137
2665 -137 -952 -3224 -1569 925 -1518 -3650 -1323 -976 -2106 -1515 -1587 -3334 -1487 66 -2679 -3889
2681 -3889 -860 -837 -2611 -2193 -995 -2190 -1240 176 -2906 -3017 -51 -18 -2547 -859 145 -1172 -950
2698 -950 -463 -1895 -1587 1767 1036 -1738 -797 655 -796 -935 894 -311 336 2208 77 -2168 469
2715 469 2641 -32 -353 1250 881 385 965 -343 -1067 1978 2664 -767 -852 1974 1005 -240 467 299
2733 299 -601 1405 1579 -1321 -287 2432 272 -1224 492 920 11 1250 992 -1777 -364 2100
2749 2100 407 -1305 1156 1615 -433 262 96 -1389 535 2563 94 -1796 985 1113 -919 -195
2765 -195 801 -187 777 1692 -935 -1680 1369 1336 -895 -419 1446 376 -98 493 -1044 -801 1694 871
2783 871 -2441 -255 1360 -292 -1006 -22 -967 -778 1043 -82 -2358 -450 776 -1651 -2528 -132
2799 -132 -494 -1083 -124 -1654 -3068 -1077 -136 -2751 -2519 -56 -831 -2463 -1790 -2134 -2836 -585 -253 -2929
2817 -2929 -2740 -550 -1554 -3333 -1620 -1089 -1844 -753 -1244 -3056 -2259 684 -1209 -3405 -771 -156
2833 -156 -1682 -1567 -744 -2156 -723 638 -1789 -2905 313 1207 -1739 -1614 -159 -927 -350 879 -719
2850 -719 -1326 1408 1030 -1721 -1053 1621 669 26 1025 -702 -777 1363 903 -1483 378 2724 545
2867 545 -776 752 -41 97 1839 775 -1077 365 1891 -153 -921 1302 930 43 707 345 -992
2884 -992 1191 2195 -808 -1145 1224 1069 -920 277 506 -614 889 779 -1573 -1175 1753 492
2900 492 -1571 -507 360 -804 -92 307 -1351 -778 1430 -725 -2502 -415 869 -1130 -769 -190 -1871
2917 -1871 -1328 276 -1468 -2793 -230 641 -2163 -2481 -628 -1260 -1127 -397 -1751 -2613 -437 -462 -3022
2934 -3022 -2218 -136 -1272 -2270 -1116 -2360 -2207 128 -982 -3560 -2032 310 -1649 -2773 -1194 -1171
2950 -1171 -1566 -503 -1224 -2990 -1324 519 -1661 -3049 -578 -384 -1709 -649 -631 -2237 -346 633
2966 633 -2273 -2223 285 410 -1408 -195 -354 -1186 34 569 -1594 -1002 1568 467 -1522 -294 576
2983 576 -188 518 1098 -605 -715 1759 241 -1710 637 1592 -132 5 672 53 457 1566 154
3000 154 -1889 1551 1937 -723 -564 1027 318 244 983 -388 -688 1696 1508 -1344 -699 1435 537 -537
3018 -537 798 353 365 1873 908 -1813 75 2135 159 -791 520 271 -382 529 248 -1502 347
3035 347 2122 -374 -1684 473 969 -649 365 131 -1333 97 1318 -1353 -1934 737 640 -2126
3051 -2126 -884 235 -1001 -33 488 -1942 -1866 635 319 -2683 -861 412 -1208 -1239 -728 -2103 -1617
3068 -1617 907 -801 -3195 -943 266 -1945 -2301 -497 -1579 -1567 -464 -1589 -2863 -807 404 -2364
3084 -2364 -2419 -604 -787 -1478 -690 -1517 -2246 -17 358 -2395 -1736 1116 -196 -1597 -399 -729 -1154 343
3102 343 524 -1753 -730 2016 69 -1829 224 942 -44 1029 611 -953 484 2494 487 -958
3118 -958 1874 1708 151 640 708 37 1518 2383 264 -547 2300 2373 -94 568 1813 1173 995 1742
3136 1742 -15 -411 2218 1639 -759 609 1992 242 327 1092 137 -75 1941 509 -1563 457 2012
3153 2012 -154 -845 307 25 -398 771 -154 -1581 580 1418 -1272 -1658 323 234 -498 278 -499 -1530
3171 -1530 604 857 -2211 -1357 1091 106 -1633 -381 37 -1391 729 458 -1655 -863 1072 -499
3187 -499 -2053 -380 92 -918 -518 -308 -1755 -578 1250 -1033 -2393 -3 416 -1369 -834 25 -1216
3204 -1216 -410 381 -1449 -2347 578 364 -1801 -1257 -40 -1776 -1003 -357 -1393 -1849 716 4 -2652
3221 -2652 -1441 204 -1004 -1308 -602 -1153 -1237 779 -584 -2809 -520 851 -1082 -1587 -79 -421 -790
3238 -790 264 -542 -1791 96 1642 -508 -1026 929 535 -610 243 339 -727 1464 1956 -475 -467 2078
3256 2078 1291 -312 847 1342 450 1280 1516 -147 346 2707 1361 -338 1417 2306 832 1057 1292
3273 1292 4 883 2619 702 -772 1333 1723 6 150 1142 136 403 1573 -91 -1077 1081
3289 1081 1492 -1314 -557 967 57 -483 401 -961 -1230 388 125 -2214 -1051 662 -910 -1548 -466
3306 -466 -1255 -1157 124 -503 -2783 -1126 554 -1488 -2457 -861 -574 -1364 -428 -1567 -2566 -823 574
3323 574 -1837 -2171 13 -134 -1763 -1078 -1188 -1564 -541 101 -2023 -2132 477 -164 -2363 -955 -304
3340 -304 -1332 -726 -88 -2194 -1554 865 -545 -2282 -782 402 -1061 -793 -101 -1602 -1085 692 -794
3357 -794 -2182 4 737 -1211 -1367 -346 -968 -277 264 -1012 -1764 521 658 -1628 -938 862 206
3374 206 -409 197 -687 -941 1166 732 -1439 -364 1237 32 -841 349 12 43 1160 672 -1073 382
3392 382 2006 27 -961 935 1086 526 890 926 -450 901 2148 -205 -619 1778 1896 -162 816
3409 816 475 -306 934 1915 -344 -406 1995 1205 -730 -47 643 -112 499 791 -723 -718 1515 322 -1685
3428 -1685 -237 934 10 -470 -341 -1194 -927 885 -408 -2171 6 1211 -1104 -1440 -467 -1087 -1038
3445 -1038 138 -1311 -2057 -65 501 -1887 -1665 -214 -527 -1653 -283 -949 -1939 -92 -140 -2418 -1372
3462 -1372 976 -284 -1932 -737 -1085 -1300 -258 -435 -1687 -264 1045 -675 -2238 -541 129 -775
3478 -775 -289 -242 -1584 -190 805 -1146 -1472 192 1177 -852 -215 121 -698 103 839 -1111 -1070 1325
3496 1325 1033 -873 -278 511 223 -6 949 -214 -173 1953 811 -760 646 1840 402 205 1320
3513 1320 142 461 1584 479 -833 1135 2254 446 -120 1418 874 768 1745 1008 -12 1857
3529 1857 2370 275 -20 1956 1571 729 1176 678 740 1855 1825 -475 245 2561 1522 231 1018 1320
3547 1320 457 1428 1194 -500 615 2368 547 -975 519 1366 132 334 380 -543 310 1373 -470
3564 -470 -1450 959 719 -671 -281 201 -755 7 563 -1115 -1405 997 393 -1581 -1012 203 -805 -851
3582 -851 -45 -1411 -1009 743 -105 -2246 -922 606 -635 -1029 -376 -682 -636 367 -777 -2111 -81
3599 -81 1202 -853 -1236 471 -116 -681 -132 -472 -1502 393 953 -1020 -1140 1101 194 -640 -221 53
3617 53 -340 744 644 -1369 -553 923 463 -891 12 802 -177 509 929 -1109 170 1488 271 -1151
3635 -1151 200 1134 -209 170 581 -307 351 1481 275 -820 893 1559 -351 110 811 281 539
3652 539 1218 -59 -508 1633 1272 -669 -81 1708 774 261 1004 -68 288 1556 1396 -564 489
3669 489 2252 574 -14 1189 771 809 2167 932 -900 743 2177 152 -333 1094 1029 -41 738
3686 738 451 -425 1033 1438 -822 -772 820 485 -115 -5 67 -573 802 722 -1174 -887 815 200 -1705
3705 -1705 -1136 -186 -538 -550 -597 -1154 -744 290 -758 -2453 -567 136 -1227 -957 -657 -1435 -1205 75
3723 75 -1202 -2276 -634 5 -1752 -1528 -495 -708 -737 11 -1176 -1559 123 154 -1848 -1188 570 -433
3741 -433 -703 232 -762 -811 628 355 -1401 -517 1278 113 -615 276 418 233 704 173 -1086 769
3759 769 1824 364 -687 744 939 179 893 506 -50 784 1563 -94 -279 1823 860 29 406 707
3777 707 69 1084 1450 -594 48 1607 804 -612 336 1150 333 447 884 -365 14 1448 634 -857
3795 -857 746 1434 -19 -18 609 34 322 1459 6 -999 1162 1313 -158 -292 799 226 77 909
3813 909 -27 -638 1196 1128 -1243 -455 996 514 68 358 -364 -739 850 396 -1586 -744 1288 37
3831 37 -1201 -151 247 -699 -139 -275 -1700 -174 795 -805 -1978 -68 -281 -947 -422 -799 -1479 -471
3849 -471 317 -1784 -1756 -69 -318 -1775 -1290 -755 -1290 -327 -218 -1841 -1667 208 -568 -1925 -781 -208
3867 -208 -1109 -604 -268 -1389 -687 479 -692 -1671 -394 567 -708 -1113 -117 -234 -388 597 -287 -1078
3885 -1078 420 880 -552 -692 918 76 -160 567 -76 -487 1027 1351 -735 -116 1608 432 6
3902 6 492 365 115 1080 1350 -727 287 1634 585 -360 576 835 367 954 916 -426 445 1663 377
3921 377 -651 978 1185 -107 550 625 -181 809 1276 -172 -478 1274 933 -561 109 672 78 207
3939 207 783 -762 -381 1030 306 -1126 -225 707 -134 -397 161 -276 -531 727 -229 -1090 -112 862 -432
3958 -432 -912 -437 -533 -677 60 -600 -1576 -327 348 -1141 -1231 148 -310 -716 -403 -667 -1506 -163 382
3977 382 -1734 -1473 -84 -392 -1600 -653 -994 -1105 -488 -221 -1626 -903 581 -661 -1470 -517 -298 -920
3995 -920 -415 -778 -1518 -443 557 -1143 -1786 300 443 -1075 -406 -416 -838 -135 550 -528 -985 526
4013 526 783 -1111 -498 439 -237 151 740 -515 -745 992 637 -473 -10 1196 201 16 835 280
4031 280 273 1214 618 -351 724 1994 419 -213 1158 794 493 1342 930 -35 1050 1726 213 -326 1107
4050 1107 1079 160 589 537 192 1313 1252 -420 -443 1839 874 -29 232 588 92 568 570 -933 49 1505
4070 1505 290 -729 623 607 -60 139 113 -560 305 1288 -279 -1279 413 679 -458 -392 16 -580
4088 -580 120 567 -500 -984 642 925 -983 -1097 453 3 -657 44 -964 -924 502 369 -1425 -805
4106 -805 659 -553 -1063 -531 -651 -596 177 -486 -1915 -527 578 -636 -1513 -297 -345 -777 -288 -594
4124 -594 -1378 8 375 -999 -1801 -96 -106 -1133 -632 -348 -831 239 354 -1588 -970 595 432 -856
4142 -856 -580 -203 -551 12 454 -686 -506 1086 87 -1193 244 966 141 43 703 -127 254 1529 224
4161 224 -488 981 1559 42 115 1205 553 847 1286 215 -235 1508 1576 197 412 1317 814 687 924
4180 924 478 108 1259 1520 -377 677 1395 417 -78 697 128 215 934 541 -749 348 1367 -17
4198 -17 -903 650 503 -6 407 348 -739 179 907 -417 -1126 496 638 -714 -387 -296 -811 -68 627
4217 627 -1200 -1114 864 150 -1242 -538 61 -186 -563 -145 -779 -528 760 -345 -1227 -217 645 -544
4235 -544 -723 -322 -881 -522 498 -318 -1631 -113 849 -552 -1100 -20 -458 -524 225 -536 -1146 261
4253 261 563 -1039 -1045 589 154 -443 161 -416 -830 529 142 -1317 -573 722 -283 -902 131 192 -262
4272 -262 -167 410 -753 -59 1414 -479 -937 317 601 -61 64 256 -617 507 940 -234 -1000 1031
4290 1031 994 -344 453 767 433 739 1077 -159 -211 1768 1324 -399 223 1175 492 633 1164 382 368
4309 368 2093 1225 -46 704 1785 682 520 983 572 920 1625 571 -269 932 1638 494 65 864
4327 864 614 447 842 30 -358 928 1513 -583 -508 1484 499 -567 343 114 -621 610 536 -957 -683
4346 -683 931 -43 -1009 -59 -211 -327 183 -304 -1258 -483 682 -450 -1646 -320 419 -1132 -558 -619
4364 -619 -1093 -481 296 -1070 -1667 -94 414 -1250 -561 -171 -720 -426 7 -968 -1107 735 377 -694
4382 -694 -673 148 -512 -416 -168 -736 -671 544 525 -1267 -59 797 -331 -759 298 -21 334 875 79 -921
4402 -921 428 1208 -186 -569 628 279 188 249 219 -550 677 1199 -723 -538 1150 957 -45 400 277
4421 277 77 809 846 -584 62 1472 702 -208 381 611 491 599 1065 134 369 1396 699 -314 491
4440 491 1132 321 619 656 110 652 1244 382 -408 778 1327 -304 211 1198 269 592 1021 -113 -300
4459 -300 1586 755 -723 210 1113 108 -231 651 -164 -377 842 398 -698 -17 1117 -35 -552 233
4477 233 -396 -424 363 -192 -1288 -114 1158 -566 -1014 92 -231 -892 -159 -392 -978 3 326 -1174
4495 -1174 -1351 516 273 -945 -335 -541 -693 -367 171 -1139 -973 649 -190 -1358 -536 193 -1138 -144
4513 -144 -193 -991 -678 722 -127 -1436 -119 298 -284 -477 64 -885 -274 507 -248 -879 348 888 -827
4532 -827 -737 449 111 -320 565 -183 -519 1096 663 -670 -148 1004 417 -188 258 70 -248 1121 974
4551 974 -566 378 1551 402 -236 576 582 137 739 408 -442 1049 1791 220 -195 764 1023 186 692
4570 692 328 -221 1128 1332 229 -358 1221 946 211 225 734 266 826 1056 -611 -5 1114 799 -385
4589 -385 634 920 123 407 842 -860 -13 1135 268 -1043 134 1149 -383 -222 -23 -3 -24 397
4607 397 -302 -968 216 588 -721 -987 342 -141 -272 -223 -643 -969 241 85 -1137 -1059 233 -303 -943
4626 -943 -545 -730 -681 110 -203 -1241 -928 400 -429 -1145 -211 -322 -639 -46 -565 -1171 -250 747 -708
4645 -708 -1124 13 419 -556 -211 -46 -800 -267 585 -1003 -789 658 151 -708 -444 199 -32 191 404
4664 404 -580 -252 860 595 -588 97 837 143 423 461 -170 -119 1336 421 -593 224 1001 91 107 696
4684 696 254 315 1175 514 -660 549 1193 92 -322 984 751 127 782 321 -176 1022 1125 -287
4702 -287 -101 1273 585 -54 587 434 182 1132 693 -294 180 1199 334 -164 447 710 59 407 361 -458
4722 -458 291 1384 162 -569 609 1014 -293 -220 312 -144 205 544 -392 -622 672 771 -712 -285 336
4741 336 -227 -518 483 -732 -779 739 362 -1272 -627 398 -657 -404 -88 -834 -495 129 -150 -1589
4759 -1589 -498 430 -359 -910 -178 -729 -863 169 -738 -1455 -179 341 -1143 -1346 -171 -355 -773 -248
4777 -248 -776 -957 102 157 -1220 -714 589 176 -718 -81 -10 -435 266 496 -901 -236 918 -268 -813
4796 -813 404 452 -30 141 567 -277 128 1017 275 -617 810 652 43 421 524 287 388 957 -464
4815 -464 -629 1056 892 -218 125 964 283 440 1317 -112 193 1190 831 -460 53 1023 320 153 581
4834 581 272 -144 890 385 -655 397 946 -88 -481 207 417 -70 666 199 -548 473 877 -692
4852 -692 -888 437 284 -418 129 -151 -791 241 615 -712 -738 722 242 -1057 -55 -12 -428 95 -56
4871 -56 -713 -719 631 40 -824 -516 115 -775 -407 -7 -1170 -641 297 -685 -1256 -335 312 -948 -591 -382
4891 -382 -579 -527 -190 -863 -1130 -141 302 -1159 -908 82 -583 -741 -296 -657 -760 392 22 -1411 -906
4910 -906 268 -374 -752 -273 -344 -569 466 -404 -1234 -307 615 -598 -678 86 -24 -477 282 -327 -906 403
4930 403 656 -361 -817 523 534 -76 285 -84 -344 682 798 -73 -478 993 454 -519 -127 429 -88
4949 -88 386 758 27 239 1353 538 -512 332 771 63 627 852 109 432 1175 492 -655 588 776
4968 776 48 -6 824 415 579 811 140 -450 674 801 -346 -190 583 -53 -13 89 -174 -368 562 611
4988 611 -885 -71 708 -63 -486 -331 -232 -659 267 -143 -1067 -537 676 -414 -1020 -15 -332 -521 -338
5007 -338 -578 -954 -299 379 -723 -1433 -273 -293 -1168 -289 -657 -776 -108 -96 -990 -1112 74 -135 -1186
5026 -1186 -691 39 -352 -17 -161 -1155 -717 179 -106 -1052 -448 169 -611 -716 82 -313 -291 152 -632 -1228
5046 -1228 91 422 -822 -512 -69 -21 -150 439 -195 -774 541 601 -405 -325 653 401 -312 -66 -29 -177
5066 -177 744 409 -463 -383 1156 263 -303 248 527 18 760 797 -383 -162 1203 427 -344 485 671 54
5086 54 323 562 -374 295 1270 -216 -493 704 684 -90 422 224 47 627 661 -27 -513 575 409 -544
5106 -544 120 784 -54 96 315 -443 24 1037 110 -920 -2 496 -70 -335 27 -282 -194 661 -295 -939
5126 -939 0 549 -550 -435 -45 -116 -316 157 -431 -1136 50 443 -1187 -609 117 -50 -822 -398 -528
5145 -528 -727 -244 -261 -1287 -817 437 -132 -1174 -604 -106 -423 24 -263 -975 -320 382 -828 -1283 -13
5164 -13 -56 -878 -587 -358 -809 -410 291 -684 -1149 303 115 -739 -531 87 -662 -72 39 -414 -575 142
5184 142 288 -728 -212 503 -86 -13 -2 -399 -202 1076 328 -443 117 641 272 7 247 113 212 988
5204 988 448 -273 673 1171 15 -379 559 512 497 715 198 -209 1017 944 -23 -182 913 759 142 218
5224 218 92 20 437 564 -345 134 1161 402 -533 469 475 -46 556 297 -202 -90 1292 234 -731 184
5244 184 362 -309 -220 124 -490 -34 390 -467 -703 388 356 -387 -181 -276 -287 -274 256 -811 -759 272 36
5265 36 -1407 -469 216 -494 -527 -215 -702 -691 199 -437 -1140 -552 297 -613 -831 -377 -467 -685 16 -573 -1027
5286 -1027 27 67 -677 -921 -211 -104 -520 -145 -333 -1144 -15 265 -785 -1010 185 57 -409 -307 -45
5305 -45 -590 124 -2 -718 -551 615 -148 -665 -101 311 179 153 -226 -443 -137 744 2 -794 91 550
5325 550 -51 -20 445 109 126 926 -174 -613 547 1027 -55 -221 339 -79 232 605 184 -138 639 434
5345 434 -454 137 1228 482 -149 801 257 -130 881 734 -152 214 1001 10 -201 461 422 117 432 177
5365 177 -510 463 961 119 -503 581 475 134 16 239 -187 179 325 -618 -686 467 170 -468 141 -55
5385 -55 -354 310 92 -661 -524 433 -97 -731 -496 6 -451 -272 -330 -681 -500 448 -590 -1056 -290 381
5405 381 -451 -836 -338 -605 -501 -140 -908 -1137 -199 104 -1073 -1005 -520 -401 -749 -335 -332 -775 -89 148 -443
5426 -443 -315 23 -53 -690 -247 -495 -566 569 -195 -702 -304 887 -244 -782 130 210 27 379 -299 -505
5446 -505 195 805 -216 -569 678 516 -23 -58 205 91 458 658 -167 -68 998 650 29 266 412 184
5466 184 541 738 -28 58 1022 775 -249 354 834 367 335 384 5 500 1024 305 -312 388 926 204 -164
5487 -164 563 -45 309 850 -3 -693 573 1028 -310 -165 430 335 -146 278 -214 -205 857 598 -806 -315
5507 -315 683 179 -523 255 -140 -118 138 -187 -925 -99 807 -382 -725 106 462 -107 22 -62 -741 -91
5527 -91 451 -585 -891 72 291 -296 12 -173 -427 116 166 -727 -829 517 62 -833 -547 -2 -260 -351
5547 -351 19 -816 -612 494 73 -1132 -69 108 -113 -123 -169 -513 -185 592 -338 -802 -145 473 -463 -447
5567 -447 228 252 -155 53 -476 -548 476 686 -623 -427 319 -69 27 -98 12 -115 784 716 -348 -357 783
5588 783 273 195 123 336 456 517 378 27 -63 1133 494 -432 766 702 286 735 369 13 594 1012 355
5609 355 -320 408 976 247 163 578 101 512 732 -223 -38 1000 782 -67 227 934 88 135 513 5
5629 5 -201 804 333 -396 196 754 38 -254 69 -413 -167 278 -401 -810 242 564 -720 -657 -31 89
5649 89 -606 83 -268 -885 235 158 -786 -867 29 119 -622 -344 -324 -514 253 43 -843 -853 147 -166 -747
5670 -747 -419 -49 -463 -23 -119 -754 -631 443 -410 -550 18 130 -158 -92 -88 -533 -89 575 -409 -857 330
5691 330 487 -268 -237 94 -147 70 224 -351 -376 500 375 -224 -48 360 -16 -200 417 -130 -311 505 584
5712 584 -598 -171 912 275 -506 152 -19 201 576 262 -206 263 892 -189 -214 417 187 303 451
5731 451 262 -287 412 833 -93 -120 723 743 -39 427 643 503 667 642 -24 -145 1085 593 -230 355 288
5752 288 205 545 357 -131 26 584 454 -381 109 629 55 207 72 -90 11 718 -38 -516 278 633
5772 633 118 -434 128 -210 -15 337 -357 -602 172 318 -575 -169 15 29 -188 -241 -461 -899 26 61 -913
5793 -913 -506 522 -286 -793 -251 -329 -560 76 83 -794 -66 438 -415 -771 -233 -5 -367 165 -212 -741 152
5814 152 503 -786 -923 14 257 -562 -566 -160 -348 114 136 -584 -560 523 25 -442 -158 501 78 158 5
5835 5 -414 -259 1023 -32 -408 169 538 389 80 95 83 162 679 -11 -252 534 1039 -19 157 475 436
5856 436 218 858 56 -333 498 752 -142 383 812 509 97 271 158 14 838 676 -487 -129 928
5875 928 294 -232 319 205 135 415 536 -342 175 690 146 -253 400 489 -75 90 -28 -377 119 520 -416
5896 -416 -399 514 169 -260 -220 -106 40 31 43 -575 -502 120 -45 -704 -137 16 -445 -38 -11 -374 -417 507 -87
5919 -87 -680 -252 261 -504 -335 -248 -477 -598 72 -390 -1168 -301 201 -452 -432 -15 -226 -512 211 -366 -624
5940 -624 -223 86 -184 -385 142 -192 -366 -65 -121 -335 216 14 -702 -336 385 167 -656 -73 37 -225
5960 -225 268 194 -551 -410 569 180 -650 233 309 -205 137 379 -364 306 941 -189 -769 705 812 -161
5980 -161 -275 510 37 375 607 -261 -234 820 278 -329 88 744 76 455 401 -75 -75 603 747 -338 260
6001 260 641 391 -73 620 -76 1 675 352 -348 230 954 -67 -17 289 350 122 37 110 -246 596 585 -413
6023 -413 -214 248 301 -99 321 295 -40 432 553 -653 -519 577 -125 -621 -298 279 -175 112 -195 -425
6043 -425 -241 347 -530 -458 -190 85 -503 -184 -205 -502 -399 129 -749 -879 -187 -14 -673 -332 135 -425 -309
6064 -309 -123 -782 -419 107 121 -769 -533 134 -419 -146 165 -454 -398 657 76 -675 65 709 -84 -277
6084 -277 -185 52 108 517 -135 -226 305 733 -85 -382 375 204 182 293 299 -30 455 650 -95 -265 473 752
6106 752 101 586 584 141 508 429 -344 63 706 201 -341 600 541 -11 292 401 -116 318 879 2 -395
6127 -395 435 424 -328 -94 610 73 492 646 -248 -457 515 499 -142 -260 383 413 -12 381 -140 11 468
6148 468 613 -167 -87 392 177 -121 165 -440 -78 451 209 -538 52 492 -425 -640 58 -227 -415 66
6168 66 -431 -886 -48 311 -310 -791 147 159 -436 -232 -189 -411 -35 24 -825 -551 573 138 -672 -266 -82
6189 -82 -355 -271 -212 -740 -676 221 -679 -1125 -385 -53 -565 -670 -203 -459 -45 61 -316 -732 15 199 -369
6210 -369 -526 -45 -496 -205 172 -246 -496 435 378 -838 -231 237 289 -14 401 -131 106 685 271 -651
6230 -651 -3 934 558 -88 382 260 -184 311 422 -361 105 649 227 67 353 367 -46 705 450 -5
6250 -5 503 632 240 -37 810 750 -32 283 406 104 424 644 -69 -339 879 653 -118 133 423 162 235
6271 235 677 -117 86 610 288 -387 156 364 -298 -178 449 -13 46 492 -81 -442 111 296 -515 -430 172
6292 172 -297 -223 0 -478 -477 -79 149 -287 -257 11 232 -344 -80 -138 -453 408 226 -782 -275 465 31
6313 31 -511 -187 -466 -179 -143 38 -953 -378 420 -11 -446 172 -76 -352 -72 -246 -403 -398 422 -117 -507
6334 -507 270 254 -385 -277 -162 -309 87 429 -171 -457 488 325 -396 41 144 129 219 82 -42 -104 285
6355 285 100 -682 136 556 7 26 195 -192 223 642 246 -136 258 782 -13 -236 399 392 14 620 -71
6376 -71 -162 702 842 -246 -58 743 96 3 332 191 -58 452 563 -324 85 714 146 -219 91 326 -13
6397 -13 441 363 -280 -201 658 74 -346 475 311 4 389 16 -215 265 538 -413 -3 531 228 -335 -155
6418 -155 -67 -229 173 110 -398 -407 424 217 -553 -266 -43 -48 -110 113 -554 -381 40 108 -908 -311 343 -513
6440 -513 -409 -496 -337 -518 122 -238 -689 -187 173 -280 -555 247 -252 -200 -219 -450 -810 146 258 -639 -373
6461 -373 113 -86 -324 4 -133 -469 -1 80 -343 -475 255 -61 -491 42 7 -74 162 177 -553 -496 507
6482 507 -178 -369 -78 117 13 9 105 -232 319 688 -226 -428 619 474 25 -245 259 -47 278 558 10
6503 10 -151 665 595 -176 53 562 32 213 528 241 171 429 484 -435 226 516 389 -169 260 -27 109
6524 109 388 240 -327 403 738 149 -154 32 591 39 168 -70 -245 267 858 -280 -212 640 116 -254
6544 -254 85 -78 -255 150 270 -423 -359 407 -336 -364 -73 -96 -437 -52 2 -529 -243 342 -247 -656 -200
6565 -200 200 -196 -9 99 -417 -153 240 -311 -677 221 401 -432 -526 -97 -448 -72 222 -265 -339 128 75
6586 75 -850 -662 2 -46 -153 -7 -396 -203 419 29 -537 -127 465 20 -466 178 -28 -159 238 164 -539
6607 -539 49 701 -19 -334 323 123 -221 333 128 -179 17 217 -201 -431 634 528 -393 107 304 -112
6627 -112 182 584 -243 117 780 511 -279 172 667 -44 342 342 -22 24 908 143 -434 269 507 180 223
6648 223 531 5 -124 699 426 -238 432 476 508 -118 469 509 143 305 216 -246 605 665 -548 -16 347
6669 347 61 -13 206 -26 121 271 480 -379 5 554 90 -205 134 239 -137 46 160 -670 -166 98
6689 98 -118 -363 114 118 -435 -264 -110 -536 -83 143 -367 -578 -16 235 -359 -624 -196 -197 119 52 -783 -737
6711 -737 69 -1 -522 -197 125 -90 -135 -20 -621 -159 255 -170 -373 -82 322 -435 -404 -104 -328 116 310
6732 310 -58 -646 404 398 31 -299 414 65 109 95 -101 -314 369 412 -553 -311 405 392 -57 444 121 47
6754 47 286 144 -92 12 504 435 -218 273 527 -116 238 457 -1 500 833 228 -81 549 129 65 106
6775 106 233 32 31 737 -42 -181 242 619 71 -81 386 -174 342 488 174 139 553 120 -344 -77 421
6796 421 86 -20 101 -54 -226 328 341 -83 -123 358 -61 -42 52 374 19 39 -172 -647 250 85 -265 -467
6818 -467 26 -36 -39 -84 -137 -480 138 127 -389 -403 -132 -134 -271 -234 -338 -496 -186 -213 -400 -575 456 -131 -360
6841 -360 -458 -168 -352 -293 62 -750 -201 107 -295 -535 -33 187 -421 -336 -150 -412 -25 292 -181 -687 55
6862 55 478 -386 -129 -58 -56 -127 8 -280 -191 506 156 -425 -190 769 -29 65 399 6 -95 368 72 -177
6884 -177 149 661 331 -206 25 27 -149 199 76 -108 477 495 -143 15 355 447 196 323 130 -238 587
6905 587 736 -528 -238 862 561 -238 267 -46 60 275 225 -239 -41 548 41 -468 -138 721 259 11
6925 11 85 -198 123 421 -179 -385 350 334 -59 -100 -13 -92 94 294 -167 -328 438 362 -466 -337 72 -46
6947 -46 -178 8 -633 -364 42 45 -710 -356 101 -185 -376 94 -278 -203 -365 -276 -980 -261 448 -457 -585 -444
6969 -444 -251 -242 -335 -287 -478 -303 223 -384 -594 60 -29 -364 -124 68 -449 -114 93 -1017 -392 112 196 -295
6991 -295 55 -42 -253 -175 172 -196 -324 261 -291 -511 130 566 144 -113 -225 -257 175 575 -137 -122 102
7012 102 421 -196 0 24 48 112 323 -114 -199 470 417 -202 59 153 -40 25 290 -56 89 255 222 -222 -70
7035 -70 477 291 350 249 87 -91 405 132 -566 37 594 81 -12 296 97 -70 321 -72 -268 568 611
7056 611 -180 -543 92 215 -53 100 -184 -80 366 418 -368 -323 448 224 -55 -346 174 -388 247 107 -641
7077 -641 -351 380 -224 -710 -195 80 -305 -346 -138 -199 -326 289 -354 -541 93 266 -390 -486 -133 -106 -318
7098 -318 118 -310 -404 -6 241 -438 -456 173 -210 -187 162 -152 -639 354 -83 -654 -444 98 51 -551 129
7119 129 -257 -178 50 -9 -509 -173 514 113 -520 22 9 -132 153 -70 -175 254 374 48 -194 791 186
7140 186 162 -79 170 59 285 385 -238 -357 652 597 -315 67 438 222 361 444 69 -49 680 157 -122
7161 -122 81 623 199 369 586 -22 -11 548 79 -368 634 535 -39 -351 524 114 1 348 152 -639
7181 -639 254 383 -379 -474 350 64 65 248 207 -428 -40 378 -424 -264 141 -38 -441 233 -166 -65 82
7202 82 -133 -615 -137 427 -190 -508 232 120 110 -73 -21 -496 39 -244 -335 -880 15 312 -158 -328 -306 -340
7224 -340 -161 132 -396 -378 244 371 -523 178 -28 -356 -23 24 -504 -188 410 -60 -558 -186 91 -138 -569
7245 -569 -91 -268 -86 215 -268 -291 398 513 -109 -293 -123 -6 -103 -28 -156 -57 518 325 -128 -207 245 382
7267 382 -453 76 31 -94 391 449 -439 79 672 -81 2 -19 285 407 207 327 -142 -70 597 312 -296 422
7289 422 483 227 -32 3 154 225 769 -22 -170 333 553 52 -208 279 129 39 146 -149 -295 598 414
7310 414 186 141 108 38 154 -12 -29 -114 197 30 -537 286 362 89 -354 -177 -522 81 -236 -157 -685 -377
7332 -377 335 -458 -277 -59 5 -408 -46 -251 -560 91 88 -757 -668 -36 -180 -431 -482 -95 -392 -170 323 -737
7354 -737 -476 -44 -337 -699 -294 -45 -300 -13 80 -700 -283 570 -71 -581 126 298 -235 25 73 -211 -378
7375 -378 400 -223 -469 320 325 -559 -427 23 87 -129 321 -278 -546 244 202 -414 -15 112 183 -213 222 -254
7397 -254 -320 405 22 -353 -8 307 -134 -100 287 -69 -17 367 174 -88 -99 293 76 5 449 288 86 445
7419 445 175 -224 294 557 163 -284 612 335 -102 -135 44 -141 136 763 -221 69 421 247 234 176 264
7440 264 335 294 295 111 2 234 117 -56 126 353 122 -47 92 -397 -184 257 -474 -350 75 237 -241
7461 -241 -484 32 6 -270 -202 -210 -469 62 89 -374 -330 329 -231 -379 -540 -459 -209 210 -97 -693 2 222
7483 222 -22 -207 -288 -227 -224 -25 -164 -334 108 145 -103 -474 -92 -121 -582 72 -191 -402 112 147 -412 -621
7505 -621 214 439 -324 -5 73 -153 -3 40 -346 -127 373 2 -273 33 662 -128 87 87 130 -31 586 -17
7527 -17 -248 72 255 -75 -141 311 283 -51 494 208 -317 399 447 -40 -7 357 142 233 434 55 179 587
7549 587 345 -140 -141 558 426 86 92 195 -4 416 -13 -95 9 369 225 121 148 154 -244 292 70 -212 109
7572 109 243 -186 -224 -174 154 -39 -122 283 -87 191 211 -123 -378 413 303 -61 -487 84 -298 -72 317
7593 317 -520 -315 122 -28 -599 -227 -107 -107 -400 -196 -102 -119 92 -374 -584 173 353 -260 -373 -550 -119
7614 -119 -366 277 -35 -525 -25 554 -451 -337 -239 170 -40 -216 -50 -524 500 97 -497 -509 146 268
7634 268 -276 -238 77 -289 -159 64 -159 -415 541 83 -440 -105 279 -102 104 489 -272 -36 183 -229
7654 -229 -347 416 494 -237 244 147 -35 303 63 -228 -193 442 299 -132 24 653 271 179 406 -212 247
7675 247 506 364 -246 478 370 352 53 181 248 583 626 136 -108 243 930 -246 13 281 -18 -10 497
7696 497 -157 -277 135 428 -351 -247 226 246 -112 305 2 -288 354 384 -384 -174 567 47 -123 182 129
7717 129 -237 300 21 -541 -147 248 48 -502 -97 164 -217 44 -328 -511 -128 156 -224 -373 -81 53
7737 53 -398 -379 -55 -448 -284 174 -526 -594 -75 -51 -248 -238 176 -341 -159 -85 -422 -480 331 81 -244 -388
7759 -388 35 -224 -333 53 -251 -53 372 -34 -684 -110 377 -26 -463 75 98 -149 307 82 -346 292
7779 292 459 24 -278 221 232 -92 -131 -4 31 351 396 -27 -39 681 269 56 164 314 121 240 66 -194
7801 -194 289 526 -218 -117 -37 375 255 69 255 41 267 429 115 -406 408 258 -200 217 171 -36 1
7822 1 447 11 -194 252 535 -38 -80 668 264 -135 440 -87 -227 150 268 -153 -316 475 165 -61 -159
7843 -159 99 -294 82 -86 -500 -51 346 -370 -569 -39 9 -137 -384 -220 -255 315 185 -318 -665 89 182
7864 182 -198 -9 -239 -209 -121 161 -401 -289 245 -71 -679 -399 -399 -182 -210 187 -503 -174 172 137 -448 184
7886 184 487 -402 -389 129 -210 82 198 -297 -318 260 384 -334 105 146 213 -105 177 -91 -174 176 354 -382
7908 -382 -92 82 318 95 212 -77 27 365 148 -281 -117 387 323 221 31 446 -137 268 506 159
7928 159 441 492 25 30 355 420 168 196 398 -139 121 620 186 -329 427 262 -160 273 237 340 383 435 -230
7951 -230 -53 352 338 -507 -28 374 -73 -105 29 -5 198 98 49 -592 107 280 -237 -199 -96 -370 -104 138
7973 138 81 -413 -135 543 -381 -216 -36 -215 -281 -4 -432 -429 155 -30 -360 -104 159 -35 -237 -163 -251 -213
7995 -213 284 272 -494 -348 -392 -134 -360 31 -222 -432 59 123 -349 -36 406 163 -377 55 21 -143 -128 -138
8017 -138 -239 -235 383 66 -201 42 23 -69 -185 -191 -343 -174 383 -502 -230 110 174 -24 -60 164 4 468 8
8040 8 37 -293 573 -221 -311 -21 527 2 -48 54 408 -41 638 -251 -261 350 597 -38 16 494 242 293 161
8063 161 324 -337 220 538 -165 -22 749 187 59 273 388 -92 524 291 -162 -100 441 125 -40 140
8083 140 241 152 48 80 -17 18 229 -51 -26 83 196 147 115 303 -61 66 484 -216 -397 98 63 -124 137
8106 137 68 -37 -125 265 -332 -213 144 -124 -576 -165 330 -75 -363 -132 -506 -133 92 -229 -883 -257 56
8127 56 -102 -146 -172 -147 -607 -319 -163 -386 -4 84 -519 -337 44 -262 -156 -273 -233 -462 -193 142 -345 -387
8149 -387 202 146 -324 72 442 -231 349 136 -389 -99 293 25 -102 88 95 -99 446 -68 -138 177 303
8170 303 -97 -469 238 198 -37 166 85 -98 281 160 67 120 81 405 -91 138 296 133 -17 523 137
8191A37
##END NTUPLES=NMR FID
##END=
