##TITLE=1H_CA-8562-3
 CDCl3, 8 sc, 
 12.4.2019
##JCAMPDX= 6.0         $$ Bruker NMR JCAMP-DX V2.0
##DATA TYPE= NMR FID
##DATA CLASS= NTUPLES
##ORIGIN= UXNMR, Bruker Analytische Messtechnik GmbH
##OWNER= root
$$ XWIN-NMR		Version 3.5
$$ Fri Apr 12 14:22:20 2019 Russian Standard Time (UT+4h)  she@DPX200
##.OBSERVE FREQUENCY= 200.1315
##.OBSERVE NUCLEUS= ^1H
##.DELAY= (6, 6)
##.ACQUISITION MODE= SIMULTANEOUS
##.ACQUISITION SCHEME= undefined
##.AVERAGES= 8
##.DIGITISER RES= 18
##SPECTROMETER/DATA SYSTEM= spect
##.PULSE SEQUENCE= zg30
##.SOLVENT NAME= D2O
##.SHIFT REFERENCE= (INTERNAL, D2O, 0, 15.7039)
##AUDIT TRAIL= $$ (NUMBER, WHEN, WHO, WHERE, WHAT)
$$ ##TITLE= Audit trail, XWIN-NMR		Version 3.5
$$ ##JCAMPDX= 5.01
$$ ##ORIGIN= Bruker BioSpin GmbH
$$ ##OWNER= she
$$ F:/spectra/data/she/nmr/H-F/1/audita.txt
$$ ##AUDIT TRAIL=  $$ (NUMBER, WHEN, WHO, WHERE, WHAT)
(   1,<2019-04-12 14:20:22.20 +0400>,<she>,<DPX200>,
      <created by zg, POWCHK disabled, PULCHK disabled
       configuration hash MD5:
       00 E9 B6 7A A2 85 ED C7 34 08 36 98 17 FE 4E 26
       data hash MD5: 16K
       AB E4 7B B9 16 8E 94 68 9B 1E 28 0D AC 4E 00 11>)
$$ ##END=
$$ 
$$ hash MD5
$$ A1 4F EF 93 CD 41 B2 5F D7 3B 0F 4D B7 36 37 34
##$RELAX= 
##$RELAX= 
##$RELAX= 
##$RELAX= 
##$RELAX= 
##$RELAX= 
$$ Bruker specific parameters
$$ --------------------------
##$DU= <F:/spectra>
##$EXPNO= 1
##$NAME= <H-F>
##$PROCNO= 1
##$TYPE= <nmr>
##$USER= <she>
##$AMP= (0..31)
100 100 100 100 100 100 100 100 100 100 100 100 100 100 100 100 100 100 
100 100 100 100 100 100 100 100 100 100 100 100 100 100 
##$AQSEQ= 0
##$AQ_mod= 1
##$AUNM= <au_zg>
##$AUTOPOS= <>
##$BF1= 200.13
##$BF2= 200.13
##$BF3= 200.13
##$BF4= 200.13
##$BF5= 200.13
##$BF6= 200.13
##$BF7= 200.13
##$BF8= 200.13
##$BYTORDA= 1
##$CFDGTYP= 0
##$CFRGTYP= 5
##$CHEMSTR= <none>
##$CNST= (0..31)
1 1 145 1 1 1 1 1 1 1 1 1 1 1 1 1 1 1 1 1 1 1 1 1 1 1 1 1 1 1 1 1 
##$CPDPRG= <>
##$CPDPRG1= <>
##$CPDPRG2= <>
##$CPDPRG3= <>
##$CPDPRG4= <mlev>
##$CPDPRG5= <mlev>
##$CPDPRG6= <mlev>
##$CPDPRG7= <mlev>
##$CPDPRG8= <mlev>
##$CPDPRGB= <>
##$CPDPRGT= <>
##$D= (0..31)
0 1.2 0 0 0 0 0 0 0 0 0 0.03 0 0 0 0 0 0 0 0 0 0 0 0 0 0 0 0 0 0 0 0 
##$DATE= 1555064421
##$DBL= (0..7)
120 120 120 120 120 120 120 120 
##$DBP= (0..7)
150 150 150 150 150 150 150 150 
##$DBP07= 0
##$DBPNAM0= <>
##$DBPNAM1= <>
##$DBPNAM2= <>
##$DBPNAM3= <>
##$DBPNAM4= <>
##$DBPNAM5= <>
##$DBPNAM6= <>
##$DBPNAM7= <>
##$DBPOAL= (0..7)
0.5 0.5 0.5 0.5 0.5 0.5 0.5 0.5 
##$DBPOFFS= (0..7)
0 0 0 0 0 0 0 0 
##$DE= 6
##$DECBNUC= <off>
##$DECIM= 24
##$DECNUC= <off>
##$DECSTAT= 4
##$DIGMOD= 1
##$DIGTYP= 9
##$DL= (0..7)
0 120 120 120 120 120 120 120 
##$DP= (0..7)
150 150 150 150 150 150 150 150 
##$DP07= 0
##$DPNAME0= <>
##$DPNAME1= <>
##$DPNAME2= <>
##$DPNAME3= <>
##$DPNAME4= <>
##$DPNAME5= <>
##$DPNAME6= <>
##$DPNAME7= <>
##$DPOAL= (0..7)
0.5 0.5 0.5 0.5 0.5 0.5 0.5 0.5 
##$DPOFFS= (0..7)
0 0 0 0 0 0 0 0 
##$DQDMODE= 0
##$DR= 18
##$DS= 0
##$DSLIST= <SSSSSSSSSSSSSSS>
##$DSPFIRM= 0
$$ [...]
##$SUBNAM2= <"">
##$SUBNAM3= <"">
##$SUBNAM4= <"">
##$SUBNAM5= <"">
##$SUBNAM6= <"">
##$SUBNAM7= <"">
##$SUBNAM8= <"">
##$SUBNAM9= <"">
##$SW= 24.9337058887773
##$SWIBOX= (0..15)
0 0 2 0 0 0 0 0 0 0 0 0 0 0 0 0 
##$SW_h= 4990.01996007984
##$TD= 16384
##$TD0= 1
##$TE= 0
##$TE2= 300
##$TE3= 300
##$TEG= 300
##$TL= (0..7)
0 120 120 120 120 120 120 120 
##$TP= (0..7)
150 150 150 150 150 150 150 150 
##$TP07= 0
##$TPNAME0= <>
##$TPNAME1= <>
##$TPNAME2= <>
##$TPNAME3= <>
##$TPNAME4= <>
##$TPNAME5= <>
##$TPNAME6= <>
##$TPNAME7= <>
##$TPOAL= (0..7)
0.5 0.5 0.5 0.5 0.5 0.5 0.5 0.5 
##$TPOFFS= (0..7)
0 0 0 0 0 0 0 0 
##$TUNHIN= 0
##$TUNHOUT= 0
##$TUNXOUT= 0
##$USERA1= <user>
##$USERA2= <user>
##$USERA3= <user>
##$USERA4= <user>
##$USERA5= <user>
##$V9= 5
##$VALIST= <valist>
##$VCLIST= <CCCCCCCCCCCCCCC>
##$VD= 0
##$VDLIST= <DDDDDDDDDDDDDDD>
##$VPLIST= <PPPPPPPPPPPPPPP>
##$VTLIST= <TTTTTTTTTTTTTTT>
##$WBST= 1024
##$WBSW= 4
##$XGAIN= (0..3)
0 0 0 0 
##$XL= 0
##$YL= 0
##$YMAX_a= 212310
##$YMIN_a= -272155
##$ZGOPTNS= <>
##$ZL1= 120
##$ZL2= 120
##$ZL3= 120
##$ZL4= 120
##$ABSF1= 10
##$ABSF2= 0
##$ABSG= 5
##$ABSL= 3
##$ALPHA= 0
##$AQORDER= 0
##$ASSFAC= 0
##$ASSFACI= 0
##$ASSFACX= 0
##$ASSWID= 0
##$AUNMP= <proc_1d>
##$AZFE= 0.1
##$AZFW= 0.1
##$BCFW= 1
##$BC_mod= 2
##$BYTORDP= 1
##$COROFFS= 0
##$CY= 11.3945322036743
##$DATMOD= 1
##$DC= 2
##$DFILT= <>
##$DTYPP= 0
##$F1P= 18.9103706918063
##$F2P= -1.10871071338519
##$FCOR= 0.5
##$FTSIZE= 0
##$FT_mod= 4
##$GAMMA= 1
##$GB= 0.15
##$INTBC= 1
##$INTSCL= 1
##$ISEN= 128
##$LB= 0.24
##$LEV0= 0
##$LPBIN= 0
##$MAXI= 10000
##$MC2= 0
##$MEAN= 0
##$ME_mod= 0
##$MI= 1.114404
##$NCOEF= 0
##$NC_proc= 0
##$NLEV= 6
##$NOISF1= 3.799351
##$NOISF2= 2.8
##$NSP= 1
##$NTH_PI= 0
##$NZP= 0
##$OFFSET= 15.70392
##$PC= 1
##$PHC0= -8854.385
##$PHC1= 14.20026
##$PH_mod= 1
##$PKNL= yes
##$PPARMOD= 0
##$PSCAL= 0
##$PSIGN= 0
##$REVERSE= no
##$SF= 200.130013532006
##$SI= 16384
##$SIGF1= 3
##$SIGF2= 2
##$SINO= 400
##$SIOLD= 16384
##$SREGLST= <1H.CDCl3>
##$SSB= 0
##$STSI= 0
##$STSR= 0
##$SW_p= 3612.71676300578
##$SYMM= 0
##$S_DEV= 0
##$TDeff= 0
##$TDoff= 0
##$TI= <>
##$TILT= no
##$TM1= 0
##$TM2= 0
##$TOPLEV= 0
##$USERP1= <user>
##$USERP2= <user>
##$USERP3= <user>
##$USERP4= <user>
##$USERP5= <user>
##$WDW= 1
##$XDIM= 8192
##$YMAX_p= 0
##$YMIN_p= 0
$$ End of Bruker specific parameters
$$ ---------------------------------
##NTUPLES= NMR FID
##VAR_NAME=  TIME,          FID/REAL,        FID/IMAG
##SYMBOL=    X,             R,               I
##VAR_TYPE=  INDEPENDENT,   DEPENDENT,       DEPENDENT
##VAR_FORM=  AFFN,          ASDF,            ASDF
##VAR_DIM=   8192,          8192,            8192
##UNITS=     SECONDS,       ARBITRARY UNITS, ARBITRARY UNITS
##FACTOR=    0.0002004,     1,               1
##FIRST=     0,             0,               0
##LAST=      1.6414764,     0,               0
##MIN=       0,             -272155,         0
##MAX=       1.6414764,     212310,          0
$$ Real data points
##PAGE= N=1
##DATA TABLE= (X++(R..R)), XYDATA
$$ [...]
$$ plain form
2250 849 424 -726 -54 880 -556 -497 447 -658 -361 706 -17 -1193 492 954 -1122 -792 1136 337
2268 337 -1108 116 266 -744 -109 665 -768 -581 623 -544 -1042 296 108 -1521 -327 287 -1327
2285 -1327 -1304 400 -544 -1895 -357 -153 -855 -1480 -570 -1175 -996 -211 -973 -1782 -305 -722 -2162 -954
2303 -954 -33 -1999 -1747 -413 -918 -2195 -922 -371 -1634 -1489 -599 -1320 -1957 -1092 -1324 -1368 -930 -1296 -2388
2322 -2388 -1177 -275 -1814 -2132 -646 -607 -2345 -1106 -726 -1524 -1422 -624 -1303 -1538 -394 -857 -1834 -941
2340 -941 -721 -1369 -723 4 -1421 -1437 -45 -235 -2034 -675 422 -996 -1176 -284 -701 -572 586 -412
2358 -412 -1143 66 323 -1075 -448 831 -88 -820 336 366 -811 215 851 -522 -351 629 127 -391
2376 -391 559 34 -638 406 734 -418 -412 1042 172 -927 488 759 -454 -171 917 -300 -316 817
$$ packed form
2250H49m25j150O72R34j436N9R44j105K97J067p23j176J685M62k076L30J928p99
2268C37j445J224J50j010O35P74j433J87J204j167m98J338j88j629J194O14j614
2285a327K3J704r44j351J538K04p02o25R10o05J79P85p62q09J477m17j440J208
2303i54R21j966K52J334n05j277J273N51j263J45Q90p21o37Q65k32m4M38l66j092
2322b388J211R02j539l18J486L9j738J239L80p98J02P98o79k35J144m63r77Q93
2340i41K20o48O46P27j425j6J392j90j799J359J097j418j80Q92m17J29J158r98
2358d12p31J209K57j398O27J279r19p32J156L0j177J026O36j373J71R80n02n18
2376c91R50n25o72J044L28j152OJ454q70j099J415K71j213K83J088j217j6J133
$$ plain form
2394 817 -170 -360 696 635 -1029 -151 627 -223 47 921 -353 -1207 505 681 -732 -362 588 -321 -665
2413 -665 283 -334 -776 -70 182 -1597 -167 371 -1035 -1542 -253 -302 -1250 -273 -349 -1293 -936 -124 -884
2432 -884 -1307 -198 -937 -1766 -1022 -349 -1266 -1201 -379 -997 -1353 -344 -941 -1808 -816 -412 -1762 -928 -375
2451 -375 -1374 -1441 40 -830 -1950 -861 -269 -1560 -1343 -387 -825 -1558 -520 -714 -1381 -636 -537 -1415 -697
2470 -697 240 -627 -1081 -48 -316 -1205 -426 542 -620 -792 607 -363 -818 133 168 -621 -248 -273 -563 -86
2490 -86 634 -627 -974 602 603 -972 -118 898 -310 -356 776 472 -382 187 395 -134 276 595 -210
2509 -210 162 815 -51 -281 1073 650 -884 50 999 70 -545 691 962 -251 -9 511 -247 234 378
2528 378 -412 47 696 198 -446 786 615 -985 53 1146 -219 -947 631 402 -833 -283 409 -453
$$ packed form
2394H17r87j90J056o1j664Q78P78q50K70Q74j274q54J712J76j413L70R50r09l44
2413f65R48o17m42P06K52j779J430N38j406n07J289m9r48R77p6r44L57Q12p60
2432h84m23J109p39q29P44O73r17O5Q22o18l56J009n97q67R92M04j350Q34N53
2451c75r99o7J481q70j120J089N92j291K17R56m38p33J038j94o67P45R9q78P18
2470f97R37q67m54J033k68q89P79R68j162j72J399r70m55R51L5p89L73k5k90M77
2490h6P20j261l47J576Jj575Q54J016j208m6J132l04q54N69K08n29M10L19q05
2509b10L72O53q66k30J354m23j534R34R49r29o15J236K71j213K42N20p58M81J44
2528C78p90M59O49m98o44J232j71j600J038J093j365p28J578k29j235N50O92q62
$$ plain form
2546 -453 -92 -244 -521 -187 73 -792 -1012 186 272 -1159 -700 342 -546 -959 -48 278 -1020 -962 -45
2565 -45 -710 -685 -193 -804 -820 -86 -554 -1138 240 -402 -1455 -1066 120 -409 -1683 -504 -320 -1234 -747
2584 -747 -149 -855 -1200 -410 -537 -1033 -315 -613 -1206 -13 -35 -1599 -866 385 -732 -1547 -47 92 -1206
2603 -1206 -584 -41 -672 -757 -117 -269 -520 210 -135 -962 -32 239 -445 -552 521 -369 -560 167 293 -383
2623 -383 -91 341 -110 -496 274 317 -733 -17 545 -12 389 577 -46 219 1042 276 -316 452 484 -142
2643 -142 -110 962 139 -77 676 474 -243 218 670 -128 263 617 -108 21 674 243 -400 326 463 -602
2663 -602 -164 644 -292 -756 662 277 -907 -199 502 -234 -518 122 -410 -556 -61 -136 -563 220 -216 -1023
2683 -1023 -237 387 -805 -1210 -43 115 -997 -789 209 -919 -1012 -58 -457 -972 -260 -784 -1087 -538 -621
$$ packed form
2546d53L61j52k77L34K60q65k20J198Q6j431M59J042q88m13R11L26j298N8R17
2565d5o65K5M92o11j6P34m68n84J378o42j053L89J186n29j274J179J84r14M87
2584g47N98p06l45P90j27m96P18k98n93J193k2j564P33J251j117q15J500J39j298
2603a206O22N43o31q5O40j52k51P30l45q27R30K71o84j07J073q90j91P27J26o76
2623c83K92M32m51l86P70M3j050P16N62n57M01J88o23K65Q23p66n92P68L2o26
2643a42L2J072q23k16P53k02p17M61M52p98L91L54p25J29O53m31o43P26J37j065
2663f02M38Q08r36m64J418l85j184P08P01p36k84O40n32j46M95p5m27P83m36q07
2683a023P86O24j192m05J167J58j112K08R98j128r3R54l99n15P12n24l03N49q3
$$ plain form
2702 -621 -1115 -1052 29 -695 -1292 -361 -238 -1770 -1078 109 -843 -1228 -564 -391 -1172 -751 -438 -843 -401
2721 -401 -228 -1337 -394 236 -906 -1256 -72 -207 -1009 -754 297 -773 -1209 -139 -155 -965 -564 -467 -299
2740 -299 -216 -34 -539 -507 396 -414 -1204 -175 91 -847 -412 514 -356 -501 167 159 -640 39 123 -222 -17
2761 -17 432 -222 -200 291 -202 -390 620 615 -541 -666 590 -78 -501 303 349 -488 -343 650 -74 -51 120
2782 120 -75 -451 103 74 -617 144 195 -553 -435 498 -258 -481 269 297 -425 -359 313 -442 -92 153 -216
2803 -216 -567 99 -283 -766 -328 -43 -724 -446 -57 -686 -567 -135 25 -893 -467 -149 -679 -784 -190 -468
2823 -468 -564 -232 -324 -1100 -307 -277 -1195 -807 -204 -810 -943 150 -333 -1032 -720 -360 -977 -1229 -325 -838 -1335
2844 -1335 -679 -552 -1045 -913 -287 -1016 -703 -307 -759 -1233 -514 -208 -687 -487 -68 -817 -1000 -253 -348 -1146
$$ packed form
2702f21m94O3J081p24n97R31J23j532O92J187r52l85O64J73p81M21L13m05M42
2721d01J73j109R43O30j142l50J184j35q02K55J051j070m36J070j6q10M01R7J68
2740b99Q3J82n05L2R03q10p90J029K66r38M35R26q70j45O68qp99O79Q4l45K05
2761a7M49o54K2M91m93j88J010nj156j25J256o68m23Q04M6q37J45R93p24K3J71
2782A20j95l76N54k9o91P61N1p48J18R33p56k23P50K8p22O6O72p55L50K45l69
2803b16l51O66l82m83M38K85o81K78L89o29J19M32J60r18M26L18n30j05N94k78
2823d68r6L32r2p76P93L0r18L88O03o06j33J093m83o99L12L60o17k52R04n13m97
2844a335O56J27m93J32O26p29L13L96m52m74P19L06m79K00M19p49j83P47r5p98
$$ plain form
2864 -1146 -327 -453 -1111 -615 -28 -579 -733 9 -414 -608 -21 153 -873 -585 377 -272 -611 -116 10
2883 10 -640 -82 296 -553 -211 79 -49 -369 435 166 -639 -250 364 -189 -447 171 -246 -727 333 285
2903 285 -101 209 292 -522 -461 642 -271 -166 66 118 -406 -199 741 -368 -523 369 2 -258 -21 171
2923 171 -246 -340 423 -379 -487 127 -265 -409 62 -73 -264 -307 -16 -402 -440 182 -274 -766 -102 -187 -753
2944 -753 -388 -9 -395 -575 87 -697 -805 -500 -23 -1003 -676 -210 -725 -584 -71 -565 -785 -86 -407 -839
2964 -839 -554 -95 -759 -905 -302 -414 -1005 -574 -532 -1215 -772 10 -472 -1149 -311 -429 -927 -534 -431 -670
2984 -670 -503 -110 -646 -868 -266 -614 -947 -486 111 -474 -654 93 -598 -887 52 -371 -405 -484 -308 -417 -491
3005 -491 -139 -419 -527 -83 -279 -593 -427 -366 -456 -129 -301 -258 -666 75 89 -629 88 461 -211 -408 132
$$ packed form
2864a146Q19j26o58M96N87n51j54P42m23j94N87J74j026K88R62o49l39M95J26
2883A0o50N58L78q49L42K90j28l20Q04k69q05L89O14n53k58O18m17m81J060m8
2903B85l86L10Q3q14O1J103r13J05K32N2n24K07R40j109j55Q92l67k60K37J92
2923A71m17r4P63q02j08O14l92j44M71j35j91m3K91l86l8O22m56m92O64q5n66
2944g53L65L79l86j80O62p84j08L05M77r80L27M66n15J41N13m94k20O99l21m32
2964h39K85M59o64j46O03j12n91M31M2o83M43P82m82o77Q38j18m98L93J03k39
2984f70J67L93n36k22O02l48l33M61N97n85j80P47o91k89R39m23l4p9J76j09p4
3005d91L52k80j08M44j96l14J66O1r0L27j72M3m08P41J4p18P17L73o72j97N40
$$ plain form
3026 132 246 -315 -76 -254 -107 -300 70 -110 -254 188 -152 -180 4 154 -459 73 508 -121 -320 345
3046 345 142 -400 215 185 -409 -13 32 -5 46 281 -198 -461 108 -250 -704 -117 116 -205 -434 -13 129
3067 129 -781 -80 6 -429 -359 -182 -265 -185 -173 -19 -322 -100 -14 -689 -346 -177 -437 -556 101 69 -659 -349
3089 -349 -54 -687 -633 -222 -461 -677 -457 -548 -752 -124 -337 -814 -481 -199 -320 -574 -164 40 -813 -386 -9
3110 -9 -625 -568 -480 -127 -301 -186 -109 -575 -232 -65 -401 -149 226 -269 -541 -254 -76 -318 -345 36 -475 -359
3132 -359 165 67 -449 -200 -202 -530 77 190 -21 -160 124 50 -242 185 287 86 132 310 200 -227 242 105
3154 105 -175 205 87 -264 -33 312 -280 133 460 161 -17 -13 373 -190 -196 132 401 -242 222 116 -14
3175 -14 175 146 -364 309 221 -144 -298 290 165 -6 322 402 -74 -127 601 206 278 -41 93 -133 185 309
$$ packed form
3026A32J14n61K39j78J47j93L70j80j44M42l40k8J84J50o13N32M35o29j99O65
3046C45k03n42O15l0n94L96M5l7N1K35m79k63N69l58m54N87K33l21k29M21J42
3067A29r10P01Q6m35P0J77q3Q0J2J54l03K22Q6o75L43J69k60j19O57l2p28L10
3089c49K95o33N4M11k39k16K20r1k04O28k13m77L33K82j21k54M10K04q53M27L77
3110io16N7Q8L53j74J15P7m66L43J67l36K52L75m95k72K87J78k42k7L81n11J16
3132c59N24r8n16K49kl28O07J13k11j39K84p4k92M27J02k01M6J78j10m27M69j37
3154A05k80L80j18l51K31L45n92M13L27k99j78ML86n63oL28K69o43M64j06j30
3175a4J89k9n10O73q8l65j54N88j25j71L28Q0m76n3P28l95P2l19J34k26L18J24
$$ plain form
3197 309 -97 207 465 -183 -124 240 265 -246 97 158 269 -25 341 -222 -212 605 -215 -33 -62 342 -268 -50
3219 -50 30 34 -13 189 -34 -222 -13 24 -30 -241 342 -398 -209 -171 -251 -483 31 264 -602 -45 192 -119 -201
3242 -201 185 -133 -208 -484 -271 -260 -233 -117 39 -461 122 265 -328 -52 363 294 -201 264 72 -150 -32
3263 -32 297 -203 -208 392 255 -78 302 120 -110 -61 291 -180 -140 426 239 189 17 291 154 170 315 -85
3285 -85 238 138 52 175 388 218 166 457 230 -14 15 425 379 -318 283 444 145 219 405 178 202 116 299
3308 299 316 192 224 109 105 88 43 297 505 324 -21 220 182 127 252 491 249 323 -239 227 260 589 195
3331 195 -26 100 486 -73 -13 344 255 -492 63 -83 -244 316 94 63 141 -72 36 -220 178 162 -206 18
3353 18 339 -84 -290 701 393 -249 -160 309 -126 125 153 -189 -281 20 -198 -95 132 116 -218 -360 157 244
$$ packed form
3197C09m06L04K58o48N9L64K5n11L43O1J11k94L66n63J0Q17q20J82k9M04o10K18
3219e0Q0Mm7K02k23j88K09L7n4k11N83p40J89L8q0k32N14K33q66N57K37l11q2
3242b01L86l18p5k76K13J1K7J16J56n00N83J43n93K76M15o9m95M65j92k22J18
3263c2L29n00nO00j37l33L80j82k30M9L52m71M0N66j87n0j72K74j37J6J45m00
3285h5L23j00q6J23K13j70n2K91k27k44K9M10m6o97O01J61k99P4J86k27K4q6J83
3308B99J7j24L2j15mj7m5K54K08j81l45K41l8n5J25K39k42P4n62M66L3L29l94
3331A95k21J26L86n59O0L57q9p47N55j46j61N60k22l1P8k13J08k56L98j6l68K24
3353A8L21m23k06R91l08o42Q9M69m35K51K8l42r2L01k18J03K27j6l34j42N17Q7
$$ plain form
3375 244 -263 -66 120 -54 36 310 62 3 193 -188 -3 100 91 -227 24 141 -398 -19 -9 -157 -287 109
3397 109 265 53 -376 15 181 -187 41 116 -182 -78 229 -312 282 384 70 -89 277 346 125 471 164
3418 164 148 268 317 58 -120 201 161 62 477 209 287 93 127 266 -206 171 83 231 514 298 139 -144
3440 -144 441 89 -292 105 -138 132 72 598 24 300 366 229 -106 362 235 41 89 495 258 -167 618
3461 618 74 172 360 303 135 64 188 -133 64 178 280 17 16 306 -377 132 173 -134 -128 143 145 -188 142
3484 142 -234 -365 64 177 24 -180 -87 43 -289 -96 -44 -43 -297 102 -260 159 162 62 -314 266 162 -428
3506 -428 -100 35 91 10 313 6 -304 39 -161 -35 17 455 -212 -222 140 -13 -312 170 56 -173 -297
3527 -297 208 123 -209 167 -19 -229 -13 400 -72 -32 233 6 -77 -26 230 -346 108 -76 -100 221 276 61
$$ packed form
3375B44n07J97J86j74R0K74k48n9J90l81J85J03rl18K51J17n39L79J0j48j30L96
3397A09J56k12m29L91J66l68K28P5k98J04L07n41N94J02l14j59L66O9k21L46l07
3418A64j6J20M9k59j78L21m0r9M15k68P8j94L4J39m72L77q8J48K83k16j59k83
3440a44N85l52l81L97k43K70o0N26n74K76O6j37l35M68j27j94M8M06k37m25P85
3461F18n44R8J88n7j68p1J24l21J97J14J02k63jK90o83N09M1l07OK71Kl33L30
3484A42l76j31M29J13j53k04R3J30l32J93N2Jk54L99l62M19Lj00l76N80j04n90
3506d28L28J35N6q1L03l07l10L43k00J26N2M38o67j0L62j53k99M82j14k29j24
3527b97N05q5l32L76j86k10K16M13m72M0K65k27q3N1K56n76M54j84k4L21N5k15
$$ plain form
3549 61 -186 19 113 150 7 132 -235 67 129 -182 -220 -40 -108 -220 212 481 202 323 353 22 -133 122
3571 122 265 -63 46 376 -203 36 109 63 -10 150 -201 -158 107 226 117 -198 32 -50 -211 284 278 -111
3593 -111 73 167 388 162 -152 64 -364 333 63 -181 146 165 93 -48 100 133 -73 54 -44 -258 47 -83
3615 -83 179 -162 -213 -30 -180 -80 57 -103 -268 -112 -119 -146 -8 239 -546 -128 262 -267 -61 126 45 -257
3637 -257 -29 176 -151 -62 -171 -259 -205 -256 -457 -267 72 -8 -294 -234 27 -296 -119 -97 142 85 -69 -155 -73
3660 -73 -124 -461 -130 -263 -140 -173 189 -13 85 -133 199 80 -188 -93 -80 -356 -251 178 156 53 34 -142 -66
3683 -66 259 214 -54 -190 295 48 -189 -212 446 5 2 93 126 -325 -91 75 -37 -57 161 198 67 267 85
3706 85 -10 -30 135 -117 116 452 181 -123 77 -73 -189 52 632 -280 -50 264 123 -226 193 368 75
$$ packed form
3549F1k47K05R4L7j43J25l67L02O2l11l8J80o8j12M32K69k79J21L0l31j55K55
3571A22J43l28J09L30n79K39P3m6p3J60l51M3K65J19j09l15K30q2j61M95ol89
3593a11J84R4K21k26l14K16m28O97k70k44L27J9p2j41J48L3k06J27r8k14L05j30
3615h3K62l41n1J83j50J00J37j60j65J56pk7J38K47p85M18L90n29K06J87q1l02
3637b57K28K05l27Q9j09q8N4n1k01J90L39q0k86O0K61l23J77K2K39n7j54q6Q2
3660g3n1l37L31j33J23l3L62k02R8k18L32j19k68R5J3k76J05M29k2j03j9j76P6
3683f6L25m5k68j36M85k47k37k3O58m41lR1L3m51K34J66j12k0K18L7j31K00j82
3706H5r5k0J65k52K33L36k71l04K00j50j16K41N80r12K30L14j41l49M19J75k93
$$ plain form
3727 75 -227 308 274 -128 60 4 -398 165 214 -182 -79 93 -187 -231 275 -256 69 186 -218 30 -114 -1
3749 -1 -98 -119 -59 -71 -174 -39 -49 -61 -142 223 158 -395 108 59 -5 36 96 40 -11 -49 -129 -364 88 -55 -194 -208
3775 -208 -232 -100 -151 -208 77 20 -187 -58 -251 -339 -229 -162 -72 179 -351 -163 -163 -56 -183 -136 -95 -285 -46 157
3799 157 -323 -107 7 203 -253 -194 -65 -164 -88 95 283 146 -148 -244 -77 193 -37 -80 -271 504 -58 -173
3821 -173 280 235 -103 187 305 -125 -240 -110 -2 173 156 42 464 403 141 131 150 263 185 90 620 14
3843 14 9 267 273 139 175 348 417 96 422 433 172 131 527 213 247 408 -62 -155 -102 113 -2 -288 119 237
3867 237 229 159 429 -166 -122 -25 84 319 386 -281 65 186 85 -204 165 566 164 -59 49 0 -368 -114
3889 -114 310 6 38 164 28 132 306 -177 -224 263 -130 -286 -82 375 -53 -233 -3 127 184 73 72 -130
$$ packed form
3727G5l02N35l4m02J88n6m02N63M9l96J03J72k80m4N06n31L25J17m04K48j44J13
3749ar7k1O0j2j03J35j0j2q1L65o5n53N03m9o4M1O0n6n1l8q0k35M52j43j39j4
3775b08k4J32n1n7K85n7k07J29j93q8J10O7R0K51n30J88%J07j27M7M1j90K39K03
3799A57m80K16J14J96m56N9J29r9P6J83J88j37k94r6J67K70k30m3j91P75n62j15
3821a73M53m5l38K90J18m30j15J30J08J75j7j14M22o1k62j0J9J13p8r5N30o06
3843A4nK58Oj34L6J73O9l21L26J1k61m1L96l14L4J61m70r3N3K15j15k86M07J18
3867B37qp0K70n95M4R7J09K35O7o67L46J21j01k89L69M01m02k23J08m9l68K54
3889a14M24l04L2J26j36J04J74m83m7M87l93j56K04M57m28j80K30J30N7j11jk02
$$ plain form
3911 -130 -101 46 -181 -245 188 -22 -473 -293 320 -239 53 224 -397 -177 115 -228 -18 -54 -27 0 -171 91
3933 91 -47 223 256 122 -298 197 -83 -141 209 344 5 -105 226 -20 14 156 172 525 255 373 126 15
3955 15 -10 246 194 340 350 -102 -149 332 0 15 210 327 112 61 296 347 381 44 149 67 356 313 127 205
3979 205 211 369 -12 389 -4 89 286 385 23 408 125 -31 314 185 230 294 322 303 -63 -1 486 103 241
4002 241 622 197 -8 165 205 81 -63 319 26 119 211 98 32 248 277 13 139 109 -214 -28 54 390
4024 390 -212 36 132 -364 163 228 -515 -514 274 263 -9 88 200 -228 -338 178 -28 -271 300 -327 -68 -185
4046 -185 -132 -41 17 128 172 -235 -68 59 -334 50 132 -376 -102 185 60 -117 257 -134 -98 263 267 -402 153
4069 153 269 58 -432 578 -42 -217 180 92 -59 12 242 355 140 -53 51 95 245 152 -124 211 378
$$ packed form
3911a30K9J47k27o4M33k10m51J80O13n59K92J71o21K20K92l43K10l6K7K7j71K62
3933I1j38K70L3j34m20M95k80n8L50J35l39j10L31k46L4J42J6L53k70J18k47j11
3955A5k5K56n2J46J0m52m7M81l32J5J95J17k15n1K35N1L4l37J05q2K89m3j86P8
3979B05OJ58l81M01l93R3J97R9l62L85k83j56L45j29M5O4K8j9l66O2M87l83J38
4002B41L81m25k05J73M0j24j44L82k93R3R2j13o6K16K9k64J26l0l23J86Q2L36
4024C90o02K48R6m96N27O5p43JP88j1k72R7J12m28j10N16k06k43N71o27K59j17
4046a85N3R1N8J11M4m07J67J27l93L84Q2n08K74K87j25j77L74l91L6L61Mo69N55
4069A53J16k11m90J010o20j75L97q8j51P1K30J13k15j93J04M4J50r3k76L35J67
$$ plain form
4090 378 107 -139 335 289 22 -93 322 16 -195 268 160 231 288 172 -36 247 256 337 67 66 39 -8 228
4113 228 129 -296 102 377 162 282 124 220 104 316 -73 359 386 108 57 129 266 526 -158 309 376 -165
4135 -165 76 43 -19 147 81 121 102 542 221 -102 293 288 32 -98 201 -304 -78 283 292 -211 169 363 78
4158 78 -412 -102 -23 145 213 216 93 -179 -127 -133 -182 -14 321 -414 371 -190 -452 71 111 -136 -259 -54 -51 -71
4182 -71 -27 -25 -288 226 3 154 -91 -8 208 -140 -122 41 -517 -94 -79 -209 -366 -235 -66 -364 273 -5
4204 -5 -131 14 59 14 -212 156 160 -301 192 465 -23 -134 57 111 -110 227 24 -172 -182 577 -23 492 176
4227 176 -203 -296 197 80 3 -230 419 310 20 254 242 269 175 377 -3 -439 184 212 -34 372 319 215
4249 215 571 715 142 181 515 150 12 157 431 -96 133 216 -173 58 379 320 -52 95 120 -43 297
$$ packed form
4090C78k71k46M74m6k67j15M15l06k11M63j08P1N7j16k08K83RQ1k70jk7m7K36
4113B28r9m25L98K75k15J20j58R6j16K12l89M32K7k78n1P2J37K60o84M67O7n41
4135a65K41l3o2J66o6M0j9M40l21l23L95nk56j30K99n05K26L61Rn03L80J94k85
4158G8m90L10P9J68O8Lj23k72N2om9J68L35p35P85n61k62N23M0k47j23K05Lk0
4182g1M4Kk63N14k23J51k45Q3K16l48J8J63n58M23J5j30j57J31J69k98O37k78
4204ej26J45M5m5k26L68Mm61M93K73m88j11J91N4k21L37k03j96j0P59o00N15l16
4227A76l79r3M93j17p7k33O49j09k90K34j2K7r4K02l80m36O23K8k46M06n3j04
4249B15L56J44n73L9L34l65j38J45K74n27K29Q3l89K31L21n9l72J47K5j63L40
$$ plain form
4270 297 -11 60 -103 32 -208 204 188 184 -445 -120 219 201 257 294 152 -165 26 166 -148 -175 188 -542 -94
4293 -94 142 51 -200 35 -231 -6 119 50 -271 -113 -263 -157 -206 -461 69 -457 -53 -135 78 -348 67 20
4315 20 -452 223 70 -41 -69 137 -300 -278 473 54 -237 67 -299 -446 -6 108 -225 -483 -51 43 39 77
4337 77 378 -290 -61 -31 -195 -74 239 227 -303 -36 314 79 -111 212 398 -52 57 -115 -5 145 76
4358 76 -290 -123 125 46 -195 178 293 -166 257 183 -82 16 380 28 170 35 449 -103 64 277 -239
4379 -239 -95 287 -70 -173 -24 239 -156 261 308 -236 -188 288 -50 -327 249 508 -53 -9 -57 -122 58 338
4401 338 -57 -23 -152 424 -255 -197 450 30 -156 -47 163 54 106 109 -65 -68 107 -356 29 171 -74 -333
4423 -333 208 328 -255 -457 -66 -148 -159 151 -44 -139 52 -41 -131 -106 0 -72 83 106 114 -134 224 -150 -249 -16
$$ packed form
4270B97l08P1j63J35k40M12j6mo29L25L39j8N6L7j42l17J91J40l14k7L63p30M48
4293i4K36r1k51K35k66K25J25o9l21J58j50J06m9k55N30n26M04q2K13m26M15m7
4315B0m72O75j53j11k8K06m37K2P51m19k91L04l66j47M40J14l33k58M32R4mL8
4337G7L01o68K29L0j64J21L13j2n30K67L50k35j90L23J86m50J09j72J10J50o9
4358G6l66J67K48p9k41L73J15m59M23p4k65R8L64l52J42j35M14n52J67K13n16
4379b39J44L82l57j03J49K63l95M17M7n44M8M76l38k77N76K59n61M4m8o5J80K80
4401C38l95L4j29N76o79N8O47m20j86J09K10j09N2Lj74lJ75m63L85J42k45k59
4423c33N41J20n83k02L91q2j1L10j95r5J91r3r0K5J06p2J55K3Qk48L58l74r9K33
$$ plain form
4447 -16 280 -12 -493 118 26 -221 51 -152 -355 -81 -299 246 -299 -149 -411 -162 15 241 -459 -280 299
4468 299 -281 -280 -166 -284 -93 59 -119 -65 155 504 72 -37 -31 98 124 249 -301 56 -427 -83 130 104
4490 104 167 129 38 53 115 62 87 156 69 138 390 32 141 536 659 94 -90 377 134 21 787 -23 54 -28
4514 -28 -64 177 -162 448 228 40 418 422 300 294 355 253 63 420 487 11 -24 569 -95 145 -129 61 84
4537 84 204 266 -48 -128 -70 -359 171 -15 -117 -291 -60 -39 -230 -243 -145 -57 -177 37 -84 -268 -163 193 -489
4560 -489 -164 18 -375 -184 114 73 -595 -254 -28 -239 -26 -70 -265 -101 -97 -76 -273 -33 -229 -379 -521 312
4582 312 -316 -52 334 -338 -1 -29 -114 -451 -270 101 -226 -139 -67 297 233 125 -4 -86 -99 -104 -190 -100 284 59
4606 59 -151 145 281 10 307 241 -93 -50 373 12 -40 286 248 -184 156 386 -50 -95 310 18 -222 129
$$ packed form
4447a6K96k92m81O11r2k47K72k03k03K74k18N45n45J50k62K49J77K26p00J79N79
4468B99n80JJ14j18J91J52j78N4K20L49m32j09OJ29K6J25n50L57m83L44K13k6
4490A04O3l8r1J5O2n3K5O9q7O9K52l58J09L95J23n65j84M67k43j13P66q10P7q2
4514b8l6K41l39O10k20j88L78Mj22oO1j02j90L57O7m76l5N93o64K40k74J90K3
4537H4J20O2l14q0N8k89N30j86j02j74K31K1j91j3R8Q8j20K14j21j84J05L56o82
4560d89L25J82l93J91K98m1o68L41K26k11K13m4j95J64MK1j97K40j96j50j42Q33
4582C12o28K64L86o72L37k8q5l37J81L71l27Q7P2L64o4j08j29q2j3nq6R0L84k25
4606E9k10K96J36k71K97o6l34M3M23l61n2L26l8m32L40K30m36m5M05k92k40L51
$$ plain form
4628 129 163 110 8 425 -8 182 206 46 -334 114 184 65 -118 372 172 -69 0 163 120 121 63 -49 316
4651 316 415 -263 96 62 307 77 175 104 -144 25 373 287 206 -156 -59 8 163 22 -124 130 305 -134 3
4674 3 384 5 -433 -105 153 -381 -177 275 -17 -80 140 79 -48 167 218 -241 -121 337 -470 -320 244 -27
4696 -27 -154 -169 51 -192 -198 -98 -42 -125 130 -40 -30 -311 -278 -215 -383 -91 -247 -178 132 97 -339 -306 188 -13
4720 -13 -385 -108 227 -153 59 -4 -353 44 -118 -343 -370 46 -26 -300 244 7 -340 -161 284 -490 -225
4741 -225 146 109 -152 72 123 -63 21 132 36 -94 307 104 -25 306 237 -165 453 347 169 -215 440 189
4763 189 -115 174 265 -149 -46 152 -71 -9 16 223 168 -97 334 -21 300 504 -115 285 353 23 -303 123
4785 123 227 120 39 285 -34 207 157 388 3 179 517 -52 99 145 -200 -183 419 -112 -92 116 328 -243
$$ packed form
4628A29L4n3j02M17m33J90K4j60l80M48P0j19j83M90k00k41O9J63m3Jn8j12L65
4651C16R9o78L59l4K45k30R8p1k48J69L48q6q1l62R7O7J55j41j46K54J75m39J37
4674CL81l79m38L28K58n34K04M52k92o3K20o1j27K15N1m59J20M58q07J50N64k71
4696b7j27j5K20k43oJ00N6q3K55j70J0k81L3O3j68K92j56O9L10l5m36L3M94k01
4720a3l72K77L35l80K12o3l49L97j62k25k7M16p2k74N44k37l47J79M45p74K65
4741b25L71l7k61K24N1j86Q4J11r6j30M01k03j29L31o9m02O18j06j78l84O55k51
4763A89l04K89R1m14J03J98k23O2K5K07n5k65M31l55L21K04o19M00O8l30l26M26
4785A23J04j07q1K46l19K41n0K31l85J76L38n69J51M6l45J7O02n31K0K08K12n71
$$ plain form
4807 -243 -163 164 -79 -205 35 -52 -441 231 177 -62 -357 61 -36 -116 232 34 -129 -99 38 -216 -354 169
4829 169 -87 -178 30 260 -269 -54 159 -109 -95 -136 -244 -284 -350 268 -302 -57 -35 -364 -457 221 229 -729 -99
4852 -99 -101 -324 -143 208 118 -271 -15 -90 -242 -49 33 215 -103 84 -363 -223 325 -207 -474 -45 173 -42
4874 -42 85 237 -98 242 190 57 29 287 232 94 -163 220 -134 -148 303 49 -86 314 282 -261 284 420
4896 420 181 38 128 319 112 231 47 -205 147 486 62 -78 265 414 -64 -154 210 -60 -308 89 55
4917 55 77 41 0 -132 168 -6 -196 388 337 27 -220 85 -6 -109 -169 209 -88 -144 242 -214 -236 -51 -4
4940 -4 -252 -272 337 -254 -422 150 -4 -399 -15 168 -93 -211 -157 -78 -14 135 -90 -86 -74 -14 -144 -94 -207 -126
4964 -126 -308 -56 -162 -40 -163 13 -95 -486 30 -61 -591 142 0 -425 -397 268 -249 -398 -89 -178 -258
$$ packed form
4807b43Q0L27k43j26K40q7l89O72n4k39k95M18r7q0L48j98j63L0J37k54j38N23
4829A69k56r1K08K30n29K15K13k68J4m1j08m0o6O18n70K45K2l29r3O78Qr58O30
4852i9kk23J81L51r0l89K56p5j52J93Q2J82l18J87m47J40N48n32k67M29K18k15
4874d2J27J52l35L40n2j33k8K58n5j38k57L83l54j4M51k54j35M00l2n43N45J36
4896D20k39j43R0J91k07J19j84k52L52L39m24j40L43J49m78r0L64k70k48L97l4
4917E5K2l6m1j32L00j74j90N84n1l10k47L05r1j03o0L78k97n6L86m56k2J85M7
4940dk48k0O09n91j68N72j54l95L84J83k61j18N4P9O4J49k25MJ2O0j30N0j13Q1
4964a26j82K52j06J22j23J76j08l91N16r1n30P33j42m25K8O65n17j49L09q9q0
$$ plain form
4985 -258 -45 -298 -490 63 190 -118 -299 184 -345 -527 239 -160 -261 231 -78 -259 -68 118 -165 102
5005 102 213 -69 186 -115 162 -170 109 100 161 -236 168 -72 63 207 224 -11 -31 228 -151 1 310 25
5027 25 -182 215 98 86 -14 -138 162 50 372 181 -201 -186 400 -310 146 253 137 -191 -32 77 65
5048 65 -271 254 304 34 522 92 -43 149 92 -220 -65 39 -304 -261 509 49 -119 -174 109 -80 43 220
5070 220 -169 -118 248 268 -456 94 -42 44 -165 -80 -246 -298 -78 -147 -188 -400 -6 -298 -260 -20 -403 -249 76
5093 76 -69 -391 41 -232 -196 -580 5 -541 -284 -213 -30 -264 -141 121 -314 -298 -37 -463 -312 34 -234
5114 -234 -337 -8 -18 -326 -270 -89 -219 -67 196 -100 -50 -186 241 -152 -223 148 -158 -79 45 -14 -96 -9 30
5137 30 -195 -201 199 49 -380 38 479 -79 -6 484 -79 -294 361 -51 -302 208 383 132 103 274 -45 49
$$ packed form
4985b58K13k53j92N53J27l08j81M83n29j82P66l99j01M92l09j81J91J86k83K67
5005A02J11k82K55l01K77l32K79rO1l97M04k40J35J44J7k35k0K59l79J52L09k85
5027B5k07L97j17j2j00j24L00j12L22j91l82J5N86p10M56J07j16l28J59J09j2
5048F5l36N25N0k70M88m30j35J92n7l12J55J04l43M3P70m60j68n5K83j89J23J77
5070B20l89N1L66K0p24N50j36Q6k09Q5j66n2K20o9m1k12L94k92L8K40l83J54L25
5093G6j45l22M32k73L6l84N85n46K57P1J83k34J23K62m35J6K61m26J51L46k68
5114b34j03L29j0l08N6J81j30J52K63k96N0j36M27l93p1L71l06P9J24n9q2Q7L9
5137C0k25oM00j50m29M18M41n58P3M90n63k15O55m12k51N10J75k51k9J71l19R4
$$ plain form
5159 49 478 -83 -91 22 165 -121 -64 432 65 -103 189 254 -220 -246 -127 -195 -75 276 206 -170 367 -106 22
5182 22 74 136 -419 35 199 37 -186 46 399 -288 -190 -58 -222 -345 376 -105 -191 306 144 -363 84 -62
5204 -62 -30 -130 -89 -105 -264 176 33 -570 -304 101 -367 -323 87 -41 -373 -29 -377 -735 -267 98 -170 -306
5226 -306 -15 4 -642 -323 -132 -76 -214 -86 -166 -252 39 51 -590 242 -78 -718 -91 -102 -309 -235 233 -105
5248 -105 -155 -270 -192 -352 -30 -325 -264 -216 -239 -548 -246 243 75 -591 127 205 -147 -164 130 -244 -147 -49 204
5271 204 -173 -44 221 -58 178 301 21 83 326 321 214 -310 299 80 -28 240 321 75 89 502 108 -159
5293 -159 611 9 -116 409 85 -169 138 155 91 -222 332 313 218 308 191 -155 -130 476 159 56 3 283
5315 283 -10 -99 35 -399 194 -128 -174 6 278 -362 -524 -230 194 -561 167 153 -432 -47 -22 -210 -249 30
$$ packed form
5159D9M29n61qJ13J43k86N7M96l67j68K92O5m74k6J19o8J20L51p0l76N37m73J28
5182B2N2O2n55M54J64j62k23K32L53o87R8J32j64j23P21m81q6M97j62n07M47j46
5204f2L2j00M1j6j59M40j43o03K66M05m68M4M10j28l32L44l48l58M68L65k68j36
5226c06K91J9o46L19J91N6j38J28q0q6K91J2o41Q32l20o40O27j1k07P4M68l38
5248a05n0j15P8j60L22k95O1M8k3l09L02M89j68o66P18P8l52j7K94l74R7R8K53
5271B04l77J29K65k79K36J23k80O2K43nj07n24O09k19j08K68Q1k46J4M13l94k67
5293a59P70o02j25N25l24k54L07J7o4l13N54j9r5R0j17l46K5O06l17j03n3K80
5315B83k93q9J34m34N93l22m6J80K72o40j62K94M24p55P28j4n85L85K5j88l9K79
$$ plain form
5337 30 173 -364 -178 -128 -485 -76 4 -256 -689 2 -86 -221 -344 -34 -86 -338 -160 54 -536 -367 -143 -192
5359 -192 -261 -109 -252 -272 45 -69 -147 -329 -137 -94 -440 113 -472 -394 361 -55 -209 63 254 -38 -26 277
5381 277 -203 -48 98 -218 -432 -299 366 -74 -39 -102 10 -156 -60 139 191 -176 146 -16 -337 -61 -137 72
5403 72 180 -18 -212 57 109 -237 -159 -228 -150 -168 21 -126 -172 -2 71 44 151 115 243 186 198 -79 -66 343
5427 343 469 -288 -168 141 60 -244 212 232 -76 -6 510 -126 134 497 -270 -55 -80 270 -305 340 297 15
5449 15 -213 -75 171 -106 401 396 -46 138 475 33 -99 167 -35 -96 54 -17 -225 -146 276 -414 -217 133
5471 133 202 -305 330 24 -353 -200 83 -285 -621 217 -84 -434 -215 -7 -23 -288 -195 -240 -218 213 -173 -393
5493 -393 -163 49 -231 -205 -226 -581 -390 318 -138 -337 -375 255 -218 -137 121 -118 -268 -101 -29 -435 -208 -63
$$ packed form
5337C0J43n37J86N0l57M09Q0k60m33O91q8j35j23L10n2k52J78K14n90J69K24m9
5359a92o9J52j43k0L17j14p8j82J92M3l46N53n85P8P55m16j54K72J91k92J2L03
5381B77m80J55J46l16k14J33O65m40L5o3J12j66R6J99N2l67L22j62l21K76p6K09
5403G2J08j98j94K69N2l46P8o9P8j8J89j47m6J70P3k7J07l6J28n7J2k77J3M09
5427C43J26p57J20L09q1l04M56K0l08P0N16o36K60L63p67K15k5L50n75O45m3k82
5449A5k28J38K46k77N07nm42J84L37m42j32K66k02o1J50p1k08P9M22o90J97L50
5471A33O9n07O35l06l77J53K83l68l36Q38l01l50K19K08j6k65R3m5K2M31l86k20
5493c93K30K12k80K6k1l55J91P08m56j99l8O30m73Q1K58k39j50J67P2m06K27J45
$$ plain form
5515 -63 -395 72 129 -199 -234 116 -82 -61 4 165 -150 -219 24 -58 122 12 -312 -459 220 549 60 -312
5537 -312 387 4 -151 203 -131 -170 269 215 -62 95 211 -101 -228 94 111 -64 298 78 34 28 201 125
5559 125 -566 112 365 -164 28 322 162 66 337 56 53 31 208 -252 146 227 95 -211 240 415 -483 216
5581 216 107 -171 -1 228 -129 -95 533 196 -281 384 204 -244 266 18 -218 -63 -33 -294 -356 -226 291
5602 291 -32 -248 182 -19 -641 -211 39 -129 88 -2 -166 -105 -76 -529 -764 44 -159 -340 -273 -148 -398
5623 -398 -394 244 -347 -631 -146 -116 -241 -329 -26 -66 -72 -34 -257 -113 54 -38 -495 -277 226 -393 -238 100 -449
5646 -449 -656 141 307 -344 -269 324 -297 -424 281 -26 -294 100 -126 -67 300 105 -37 -250 379 -210 -317
5667 -317 42 146 -72 49 128 -82 -126 379 171 -23 265 61 -123 375 172 -104 -40 127 105 -117 375
$$ packed form
5515f3l32M67N7l28l5L50j98K1O5J61l15o9K43q2J80j10l24j47O79L29m89l72
5537c12O99l83j55L54l34l9M39n4k77J57J16l12j27L22J7j75L62k20m4oJ73p6
5559A25o91O78K53n29J92K94j60r6K71k81lk2J77m60L98Q1j32l06M51J75q98O99
5581B16j09k78J70K29l57L4O28l37m77O65j80m48N10k48k36J55L0k61o2J30N17
5602B91l23k16M30k01o22M30K50j68K17r0j64O1K9m53k35Q08k03j81O7J25k50
5623c98MO38n91k84M85L0j25q8L03m0oL8k23J44J67r2m57K18N03o19J55L38n49
5646d49k07P97J66o51P5N93o21j27P05l07k68L94k26N9L67j95j42k13O29n89j07
5667c17L59J04k18J21P9k10m4N05k08j94K88k04j84M98k03k76O4J67k2k22M92
$$ plain form
5688 375 205 5 -116 172 26 -134 192 -131 -73 -57 14 -56 16 -239 -271 71 211 197 -440 -43 269 -410
5710 -410 -321 397 -203 -341 343 79 -91 -34 107 -264 37 -105 -380 -321 86 71 -204 -39 142 -226 32
5731 32 224 134 -410 -297 198 -375 -156 -174 4 -436 218 61 24 -132 -53 -399 161 -2 -335 -266 -168 -269
5753 -269 -225 50 -156 -515 -663 -174 -266 -240 -57 -209 -385 -317 -99 -491 -154 -67 -663 -476 -44 -193 -547 -204
5775 -204 -374 -469 -104 67 -52 -321 199 -305 -168 -203 -198 -480 -45 -201 -312 -102 103 -79 -299 -67 264
5796 264 -66 -13 388 149 23 212 24 46 -19 95 -137 77 324 193 419 463 -52 102 236 457 -33
5817 -33 -131 279 63 144 62 195 -106 201 806 111 131 86 279 78 597 -76 -185 406 487 -575 -37 346
5839 346 -155 -149 39 355 -81 79 273 -92 50 198 37 -160 242 171 -130 69 99 -194 -48 93 -31
$$ packed form
5688C75j70k00j21K88j46j60L26l23N8J6P1p0P2k55l2L42J40j4o37L97L12o79
5710d10Q9P18o00j38O84k64j70N7J41l71L01j42k75N9M07j5k75J65J81l68K58
5731C2J92r0n44J13M95n73K19j8J78m40O54j57l7j56P9l46N60j63l33O9R8j01
5753b69M4K75k06l59j48M89r2K6J83j52j76O8K18l92L37Q7n96J87M32j49l54L43
5775b04j70r5L65J71j19k69N20n04J37l5Nk82M35j56j11K10K05j82k20K32L31
5796B64l30N3M01k39j26J89j88K2o5J14k32K14K47j31K26M4n15J54J34K21m90
5817c3r8M10k16Q1q2J33l01L07O05o95K0m5J93k01N19o73j09N91Q1j062N38L83
5839C46n01OJ88L16m36J60J94l65J42J48j61j97M02p1l01J99L0k93J46J41j24
$$ plain form
5860 -31 -323 -214 -394 -607 -372 1 -301 -180 103 -478 -375 156 14 -17 186 -168 -197 -425 -169 -272 -547
5881 -547 -122 152 -273 -274 432 -239 -467 -33 -483 -445 38 -102 -449 30 -5 -121 -236 -181 -104 -155 -61 89 -344
5904 -344 -330 135 -103 -185 301 -39 -228 207 166 -414 -15 280 -196 -399 95 160 -385 55 315 -282 -317 369
5926 369 196 -449 284 -13 -201 -46 28 -106 -314 430 22 18 97 83 -36 29 73 -116 -186 246 -109 -253 256
5949 256 121 -224 116 387 22 -72 346 53 144 429 -51 -24 334 381 -125 -143 570 -72 -414 267 384 -436
5971 -436 -8 244 125 11 350 95 -103 443 25 -322 -109 -80 -219 -122 411 127 -5 -54 117 -292 -59
5992 -59 113 36 -306 130 -10 -438 348 -166 -427 -73 49 -151 -307 -235 -75 -399 -208 232 -422 55 -117
6013 -117 -655 -716 103 -212 -452 -64 20 -457 87 136 -367 -457 197 1 -254 -44 -65 -409 -253 80 -96 -67
$$ packed form
5860c1k92J09j80k13K35L73l02J21K83n81J03N31j42l1K03l54k9k28K56j03k75
5881e47M25K74m25jP06o71k28M34m50L8M83j40l47M79l5j16j15N5P7n1R4J50m33
5904c44J4M65k38q2M86l40j89M35m1n80L99K95m76k03M94O5n45M40K60n97l5O86
5926C69j73o45P33k97j88J55P4j34k08P44m08mP9j4j19O5M4j89p0M32l55j44N09
5949B56j35l45L40K71l65r4M18k93R1K85m80K7L58M7n06j8P13o42l42O81J17q20
5971d36M28K52j19j14L39k55j98N46m18l47K13K9j39R7N33k84j32m9J71m09K33
5992e9J72p7l42M36j40m28P86n14k61L54J22k00j56P2J60l24J91M40o54M77j72
6013a17n38o1Q19l15k40L88Q4m77N44M9n03r0O54j96k55K10k1l44J56L33j76K9
$$ plain form
6035 -67 81 -143 -199 40 -13 -642 -335 270 -225 -275 -21 210 -185 -32 144 -283 72 -36 -52 -256 74 252
6057 252 -221 -38 303 -34 -141 345 -114 -150 36 350 -30 -12 -11 75 -9 -41 -68 -146 144 263 -108 81 238
6080 238 -65 68 155 0 -18 391 324 7 41 151 -140 -189 521 101 -230 337 246 56 77 190 -118 -140 216
6103 216 116 -105 333 543 -343 155 285 -14 -55 234 131 -496 -123 187 -138 -177 339 122 -295 56 -318
6124 -318 -232 164 0 -525 -180 48 -311 -555 78 2 -683 171 -30 -204 -197 -69 -215 -425 274 -281 -570
6145 -570 -95 -376 103 -231 -85 -464 -522 -67 -213 -323 -133 33 -342 -332 -20 -442 -277 11 133 -498 -331
6166 -331 -19 -168 86 246 -25 -473 255 139 -369 -98 166 -174 -130 240 62 -120 103 175 -83 212 182
6187 182 -233 -66 406 77 -196 472 189 -359 310 474 120 11 154 111 7 267 203 -98 134 674 48
$$ packed form
6035f7J48k24n6K39n3o29L07O05m95n0K54K31l95J53J76m27L55j08j6k04L30J78
6057B52m73J83L41l37j07M86m59l6J86L14l80J8JQ6q4l2k7p8K90J19l71J89J57
6080B38l03J33Q7j55j8M09o7l17L4J10k91m9P10m20l31N67r1j90K1J13l08k2L56
6103B16j00k21M38K10q86M98J30k99m1K89j03o27L73L10l25l9N16k17m17L51l74
6124c18Q6L96j64n25L45K28l59k44O33p6o85Q54k01j74PJ28j46k10O99n55k89
6145e70M75k81M79l34J46l79n8M55j46j10J90J66l75J0L12m22J65K88J22o31J67
6166c31L12j49K54J60k71m48P28j16n08K71K64l40M4L70j78j82K23P2k58K95l0
6187A82m15J67M72l29k73O68k83n48O69J64l54j09J43m3j04K60o4l01K32N40o26
$$ plain form
6208 48 150 445 -46 3 290 294 55 175 528 120 14 325 104 -153 52 41 -242 -60 210 -12 -139 92
6230 92 98 -82 436 49 -202 29 0 -145 -77 191 -132 -171 241 221 -550 33 170 -238 -457 -135 -60 -164 -227
6253 -227 326 -218 -313 -91 -362 -111 409 -280 -350 199 -18 -266 -242 -171 -97 -279 -93 -114 -452 -188 54 -416
6275 -416 -85 91 -384 -114 45 14 -163 32 151 -215 -157 391 98 -217 -65 -66 140 -3 66 -668 -264 20
6297 20 -439 -312 -278 132 -289 16 145 -235 -192 44 33 -218 101 -82 -167 -87 181 70 240 249 -291 -87 40
6320 40 201 1 161 198 -165 -33 242 -102 100 7 243 68 202 204 176 -267 518 170 111 28 314 252 10
6343 10 128 127 -219 145 258 169 309 55 59 545 316 19 -250 359 -28 -111 206 153 -129 169 464 -241 88
6366 88 -4 145 247 364 39 28 54 42 -26 -264 172 500 -43 -49 343 -9 -53 187 -209 -233 -106 1 -97 98
$$ packed form
6208D8J02K95m91M9K87Mk39J20L53m08j06L11k21k57K05j1k83J82K70k22j27K31
6230I2Oj80N18l87k51K31k9j45O8K68l23l9M12k0p71N83J37m08k19L22P5j04o3
6253b27N53n44r5K22k71K51N20o89p0N49k17k48K4P1P4j82J86k1l38K64K42m70
6275d16L31J76m75K70J59l1j77J95J19l66N8N48k93l15J52jK06j43O9p34M04K84
6297B0m59J27L4M10m21L05J29l80M3K36j1k51L19j83q5Q0K68j11J70Rn40K04J27
6320D0J61k00J60L7l63J32K75l44K02r3K36j75J34Kk8m43P85l48n9q3K86o2k42
6343A0J18jl46L64J13q9J40k54MM86k29k97k69O09l87q3L17n3k82K98K95p05L29
6366H8r2J49J02J17l25j1K6j2o8k38M36L28n43oL92l52m4K40l96k4J27J07r8J95
$$ plain form
6390 98 -233 -482 -107 242 -221 -133 29 -310 -326 -168 46 -245 -361 -68 -198 -387 -89 -155 -463 -122 -257
6411 -257 -319 -206 89 -336 -449 -27 -6 -434 -155 158 -270 -171 70 -95 -487 -227 -66 166 19 77 207
6432 207 241 543 125 -331 427 88 -218 373 305 -269 -134 422 -38 -103 144 185 -188 43 -42 -20 142 266
6454 266 132 -216 126 245 -58 190 509 98 -39 114 163 107 108 264 -7 57 158 -161 -102 229 429 -194
6476 -194 -46 290 -95 122 350 -73 -49 180 205 -110 8 289 -52 79 -48 139 -243 -22 431 -213 84
6497 84 -155 -118 -129 210 102 -287 638 215 -274 53 239 -137 -419 358 -33 -279 189 -88 -123 232 -178
6518 -178 -297 190 -60 -98 -95 185 -142 -249 222 -123 -114 -447 -58 -346 7 230 -158 -349 14 -367 -116 -278
6540 -278 -42 -408 -329 197 -194 -232 83 -144 -403 -634 -26 302 -334 -65 194 -106 -340 100 -267 -97 -296
$$ packed form
6390I8l31k49L75L49m63Q8J62l39j6J58K14k91j16K93j30j89K98o6l08L41j35
6411b57o2J13K95m25j13M22K1m28K79L13m28R9K41j65l92K60J61K32j47N8J30
6432B07L4L02m18m56P58l39l06N91o8n74J35N56m60o5K47M1l73K31q5K2J62J24
6454B66j34l48L42J19l03K48L19m11j37J53M9n6JJ56k71O4J01l19N9L31K00o23
6476a94J48L36l85K17K28m23K4K29K5l15J18K81l41J31j27J87l82K21M53o44K97
6497H4k39L7j1L39j08l89R25m23m89L27J86l76k82P77l91k46M68k77l5L55m10
6518a78j19M87k50l8LK80l27j07M71l45Rl33L89k88L53K23l88j91L63l81K51j62
6540b78K36l66P9N26l91l8L15k27k59k31O08L28o36K69K59l00k34M40l67J70j99
$$ plain form
6561 -296 -189 -3 249 14 -102 -159 753 -109 -221 280 -109 -159 -39 191 65 -230 401 334 -31 357 -73
6582 -73 181 209 146 -248 219 423 -188 -255 283 156 209 330 78 375 -208 580 -144 70 286 413 -65 305
6604 305 178 -200 264 211 -11 140 712 172 -81 -12 109 -67 47 500 77 -152 138 224 107 107 139 167
6626 167 -118 91 -74 -100 342 43 -25 -155 485 -300 70 89 88 -183 -202 92 -146 -308 126 -384 263 142
6648 142 -8 19 87 358 -218 -351 251 -88 -16 254 -83 -457 -322 58 -172 37 227 -101 -151 118 -261
6669 -261 -216 15 -31 -598 -415 -34 -297 -180 232 -267 31 271 225 -356 -181 76 -201 -257 151 6 -300
6690 -300 164 89 -611 82 49 -143 -100 58 173 -262 236 130 115 -42 229 -17 -112 123 29 53 216 74
6712 74 -49 179 160 -38 -84 429 104 86 342 404 -245 -14 246 300 50 194 73 35 -29 215 240 401 190
$$ packed form
6561b96J07J86K52k35j16n7R12q62j12N01l89n0J20K30j26k95O31o7l65L88m30
6582g3K54K8o3l94M67K04o11o7N38j27N3J21k52K97n83P88p24K14K16J27m78L70
6604C05j27l78M64n3k22J51N72n40k53O9J21j76J14M53m23k29K90Q6j17%L2K8
6626A67k85K09j65k6M42k99o8j30O40p85L70J9jk71j9K94k38j62M34n10O47j21
6648A42j50K7O8K71n76j33O02l39P2K70l37l74J35L80k30K09J90l28n0K69l79
6669b61M5K31m6n67J83L81k63J17M12m99K98K40m6n81J75K57k77n6M08j45l06
6690c00M64p5p00O93l3j92M3J58J15m35M98j06j5j57K71k46r5K35r4K4J63j42
6712G4j23K28j9j98m6N13l25j8K56O2o49K31K60N4k50J44j21l8o4K44K5J61k11
$$ plain form
6735 190 -201 198 413 326 84 232 160 107 -78 246 383 38 187 436 146 61 347 29 158 366 -76
6756 -76 31 525 184 29 126 -105 -134 -340 343 166 -288 14 -14 -223 -45 278 -154 18 58 -116 -147 188
6778 188 -85 -75 235 423 -267 -176 170 -79 -448 -21 91 77 -152 -36 -296 -345 66 -86 -439 -211 -110
6799 -110 -91 50 -46 165 -13 32 246 -514 -49 31 -411 -103 162 -155 -222 282 40 -229 146 36 17 -197
6821 -197 352 7 -556 151 -100 -121 206 166 -74 228 400 50 4 49 -243 -190 -102 275 250 144 368 114
6843 114 -30 168 414 -73 108 343 243 357 256 209 -168 340 270 83 416 341 92 -143 314 267 -9
6864 -9 325 269 -277 74 95 -112 44 135 145 56 261 498 -293 84 186 -252 196 434 76 -368 361 189
6886 189 -156 279 176 -184 -20 282 29 -102 -130 172 -338 43 152 31 -85 -95 39 -215 -117 -15 108
$$ packed form
6735A90l91L99K15q7k42J48p2n3j85L24J37l45J49K49k90q5K86l18J29K08m42
6756g6J07M94l41j55R7k31k9k06O83j77m54L02k8k09J78L23m32J72M0j74l1L35
6778A88k73J0L10J88o90R1L46k49l69M27J12j4k29J16k60m9M11j52l53K28J01
6799a10J9J41r6K11j78M5K14p60M65Q0m42L08K65l17o7N04k42k69L75j10j9k14
6821a97N49l45n63P07k51k1L27m0k40L02J72l50m6M5k92N3Q8L77k5j06K24k54
6843A14j44J98K46m87J81K35j00J14j01m7l77N08p0j87L33p5k49k35M57m7k76
6864iL34n6n46L51K1k07J56R1J0q9K05K37p91L77J02m38M48K38l58m44P29j72
6886A89l45M35j03l60J64L02k53j31k8L02n10L81J09j21j16j0J34k54R8J02J23
$$ plain form
6907 108 -131 35 -175 -43 -179 -287 -147 -40 12 -147 202 57 -429 4 -28 -350 -474 114 79 -79 -130
6928 -130 89 -179 -323 164 -118 164 -280 127 -222 -241 -77 -168 -272 510 -149 -346 297 114 110 -198 73
6949 73 -113 -235 68 -174 44 62 139 -33 26 190 -92 -368 90 287 -200 112 509 -5 253 219 41 -240
6971 -240 100 96 5 120 167 -63 -219 453 47 -228 247 389 -283 311 562 -45 -61 200 147 -170 536 180
6993 180 51 82 297 103 159 409 126 25 13 174 -82 180 376 230 -280 312 159 -158 27 90 -106
7014 -106 58 330 -43 -190 403 -16 -184 329 111 -259 -295 188 -203 -1 297 260 -132 424 176 41 28
7035 28 79 -195 -334 42 -29 168 -111 5 -465 -62 -30 -86 -263 -184 10 -72 -132 -216 -223 -12 250 -200 -147 -4
7059 -4 -162 -536 316 94 -106 85 141 -389 35 -131 -43 -325 121 -87 -54 -346 255 -19 -492 267 208 -403
$$ packed form
6907A08k39J66k10J32j36j08J40J07N2j59L49j45m86M33l2l22j24N88l5j58n1
6928a30K19k68j44M87k82K82m44M07l49j9J64r1j04P82o59j97O43j83ml08K71
6949G3j86j22L03k42K18J8P7j72N9J64k82k76M58J97m87L12L97n14K58l4j78k81
6971b40L40mr1J15M7k30j56O72m06k75M75J42o72N94K51o07j6K61n3l17P06l56
6993A80j29L1K15j94N6K50k83j01j2J61k56K62J96j46n10N92j53l17J85O3j96
7014a06J64K72l73j47N93m19j68N13k18l70l6M83l91K02K98l7l92N56k48j35j3
7035B8N1k74j39L76p1J97k79J16m70M03L2n6j77P9J94q2o0q4pK11K62m50N3J43
7059dj58l74Q52k22k00J91N6n30M24j66Q8k82M46k08L3k92O01k74m73P59n9o11
$$ plain form
7081 -403 -157 331 -139 -67 369 -58 -28 150 321 -168 183 196 -6 70 275 66 -201 208 157 -2 325 489
7103 489 -258 94 292 -114 138 243 371 108 283 586 42 -103 337 -44 159 345 139 80 318 15
7123 15 187 -246 348 135 15 547 294 -137 49 110 142 -191 470 151 -76 208 172 152 -106 339 -245 41
7145 41 406 -72 -102 245 85 50 -275 -115 -295 -46 -221 104 -215 153 333 -269 -239 165 -129 -190 -69 -439
7167 -439 -319 97 -5 -352 84 118 -79 -389 -67 84 -245 -3 -9 -205 -229 152 -29 -330 -133 6 -127
7188 -127 12 -154 -228 141 202 53 -654 -212 -143 -201 153 94 -351 -93 -236 -72 -218 -24 100 -326 339 -108
7210 -108 -503 -123 34 178 -114 181 -33 -315 147 351 -54 175 -22 -278 132 -61 150 100 -195 364
7230 364 -97 -2 534 -95 -103 122 214 -43 55 290 -73 -95 243 119 347 46 215 82 447 203 -344 -197
$$ packed form
7081d03K46M88m70P2M36m27L0J78J71m89L51J3k02P6K05k09k67M09n1j59L27J64
7103D89p47L52J98m06K52J05J28k63J75L03n44j45M40l81K03J86k06n9K38l03
7123A5J72m33N94k13j20N32k53m31J86O1L2l33O61l19k27K84l6k0k58M45n84K86
7145D1L65m78l0L47j60l5l25J60j80K49j75L25l19L68J80o02L0M04k94o1J21l70
7167d39J20M16j02l47M36L4j97l10L22J51l29K42oj96k4L81j81l01J97J39j33
7188a27J39j66p4L69O1j49p07M42O9n8L54n9m45K58j43J64j46J94J24m26O65m47
7210a08l95L80J57J44k92K95k14k82M62K04m05K29j97k56M10j93K11n0k95N59
7230C64m61R5N36o29qK25R2k57R8K35l63k2L38j24K28l01J69j33L65k44n47J47
$$ plain form
7252 -197 246 298 110 98 81 21 -37 478 -139 -284 444 384 -80 -19 287 -54 352 415 28 214 193 -30 109
7275 109 88 -41 143 -139 150 101 -113 42 118 -97 -47 149 59 -105 406 21 -220 -122 -162 -377 -42 -97 -311
7298 -311 -12 117 -90 -136 234 -181 -453 98 -23 -104 -169 287 -21 -351 170 -105 -85 79 4 -278 -59 246
7320 246 -388 -120 -17 -206 117 -281 193 -252 -108 -356 -189 -381 -103 -9 -184 -2 288 -249 24 -145
7340 -145 -203 78 123 -100 -322 -63 113 -133 -263 194 175 -158 36 278 12 144 247 -139 30 264 105
7361 105 -400 247 330 -265 149 522 -178 30 -97 81 0 208 210 -55 132 378 58 134 209 17 -138 378
7383 378 -4 -83 38 312 -156 163 167 243 58 165 362 -66 39 196 238 -280 49 15 -230 193 394 296
7405 296 97 403 -119 -245 322 -40 -516 -176 142 -248 176 101 227 -97 356 -14 17 314 -26 11 -42
$$ packed form
7252a97M43N2j88j2j7o0n8N15o17j45P28o0m64O1L06l41M06O3l87J86k1k23J39
7275A09k1j29J84k82K89m9k14J55P6k15N0J96r0j64N11l85k41R8m0k15L35n5k14
7298c11K99J29k07m6L70m15k72N51j21q1o5M56l08l30N21k75K0J64p5k82K19L05
7320B46o34K68J03j89L23l98M74m45J44k48J67j92K78R4j75J82K90n37K73j69
7340a45n8K81M5k23k22K59J76k46j30M57j9l33J94K42k66J32J03l86J69K34j59
7361A05n05O47Q3n95M14L73p00K08j27J78q1K08Kk65J87K46l20P6P5j92j55N16
7383C78l82p9J21K74m68L19MP6j85J07J97m28J05J57M2n18L29l4k45M23K01r8
7405B96j99L06n22j26N67l62m76L40L18l90M24p5J26l24M53l70L1K97l40L7n3
$$ plain form
7426 -42 -145 56 -357 108 156 -316 -114 131 -121 -279 -32 -83 -397 -66 141 -321 -131 -261 -288 -62 239
7447 239 24 -170 -136 -293 -271 -136 416 -442 -269 61 12 -56 14 -111 -117 -42 116 -98 -352 111 -238 -67 292
7470 292 -89 -20 104 59 -150 -278 250 116 263 66 -218 33 165 34 -172 194 107 -164 -240 -89 408
7491 408 -111 -82 140 -58 45 489 167 -110 254 228 32 104 315 -62 73 227 -7 60 165 226 -44 -28
7513 -28 216 78 51 324 210 -78 119 8 9 -119 93 215 -23 81 -85 -206 55 146 -15 -199 111 -415
7535 -415 -106 117 258 -177 -34 349 -11 18 61 -7 -180 17 210 -131 -95 207 -58 120 161 30 -389 154
7557 154 -104 -135 36 360 -361 -454 29 -12 -225 -27 209 -84 -211 212 -400 -13 -9 -373 -168 18 88 11
7579 11 92 240 -195 -82 134 -39 -399 47 -111 -109 66 -108 -326 -306 -93 -84 19 89 149 -154 -173 -52 4 -36
$$ packed form
7426d2j03K01m13M65M8m72K02K45k52j58K47n1l14L31K07m62J90j30k7K26L01
7447B39k15j94L4j57K2J35N52q58J73L30m9o8P0j25oP5J58k14k54M63l49J71L59
7470B92l81O9J24m5k09j28N28j34J47j97k84K51J32j31k06L66q7k71p6J51M97
7491D08n19K9K22j98J03M44l22k77L64k6j96P2K11l77J35J54k34O7J05O1k70J6
7513b8K44j38k7K73j14k88J97j11Jj28K12J22k38J04j66j21K61R1j61j84L10n26
7535d15L09K23J41m35J43L83l60K9M3o8j73J97J93l41L6L02k65J78M1j31m19N43
7557A54k58l1J71L24p21r3M83m1k13J98K36k93j27M23o12L87Ml64K05J86P0p7
7579A1Q1J48m35J13K16j73l60M46j58KJ75j74k18K0K13RJ03P0O0l03j9J21N6m0
$$ plain form
7603 -36 215 -384 -90 52 -65 -15 -268 219 -106 -37 489 223 -90 204 225 -150 54 -117 -195 186 141 100
7625 100 -63 -49 -34 -133 -49 543 69 -148 322 -164 273 338 531 146 494 432 28 215 430 259 -196 233
7647 233 499 83 -144 280 -9 109 204 -36 -275 54 269 -152 -27 293 -251 -210 -47 -213 -144 61 -214
7668 -214 89 -54 451 -40 -299 63 108 -16 252 232 -380 -36 394 -260 -175 9 93 -388 -94 -51 -152 -51
7690 -51 86 266 -483 -91 -84 -119 -233 28 -199 -82 -157 -54 -264 20 188 -634 -239 163 -291 -23 104 -317
7712 -317 -278 133 -169 -160 -147 224 -134 -251 -61 -235 -349 229 169 -443 -18 -42 -16 -372 272 -108 -242 -107
7734 -107 100 27 186 23 27 -266 95 -158 -143 -321 164 -183 -221 376 -48 -101 139 167 -303 -38 252 25
7756 25 -14 84 -133 -60 143 230 -440 197 621 -25 -107 315 -133 -366 439 257 314 178 344 90 79 331 -307
$$ packed form
7603c6K51n99K94J42j17N0k53M87l25O9N26k66l13K94K1l75K04j71p8L81m5m1
7625A00j63J4J5r9Q4N92m74k17M70m86M37O5J93l85L48o2m04J87K15j71m55M29
7647B33K66m16k27M24k89J18R5k40k39L29K15m21J25L20n44M1J63j66O9K05k75
7668b14L03j43N05m91k59L62M5j24K68k0o12L44M30o54Q5J84Q4m81K94M3j01J01
7690e1J37J80p49L92Pl5j14K61k27J17p5J03k10K84J68q22L95M02m54K68J27m21
7712c17L9M11l02RJ3L71l58j17J90j74j14N78o0o12M25k4K6l56O44l80j34J35
7734a07K07p3J59j63Mk93L61k53J5j78M85l47l8N97m24n3K40K8m70K65K90k27
7756B5l9R8k17P3K03Q7o70O37M24o46q2M22m48k33Q05j82N7j36J66k54j1K52o38
$$ plain form
7779 -307 -153 342 122 -45 106 141 -239 -9 23 -208 -72 250 94 -146 339 200 73 149 271 192 -73
7800 -73 75 146 -139 296 233 15 2 142 387 -67 -30 -73 -100 146 81 18 -62 70 -106 -165 -163 -145 -232 -304 150
7825 150 -386 -357 -117 -139 -329 143 209 -395 -113 -40 -280 -326 166 -87 -316 -157 24 -320 -58 175 -179 -463
7847 -463 -101 -30 -165 -171 104 -96 -240 40 -80 -24 34 109 -381 23 90 -109 -84 -82 -63 -228 141 44 -78 172
7871 172 -110 -143 40 413 -192 -79 -107 -96 -113 -112 218 -18 203 46 -152 -104 387 56 -130 -107 433 55 84
7894 84 122 260 -108 9 280 28 -87 279 24 7 258 -54 119 213 274 -504 -14 378 -103 -106 297 182
7916 182 75 151 229 34 96 282 -234 -44 93 -40 -61 -10 233 -154 -234 96 -110 -407 309 -94 -311 -64
7938 -64 175 -154 -422 -59 440 -349 172 21 -272 -182 -157 33 -426 103 -324 -121 -334 -119 -113 119 -221 -379
$$ packed form
7779c07J54M95k20j67J51L5l80K30L2k31J36L22j56k40M85j39j27P6J22p9k65
7800g3J48P1k85M35o3k18j3J40K45m54L7m3k7K46o5o3q0J32j76n9KJ8q7p2M54
7825A50n36K9K40k2j90M72O6o04K82P3k40m6M92k53k29J59J81l44K62K33l54k84
7847d63L62P1j35oK75k00j44K80j20N6N8P5m90M04O7j99K5KJ9j65L69r7j22K50
7871A72k82l3J83L73o05J13k8J1j7JL30k36K21j57j98M8M91l31j86K3N40l78K9
7894H4L8J38l68J17K71k52j15L66k55j7K51l12J73R4O1p78M90L92m81lM03j15
7916A82j07P6P8j95O2J86n16J90J37j33k1N1K43l87q0L30k06k97P16m03k17K47
7938f4K39l29k68L63M99p89N21j51k93R0K5J90m59N29m27K03k13K15OK32l40j58
$$ plain form
7960 -379 -106 65 -218 -173 -223 -303 -64 -296 -57 -250 -211 7 -460 -338 -278 128 -5 -70 -306 -334 -149 134
7982 134 -42 -187 233 9 73 -181 218 -260 -131 -41 -255 -95 131 283 -297 -318 257 -33 53 313 -169
8003 -169 -40 -363 -57 -125 11 204 141 364 31 150 66 26 68 71 16 -131 -142 52 -16 92 112 140 104 19 73
8028 73 108 -101 139 259 -59 237 -120 101 -360 -104 -40 -135 -273 -6 39 -161 133 -157 -14 -71 139 5
8050 5 55 214 175 -209 -168 219 59 -48 133 -22 -31 42 -118 200 -74 239 65 -82 -30 -104 -323 217 -121
8073 -121 25 18 -147 -146 -89 111 -49 -276 -81 86 -281 -79 -121 -4 -95 -249 -183 -116 9 89 -164 -15 215
8096 215 -259 -274 174 -254 -323 -162 69 -384 -286 32 -36 -56 244 -54 -487 169 41 -295 -38 88 -108 -110
8118 -110 -238 117 -48 84 30 -231 20 -85 -56 -119 33 120 -172 105 145 -121 -176 383 -307 37 132 -62
$$ packed form
7960c79K73J71k83M5n0q0K39k32K39j93L9K18m67J22O0M06j33o5k36k8J85K83
7982A34j76j45M20k24O4k54L99m78J29R0k14J60K26J52n80k1N75k90Q6K60m82
8003a69J29l23L06o8J36J93o3K23l33J19q4m0M2Ln5j47j1J94o8J08K0K8l6q5N4
8028G3L5k09K40J20l18K96l57K21m61K56O4r5j38K67M5k00K94k90J43n7K10j34
8050EN0J59l9l84M1L87j60j07J81j55rP3j60L18k74L13j74j47N2p4k19N40l38
8073a21J46pj65JN7K00j60k27J95J67l67K02m2J17r1j54O6O7J25Q0k53J49K30
8096B15m74j5M48m28o9J61K31m53R8L18o8k0L00k98m33O56j28l36K57J26j96k
8118a10j28L55j65J32n4k61K51j05K9o3J52Q7k92K77M0k66n5N59o90L44R5j94
$$ plain form
8140 -62 -125 43 335 11 59 281 156 -115 363 -200 -119 473 -2 -223 -136 224 34 11 184 -40 -137 218
8162 218 387 -76 -22 28 39 -153 27 -14 -200 -247 227 24 -258 330 -84 236 247 -389 5 77 133 -87 55
8185 55 365 77 5 -108 77 53
$$ packed form
8140f2o3J68K92l24M8K22j25k71M78n63Q1N92m75k21Q7L60j90k3J73k24r7L55
8162B18J69m63N4N0J1j92J80m1j86m7M74k03k82N88m14L20J1o36L94P2N6k20J42
8185E5L10k88p2j13J85k4
8191E3
$$ Imaginary data points
##PAGE= N=2
##DATA TABLE= (X++(I..I)), XYDATA
$$ plain form
0 0 0 0 0 0 0 0 0 0 -8 8 -8 8 -8 16 -16 17 -24 25 -32 40 -45 51 -60 69 -81 89 -102 117 -134 150 -166 190
32 190 -210 234 -263 292 -324 360 -400 442 -490 542 -600 665 -740 819 -913 1017 -1138 1280
50 1280 -1448 1653 -1904 2229 -2657 3257 -4156 5653 -8603 16641 -83681 -272155 -134971
63 -134971 -47105 -108770 -159661 -88364 -52789 -81299 -93442 -39307 13270 2315 -70982 -97959
75 -97959 -64425 -60370 -100532 -104609 -107688 -145231 -137032 -69298 -60685 -96532 -72645 -28594 -48118
88 -48118 -63989 -25394 1632 -25738 -70410 -91512 -64051 -23806 -37131 -69825 -48963 -31072
100 -31072 -63868 -51804 22888 32405 -20837 -17761 17011 2733 -11269 12937 17017 -8713 -22832
113 -22832 -22915 -2278 30862 16738 -27807 -8449 41854 23548 -9991 20021 40831 4929 -13333
$$ packed form
0@%%%%%%%%qJ6j6J6j6K4l2L3m1M9n7P2q5R6j11J29j50J70j91K19k51K84l16L56
32A90m00M44m97N55o16O84p60Q42r32J032j142J265j405J559j732J930k155K418
50A280k728L101l557M133m886N914p413R809j4256K5244j00322j88474J37184
63a34971Q7866o1665n0891P1297L5575k8510j2143N4135N2577j0955p3297k6977
75i7959L3534M055m0162m077l079l7543Q199O7734Q613l5847K3887M4051j9524
88d8118j5871L8595K7026k7370m4672k1102K7461M0245j3325l2694K0862J7891
100c1072l2796J2064P4692R517n3242L076L4772j4278j4002K4206M080k5730j4119
113b2832q3K0637L3140j4124m4545J9358N0303j8306l3539L0012K0810l5902j8262
$$ plain form
126 -13333 7067 14193 7486 -1292 -21238 -25633 -3031 1363 -10513 -4019 -4314 -23454 -16756 -2997
140 -2997 -23546 -27569 3050 -11471 -57745 -44920 -8938 -24982 -46305 -34481 -34978 -44425 -31767
153 -31767 -30115 -44846 -32645 -20562 -44347 -55097 -34935 -33098 -42566 -35086 -41426 -54694 -33786
166 -33786 -21372 -51764 -54943 -17719 -20121 -50370 -38408 -14481 -24278 -31540 -24880 -32116 -31442 -13754
180 -13754 -13999 -26082 -19965 -17713 -23508 -11689 -6173 -18961 -7668 7318 -23308 -40154 6743
193 6743 27701 -16116 -32163 -1989 -1101 -20002 -9056 3882 -3874 -11135 -18250 -20864 -3570
206 -3570 4782 -17365 -21506 -6037 -20541 -32847 -2940 4371 -36854 -41690 -7102 -12801 -39433
219 -39433 -26181 -8905 -25772 -41936 -39147 -27400 -12986 -21188 -51254 -50201 -22646 -29711 -46757
$$ packed form
126a3333K0400P126o707q778j9946m395K2602M394j1876O494k95j9140O698J3759
140b997k0549m023L0619j4521m6274J2825L5982j6044k1323J1824m97r447J2658
153c1767J652j4731J2201J2083k3785j0750K0162J837r468P480o340j3268K0908
166c3786J2414l0392l179L7224k402l0249J1962K3927r797p262O660p236O74J7688
180a3754k45j2083O117K252n795J1819N516j2788J1293J4986l0626j6846M6897
193F743K0958m3817j6047L0174Q88j8901J0946J2938p756p261p115k614J7294
206c570Q352k2147m141J5469j4504j2306K9907P311m1225m836L4588n699k6632
219c9433J3252J7276j6867j6164K789J1747J4414q202l0066J053K7555p065j7046
$$ plain form
232 -46757 -24901 -17592 -52482 -58439 -27055 -25987 -41008 -30406 -27814 -48817 -48251 -29297 -24102
245 -24102 -25749 -33592 -48637 -37894 -12025 -23801 -44898 -22683 -8012 -38102 -42597 -7718 -4708
258 -4708 -30338 -28702 -16295 -19054 -15001 -7994 -15353 -16940 -12188 -19033 -14654 3861 -4494 -21843
272 -21843 -6969 2167 -21698 -18749 14902 7864 -23461 -17364 2409 -2323 -7208 -3271 -6737 -6159
286 -6159 -2924 -13499 -12350 6785 378 -23050 -13347 4226 -9738 -15980 -1288 -10300 -26179
299 -26179 -9140 2508 -16151 -21210 -9926 -14984 -21157 -13255 -15101 -19264 -11355 -17273 -32992 -20355
313 -20355 -5091 -22059 -31758 -14865 -16780 -31558 -22618 -15518 -27870 -25722 -15176 -27597 -34452
326 -34452 -18720 -18057 -30908 -25568 -21774 -30948 -25528 -16507 -29711 -34384 -18460 -22312 -36231 -24783
$$ packed form
232d6757K1856P309l4890n957L1384J068j5021J0602K592k1003N66J8954N195
245b4102j647p843j5045J0743K5869j1776k1097K2215J4671l0090m495L4879L010
258d708k5630J636J2407k759M053P007p359j587M752o845M379J8515q355j7349
272b1843J4874R136k3865K949L3651p038l1325O097J9773m732m885L937l466N78
286f159L235j0575J149J9135o407k3428R703J7573j3964o242J4692r012j5879
299b6179J7039J1648j8659n059J1284n058o173P902j846m163P909n918j5719J2637
313b0355J5264j6968r699J6893j915j4778Q940P100j2352K148J0546j2421o855
326c4452J5732O63j2851N340L794r174N420R021j3204m673J5924l852j3919J1448
$$ plain form
340 -24783 -15375 -30004 -32403 -21047 -26459 -30242 -17969 -21495 -34768 -25825 -17001 -28580 -28773 -17458
354 -17458 -24120 -29695 -19106 -21641 -31996 -20514 -12800 -27819 -27896 -13943 -21032 -29234 -15079 -13177
368 -13177 -26040 -20754 -12183 -22074 -21758 -8974 -14800 -22900 -13635 -12652 -20299 -10280 -5300 -19983
382 -19983 -19048 -2766 -9149 -19534 -6686 -2946 -16059 -12068 -2055 -9718 -10874 -1512 -7800 -14859
396 -14859 -2637 -1001 -13204 -6844 2162 -9152 -11591 224 -4567 -12566 -1352 244 -14017
409 -14017 -10029 875 -7695 -12032 -2633 -7090 -15665 -6659 -4602 -15510 -10708 -3707 -16286 -19084
423 -19084 -5228 -8794 -21516 -14805 -9858 -20369 -17918 -10097 -20324 -24678 -13546 -16833 -26368 -18796
437 -18796 -15349 -26763 -24586 -15551 -23855 -28322 -18129 -21427 -31174 -22233 -17563 -29791 -28841 -18567
$$ packed form
340b4783R408j4629k399J1356n412l783J2273l526j3273Q943Q824j1579j93J1315
354a7458o662n575J0589k535j0355J1482P714j5019p7J3953p089q202J4155J902
368a3177j2863N286Q571r891L16J2784n826q100R265R83p647J0019M980j4683
382a9983R35J6282o383j0385J2848L740j3113L991J0013p663j156R362o288p059
396a4859J2222J636j2203O360R006j1314k439J1815m791p999J1214J596j4261
409a4017L988J0904q570m337R399m457q575R006K057j0908M802P001j2579k798
423a9084J3856l566j2722O711M947j0511K451P821j0227m354J1132l287r535P572
437a8796L447j1414K177R035q304m467J0193l298r747Q941M670j2228R50J0274
$$ plain form
451 -18567 -24530 -29454 -20259 -23157 -31569 -21411 -16282 -28987 -28485 -16287 -22114 -28467 -18456 -18345
465 -18345 -27025 -20471 -15322 -23686 -20639 -12758 -21342 -25042 -11490 -11717 -23573 -16687 -9505 -19591
479 -19591 -18491 -6615 -12680 -21219 -11296 -8895 -17484 -12738 -7306 -16225 -15179 -5443 -12831 -18224 -7407
494 -7407 -7840 -18392 -12253 -5439 -16458 -16971 -6170 -11649 -18956 -10091 -9773 -20185 -15439 -7685 -16694
509 -16694 -19422 -11320 -16293 -21331 -11162 -11520 -23892 -19602 -11109 -18839 -22285 -13277 -16533 -24148 -17450
524 -17450 -15482 -23132 -18017 -12473 -22829 -24043 -12367 -16554 -25084 -15507 -11648 -22673 -20247 -10906
538 -10906 -17869 -21600 -11636 -12392 -20008 -14370 -11316 -17783 -13187 -7541 -16260 -16976 -5960 -10020 -18590
553 -18590 -7640 -3276 -16037 -14550 -3014 -8332 -13727 -5463 -6578 -14127 -7479 -2810 -11719 -10128
$$ packed form
451a8567n963m924R195k898q412J0158N129j2705N02J2198n827o353J0011J11
465a8345q680O554N149q364L047P881q584l700J3552k27j1856O886P182j0086
479a9591J100J1876o065q539R923K401q589M746N432q919J046R736p388n393J0817
494g407m33j0552O139O814j1019n13J0801n479p307Q865L18j0412M746P754r009
509a6694k728Q102m973n038J0169l58j2372M290Q493p730l446R008l256p615O698
524a7450J968p650N115N544j0356j214J1676m187q530R577L859j1025K426R341
538a0906o963l731R964p56p616N638L054o467M596N646q719p16J1016m060q570
553a8590J0950M364j2761J487J1536n318n395Q264j115p549O648M669q909J591
$$ plain form
567 -10128 -3130 -10099 -13377 -3753 -6074 -14541 -8053 -4549 -14938 -13226 -4442 -11072 -16849 -8362 -9813
582 -9813 -18945 -14030 -9747 -18337 -17613 -10566 -18171 -24171 -14156 -13871 -24062 -20164 -15535 -23716 -24421
597 -24421 -17084 -21643 -26482 -20134 -22295 -28967 -22044 -17756 -29132 -28936 -18957 -24534 -30568 -20734 -20016
612 -20016 -31295 -27287 -18682 -25044 -27438 -19916 -23006 -27778 -21424 -20059 -25933 -20067 -15322 -24352 -24209
627 -24209 -13452 -16858 -22781 -14537 -12054 -20496 -16905 -9427 -15030 -14946 -6623 -10996 -17636 -7982 -4207
642 -4207 -12567 -9293 -2829 -10366 -11788 -391 -2110 -10444 -5206 -2165 -8348 -4696 1371 -4305 -6344
657 -6344 -1146 -5910 -8819 2373 2621 -10752 -7158 2897 -5520 -10897 567 1290 -10271 -8009
671 -8009 -1960 -7072 -8054 -3841 -6722 -9248 -6270 -9850 -12022 -4079 -6156 -17728 -11621 -1980 -13499
$$ packed form
567a0128O998o969l278R624k321q467O488L504j0389J712Q784o630n777Q487j451
582i813r132M915M283q590P24P047p605o000J0015K85j0191L898M629q181p05
597b4421P337m559m839O348k161o672O923M288j1376J96R979n577o034R834P18
612b0016j1279M008Q605o362k394P522l090m772O354J365n874N866M745r030J43
627b4209J0757l406n923Q244K483q442L591P478n603Q4Q323m373o640R654L775
642d207q360L274O464p537j422J1397j719q334N238L041o183L652O067n676k039
657f344N198m764k909J1192K48j3373L594J0055q417n377J1464P23j1561K262
671h009O049n112r82M213k881k526K978l580k172P943k077j1572O107R641j1519
$$ plain form
686 -13499 -19747 -6024 -5393 -19730 -18744 -8561 -11321 -15020 -13263 -16265 -17244 -12113 -14495 -18579 -11802
701 -11802 -11512 -22085 -18700 -8600 -15138 -20578 -10811 -11653 -22821 -17496 -7429 -14926 -19569 -12251
715 -12251 -12484 -16212 -13050 -14102 -17090 -10257 -8668 -18720 -15995 -5187 -11586 -19788 -10009 -6527 -15526
730 -15526 -14193 -6469 -10905 -13616 -8332 -10124 -13266 -7761 -8262 -13487 -8119 -6012 -15089 -11868 -544
745 -544 -7655 -17776 -8404 -3052 -12599 -12016 -3853 -7969 -11309 -6934 -8848 -12162 -6102 -5645 -12569 -9002
761 -9002 -4422 -10806 -11176 -4089 -8474 -14003 -5481 -3657 -14901 -11337 -319 -5963 -13529 -7293 -4958
776 -4958 -8983 -6204 -5265 -10447 -7768 -3017 -7801 -8738 -1586 -5372 -11856 -6033 -2664 -7791 -3935 383
792 383 -9147 -11461 165 -144 -10258 -5018 1361 -6004 -8025 -912 -1777 -4981 -1647 -3464 -7962
$$ packed form
686a3499o248J3723O31j4337R86J0183k760l699J757l002r79N131k382m084O777
701a1802K90j0573L385J0100o538n440R767q42j1168N325J0067p497m643P318
715a2251k33l728L162j052k988O833J589j0052K725J0808o399q202R779L482q999
730a5526J333P724m436k711N284j792l142N505n01n225N368K107r077L221J1324
745e44p111j0121R372N352r547N83Q163m116l340M375j914l314O060M57o924L567
761i002M580o384l70P087m385n529Q522J824j1244L564J1018n644p566O236K335
776d958m025K779R39n182K679M751m784r37P152l786o484N823L369n127L856M318
792C83r530k314J1626l09j0114N240O379p365k021P113q65l204L334j817m498
$$ plain form
807 -7962 -2025 96 -5453 -2290 1788 -6480 -8473 2504 725 -9520 -3094 3439 -6611 -9887
821 -9887 1347 2048 -6294 -6495 -5290 -5061 -1281 -1486 -7423 -5487 -1452 -9413 -9347 2283 -1236 -14021
837 -14021 -8599 116 -7509 -10335 -514 -2295 -12766 -10729 -4830 -5425 -5418 -7065 -10224 -5760 -3349 -12318
853 -12318 -12333 498 -2583 -17113 -11115 1354 -6614 -14124 -4872 -3033 -11813 -10822 -5220 -5114 -6219
868 -6219 -7368 -10538 -6654 -2501 -8843 -8750 615 -4319 -16606 -6773 6623 -4152 -13514 -2903 850
883 850 -8407 -7686 294 30 -3398 -5146 -6551 -1121 3002 -4832 -6985 3074 1912 -8598 -1870
898 -1870 8223 -1561 -8540 2821 5856 -4084 -2906 5426 3062 -1504 26 1042 4217 5578 -1466
913 -1466 -3041 6403 6244 -3367 2233 12109 2232 -5699 5003 8481 664 1891 8249 3225 282
$$ packed form
807g962N937K121n549L163M078q268j993J0977j779j0245O426O533j0050l276
821i887J1234P01q342k01J205K29L780k05n937J936M035p961O6J1630l519j2785
837a4021N422Q715p625k826R821j781j0471K037N899n95Pj647l159M464K411q969
853a2318j5J2831l081j4530N998J2469p968p510R252J839q780R91N602J06j105
868f219j149l170L884M153o342R3R365m934j2287R833J3396j0775r362J0611L753
883H50r257P21P980k64l428j748j405N430M123p834k153J0059j162j0510O728
898a870J0093r784o979J1361L035r940J178Q332k364m566J530J016L175J361p044
913a466j575R444j59r611N600R876r877p931J0702L478p817J227O358n024k943
$$ plain form
928 282 4726 5187 3952 5613 2318 624 7628 7092 -1217 2932 11119 2612 -3075 6865 9006 -402
944 -402 1042 7609 3347 946 5534 3845 345 3985 3691 -238 3603 5514 10 1671 6018 -163
960 -163 -3423 5543 5573 -3586 311 6170 -664 -3204 3617 2833 -2189 914 1983 -2786 -109 3342
976 3342 -1649 -1960 2595 -1008 -3734 2234 1535 -4816 410 4988 -3303 -5218 4028 2298 -5202 -336
992 -336 3890 -2185 -2259 2713 715 -1135 1472 -526 -1517 4041 2960 -3132 1462 5943 -2155 -2178 8199
1009 8199 5166 -4495 1248 8061 2355 93 5808 4802 1402 3866 3878 3664 7332 5549 849 5672
1025 5672 10194 2541 2060 11812 8565 -471 6045 13104 5306 2374 9941 9848 4596 6304 8281 7772
1041 7772 9754 7677 3708 9395 13012 5430 4155 13884 10487 814 8051 15979 7879 3096 10208
$$ packed form
928B82M444M61j235J661l295j694P004n36q309M149Q187q507n687R940K141r408
944d02J444O567m262k401M588j689l500L640k94l929L841J911n504J661M347o181
960a63l260Q966L0r159L897N859o834k540O821p84n022L103J069m769K677L451
976C342m991l11M555l603k726N968o99o351N226M578q291j915R246j730p500M866
992c36M226o075p4M972j998j850K607j998r91N558j081o092M594M481q098k3J0377
1009H199l033r661N743O813n706k262N715j006l400K464J2k14L668j783m700M823
1025E672M522p653m81R752l247r036O516P059p798k932P567r3n252J708J977n09
1041G772J982k077l969N687L617p582j275R729l397r673P237P928q100m783P112
$$ plain form
1056 10208 10695 6279 8416 10808 7986 8196 7575 5059 10067 13180 5280 3570 12303 10678 1612
1071 1612 7579 14208 5563 2180 10204 10557 4062 6094 8759 5681 6546 7079 4629 7022 9471 3030
1087 3030 1627 9739 8332 -340 4943 10763 3108 -562 7518 7972 1973 3936 6435 3004 3117
1102 3117 5345 3062 3652 6973 2072 -21 6809 6608 -884 2351 8193 1986 -712 6532 5698 -779
1118 -779 2703 5915 1963 2472 5834 2567 1174 5427 3669 1299 6297 6247 -181 3207 8564 3131
1134 3131 528 7877 7365 1171 4648 8472 3980 3935 8067 5178 3578 7834 6504 3304 7675 8795
1150 8795 3755 5871 10578 6199 3777 10237 9066 3600 7749 11474 6335 5914 10733 8106 5437
1165 5437 10541 10227 5697 8327 10797 7080 7867 11732 7919 5934 11547 10685 5233 8768 12158 6471
$$ packed form
1056A0208M87m416K137K392k822K10o21k516N008L113p900j710Q733j625r066
1071A612N967O629q645l383Q024L53o495K032K665l078Q65N33k450K393K449o441
1087C030j403Q112j407q672N283N820p655l670Q080M54n999J963K499l431J13
1102C117K228k283N90L321m901k093O830k01p492L235N842o207k698P244q34o477
1118g79L482L212l952N09L362l267j393M253j758k370M998n0o428L388N357n433
1134C131k603P349n12o194L477L824m492m5M132k889j600M256j330l200M371J120
1150H795n040K116M707m379k422O460j171n466M149L725n139m21M819k627k669
1165E437N104l14m530K630K470l717P87L865l813j985N613q62n452L535L390n687
$$ plain form
1181 6471 6148 12005 9734 5404 9369 10698 6425 8794 10469 6400 6975 11014 8071 5695 10062
1196 10062 9497 4997 8425 11454 5489 5556 11185 8451 4182 9005 10355 4838 6703 10046 6502
1211 6502 5641 9382 6975 4203 8882 8810 3579 5784 9825 5281 4422 8987 6223 2598 7256 8987
1227 8987 3522 4821 8331 4534 3188 8018 6466 2756 6130 6989 2399 5344 8815 3332 1711
1242 1711 7090 5971 1843 5426 6704 2276 3852 7065 2963 1577 6803 4968 780 4681 6306
1257 6306 1943 2587 6827 3207 1522 6470 5025 850 4530 7153 2043 2511 6631 3971 2387
1272 2387 6764 5210 1160 5115 7426 2947 3036 7540 4568 2396 6835 6716 3105 5980 7873 3590
1288 3590 4734 9126 6297 3572 7409 7888 4451 7160 9306 4672 5511 9827 7298 4881 9330
$$ packed form
1181F471l23N857k271m330L965J329m273K369J675m069N75M039k943k376M367
1196A0062n65m500L428L029n965O7N629k734m269M823J350n517J865L343l544
1211F502q61L741k407k772M679p2n231K205M041m544q59M565k764l625M658J731
1227H987n465J299L510l797j346M830j552l710L374Q59m590K945L471n483j621
1242A711N379j119m128L583J278m428J576L213m102j386N226j835m188L901J625
1257F306m363O44M240l620j685M948j445m175L680K623n110M68M120k660j584
1272B387M377j554m050L955K311m479Q9M504k972k172M439j19l611K875J893m283
1288C590J144M392k829k725L837M79l437K709K146m634Q39M316k529k417M449
$$ plain form
1303 9330 9081 5018 7605 10096 5765 6639 11182 7841 4632 9676 10440 4764 6865 10853 7102 5567
1319 5567 9271 7663 5520 9175 8723 4578 6453 9891 6469 5000 8706 6608 3748 8017 7940 3119
1335 3119 5654 8704 3916 2005 7296 6335 2613 4956 5399 1948 3889 6473 1825 1153 6094 3640
1351 3640 -329 2932 4639 836 1672 4200 810 -439 4541 2300 -1807 2169 3832 -1013 -371
1366 -371 3619 910 -495 3018 1103 -2361 1700 3814 -598 -885 2584 325 -377 2629 1245 -1660
1382 -1660 2480 3254 -2077 117 4691 1196 -2047 1892 2649 -952 1827 3638 -250 400 3804 961
1398 961 -992 3432 3719 -13 2132 3197 -16 1886 6196 1616 -1431 3994 4727 537 1969 5119
1414 5119 1998 1338 4167 2060 1264 5285 4043 -1076 2282 5930 2325 1597 4692 2287 663 4465
$$ packed form
1303I330k49m063K587K491m331Q74M543l341l209N044P64n676K101L988l751j535
1319E567L704j608k143L655m52m145J875L438l422j469L706k098k860M269p7m821
1335C119K535L050m788j911N291r61l722K343M43l451J941K584m648o72M941k454
1351C640l969L261J707l803Q36K528l390j249M980k241m107L976J663m845O42
1366c71L990k709j405L513j915l464M061K114m412k87L469k259p02L006j384k905
1382a660M140P74n331K194M574l495l243L939P57l601K779J811l888O50L404k843
1398I61j953M424K87l732K145J065l213J902M310m580l047N425P33m190J432L150
1414E119l121o60K829k107p96M021j242n119L358L648l605p28L095k405j624L802
$$ plain form
1430 4465 4753 264 2843 5408 1955 943 4682 3932 1626 4319 2989 -129 3881 6316 997
1445 997 384 5804 3861 -832 2625 5160 1896 1983 3529 474 1211 5154 3037 -542 2280 3357
1461 3357 99 2138 4569 363 -905 3692 1941 -1609 2255 4279 -644 -1903 2302 1482 478
1476 478 2341 -136 -2296 1859 2146 -2137 -902 2874 -885 -3286 814 388 -2305 323 1233 -3173
1492 -3173 -2579 1554 -958 -3187 -45 -710 -3169 -777 -63 -3677 -1558 1426 -2946 -5231 753 891
1508 891 -3950 -2845 -402 -2580 -2323 443 -1933 -3310 -186 -1453 -4342 -643 1162 -2809 -2992 319
1524 319 -1787 -3105 1132 527 -3999 -1876 1422 -1680 -2752 -62 -435 -1402 260 -943 -3096 555
1540 555 1866 -2438 -2334 2243 398 -3180 305 1553 -1792 66 1862 -1310 -1658 2307 963 -1734
$$ packed form
1430D465K88m489K579K565l453j012L739p50k306K693j330l118M010K435n319
1445I97o13N420j943m693L457K535l264Q7J546l055P37L943k117l579K822J077
1461C357l258K039K431m206j268M597j751l550L864K024m923j259M205q20j004
1476D78J863k477k160M155K87m283J235L776l759k401M100m26k693K628R10m406
1492c173N94M133k512k229L142o65k459K392P14l614K119K984m372k285N984J38
1508H91m841J105K443k178K57K766k376j377L124j267k889L699J805l971j83L311
1524C19k106j318M237o05m526K123L298l102j072K690l73r67J662j203k153L651
1540E55J311m304J04M577j845l578L485J248l345J858J796l172l48L965j344k697
$$ plain form
1556 -1734 441 1588 -747 837 1521 -1749 -588 3301 669 -2620 1986 3214 -1500 -1306 2084
1571 2084 577 63 2476 446 -1268 1349 1562 -1535 -51 3045 249 -1374 1231 -143 -1647
1586 -1647 2392 2506 -2453 -1789 2911 79 -2048 969 684 -1480 -44 504 -1558 -68 1990 -2149
1602 -2149 -3014 1648 907 -2587 -1179 145 -2724 -1332 1430 -2042 -3326 161 -286 -4492 -2105 585
1618 585 -2377 -2867 -1073 -3427 -3659 -511 -1687 -4748 -2529 -1076 -4328 -3836 -581 -2846 -5152 -2172
1634 -2172 -2403 -5253 -2788 -798 -4773 -5523 -2297 -2464 -4185 -2687 -3428 -5530 -3272 -1929 -4753 -3747
1650 -3747 -602 -3962 -6204 -2030 -1240 -4725 -3237 -940 -4302 -4228 -689 -1308 -4204 -2231 -1487 -3032
1666 -3032 -1983 -912 -2694 -1538 531 -2964 -4287 1072 1269 -3925 -2594 1523 -594 -2462 504
$$ packed form
1556a734K175J147k335J584O84l270J161L889k632l289M606J228m714J94L390
1571B084j507n14K413k030j714K617K13l097J484L096k796j623K605j374j504
1586a647M039J14m959O64M700k832k127L017k85k164J436N48k062J490K058m139
1602b149q65M662p41l494J408J324k869J392K762l472j284L487m47m206K387K690
1618E85k962m90J794k354k32L148j176l061K219J453l252M92L255k265k306K980
1634b172k31k850K465J990l975p50L226j67j721J498p41k102K258J343k824J006
1650c747L145l360k242M174P90l485J488K297l362P4L539o19k896J973P44j545
1666c032J049J071j782J156K069l495j323N359J97n194J331M117k117j868K966
$$ plain form
1681 504 836 -1939 -564 112 -1275 78 1645 -1041 -1021 1414 -237 -1164 2596 1738 -3034 -1014 3527
1698 3527 114 -2233 1854 1732 -1861 -600 1338 268 199 773 -1242 -657 1724 -417 -2098 763
1714 763 770 -2882 -769 2438 -1260 -3606 893 952 -3176 -1881 893 -993 -2591 -1160 -1841 -1332 24
1731 24 -2521 -3854 -433 80 -4187 -2665 1216 -1919 -4891 -1239 -340 -3667 -2523 -329 -2591 -3571
1747 -3571 -2027 -1628 -2876 -1737 -2863 -3800 -736 -833 -4086 -2576 315 -2786 -4995 -502 408 -4066
1763 -4066 -3336 -806 -2053 -3043 -1160 -1639 -2879 -1654 -1509 -3110 -1211 -834 -3710 -2470 435 -2168
1779 -2168 -4250 -222 -33 -4164 -2699 967 -1352 -3437 -1161 -1021 -2568 -972 -621 -2159 -867 -508
1795 -508 -2683 -2034 747 -1285 -3015 334 321 -2913 -1374 1871 -1021 -2642 476 748 -1933 -453
$$ packed form
1681E04L32k775J375O76j387J353J567k686K0K435j651r27L760q58m772K020M541
1698C527l413k347M087j22l593J261J938j070o9N74k015N85K381k141j681K861
1714G63Pl652K113L207l698k346M499N9m128J295K774j886j598J431o81N09J356
1731B4k545j333L421N13m267J522L881l135k972L652Q99l327J144K194k262r80
1747c571J544L99j248J139j126r37L064r7l253J510K891l101k209M493R10m474
1763d066P30K530j247r90J883m79j240J225J45j601J899L77k876J240K905k603
1779b168k082M028J89m131J465L666k319k085K276J40j547J596L51j538J292L59
1795e08k175O49K781k032j730L349j3l234J539L245k892j621L118K72k681J480
$$ plain form
1811 -453 694 -850 -993 596 -753 -338 1624 -614 -2165 1155 1442 -1462 -56 2655 -668 -2069
1827 -2069 2176 2067 -856 573 2290 -241 -268 1914 1067 297 1575 316 -431 2000 2172 -944 243
1844 243 2898 254 -1049 2490 2187 -1313 191 2341 -118 -507 1833 1091 -824 514 186 -518
1860 -518 1272 1218 -1541 -423 1564 -1122 -1520 1581 1322 -2938 -1381 1590 -932 -2015 201 -314
1876 -314 -2021 -842 -903 -1884 -1217 -752 -2731 -1464 465 -2109 -3516 -182 -462 -3976 -1969 816 -2215
1893 -2215 -3664 -1148 -744 -2388 -1783 -1359 -2368 -1670 -1137 -2986 -2187 64 -2368 -3402 -232 -221 -3529
1910 -3529 -1930 1222 -1992 -3643 42 48 -2235 -1518 57 -1729 -1435 -404 -1645 -602 685 -1279
1926 -1279 -2032 605 949 -1888 -552 1892 -1019 -1895 1498 1035 -1590 -303 1174 -386 -311 1328
$$ packed form
1811d53J147j544j43J589j349M15J962k238j551L320K87k904J406K711l323j401
1827b069M245j09k923J429J717k531k7K182q47p70J278j259p47K431J72l116J187
1844B43K655k644j303L539l03l500J504K150k459l89K340p42j915J338l28p04
1860e18J790n4k759J118J987k686l98L101k59m260J557K971k522j083K216n15
1876c14j707J179o1r81O67M65j979J267J929k574j407L334k80l514K007K785l031
1893b215j449K516M04j644O05M24j009O98N33j849P99K251k432j034L170J1l308
1910c529J599L152l214j651L685Ok283P17J575j786K94J031j241J043J287j964
1926a279p53K637L44k837J336K444k911q76L393m63k625J287J477j560P5J639
$$ plain form
1942 1328 347 -416 1068 662 -572 1462 1971 -1496 96 2355 196 -1231 1840 1692 -818 684
1958 684 2091 82 -211 1775 782 -35 1230 906 -587 991 1443 -680 105 2408 138 -812 1581
1975 1581 1479 -1157 245 1670 -152 -764 1040 74 -599 1164 741 -1164 250 934 -1326 -565 1419
1992 1419 -975 -1954 396 439 -1599 -736 913 -1461 -1975 414 -91 -1863 -748 -637 -2131 -865 213
2009 213 -1848 -1620 -15 -1284 -2438 -538 -442 -2737 -1670 -102 -1939 -2650 -229 -1157 -2718 -1007
2025 -1007 -396 -2362 -1552 -503 -2096 -2077 -678 -1701 -2605 -443 -221 -2635 -1791 -223 -2114 -2626 -76
2042 -76 -1054 -2644 -1182 -65 -1811 -1584 125 -1301 -2178 -429 -659 -1649 -328 -143 -2034 -849 939
2059 939 -760 -1678 371 -130 -1415 -81 625 -974 -730 950 -454 -1216 974 455 -1199 262 1002
$$ packed form
1942A328r81p63J484m06j234K034N09l467J592K259k159j427L071j48k510J502
1958F84J407k009k93J986r93q17J265l24j493J578M52k123P85K303k270r50K393
1975A581j02k636J402J425j822o12J804r66o73J763m23j905J414O84k260P61J984
1992A419k394r79K350M3k038Q63J649k374n14K389n05j772J115J11j494J266J078
2009B13k061K28J605j269j154J900R6k295J067J568j837p11K421r28j561J711
2025a007O11j966Q10J049j593J9J399j023r04K162K22k414Q44J568j891n12K550
2042g6r78j590J462J117j746K27J709j426q77J749k30r90J321J85j891J185J788
2059I39j699r18K049n01j285J334P06j599K44J680j404p62K190n19j654J461P40
$$ plain form
2076 1002 -764 -319 1313 86 -640 1208 417 -976 383 1443 -395 -195 1226 173 -514 1397
2092 1397 1019 -887 673 1392 -676 -449 1446 521 -689 553 694 -700 490 1055 -700 -729 1268
2109 1268 -7 -1151 591 383 -1092 -127 757 -1251 -1088 713 -422 -1990 -204 130 -1398 -540
2125 -540 211 -1651 -1846 22 -902 -2056 -656 -231 -2341 -1428 5 -1476 -2006 -680 -1618 -2683 -1089
2142 -1089 -487 -2436 -1636 -446 -2101 -2441 -888 -1478 -2728 -1601 -1336 -3237 -1972 -296 -2065 -2949
2158 -2949 -969 -1151 -2673 -1297 -1271 -2315 -1991 -1073 -2427 -2518 -864 -1165 -2578 -1648 -1033 -2382 -1741 -475
2176 -475 -1930 -2646 -664 -978 -2927 -1193 -12 -2002 -1610 -697 -1365 -1907 -161 -807 -2214 -1083 -319
2193 -319 -1801 -1386 -41 -752 -1610 -105 -406 -1594 -312 279 -1787 -1710 421 -334 -1256 -356 -16 -1487
$$ packed form
2076A002j766M45J632j227p26J848p91j393J359J060j838K00J421j053o87J911
2092A397l78j906J560P19k068K27J895r25j210J242J41j394J190N65j755k9J997
2109A268j275j144J742k08j475R65Q84k008J63J801j135j568J786L34j528Q58
2125e40P51j862j95J868r24j154J400M25k110R13J433j481n30J326r38j065J594
2142a089O02j949Q00J190j655l40J553n90j250J127K65j901J265J676j769q84
2158b949J980j82j522J376K6j044L24R18j354r1J654l01j413R30O15j349O41J266
2176d75j455p16J982l14j949J734J181j990L92R13o68n42J746o46j407J131P64
2193c19j482M15J345p11q58J505l01j188J282N91k066P7K131p55r22R00L40j471
$$ plain form
2211 -1487 -858 187 -1212 -1036 740 -352 -1333 284 73 -990 -423 394 -1091 -1423 493 -430 -1463
2228 -1463 176 5 -1160 -993 158 -620 -814 -220 -969 -1367 180 -190 -1764 -1070 -47 -1158 -1606
2245 -1606 -392 -781 -2029 -731 -538 -2172 -1296 -296 -1386 -2406 -885 -1240 -1752 -633 -1025 -2773
2261 -2773 -1531 -802 -2232 -2501 -488 -948 -2842 -2170 -1246 -2109 -1731 -1248 -2255 -2608 -1323 -2085 -2841 -1489
2279 -1489 -1490 -2746 -2044 -1067 -2352 -2484 -1151 -1850 -3273 -1684 -951 -2503 -2957 -1573 -2088 -2274 -1460 -1981
2297 -1981 -2531 -1059 -1153 -2816 -2279 -787 -1799 -2573 -1062 -1547 -2933 -1555 -745 -1899 -1909 -751 -1429
2314 -1429 -2227 -1589 -1106 -1687 -1156 -1066 -2076 -1478 -174 -1317 -2098 -77 -404 -1733 -1253 -109 -1433 -1076
2332 -1076 -353 -796 -1399 -224 -786 -1700 -486 68 -1313 -768 354 -678 -1595 107 158 -1680 -685 379
$$ packed form
2211a487O29J045j399J76J776j092r81J617k11j063N67Q17j485l32J916r23j033
2228a463J639j71j165J67J151p78j94N94p49l98J547l70j574O94J023j111m48
2245a606J214l89j248J298J93j634Q76J000j090j020J521l55n12J119l92j748
2261b773J242P29j430k69K013m60j894O72R24q63L78M83j007l53J285p62p56J352
2279a489jj256P02R77j285j32J333o99j423J589P33j552m54J384n15j86Q14n21
2297a981n50J472r4j663N37J492j012p74J511m85j386J378Q10j154j0J158o78
2314a429p98O38M83n81N31R0j010N98J304j143p81K021l27j329M80J144j324L57
2332a076P23m43o03J175n62r14J214N54j381N45J122j032r17J702N1j838R95J064
$$ plain form
2350 379 -552 -1264 -235 10 -966 -255 -110 -1061 -726 176 -1322 -835 852 -276 -1516 -66 119 -1349
2368 -1349 -657 268 -871 -1360 -46 -161 -1260 -697 -847 -1353 -1162 -121 -1811 -1212 -307 -715 -2287 -1069
2386 -1069 -129 -1745 -1623 -402 -1278 -1695 -904 -1120 -1766 -1163 -861 -1939 -1562 -667 -1536 -1908 -943 -1683 -2355
2405 -2355 -1148 -843 -1981 -1976 -890 -1453 -2154 -1030 -1205 -2050 -1700 -1013 -2162 -1638 -965 -1913 -2200 -1033
2423 -1033 -1009 -1923 -1253 -804 -2120 -1665 -633 -1529 -2161 -674 -594 -2087 -1005 -614 -1380 -1501 -549 -1185 -1417
2442 -1417 -630 -527 -1773 -741 -381 -1121 -1321 -269 -730 -1219 -399 -174 -1354 -714 365 -1031 -1072 132
2460 132 -361 -916 -164 218 -953 -494 313 -627 -510 360 227 -585 180 361 -820 -175 529 -596 -646
2479 -646 309 95 -920 -153 185 -394 -591 331 -378 -398 425 -273 -1137 257 489 -1098 -696 472 8
$$ packed form
2350C79r31p12J029K45r76P11J45r51L35R02j498M87J687j128j240J450J85j468
2368a349O92R25j139m89J314j15j099N63j50n06J91J041j690N99R05m08j572J218
2386a069R40j616J22J221q76m17P91k16o46O03L02j078L77Q95q69l72R65p40o72
2405b355J207L05j138NJ086n63p01J124j75q45L50O87j149N24O73r48k87J167
2423a033K4r14O70M49j316M55J032q96o32J487Q0j493J082L91p66j21R52o36k32
2442a417P87J03j246J032L60p40k00J052m61m89Q20K25j180O40J079j396m1J204
2460A32m93n55P52L82j171M59Q07r40J17Q70j33q12P65J81j181O45P04j125n0
2479f46R55k14j015P67L38n79j97R22p09k0Q23o98q64J394K32j587M02J168m64
$$ plain form
2498 8 -830 182 26 -758 -336 208 -733 -206 183 -337 -672 101 -803 -1094 151 -272 -1328 -975 452
2517 452 -736 -1525 -220 -237 -1335 -1350 -183 -823 -795 -504 -1084 -806 -451 -772 -1739 -251 10 -1779 -1013
2536 -1013 12 -808 -2021 -561 -466 -1228 -1105 -319 -1111 -1244 -502 -838 -810 -464 -952 -1614 -153 -101 -1736
2555 -1736 -1353 410 -569 -1627 -573 -344 -1317 -1244 -282 -718 -1153 -315 -708 -831 -280 -390 -952 -407 45
2574 45 -1170 -563 740 -258 -1348 -165 694 -323 -506 370 -79 -638 181 -338 -675 -20 344 -322 -93
2593 -93 442 -407 -224 1126 394 -651 537 793 -120 151 859 651 -283 758 714 158 510 448 25 396
2613 396 1003 -109 -215 811 757 -128 771 1095 -199 199 976 562 -233 698 777 -229 170 945 80
2632 80 -101 994 -139 -102 878 597 -341 738 612 -463 146 806 131 -345 372 676 -492 -105 619
$$ packed form
2498Hq38J012j56p84M22N44r41N27L89n20l35P73r04k91J245m23j056L53J427
2517D52j188p89J305j7j098j5J167o40K8K91n80K78L55l21r67J488K61j789P66
2536a013J025q20j213J460R5p62J23P86p92j33P42l36K8L46m88o62J461N2j635
2555a736L83J763r79j058J054K29r73P3R62m36m35Q38l93j23N51j10n62N45M52
2574D5j215O07J303r98j090J183Q59j017j83Q76m49n59Q19n19l37O55L64o66K29
2593i3N35q49J83J350p32j045J188K56r13K71P08k08r34J041m4n56L52o2m23L71
2613C96O07j112j06J026n4q85Q99L24j294L98P77m14p95R31P9j006L99P75q65
2632H0j81J095j133L7R80k81r38J079j26j075O09O60o75m76P17L04j168L87P24
$$ plain form
2651 619 -519 -249 161 22 -458 -71 -4 -319 -146 382 -901 -626 123 -285 -776 283 171 -840 -527
2670 -527 208 -515 -832 -107 -116 -438 -51 219 -739 -173 116 -477 -462 416 -462 -940 478 523 -595 -268 246
2691 246 -371 -385 289 423 -470 -106 118 -264 -8 229 -405 -429 826 -62 -605 450 491 -193 -117 1167
2711 1167 400 -182 83 906 426 412 633 350 380 642 262 343 1044 271 -68 1146 1144 179 508 1506 693
2732 693 -97 965 1052 370 516 1052 696 476 839 478 383 1178 814 -62 795 1136 312 147 1297 680
2752 680 48 1154 1061 274 916 1010 287 333 1094 516 345 1252 778 64 542 963 -25 32 1166 435 19
2773 19 703 809 69 549 800 179 -62 554 157 -159 537 180 -138 401 527 -215 -25 581 57 -533
2793 -533 479 741 -599 -435 515 -67 -284 576 281 -141 338 622 -171 3 382 -393 -212 707 359
$$ packed form
2651F19j138K70M10j39m80L87O7l15J73N28j283K75P49m08m91J059j12j011L13
2670e27P35p23l17P25rl22L87K70r58N66K89n93J5Q78q78m78J418M5j118L27N14
2691B46o17j4O74J34q93L64K24l82K56K37o34k4J255q88n43J055M1o84P6J284
2711A167p67n82K65Q23m80j4K21k83L0K62l80Q1P01p73l39J214kr65L29R98q13
2732F93p90J062Q7o82J46N36l56k20L63l61r5P95l64q76Q57L41q24j65J150o17
2752F80o32J106r3p87O42R4p23M6P61n78j71R07m74p14M78M21r88N7J134p31m16
2773A9O84J06p40M80K51o21k41O16l97l16O96l57l18N39J26p42J90O06n24n90
2793e33J012K62j340J64R50n82k17Q60k95m22M79K84p93J74L79p75J81R19l48
$$ plain form
2812 359 -397 458 241 -625 1 550 -202 -698 609 216 -329 238 171 -290 -41 355 154 -321 698 633
2832 633 -397 176 582 -59 -258 716 19 -58 828 562 -8 582 810 135 277 649 504 250 806 311
2852 311 155 728 980 152 400 1179 498 86 935 1123 267 695 1135 268 517 1160 865 387 931 1160
2872 1160 499 865 1185 530 529 1097 877 220 1099 1123 376 729 862 626 551 1068 498 397 1417 923 191
2893 191 559 1278 564 201 960 458 27 728 987 56 532 814 281 235 924 409 223 790 326 -2
2913 -2 519 766 40 -127 409 425 -294 -99 453 -62 152 541 -64 6 451 141 -361 280 158 -345 -23
2934 -23 376 -203 -89 512 153 -158 359 74 -447 -2 477 -80 -115 316 36 -162 -114 466 -270 -209 497
2955 497 -6 -290 739 187 82 485 305 -26 91 663 296 85 618 236 33 535 464 -135 66 668
$$ packed form
2812C59p56Q55k17q66O26N49p52m96J307l93n45N67o7m61K49L96k01m75J019o5
2832F33j030N73M06o41j99R74o97p7Q86k66n70N90K28o75J42L72j45k54N56m95
2852C11j56N73K52q28K48P79o81m12Q49J88q56M28M40q67K49O43k95m78N44K29
2872A160o61L66L20o55jN68k20o57Q79K4p47L53J33k36p5N17n70j01J020m94p32
2893A91L68P19p14l63P59n02m31P01K59r31M76K82n33m6O89n15j86N67m64l28
2913bN21K47p26j67N36J6p19J95N52n15K14L89o05P0M45l10n02O41j22n03L22
2934b3L99n79J14O01l59l11N17k85n21M45M79n57l5M31k80j98M8N80p36O1P06
2955D97n03k84J029n52j05M03j80l31J17N72l67k11N33l82k03N02p1n99K01O02
$$ plain form
2975 668 504 -325 326 750 122 182 415 303 533 855 393 221 524 630 -297 241 942 191 112 749 400
2996 400 363 496 721 99 229 603 403 96 794 353 173 536 696 297 619 858 220 242 488 565 142
3017 142 589 805 383 332 687 103 13 785 349 -63 414 505 81 489 446 91 188 647 137 14 303 373
3039 373 136 26 555 170 -122 465 362 -353 113 388 -163 -37 56 215 -102 133 149 -457 170 516 -138
3060 -138 39 309 -178 -405 222 263 -358 -52 118 -379 -215 219 -32 -276 -8 207 -323 -21 -64 -207 -188
3081 -188 451 -153 -654 91 167 -283 -233 162 -266 -405 156 -76 -451 223 120 -222 -38 533 35 65 284
3102 284 124 -218 388 488 -270 6 660 -88 96 307 421 240 182 118 270 283 491 -170 -213 300 182
3123 182 -109 347 340 -98 79 653 229 133 530 436 165 469 426 230 465 246 82 242 824 272 -128 262
$$ packed form
2975F68j64q29O51M24o28O0K33j12K30L22m62j72L03J06r27N38P01p51p9O37l49
2996D00l7J33K25o22J30L74k00l07O98m41j80L63J60l99L22K39o38K2K46P7m23
3017A42M47K16m22n1L55n84r0P72m36m12M77R1m24M08m3l55R7M59n10j23K89P0
3039C73k37j10N29l85k92N87j03p15M66K75n51J26R3J59l17K35J6o06O27L46o54
3060a38J77K70m87k27O27M1o21L06J70m97J64M34k51k44K68K15n30L02m3j43J9
3081a88O39o04n01P45P6m50N0L95m28j39N61k32l75O74j03l42J84N71m98L0K19
3102B84j60l42O06J00p58K76O54p48J84K11J14j81n8o4J52J3K08o61m3N13j18
3123A82k91M56pm38J77N74m24r6L97r4k71L04m3j96K35k19j64J60N82n52m00L90
$$ plain form
3145 262 577 107 -17 298 280 -54 275 511 -346 1 467 168 64 621 -49 159 458 258 -78 284
3165 284 384 25 -255 311 198 -332 108 219 -113 282 274 -58 60 514 183 -267 500 102 182 -96 270
3186 270 -352 -327 -13 -122 -376 -356 230 -66 -26 -30 -700 -407 152 -133 -216 -58 96 -23 39 67 -214 -253 18
3209 18 -216 -291 409 9 -158 -336 72 -200 -162 -343 -58 -27 137 172 -299 -298 96 -278 -228 318 230 -332 76
3232 76 371 28 -77 344 36 -50 237 264 -93 25 148 -177 163 325 -30 -150 403 55 71 12 177 -109
3254 -109 171 491 -41 40 72 398 -34 206 412 283 -120 45 438 45 427 333 99 497 431 -67 400
3275 400 592 245 88 286 510 173 -189 278 189 48 25 13 80 395 215 -60 260 407 -5 230 408
3296 408 165 -142 194 69 -310 157 130 172 -208 54 7 -115 238 -347 -179 -164 54 -73 -275 277 207 -49
$$ packed form
3145B62L15m70j24L15j8l34L29K36q57L47M66k99j04N57o70K08K99k00l36L62
3165B84J00l59k80N66j13n30M40J11l32L95ql32J18M54l31m50P67l98Q0k78L66
3186B70o22K5L14j09k54K0N86k96M0mo70K93N59k85q3J58J54j19O2K8k81l9K71
3209A8k34p5P00m00j67j78M08k72L8j81K85L1J64L5m71JL94l74N0N46q8n62M08
3232G6K95l43j05M21l08q6K87K7l57J18J23l25L40J62l55j20N53l48J6n9J65k86
3254a09K80L20n32Q1L2L26m32K40K06j29m03J65L93l93L82r4k34L98o6m98M67
3275D00J92l47j57J98K24l37l62M67q9j41k3j2O7L15j80k75L20J47m12K35J78
3296D08k43l07L36j25l79M67k7M2l80K62m7j22L53n85J68J5K18j27k02N52p0k56
$$ plain form
3318 -49 150 283 26 -268 77 45 -392 89 226 -106 60 -86 -501 -19 486 -201 -41 413 67 -268 12
3339 12 183 -533 -156 2 -179 -68 275 -220 -123 98 180 63 -277 29 -137 -193 219 341 3 -74 -70 91
3361 91 -302 158 -6 -202 -83 -159 223 -67 100 -293 -223 140 -127 -91 -13 367 143 -95 464 60 -314 414
3383 414 250 127 336 104 54 284 409 -29 23 553 96 301 385 226 -30 -3 276 357 343 340 309 380 249
3406 249 700 2 544 543 25 -286 509 363 49 373 427 47 192 541 -8 -174 198 399 212 210 320 397
3428 397 289 86 415 329 606 394 -102 5 491 -109 25 -83 488 370 66 -155 37 302 79 131 -138
3449 -138 286 -308 200 -18 203 79 344 100 53 -76 143 -85 47 -95 -48 -286 -122 445 -215 -23 213
3470 213 68 21 -269 169 -120 -19 142 -364 -249 -107 58 -92 303 56 34 -130 125 -42 -103 15 158
$$ packed form
3318d9J99J33k57k94L45l2m37M81J37l32J66j46m15M82N05o87J60M54l46l35K80
3339A2J71p16L77J58j81J11L43m95R7K21Q2j17l40L06j66n6M12J22l38p7MJ61
3361I1l93M60j64j96J19p6L82k90J67l93P0L63k67L6P8L80k24k38N59m04l74P28
3383D14j64j23K09k32n0K30J25m38N2N30m57K05Q4j59k56K7K79Q1j4ll1P1j31
3406B49M51o98N42jn18l11P95j46l14L24N4l80J45L49n49j66L72K01j87kJ10P7
3428C97j08k03L29q6K77k12m96J07M86o00J34j08N71j18l04k21J92K65k23N2k69
3449a38M24n94N08k18K21j24K65k44m7j29K19k28J32j42M7k38J64N67o60J92K36
3470B13j45m7k90M38k89J01J61n06J15J42J65j50L95k47k2j64K55j67o1J18J43
$$ plain form
3491 158 -87 -45 179 -125 -35 343 97 -26 53 230 45 169 235 50 32 426 131 58 301 218 37 427
3513 427 648 -322 297 221 212 98 343 468 199 248 412 267 58 88 139 -285 354 286 127 91 52 -159 259
3536 259 373 159 88 376 205 86 431 481 119 144 362 332 -130 394 495 54 106 442 215 167 275 15
3558 15 161 455 161 128 26 14 313 -1 417 312 -115 139 24 128 -77 159 162 154 499 357 133 292
3580 292 356 195 207 281 55 67 382 155 -161 224 100 -429 -231 260 106 138 -19 10 -234 -578 313 -55
3602 -55 119 525 -81 153 171 5 115 93 78 -95 22 299 -201 -148 89 312 -119 158 35 49 -76 310
3624 310 -272 99 -104 154 50 6 208 -34 -31 195 43 -180 250 335 -407 101 -50 97 -66 -139 164 47
3646 47 543 160 126 185 -146 33 -99 121 142 -129 129 -4 34 409 144 233 106 -115 235 152 166 226 -37
$$ packed form
3491A58k45M2K24l04R0L78k46j23P9J77j85J24O6j85j8L94k95p3K43q3j81L90
3513D27K21r70O19p6rj14K45J25k69M9J64j45k09L0N1m24O39o8j59l6l9k11M18
3536B59J14k14p1K88j71j19L45N0l62K5K18l0m62N24J01m41N2L36k27m8J08k60
3558A5J46K94k94l3j02j2K99l14M18j05m27K54j15J04k05K36LqL45j42k24J59
3580B92O4j61J2P4k26J2L15k27l16L85j24n29J98M91j54L2j57K9k44l44Q91l68
3602e5J74M06o06K34J8j66J10k2j5j73J17K77n00N3K37K23m31K77j23J4j25L86
3624C10n82L71k03K58j04m4K02k42LK26j52k23M30Q5p42N08j51J47j63p3L03j17
3646D7M96l83l4N9l31J79j32K20K1k71K58j33L8L75k65Q9j27k21L50q3J4O0k63
$$ plain form
3669 -37 337 163 334 8 417 325 307 121 441 136 45 351 22 -35 493 254 64 306 351 307 -83 322
3691 322 -33 -157 222 177 -109 149 635 49 2 426 -145 153 52 86 -149 -271 259 55 -71 206 3
3712 3 299 260 91 135 -70 55 257 -172 -112 394 -107 -257 -56 -102 60 266 -372 -348 389 6 -357 154
3734 154 -13 -494 -69 305 -85 -62 157 41 -163 -67 -19 -131 -27 -255 -182 -38 1 -35 146 -164 82 83 19
3757 19 228 154 -357 3 196 -243 -177 79 -173 -167 229 -93 90 -62 33 -242 -106 59 13 -125 82 -151
3779 -151 -134 131 340 -69 199 -28 -317 -249 133 -21 -13 186 402 95 132 148 -16 178 48 362 -201 506
3801 506 288 -254 128 158 314 -21 401 414 -132 -133 -16 -93 98 -82 47 169 543 138 -81 156 220 76
3823 76 112 361 195 -211 351 370 -236 -235 211 -178 -81 393 8 107 13 228 -197 206 287 -115 -46 269 66
$$ packed form
3669c7L74j74J71l26M09r2j8j86L20l05r1L06l29n7N28k39j90K42M5m4l90M05
3691C22l55j24L79m5k86K58M86n86m7M24n71K98j01L4k35j22N30k04j26K77k03
3712CK96l9j69M4k05J25K02m29O0N06n01j50K01m6J62K06o38K4P37l83l63N11
3734A54j67m81M25L74l90K3K19j16k04R6M8j12J04k28P3J44L9l6J81l10K46Jo4
3757A9K09p4n11L60J93m39O6K56k52OL96l22J83j52R5k75J36J65m6j38K07k33
3779a51J7K65K09m09K68k27k89O8L82j54QJ99K16l07L7J6j64J94j30L14n63P07
3801E06k18n42L82L0J56l35M22J3n46jJ17p7J91j80J29J22L74m05k19K37O4j44
3823G6L6K49j66m06N62J9o06JM46l89R7M74l85R9r4K15m25M03Q1m02O9L15k03
$$ plain form
3846 66 266 15 -73 108 271 -177 -239 64 385 30 -617 -151 -22 47 -212 -49 -239 -138 242 33 -210
3867 -210 -258 -24 -269 -152 127 -284 -20 1 142 -504 156 63 -33 2 -258 -20 -145 323 166 -209 -229 314
3889 314 -107 -194 -217 147 -131 79 -157 -246 -207 123 -287 -28 95 -92 -284 47 240 -149 -189 -40 -249 -82
3911 -82 -3 96 -127 153 13 -400 222 -156 -69 -295 239 49 -323 28 434 -142 59 299 295 52 150 -81
3933 -81 -79 309 179 73 -148 160 -42 -34 563 -33 22 189 162 125 39 555 102 212 325 293 39 284 306 -56
3957 -56 63 521 61 42 210 111 127 51 172 78 -173 257 193 228 274 317 -130 193 -101 79 -175 11 241
3980 241 180 167 -199 54 162 348 -153 72 262 146 -16 349 2 36 461 -115 -142 105 -35 -197 -98 121
4002 121 43 -60 -331 339 -1 -222 -8 -356 -87 -331 -151 -42 -91 24 5 -158 72 -220 -476 241 -123
$$ packed form
3846F6K00k51q8J81J63m48o2L03L21l55o47M66J29O9k59J63j90J01L80k09k43
3867b10m8K34k45J17K79m11K64K1J41o46O60r3r6L5k60K38j25M68j57l75k0N43
3889C14m21q7k3L64k78K10k36q9L9L30m10K59J23j87j92L31J93l89m0J49k09J67
3911h2P9R9k23K80j40m13O22l78Q7k26N34j90l72L51M06n76K01K40mk43R8k31
3933h1KL88j30j06k21L08k02QN97n96N5J67k7l7q6N16m53J10J13l2k54K45K2l62
3957e6J19M58m60j9J68r9J6p6J21r4k51M30o4L5M6M3m47L23k94J80k54J86K30
3980B41o1j3l66K53J08J86n01K25J90j16j62L65l47L4M25n76k7K47j40j62R9K19
4002A21p8j03k71O70l40k21K14l48K69k44J80J09m9J15j9j63K30k92k56P17l64
$$ plain form
4023 -123 -155 -79 -173 75 -23 133 -12 -149 115 -34 -403 -229 106 -29 -233 346 38 -156 95 175 -156 295
4045 295 98 -32 11 149 163 -307 350 83 -46 232 200 90 2 431 661 66 469 12 -379 84 186
4066 186 96 319 328 230 -96 44 123 89 211 473 134 130 111 -47 -115 138 343 420 34 335 113 -105 341 590
4090 590 -347 143 -95 -214 -35 201 -7 -272 406 72 111 83 -94 120 218 325 -143 -227 209 197 -151 -115
4112 -115 157 -415 69 253 -230 -159 193 184 -73 -389 -81 25 -166 95 -160 -80 124 121 -217 -134 164 -357
4134 -357 -414 195 52 -301 169 -109 -251 -195 43 27 -265 82 155 -125 -44 -29 -464 167 287 -458 -111 23
4156 23 -50 8 71 96 -320 -17 -99 -11 -94 207 29 -271 -124 98 -406 85 109 -216 8 303 115 -327 71
4179 71 56 122 -129 128 37 59 26 2 -69 -57 371 -7 -33 251 -70 -244 471 312 82 243 85 376 -17
$$ packed form
4023a23l2P6r4K48r8J56j45j37K64j49l69J74L35j35k04N79l08j94K51Q0l31M51
4045B95j97j30M3J38J4m70O57k67j29K78l2j10q8M29K30n95M03m57l91M63J02
4066A86r0K23Rr8l26J40P9l4J22K62l39mj9j58o8K53K05P7l86L01k22k18M46K49
4090E90r37M90k38j19J79K36k08k65O78l34L9k8j77K14R8J07m68q4M36j2l48L6
4112a15K72n72M84J84m83P1L52rk57l16L08J06j91K61k55Q0K04ll38Q3K98n21
4134c57n7O09j43l53M70k78j42N6K38j6k92L47P3k80Q1J5m35O31J20p45L47J34
4156B3p3N8O3K5m16L03q2Q8q3L01j78l00J47K22n04M91K4l25K24K95j88m42L98
4179G1j5O6k51K57r1K2l3k4p1J2M28l78k6K84l21j74P15j59k30J61j58K91l93
$$ plain form
4202 -17 318 107 24 643 128 -140 317 202 -180 95 617 172 72 441 460 119 -68 342 160 -127 347
4223 347 -40 -18 463 52 107 441 357 2 264 571 234 -93 395 46 -49 109 -58 23 -292 211 372 -63
4245 -63 562 378 115 -28 -79 144 -391 99 148 -308 -97 -152 -50 131 455 -187 -235 49 3 49 -93 -294
4267 -294 -123 152 87 -432 -209 349 -205 -197 197 58 -283 -247 97 -375 -329 69 20 -198 63 111 -67 -262
4289 -262 34 -346 -198 85 21 127 15 83 -302 -168 -110 -279 -393 351 -118 -30 300 231 26 -220 383 9
4311 9 -200 134 28 38 210 112 128 371 240 -52 -93 537 36 76 365 287 222 38 416 -69 -155 400 -5
4334 -5 -106 263 324 -25 110 155 -140 138 343 293 -125 84 379 -85 -254 387 224 -274 105 214 146 30
4356 30 343 -345 -123 320 110 -51 280 47 -31 262 -127 10 -355 564 -113 115 238 60 30 -41 246
$$ packed form
4202a7L35k11q3O19n15k68M57j15l82K75N22m45j00L69J9l41j87M10j82k87M74
4223C47l87K2M81m11N5L34q4l55K62L07l37l27M88l49r5J58j67Q1l15N03J61m35
4245f3O25j84k63j43n1K23n35M90M9m56K11n5J02J81L24o42m8K84m6M6j42k01
4267b94J71K75o5n19K23N58n54QL94j39l41L6L44m72M6L98m9k18K61M8j78j95
4289b62K96l80J48K83o4J06j12O8l85J34N8j69j14P44m69Q8L30o9k05k46O03l74
4311Ik09L34j06J0J72r8J6K43j31k92m1O30n01M0K89p8o5j84L78m85q6N55m05
4334ej01L69O1l49J35M5k95K78K05n0m18K09K95m64j69O41j63m98L79J09o8j16
4356C0L13o88K22M43k10j61L31k33p8K93l89J37l65R19o77K28J23j78l0p1K87
$$ plain form
4377 246 -390 -230 -42 -73 -257 171 -36 -409 -306 269 -15 -545 -108 -228 -143 -24 -12 -168 -264 27 -125
4398 -125 -61 80 -45 -464 25 -24 -314 -140 249 -54 -362 -59 126 -402 -55 -99 -26 -183 -286 -77 -277
4419 -277 298 -182 -514 25 -255 -211 -116 143 -166 -289 -66 80 -177 -155 117 -239 -142 -55 -129 -294 -31 15
4441 15 -214 -3 -25 -127 -109 49 -7 -248 -8 -32 -226 76 199 -293 -112 296 -46 155 -204 89 -196 50
4463 50 -137 56 -80 -182 231 -232 201 65 -119 222 244 -37 -149 343 129 -74 54 276 -26 191 331
4484 331 -212 -6 281 252 -79 226 37 -153 -106 339 253 -40 309 235 66 -86 302 -99 -68 196 -305 -177
4506 -177 201 150 -90 153 178 -35 -183 140 221 -230 84 -19 -151 -457 -139 -298 -265 20 -326 -542 -407
4527 -407 -237 -337 -102 -127 -290 -346 25 -210 -454 -264 131 -566 -256 115 -495 -207 -128 -65 -344 -247 -212 -168
$$ packed form
4377B46o36J60J88l1j84M28k07l73J03N75k84n30M37j20Q5J19J2j56r6K91j52
4398a25O4J41j25m19M89m9k90J74L89l03l08L03J85n28L47m4P3j57j03K09k00
4419b77N75m80l32N39k80M4R5K59l09j23K23J46k57K2K72l56R7Q7p4j65K63M6
4441A5k29K11k2j02J8J58n6k41K40k4j94L02J23m92J81M08l42K01l59K93k85K46
4463E0j87J93j36j02M13m63M33j36j84L41K2k81j12M92k14k03J28K22l02K17J40
4484C31n43K06K87k9l31L05j89j90M7M45q6k93L49p4j69j52L88m01L1K64n01J28
4506a77L78n1k40K43K5k13j48L23Q1m51L14j03j32l06L18j59L3K85l46k16J35
4527d07J70j00K35k5j63n6L71k35k44J90L95o97L10L71o10K88P9O3k79R7L5M4
$$ plain form
4549 -168 -305 209 -311 -376 121 -315 -470 -320 -141 -530 -171 384 -112 -258 41 -175 -426 190 -128 -95 72
4570 72 11 -434 -372 368 -463 -154 75 147 292 49 338 24 -130 26 291 -103 163 206 -280 232 310 80
4592 80 -266 424 300 195 35 7 -54 -290 376 62 119 345 -246 -282 179 333 -319 -131 160 -79 44 297
4614 297 12 -158 64 254 -88 77 77 108 -513 143 -236 -252 112 -48 -153 -168 103 -224 -24 365 -35 -180
4636 -180 -179 449 -339 -24 18 -238 -370 141 150 -407 2 228 -206 -226 337 -195 -263 142 -276 -579 -200 -179 -272
4659 -272 -465 33 -213 -291 -166 -241 -153 -104 -306 -254 -299 -235 -266 -303 -19 -13 -342 -442 30 -314 -328 -177 85 -95
4683 -95 -195 4 -107 -31 -36 -75 -294 1 -162 -234 429 -140 -202 -202 -86 -249 -366 -70 -58 -441 -132 16 -94
4706 -94 61 81 -221 50 45 -129 212 120 -101 -543 -233 266 171 -276 234 99 -52 44 224 100 -32 251
$$ packed form
4549a68j37N14n20o5M97m36j55J50J79l89L59N55m96j46K99k16k51O16l18L3J67
4570G2o1m45O2P40q31L09K29P2J45k43K89l14j54J56K65l94K66M3m86N12P8k30
4592H0l46O90j24j05j60k8o1k36O66l14N7K26n91l6M61J54o52J88K91k39J23K53
4614B97k85j70K22J90l42J65%L1o21O56l79j6L64j60j05j5K71l27K00L89m00j45
4636a80JO28p88L15M2k56j32N11Rn57M09K26m34k0N63n32o8M05m18l03L79K1r3
4659b72j93M98k46p8J25p5Q8M9k02N2m5O4l1l7K84Ol29j00M72l44j4J51K62j80
4683i5j00J99j11P6nl9k19K95j63p2O63n69o2%J16j63j17K96J2l83L09J48j10
4706i4J55K0l02K71nj74L41r2k21m42L10M99r5m47N10j35j51R6J80j24j32K83
$$ plain form
4728 251 56 -52 211 118 -150 -19 107 -74 -183 258 1 -154 134 14 -141 -93 186 -108 177 128 -9
4749 -9 -331 110 128 130 -55 85 -32 54 304 392 -188 54 469 -169 -212 255 -90 99 199 -107 -285 -158 -120
4772 -120 -354 45 265 -302 -284 68 -210 -53 176 0 -284 -297 119 -255 -211 -16 -278 -288 -328 -109 -123 -248
4794 -248 -64 -365 -145 8 56 -448 -160 -371 -65 93 45 16 -79 51 -217 -543 -388 186 -188 -188 216 -182
4816 -182 76 -48 -333 -256 -123 -6 -341 -54 36 -168 -183 -14 38 -33 -211 161 -430 92 111 -18 -358 -69
4838 -69 -171 -214 469 164 76 -122 233 -366 -132 122 38 -393 102 170 -305 -17 201 287 106 345 372 19
4860 19 372 71 -55 95 220 -41 108 579 254 7 335 293 182 -58 206 135 -279 -124 399 64 142
4881 142 137 -77 89 416 100 89 639 442 -508 87 526 26 97 515 122 -144 -339 259 68 -226 3
$$ packed form
4728B51j95j08K63r3k68J31J26j81j09M41k57j55K88j20j55M8K79k94K85m9j37
4749il22M41J8Kj85J40j17Q6K50Q8n80K42M15o38m3M67l45J89J00l06j78J27L8
4772a20k34L99K20n67J8L52k78J57K29j76k84j3M16l74M4J95k62j0m0K19j4j25
4794b48J84l01K20J53M8n04K88k11L06J58m8k9r5J30k68l26J55N74l74%M04l98
4816a82K58j24k85P7J33J17l35K87R0k04j5J69N2p1j78L72n91N22J9j29l40K89
4838f9j02m3O83l05q8j98L55n99K34K54q4m31M95O8m75K88K18Q6j81K39K7l53
4860A9L53l01j26J50J25k61J49M71l25k47L28m2j11k40K64p1m14J55N23l35P8
4881A42nk14J66L27l16j1N50j97r50N95M39n00P1M18l93k66j95N98j91k94K29
$$ plain form
4902 3 -180 35 231 -201 -132 178 5 -122 26 -94 -282 -229 167 -124 -331 -391 56 -159 -73 16 -87 14
4924 14 -43 20 -423 118 -153 -563 78 50 -135 -472 99 104 -74 -350 -133 -218 -21 -2 -426 -56 -38 -247 -315
4947 -315 -99 25 -27 -27 170 -155 -200 -80 -12 -219 -16 -54 70 -140 138 -64 -64 128 210 -34 -3 589 -165
4970 -165 93 333 -67 -163 196 -4 -186 23 227 216 332 245 -49 25 478 194 -175 -192 273 23 -85 3
4992 3 -98 -107 422 686 -197 60 215 184 131 258 -285 196 29 499 -139 -65 432 105 -136 32 419 40
5014 40 408 182 169 -47 266 6 -126 283 126 -16 136 527 -235 16 115 76 15 451 541 -60 164 70
5036 70 -156 26 203 72 -57 102 -275 -360 180 221 -243 -89 103 -292 -191 241 -42 -342 -45 -54 -218 -72
5058 -72 -56 53 -172 -37 15 -197 -27 -10 -435 -299 131 28 -110 120 -165 -495 95 187 -104 -340 256 -155
$$ packed form
4902Cj83K15J96m32O9L10j73j27J48j20j88N3L96k91k07o0M47k15Q6Q9j03J01
4924A4n7O3m43N41k71m10O41k8j85l37N71Nj78k76K17q5J97J9m24L70J8k09o8
4947c15K16J24n2%J97l25m5J20O8k07K03l8J24k10K78k02%J92Q2k44L1N92p54
4970a65K58K40m00r6L59k00j82K09K04j1J16q7k94P4M53k84l69j7M65k50j08Q8
4992Cj01rN29K64q83K57J55l1n3J27n43M81j67M70o38P4M97l27k41J68L87l79
5014D0L68k26j3k16L13k60j32M09j57j42J52L91p62K51R9l9o1M36R0o01K24r4
5036G0k26J82J77j31j29J59l77q5N40M1m64J54J92l95J01M32k83l00K97rj64J46
5058g2J6J09k25J35N2k12J70J7m25J36M30j03j38K30k85l30N90R2k91k36N96m11
$$ plain form
5080 -155 -324 86 123 -284 -54 -472 -115 -171 264 -139 -257 114 128 -273 -56 259 -211 -87 -11 -242 -415
5101 -415 294 290 -108 32 250 129 65 249 378 -118 122 261 -45 15 14 -133 -37 560 222 42 183 452
5123 452 110 189 199 -66 61 89 -35 -92 35 134 -33 121 131 -91 53 64 260 6 30 277 -185 -17 355
5146 355 -18 127 238 284 45 310 229 39 59 255 24 -108 55 172 -174 -127 250 -365 -162 276 173
5167 173 247 94 -10 -111 -166 49 -173 8 54 336 -224 94 -145 -322 -58 -141 -1 25 176 -18 -501 -313
5189 -313 -234 -110 16 -32 -252 -225 -31 -187 -579 2 -7 -305 -57 69 -223 -376 -133 -354 -522 -73 46 -9
5211 -9 -152 51 -319 -101 97 -4 -576 -423 -196 -132 100 253 -108 -165 -206 -235 -643 -30 30 -45 -182 208 84
$$ packed form
5080a55j69M10L7m07K30m18L57n6M35m03j18L71J4m01K17L15m70J24P6k31j73
5101d15P09ml98J40K18j21o4J84J29m96K40J39l06O0jj47R6N97l38j80J41K69
5123D52l42P9J0k65J27K8j24n7J27R9j67J54J0k22J44J1J96k54K4K47m62J68L72
5146C55l73J45J11M6k39K65q1j90K0J96k31j32J63J17l46M7L77o15K03M38j03
5167A73P4j53j04j01n5K15k22J81M6K82n60L18k39j77K64q3J40K6J51j94m83J88
5189c13P9J24J26m8k20K7J94j56l92N81rk98K48J26k92j53K43k21j68M49J19n5
5211ij43K03l70K18J98j01n72J53K27O4K32J53l61n7m1k9m08O13O0p5j37L90j24
$$ [...]
8191G5
##END NTUPLES=NMR FID
##END=
