##TITLE=1H_CA-8579-3
 CDCl3, 8 sc, 
 4.4.2019
##JCAMPDX= 6.0         $$ Bruker NMR JCAMP-DX V2.0
##DATA TYPE= NMR FID
##DATA CLASS= NTUPLES
##ORIGIN= UXNMR, Bruker Analytische Messtechnik GmbH
##OWNER= root
$$ XWIN-NMR		Version 3.5
$$ Thu Apr  4 14:10:24 2019 Russian Standard Time (UT+4h)  she@DPX200
##.OBSERVE FREQUENCY= 200.1316
##.OBSERVE NUCLEUS= ^1H
##.DELAY= (6, 6)
##.ACQUISITION MODE= SIMULTANEOUS
##.ACQUISITION SCHEME= undefined
##.AVERAGES= 8
##.DIGITISER RES= 18
##SPECTROMETER/DATA SYSTEM= spect
##.PULSE SEQUENCE= zg30
##.SOLVENT NAME= CDCl3
##.SHIFT REFERENCE= (INTERNAL, CDCl3, 0, 15.7039)
##AUDIT TRAIL= $$ (NUMBER, WHEN, WHO, WHERE, WHAT)
$$ ##TITLE= Audit trail, XWIN-NMR		Version 3.5
$$ ##JCAMPDX= 5.01
$$ ##ORIGIN= Bruker BioSpin GmbH
$$ ##OWNER= she
$$ F:/spectra/data/she/nmr/H-F/1/audita.txt
$$ ##AUDIT TRAIL=  $$ (NUMBER, WHEN, WHO, WHERE, WHAT)
(   1,<2019-04-04 14:09:15.17 +0400>,<she>,<DPX200>,
      <created by zg, POWCHK disabled, PULCHK disabled
       configuration hash MD5:
       00 E9 B6 7A A2 85 ED C7 34 08 36 98 17 FE 4E 26
       data hash MD5: 16K
       80 53 00 51 A2 40 D8 1B 20 B9 38 2C 41 1C 78 B6>)
$$ ##END=
$$ 
$$ hash MD5
$$ 48 91 0C 21 F6 C9 44 5C 74 63 65 72 65 FB 03 3F
##$RELAX= 
##$RELAX= 
##$RELAX= 
##$RELAX= 
##$RELAX= 
##$RELAX= 
$$ Bruker specific parameters
$$ --------------------------
##$DU= <F:/spectra>
##$EXPNO= 1
##$NAME= <H-F>
##$PROCNO= 1
##$TYPE= <nmr>
##$USER= <she>
##$AMP= (0..31)
100 100 100 100 100 100 100 100 100 100 100 100 100 100 100 100 100 100 
100 100 100 100 100 100 100 100 100 100 100 100 100 100 
##$AQSEQ= 0
##$AQ_mod= 1
##$AUNM= <au_zg>
##$AUTOPOS= <>
##$BF1= 200.13
##$BF2= 200.13
##$BF3= 200.13
##$BF4= 200.13
##$BF5= 200.13
##$BF6= 200.13
##$BF7= 200.13
##$BF8= 200.13
##$BYTORDA= 1
##$CFDGTYP= 0
##$CFRGTYP= 5
##$CHEMSTR= <none>
##$CNST= (0..31)
1 1 145 1 1 1 1 1 1 1 1 1 1 1 1 1 1 1 1 1 1 1 1 1 1 1 1 1 1 1 1 1 
##$CPDPRG= <>
##$CPDPRG1= <>
##$CPDPRG2= <>
##$CPDPRG3= <>
##$CPDPRG4= <mlev>
##$CPDPRG5= <mlev>
##$CPDPRG6= <mlev>
##$CPDPRG7= <mlev>
##$CPDPRG8= <mlev>
##$CPDPRGB= <>
##$CPDPRGT= <>
##$D= (0..31)
0 1.2 0 0 0 0 0 0 0 0 0 0.03 0 0 0 0 0 0 0 0 0 0 0 0 0 0 0 0 0 0 0 0 
##$DATE= 1554372554
##$DBL= (0..7)
120 120 120 120 120 120 120 120 
##$DBP= (0..7)
150 150 150 150 150 150 150 150 
##$DBP07= 0
##$DBPNAM0= <>
##$DBPNAM1= <>
##$DBPNAM2= <>
##$DBPNAM3= <>
##$DBPNAM4= <>
##$DBPNAM5= <>
##$DBPNAM6= <>
##$DBPNAM7= <>
##$DBPOAL= (0..7)
0.5 0.5 0.5 0.5 0.5 0.5 0.5 0.5 
##$DBPOFFS= (0..7)
0 0 0 0 0 0 0 0 
##$DE= 6
##$DECBNUC= <off>
##$DECIM= 24
##$DECNUC= <off>
##$DECSTAT= 4
##$DIGMOD= 1
##$DIGTYP= 9
##$DL= (0..7)
0 120 120 120 120 120 120 120 
##$DP= (0..7)
150 150 150 150 150 150 150 150 
##$DP07= 0
##$DPNAME0= <>
##$DPNAME1= <>
##$DPNAME2= <>
##$DPNAME3= <>
##$DPNAME4= <>
##$DPNAME5= <>
##$DPNAME6= <>
##$DPNAME7= <>
##$DPOAL= (0..7)
0.5 0.5 0.5 0.5 0.5 0.5 0.5 0.5 
##$DPOFFS= (0..7)
0 0 0 0 0 0 0 0 
##$DQDMODE= 0
##$DR= 18
##$DS= 0
##$DSLIST= <SSSSSSSSSSSSSSS>
##$DSPFIRM= 0
$$ [...]
##$SUBNAM2= <"">
##$SUBNAM3= <"">
##$SUBNAM4= <"">
##$SUBNAM5= <"">
##$SUBNAM6= <"">
##$SUBNAM7= <"">
##$SUBNAM8= <"">
##$SUBNAM9= <"">
##$SW= 24.9336934301222
##$SWIBOX= (0..15)
0 0 2 0 0 0 0 0 0 0 0 0 0 0 0 0 
##$SW_h= 4990.01996007984
##$TD= 16384
##$TD0= 1
##$TE= 0
##$TE2= 300
##$TE3= 300
##$TEG= 300
##$TL= (0..7)
0 120 120 120 120 120 120 120 
##$TP= (0..7)
150 150 150 150 150 150 150 150 
##$TP07= 0
##$TPNAME0= <>
##$TPNAME1= <>
##$TPNAME2= <>
##$TPNAME3= <>
##$TPNAME4= <>
##$TPNAME5= <>
##$TPNAME6= <>
##$TPNAME7= <>
##$TPOAL= (0..7)
0.5 0.5 0.5 0.5 0.5 0.5 0.5 0.5 
##$TPOFFS= (0..7)
0 0 0 0 0 0 0 0 
##$TUNHIN= 0
##$TUNHOUT= 0
##$TUNXOUT= 0
##$USERA1= <user>
##$USERA2= <user>
##$USERA3= <user>
##$USERA4= <user>
##$USERA5= <user>
##$V9= 5
##$VALIST= <valist>
##$VCLIST= <CCCCCCCCCCCCCCC>
##$VD= 0
##$VDLIST= <DDDDDDDDDDDDDDD>
##$VPLIST= <PPPPPPPPPPPPPPP>
##$VTLIST= <TTTTTTTTTTTTTTT>
##$WBST= 1024
##$WBSW= 4
##$XGAIN= (0..3)
0 0 0 0 
##$XL= 0
##$YL= 0
##$YMAX_a= 585118
##$YMIN_a= -704571
##$ZGOPTNS= <>
##$ZL1= 120
##$ZL2= 120
##$ZL3= 120
##$ZL4= 120
##$ABSF1= 10
##$ABSF2= 0
##$ABSG= 5
##$ABSL= 3
##$ALPHA= 0
##$AQORDER= 0
##$ASSFAC= 0
##$ASSFACI= 0
##$ASSFACX= 0
##$ASSWID= 0
##$AUNMP= <proc_1d>
##$AZFE= 0.1
##$AZFW= 0.1
##$BCFW= 1
##$BC_mod= 2
##$BYTORDP= 1
##$COROFFS= 0
##$CY= 11.3945322036743
##$DATMOD= 1
##$DC= 2
##$DFILT= <>
##$DTYPP= 0
##$F1P= 18.9103706918063
##$F2P= -1.10871071338519
##$FCOR= 0.5
##$FTSIZE= 0
##$FT_mod= 4
##$GAMMA= 1
##$GB= 0.15
##$INTBC= 1
##$INTSCL= 1
##$ISEN= 128
##$LB= 0.24
##$LEV0= 0
##$LPBIN= 0
##$MAXI= 10000
##$MC2= 0
##$MEAN= 0
##$ME_mod= 0
##$MI= 1.114404
##$NCOEF= 0
##$NC_proc= 0
##$NLEV= 6
##$NOISF1= 3.799351
##$NOISF2= 2.8
##$NSP= 1
##$NTH_PI= 0
##$NZP= 0
##$OFFSET= 15.70392
##$PC= 1
##$PHC0= -8858.96
##$PHC1= 22.40025
##$PH_mod= 1
##$PKNL= yes
##$PPARMOD= 0
##$PSCAL= 0
##$PSIGN= 0
##$REVERSE= no
##$SF= 200.130013532006
##$SI= 16384
##$SIGF1= 3
##$SIGF2= 2
##$SINO= 400
##$SIOLD= 16384
##$SREGLST= <1H.CDCl3>
##$SSB= 0
##$STSI= 0
##$STSR= 0
##$SW_p= 3612.71676300578
##$SYMM= 0
##$S_DEV= 0
##$TDeff= 0
##$TDoff= 0
##$TI= <>
##$TILT= no
##$TM1= 0
##$TM2= 0
##$TOPLEV= 0
##$USERP1= <user>
##$USERP2= <user>
##$USERP3= <user>
##$USERP4= <user>
##$USERP5= <user>
##$WDW= 1
##$XDIM= 8192
##$YMAX_p= 0
##$YMIN_p= 0
$$ End of Bruker specific parameters
$$ ---------------------------------
##NTUPLES= NMR FID
##VAR_NAME=  TIME,          FID/REAL,        FID/IMAG
##SYMBOL=    X,             R,               I
##VAR_TYPE=  INDEPENDENT,   DEPENDENT,       DEPENDENT
##VAR_FORM=  AFFN,          ASDF,            ASDF
##VAR_DIM=   8192,          8192,            8192
##UNITS=     SECONDS,       ARBITRARY UNITS, ARBITRARY UNITS
##FACTOR=    0.0002004,     1,               1
##FIRST=     0,             0,               0
##LAST=      1.6414764,     0,               0
##MIN=       0,             -704571,         0
##MAX=       1.6414764,     585118,          0
$$ Real data points
##PAGE= N=1
##DATA TABLE= (X++(R..R)), XYDATA
0@%%%qJ6j6J6k4M0n1N9p3R7j28J52j77K18k65L12l69M36n08N88o80P86r04J031
$$ 0 0 0 0 -8 8 -8 8 -16 24 -27 32 -41 56 -72 80 -97 121 -144 168 -201 235 -273 315 -365 421 -483 548
27E48j170J332j511J700j913K151k409K692l002L343l716M124m573N069n616O216
$$ 548 -622 710 -801 899 -1014 1137 -1272 1420 -1582 1761 -1955 2169 -2404 2665 -2951 3265
43C265o880P622q449R376j0428J1630j3017J4637j6557J8885k1779K5472l0382
$$ 3265 -3615 4007 -4442 4934 -5494 6136 -6881 7756 -8801 10084 -11695 13777 -16605
56a6605L7288m7773O5767j04866L27323l16370o38453P47381M55053m83660m49184
$$ -16605 20683 -27090 38677 -66189 261134 -55236 -693689 53692 508745 25085 -424099
67d24099M84901L13909m81960l65611N86254M27888n59713n43686M68446N12804
$$ -424099 60802 374711 -107249 -472860 113394 541282 -18431 -562117 -93671 419133
77D19133k96140m04942K08231K37935j93926j59559K73508J77001l12340k59714
$$ 419133 122993 -281949 -73718 164217 -29709 -189268 84240 261241 -51099 -310813
87c10813K88210K81022j88239j94580J18151K9743j18052R9292J97596j21730
$$ -310813 -22603 258419 70180 -124400 -6249 23494 -94558 4734 202330 80600
97H0600k77023L9837K97295M5714k49397n4420J87409m2981j85491J56757K48484
$$ 80600 -196423 -156586 140709 186423 -62974 -117394 70015 27034 -158457 -1700 246784
108B46784j98965l25362J28730L45282o487k89088p4628J97742N4049j46455L7307
$$ 246784 47819 -277543 -148813 196469 189982 -99106 -173734 24008 78057 -68398 -31091
119c1091J74825r9455k30531P8236K48432K0214j77544j14809N2103J31096N3756
$$ -31091 143734 44279 -186252 -108016 140416 160630 -16914 -131723 -79620 51476 105232
130A05232n7015p1300l2523J6958O4121K5624k0904O730n3719j27263P6402K55688
$$ 105232 48217 -23083 -55606 -38648 25473 51097 30193 36923 -16796 -144059 -67657 188031
142A88031k1190l09494p7378K59208J37852j72212j26991J37367O7593j99350
$$ 188031 166841 -142653 -220031 39177 177029 4817 -122174 15193 82786 -116564
152a16564k9115L21507N9745m05050j38804L92722K07408k93798k05378K06737
$$ -116564 -145679 175828 235573 -169477 -308281 84441 291849 -1949 -207327 -590
162e90J46888k03056q6057K90771Q6437l98087j48610M35105K21865l75353k40441
$$ -590 146298 -56758 -142815 147956 234393 -163694 -312304 122801 344666 -30687 -271128
173b71128K70463J83686k18045j09756K53948P8635l51826j25654M22634K10070
$$ -271128 -665 183021 -35024 -144780 109168 187803 -164023 -289677 132957 343027
183C43027m09258k60267L20570K27741k34807j41287K19963P8616k74442q8113
$$ 343027 -66231 -326498 -5928 221813 -12994 -154281 65682 144298 -130144 -218257
193b18257L48114J66869l62682k38549L02604K39278k11900j55206J64887N7208
$$ -218257 129857 296726 -65956 -304505 -1901 237377 25477 -129729 35158 92366
203I2366j86457j6808K45668N9579k83090j41513K53723J75402j85294j25186
$$ 92366 -94091 -110899 134769 194348 -88742 -230255 23468 198870 13576 -111610
213a11610J33772J7821j45177N8460K00326n5179k50227k1170K48131R5148j97013
$$ -111610 22162 39983 -105194 -46734 153592 98413 -151814 -172984 75147 170295 -26718
224b6718r7931J48050K9716j46347N2569J98711p2356k51190J4570K59116Q1615
$$ -26718 -124649 23401 53117 -93230 -40661 158050 85694 -165496 -150926 108190 189805
235A89805k04089j37845J32161J19143r7388n2793J22671Q039j72242l4730J81731
$$ 189805 -14284 -152129 -19968 99175 1787 -51006 71665 79704 -92538 -127268 54463
246E4463J11319j26354j83422K3753J90788N4712j35174o7294O5912K2825m4420
$$ 54463 165782 39428 -143994 -120241 70547 125259 -9915 -77209 -11297 11528 -32892
257c2892J0396P9856J8719j31046j09392J45009K11965r2323k50924J1396K12272
$$ -32892 -22496 57360 76079 -54967 -164359 -19350 192615 100292 -150632 -139236 73036
268G3036M4598j39068m1356J07995M777j46753J7702K31385J1942k88487q0912
$$ 73036 117634 -21434 -62790 45205 49982 -96771 -79069 152316 164258 -124229 -205141
279b05141K64301J34397j80356j37075R8044Q9602q2722m2670J34587L4979k05354
$$ -205141 59160 193557 13201 -123874 -25830 63772 -18950 -61620 72967 107946 -97408
290i7408p4700K22401J17208j70580j15675Q9119O1410m4694J1243P5064m4652
$$ -97408 -172108 50293 167501 -3079 -118754 -29635 31775 -12919 -1676 73388 28736
301B8736j47790K5183K09363K3408k09521m3349J61917Q947j15860O0322J23172
$$ 28736 -119054 -93871 115492 138900 -70621 -113970 47947 56894 -58966 1356 124528
312A24528j06512j82399R1466K51011l0282k82161l2455K55262L8692k09214P729
$$ 124528 18016 -164383 -72917 178094 147812 -134349 -166804 88458 127150 -82064 -74335
323g4335J87989o2104k14615O5856K61886r895k87317p2335K64026J17745k07101
$$ -74335 113654 51550 -163065 -97209 164677 154782 -132535 -204870 59156 176901 -30200
334c0200r3546J66321L2266j62543J1610J89978Q796k06982p4684J84996J35627
$$ -30200 -123746 42575 74841 -87702 -76092 113886 122682 -84300 -158984 26012 161639
345A61639j26396j35726P3283P6917o1481o141Q7891k1975j19861j4115J12395
$$ 161639 35243 -100483 -27200 49717 -11764 -17905 69986 48011 -71850 -85965 26430
356B6430P1479o5788j00309R053O8200R588j436J9499m7549p0349M0274R1811
$$ 26430 97909 32121 -68188 -59135 9065 18653 17217 36716 -10833 -81182 -40908 50903
368E0903J1050n9288n8360j75O4617M3759k2640l0259k2616k2150L2979O5358
$$ 50903 61953 2665 -55695 -55870 8747 52506 29866 -393 -23009 -45159 -12180 53178
380E3178M012n4432n4946n973Q0135P4915o1344j01340J8995O7218J454j5571
$$ 53178 57190 2758 -52188 -58161 21974 96889 35545 -65795 -46800 20418 21872 6301
392F301J4158n750n4969l4021P9156J08185o7337j63550K6206J58446O776j06386
$$ 6301 20459 14709 -40260 -74281 4875 113060 45723 -117827 -91621 66825 73601 -32785
404c2785l193N7075k7778n4338N7823J06271n0443j65836J3244J87581K7089j51813
$$ -32785 -35978 21097 -6681 -61019 -3196 103075 52632 -113204 -99960 87621 114710 -37103
416c7103l1551R2515k321n7930M5506P5659n9870j26710L1401J62744J1118j57622
$$ -37103 -68654 23861 21540 -36390 9116 84775 24905 -101805 -70404 92340 103458 -54164
428e4164l0401J12477K71p2238N3691O9875r1265j08020P9572J51876l2182j67428
$$ -54164 -84565 27912 28183 -44055 9636 79511 -11754 -119774 -40202 111674 79492 -87936
440h7936q900J46018Q147j10426L8502J00346q6163j21766R5625J60336n2464
$$ -87936 -96836 49182 57329 -53097 -14595 85751 -412 -122178 -26553 133783 81319
451H1319j79287q302J66066M1691j31301k3585J08565k5218j16339N4582J41337
$$ 81319 -97968 -106270 59796 101487 -29814 -53399 55166 29948 -86391 -31809 109528
462A09528l7807j57868k0309J39999P1110r8790q0479O0790M1662n5324P227P6778
$$ 109528 71721 -86147 -106456 33543 104653 5863 -74616 -13826 27836 -27488 -20261 56517
474E6517k3676r8015m470Q9620N3456m7338p7153L211N7509J4916p217Q955k9327
$$ 56517 32841 -65174 -69644 19976 73432 26094 -51059 -47848 9661 24577 17360 26315 -3012
487c012m6572K8432O3143N864l8458l8612q214L9655L6342r627k4190k6556k2628
$$ -3012 -49584 -21152 41991 47855 9397 -29215 -37429 2226 38568 28941 4751 -21805 -44433
500d4433L3638O0915j0113o0955k6942K0437M3967K3934l3726l6757R194P918
$$ -44433 -10795 50120 40007 -20948 -47890 -27453 16514 40448 6722 -30035 -20841 -12923
512a2923K5L8009K0171n4570n2547K8710P4485K5652o7546o4941M4926O4645k8173
$$ -12923 -12898 25111 45282 -9288 -61835 -33125 41360 67012 -534 -65475 -20549 44096 15923
525A5923k9504L8526r33o6222m285Q5409M4714p8267r3401M5318J11489j6398
$$ 15923 -13581 24945 24012 -42210 -46495 38914 83628 5361 -88040 -42722 68767 52369
537E2369r2279J1862N3471l6250l4874O1349N0183o2491q6858L1579J11461R643
$$ 52369 -39910 -28048 25423 -10827 -45701 15648 65831 3340 -83518 -51939 59522 69165
549F9165j02725k6352O9217Q760l5821L0901L1880n2363n3809L9897P9145l85
$$ 69165 -33560 -59912 9305 18065 -17756 13145 45025 -7338 -61147 -21250 57895 57510
561E7510q1132l0033N8907K5691l0344J2672J9471n5246l7003O4285O1394l7297
$$ 57510 -23622 -53655 5252 30943 599 13271 32742 -22504 -59507 4778 66172 28875
573B8875p4178m729O2729K2693m1346l802L0180l8468m3521O4611P0572n3058
$$ 28875 -45303 -50032 12697 35390 -5956 -9758 20422 -18046 -61567 3044 73616 20558
585B0558q5985J3031Q0386K5791n4999l1937L7454P395m1187K5234O5505l1424
$$ 20558 -65427 -52396 27990 53781 -1218 -33155 4299 11694 -29493 -4259 61246 29822
597B9822q5051O449Q0319L2913n2033n5899K0061M5994j1041j8168K7036m827
$$ 29822 -55229 -48780 31539 64452 12419 -43480 -23419 22575 11534 -6634 20402 15575
609A5575n3913j310O0658K6335l8168n0056J5N0952K2592k9263j4835L999j5714
$$ 15575 -38338 -39648 21010 47345 9177 -40879 -40864 10088 32680 3417 -11418 -7419 -23133
622b3133N081M2174J0138l7082k8058O953L5093K5424k1373l1970K503O883O660
$$ -23133 -18052 24122 34260 -2822 -30880 -23927 11166 36590 15217 -16753 -14250 -7367 -707
635g07L0076M877m6474k4813K8991L4289M234k8800k8615J1259K1050l633P932
$$ -707 29369 34246 -12228 -37041 -8050 26239 30473 1673 -26942 -15683 5367 1734 9666
648I666J4442l5367l7508L4002N1905o247m6812k7227K7353M1337j0716k5928
$$ 9666 24108 -11259 -48767 -14765 37140 30893 -15919 -43146 -15793 25544 14828 -11100
660a1100J5087J748l5898J1560N6966L385n6004l1362L3157N3039m195n1738p189
$$ -11100 3987 5735 -30163 -18603 38363 41748 -14256 -45618 -12461 40578 36383 -15355 -22544
673b2544L2106p880j2896L3298J0844m6899k8524L1161M4775m68m8236k5554L4047
$$ -22544 9562 1682 -11214 22084 32928 -13971 -42495 -11334 33441 32973 -15263 -40817 -6770
686f770K3839j5547K760O717l0382j5550L5863K9520j3784l2263j5890K4168L0435
$$ -6770 17069 1522 4282 10999 -19383 -34933 930 30450 16666 -15597 -31487 -7319 23116
699B3116q150j3956J529j7080q926L9808K4831l4030l3112Q479K6334J5477j1717
$$ 23116 14966 1010 2539 -14541 -23467 16341 41172 7142 -25970 -17491 8843 24320 12603
712A2603j9717K727j680j1641K5387L0834l4653m5586J7953M1315P403k3308k3999
$$ 12603 -7114 -4387 -6067 -17708 7679 38513 3860 -41726 -23773 17542 24945 1637 -22362
725b2362O190J9520n619j161K3767j1337m3554Q061M8749J0429k9160k6984L733
$$ -22362 -16172 3348 -2271 -3432 20335 8998 -34556 -26495 22254 32683 3523 -23461 -19728
738a9728L1237J1628k0511k885P595k0377l915L6698J2339l0483k4151M040K5601
$$ -19728 11509 23137 2626 -259 7336 -13041 -16956 19742 32081 1598 -22553 -18513 7088
751G088K0137j8161k6625N449P534j732J8266P154k9344j7049J6196J8928Q992
$$ 7088 27225 9064 -17561 -12112 -4578 -6310 11956 19110 -10234 -27283 -11087 7841 16833
764A6833r870k5150j982K1112P509L275J934k4728j5590K8066K4053j0885j6125
$$ 16833 6963 -18187 -20169 943 8452 11727 13661 -11067 -26657 1409 25462 14577 -1548
777a548j0463J328J9338Q571r087l145j1385j6437K2275L1822j6342l3225j941
$$ -1548 -12011 -10683 8655 17226 8139 4994 -6391 -22828 -553 31269 14927 -18298 -20239
790b0239J5854J5958K515j8285q474P604n591L668K6755m908l6668m227K6567
$$ -20239 -4385 11573 14088 -4197 -12671 -5067 -10658 -6990 19765 14857 -21811 -26038 529
803E29J7332l380j9953j4780J6314J5141o908L325M532k2157q663K5579J5002
$$ 529 17861 14481 -5472 -20252 -3938 11203 4295 7620 12152 -10005 -18668 6911 21913
816B1913r166j5938j3369R254K4899l093j7548n03l682n646J8234J1598j6104
$$ 21913 12747 -3191 -16560 -7306 17593 14500 -3048 -3551 -7233 -12879 5355 16953 849
829H49j2814r03M033J6899O013j9929j0042P947L477J0409J0471j7716j6766J2167
$$ 849 -11965 -12868 -8835 8064 14077 -5852 -15894 -7947 -4470 5939 16410 -1306 -18072 -5905
843e905J2134K299K254j1384j1968R760J0113J391N623j0838k1519J0264K4092
$$ -5905 6229 8528 10782 -602 -12570 -2810 7303 8694 14317 3479 -18040 -7776 16316
856A6316k631j2135p076o136Q736J3265n319o139p14j2497P47K4420L825k0505
$$ 16316 13685 1550 -5526 -11662 -2926 10339 5020 -1119 -1833 -14330 -13583 10837 14662 -5843
870e843q900K859R958J4809n481j8000K447O748j530J0895P610j7458j1381R159
$$ -5843 -14743 -11884 -1926 12883 7402 -10598 -8151 -1403 -2933 7962 15572 -1886 -13267 -4108
884d108R999Q712j872k1077n034J9298N892n934L15j0048r139J1650J0045k809
$$ -4108 5891 14603 12731 -8346 -13380 5918 11810 5876 6191 -3857 -12996 -1346 8699 5890
898E890k506j1246r871J7048J5220j1528j0511j135k359J0255J1955r068r544
$$ 5890 3384 -7862 -17733 -685 14535 3007 -7504 -8639 -10998 -743 11212 2144 -7400
911g400J597j513P415J5182q766j6371L362O971L923Q799n867j5921L175R729
$$ -7400 -5803 -7316 99 15281 6515 -9856 -6494 477 4400 13199 7332 -8589 -5414 4315
925D315J181N440n108j6377L370J4369j778k442j54j1536k660J3582L746l945
$$ 4315 5496 10936 5828 -10549 -7179 7190 5412 2970 2816 -8720 -11380 2202 5948 2003
939B003l258j0721R8J9099J698j4823L0L111l590P543P129o067l833l376k099
$$ 2003 -1255 -11976 -11878 7221 8919 -5904 -5874 -2763 -6353 1190 8319 2252 -1581 -4957 -7056
954g056J4910R033j8564q980J2872L161k112M057m160o403J572o50M769J0215
$$ -7056 7854 16887 -1677 -10657 2215 5376 3264 7321 3161 -3242 -1670 -2320 2449 12664
968A2664j2221j7113J2136J2930o755l566Mn890K474N694m97L181k441j4318N745
$$ 12664 443 -16670 -4534 8396 1641 -1925 -1921 -7811 -5337 357 -140 3041 600 -13718 -7973
983g973J9299m997j2010L227O14l95Q382O38n336l95n096M48J6277m81j8863J143
$$ -7973 11326 6329 -5681 -2454 -1840 -2235 6147 6785 1449 1054 -4042 -3594 12683 12202 -6661 -5518
999e518J0644l466M52M305p261m590K194J81P762L298j7163m816J6831K301r659
$$ -5518 5126 1660 2112 6417 -844 -5434 -3240 -3059 4703 8001 -9162 -13978 2853 5154 -4505
1014d505L039K14n628L464L922J064L727q473r492J5336J1783j4333o221Q834
$$ -4505 -1466 -1252 -6880 -3416 506 1570 5297 -3176 -12668 2668 14451 118 -6103 2731
1028B731q16j064M117j472J9j089q788N011J5553r388j6265Q817Q244n656p01
$$ 2731 1915 851 4968 3496 3515 2426 -6362 -1351 14202 4814 -11451 -2634 5610 -46 -747
1043g47J014l468J573k217k729J1671N90j8416K626J7495m479q532M679M58j277
$$ -747 267 -3201 -1628 -3845 -6574 5097 5687 -12729 -10103 7392 2913 -5619 -940 -482 -1759
1058a759K327j748M205N185j1885n301J8333K805j6468J324R361l865k851J906
$$ -1759 568 -1180 3025 8210 -3675 -8976 9357 12162 -4306 -2982 6379 2514 -337 1569
1072A569L76L421o003r249J2249J0680j8308p900J6783J439j1204J916M640J45
$$ 1569 1945 5366 -637 -9886 2363 13043 -5265 -13165 3618 5057 -6147 -4231 409 554
1086E54k799o431N547J3732j0473j5815J5557J2746j4986n257J1809J458n678
$$ 554 -2245 -8676 -3129 10603 130 -15685 -128 12618 -2368 -7625 4184 5642 -36
1099c6k572K991R067k894j6157O286J9216j1175j5579J2493P397j0488l305M516
$$ -36 -2608 383 9450 6556 -9601 -3315 15901 4726 -10853 1640 9037 -1451 -4756 -240
1113b40L695m60j0217j713J7158k310j9575O669J6025r465r722R054M660l939
$$ -240 3455 2995 -7222 -8935 8223 5913 -13662 -6993 9032 -433 -10155 -1101 3559 -380
1127c80l945j143R502M557j5204j848J9096k776j6328P595J0741p302m574K062
$$ -380 -4325 -5468 4034 8591 -6613 -8461 10635 7859 -8469 -874 9867 2565 -2009 53
1141E3L587L778p544p852J3226N503j7847j932J6348l192j1416L291M532P90j994
$$ 53 3640 7418 -126 -7978 5248 10751 -7096 -9028 7320 4128 -7288 -3997 535 1325 -669
1156f69p111M511J0732j0546r807J5348O499j4810j261R824O59j801l098j800
$$ -669 -7780 -3269 7463 -3083 -12890 2458 8957 -5853 -7114 2710 3369 1568 -1530 -3330
1170c330R601J47j3222N876J4110j0786j0989J0839O124o280l477j788M502N594
$$ -3330 6271 6418 -6804 -928 13182 2396 -8593 2246 8370 2090 -1387 -3175 1327 6921
1184F921r897m782J4060j288j6772O012J4233o930r616K178M814M941l838r474
$$ 6921 -2976 -7758 6302 5014 -11758 -5746 8487 1557 -8059 -5881 -1067 3874 36 -9438
1198i438Q911Q565j4608k583J8864q79j6834J875J2024J876m947p642L541J1317
$$ -9438 -527 8038 -6570 -9153 9711 8832 -8002 -6127 5897 7773 2826 -4816 -1275 10042
1212A0042p549j1186J4964P519k0951m366J8782L238j2468o151N076Q766l295
$$ 10042 2493 -8693 6271 13790 -7161 -11527 7255 10493 -1975 -8126 -3050 5716 2421
1225B421j2740P386J3690j5265j2635K0148J0029j7803p493J0052Q332k357r389
$$ 2421 -10319 -2933 10757 -4508 -17143 3005 13034 -4769 -12262 -2210 6122 3765 -5624
1238e624Q24J3304m654j6026J2749J7465j6516j4300J3421J0306n827p623r44
$$ -5624 -4800 8504 3850 -12176 573 18038 1522 -12778 643 10949 5122 -2501 -3445
1251c445P614K249j2877K185J6789q324j9831J0958J5871q751r982K298M663K527
$$ -3445 4169 6418 -6459 -4274 12515 4191 -15640 -4682 11189 2438 -7544 -5246 -583 1944
1265A944m981l330J0689J36j7212L717K0607m503j5626L407P696J419j469l816
$$ 1944 -3037 -6367 4322 4458 -12754 -9037 11570 7067 -8559 -5152 2544 3963 2494 -1322
1279a322L138M934r733m277J8056K447j9989k382J3825K674n006l848j637N124
$$ -1322 1816 6750 -2983 -7260 10796 13243 -6746 -9128 4697 7371 2365 -1483 -3120 2004
1293B004j387p900R042R548j7139j0831J6911R606r456p509R25N914L708o803
$$ 2004 617 -7283 1759 11307 -5832 -16663 248 9854 398 -7111 -6186 -272 3436 -3367
1307c367J67J1326p232j5628J3112J8719j1889j4345M720Q831L240m911n657O581
$$ -3367 -3200 8126 894 -14734 -1622 17097 5208 -9137 -4417 4414 7654 2743 -2914 3667
1321C667J884j3562M050J9892p719k1667N123J5266P5p494n604L013N094o689
$$ 3667 5551 -8011 -3961 15931 8212 -13455 -8332 6934 7009 -485 -6089 -3076 2018 -4671
1335d671k267J5266r83k2769J555K3173O06j4810k570N848M617j928m198Q058
$$ -4671 -6938 8328 7345 -15424 -13869 9304 9910 -4900 -7470 -1622 2995 1067 -3131 4927
1349D927M315j7330l926K3867N535k1586n552J1754M749l222m009J383M766q918
$$ 4927 9242 -8088 -12014 11853 17388 -4198 -9750 2004 6753 3531 -478 905 5671 -3247
1363c247q585J7322J1512k1607j2665J5675R504o656n211j90L037L0o008O112
$$ -3247 -11832 5490 17002 -4605 -17270 -1595 7909 1253 -3958 -4148 -1111 -1081 -7089 -977
1377i77J3402j2347j7456J3321J6566p415q953P85K036L862n46j055O423l546
$$ -977 12425 78 -17378 -4057 12509 5094 -3859 -3074 -1038 2824 2278 1223 7646 4100
1391D100j5331O286K0273n565j6237J153N452J866K156k960k090O37p822J038
$$ 4100 -11231 -4945 15328 9763 -6474 -5321 131 1997 4153 1193 -897 -260 -8082 -7044
1405g044J7502j082k1090j363J4918K434l634j320l067Q33l28p48J1940M321k1247
$$ -7044 10458 9376 -11714 -13077 1841 4275 641 -679 -3746 -2913 -3241 -3989 7951 12272 -8975
1420h975p137K2132Q823j2989o404K889L015J470j792L243N973j3767j2991J9472
$$ -8975 -16112 6020 14843 1854 -4550 -1661 1354 2824 1032 4275 10248 -3519 -16510 2962
1434B962J7570j7897j6528Q074Q915M54l684k743L947k707j1562R663K0711j2253
$$ 2962 20532 2635 -13893 -5819 3096 3550 -134 -2877 1070 -1637 -13199 -3536 17175 4922
1448D922k3126Q096J7351o71o907k904Q51L247l191J099J3510l947k1716L434
$$ 4922 -18204 -10108 7243 6572 -335 -3239 -2388 859 -2332 -1233 12277 8330 -13386 -9952
1462i952K2305p75j2935j279R70J090L038J71L066j803j4898j61K1863J670k0070
$$ -9952 12353 11578 -1357 -2636 -1666 -576 2462 2633 5699 3896 -11002 -11163 10700 12370 -7700
1477g700j978Q992q70M38L835j251l954p141n0J8482O456k2240q670J7770N894
$$ -7700 -9678 -686 -1556 -1118 2717 1466 -2488 -9629 -9679 8803 15259 -6981 -15651 2119 8013
1492H013p307J124J124m517k219R53J0945P789j7733j5720J7460J6484j1443r578
$$ 8013 706 1830 2954 -1563 -3782 -2829 8116 15905 -1828 -17548 -88 16396 4953 -4625
1506d625L058o24k54K951K360L599p640j5683R623K2083o595j8773J763O906J854
$$ -4625 -1567 -2191 -2445 506 2866 6465 -1175 -16858 -7235 14848 8253 -10520 -8757 -1851 3
1521CL394r33l602j614n087L352J7792j220k1066j957J4434L558j546j041o606
$$ 3 3397 2464 -1138 -2752 -7839 -4487 13305 12085 -8981 -10938 3496 7054 5508 4467 -2139
1536b139k463L359L403P807l12j8535n451J9728O355j1265l615k80k976L697O053
$$ -2139 -4602 -1243 2160 9967 9655 -8880 -14331 5397 11752 487 -3128 -3408 -6384 -2687 3366
1551C366J620k523j2504o135J9878J3114j7501j2090R481M667r40L212J000l333
$$ 3366 4986 2463 -10041 -16176 3702 16816 -685 -12775 -3294 1373 433 3645 4645 1312
1565A312o498m628J3723J6315j5635k0973J0793J5889l460n699K5k571j738q78
$$ 1312 -5186 -9814 3909 20224 4589 -16384 -5591 10298 6838 1139 1164 -1407 -3145 -4023
1579d023N589J1231p965k1696M662K2230o87j2689j986M72J2M854L017J307l762
$$ -4023 1566 12797 4832 -16864 -12202 10028 9341 -3348 -5334 -4862 -4850 4 3021 4328 566
1594E66j2318J287J9927L167j6356l144N752j77M493O067m771q203l471M064J4519
$$ 566 -11752 -10465 9462 12629 -3727 -6871 -1119 -1296 3197 9264 4493 -3710 -7181 -3117 11402
1609A1402K288j8581o076J2976K305l967N447k476j1322j634Q840J0079j73j7210
$$ 11402 13690 -4891 -10967 2009 4314 347 5794 3318 -8004 -9638 -798 9281 9108 -8102
1623h102r855J7080J1841j0364m523L672m911j970R004O970j763j2017j0785J3649
$$ -8102 -17957 -877 10964 600 -3923 -251 -5162 -7132 1872 8842 7079 -4938 -15723 -2074
1637b074K0238q997j7277K727O915QL647J472m646m950n329N451J6950k252k1847
$$ -2074 18164 9167 -8110 -5383 1532 1540 5187 6659 2013 -2937 -8266 -2815 14135 11883 -9964
1652i964l425J4754M518j556l051p274j565M319L295O325J09j5287o321J6392
$$ -9964 -13389 1365 5883 4327 1276 -5998 -7563 -3244 51 6376 6485 -8802 -15123 1269
1666A269Q394o284m244m095k977Q198Q370j995n079q434k399J4955R118j2525
$$ 1269 9663 3379 -865 -4960 -7937 261 8631 6636 1557 -6877 -9276 5679 14797 2272
1680B272p267M107j203J460R161m37j0746p296K069J3966Q718j5994j4484J1836
$$ 2272 -4995 -888 -2091 -631 8530 8093 -2653 -9949 -7880 6086 14804 -1190 -15674 -3838
1694c838Q593n279R04L860p751p070M445J1923P494j2664j8449R572K0316l365
$$ -3838 4755 -524 380 4240 -3511 -10581 -6136 5787 13281 617 -17832 -8260 12056 8691
1708H691j1365J994j28l798M834P685J674p394j3901K665K0879K843j7162n671
$$ 8691 -2674 -680 -808 -4606 228 7913 9587 2193 -11708 -9043 11836 14679 -2483 -8154
1722h154N472R92M834M537o238p439k243K446J1961M739j4577r119Q336N354K129
$$ -8154 -2682 -1690 3144 7681 1443 -5996 -8239 -5793 6168 10907 -3670 -12789 -4453 901 3030
1737C030M112p508j0805M461J0266N060j571j1099p219J0843R416m695j001j297
$$ 3030 7142 -366 -11171 -6710 3556 8616 7045 -4054 -11273 -430 8986 4291 3290 1993
1751A993r737J698J4510L815q405j1183m496J2509J3150r127j2143L781J293k337
$$ 1993 -7744 -6046 8464 12279 3874 -7309 -11805 704 13854 4727 -7416 -3635 -2342 -4679
1765d679P862N026q728r090j770J0011J4781n634k0041Q48J4202J759k078J605
$$ -4679 3183 8209 -519 -9609 -11379 -1368 13413 7779 -12262 -11414 2788 4547 2469 4074
1779D074n192n423K717O503Q109j240j7377n320J7415Q791q592n122k845k512
$$ 4074 -1118 -6541 -3824 2679 10788 9548 -7829 -13149 4266 13057 4465 -657 -3502 -6014
1793f014O509O710j719m252p711m688J2022J0533q906q521K02r02N723J0297m388
$$ -6014 495 7205 5486 1234 -6477 -11165 857 11390 2484 -6037 -5835 -6737 -1014 9283 4895
1808D895j1904k200M653Q898N922r007j0455N365M672l09P565N74j4781n052J1708
$$ 4895 -7009 -9209 -4556 4342 10264 1257 -9198 -3833 839 530 8095 8669 -6112 -11164 544
1823E44J0346oj1260j1640P727J3140l678n406L381o544p466R351J1457k501j1384
$$ 544 10890 10884 -376 -12016 -4289 8851 5173 -233 3148 -3396 -10862 -1511 9946 7445 -3939
1838c939j0518O039J8384O64j5900k812N315r47M630P116m825q428l280L684J3106
$$ -3939 -14457 -8418 9966 10630 -5270 -8082 -2767 -3714 916 8032 3207 -5221 -8501 -4817 8289
1853H289O026j5280j1039Q945Q601J181N23p335p618M519O566K477J814q313j0957
$$ 8289 14315 -965 -12004 -3059 5542 6723 7246 -89 -7707 -3188 3378 5855 7669 -644 -11601
1868a1601O321J1926k25m067n855p575N244J3665j226q445m570k000O024R965
$$ -11601 -5280 6646 6421 2354 -3501 -11076 -5832 7833 6607 -1838 -6408 -8408 -2384 7581
1882G581k388p842q61k180Q45J2643M298j3596q442M779R168P338n419j2896J776
$$ 7581 5193 -2649 -3510 -5690 -4845 7798 12096 -1500 -9942 -5163 4005 11343 5924 -6972 -5196
1897e196Q128j628J819N535q256j1432M526J1968N194o035j5322j578J5810M521
$$ -5196 2932 1304 3123 8658 402 -11030 -6504 5464 10658 4623 -10699 -12277 3533 8054
1911H054q688j266k41o021L550R758J795n037r751l831J3164J2445r502j0689
$$ 8054 -634 -1900 -2141 -8162 -4612 5146 6941 1904 -7847 -11678 1486 13931 4429 -6260
1925f260J182K748M638P080l796q822j335J202N728Q758m636j3621m14O721N135
$$ -6260 -5078 -2330 2308 9388 5592 -3230 -4565 -3363 2365 11123 6487 -7134 -7548 -827 4308
1940D308M530n332j3219K45J0916M474j743m637q143J107Q760K806o1k255j0327
$$ 4308 8838 3506 -9713 -9468 1448 5922 4179 -458 -8601 -7494 1266 4072 4011 1756 -8571
1955h571k749J4562R243q333r453k973N394J0971M57q882j387Q6l257P581R768
$$ -8571 -11320 3242 12485 4152 -5301 -8274 -2880 8091 8548 -334 -1721 -1635 -4892 2689 12457
1970A2457p108j2786j031P224J0670O71j3964o914Q654M718j336K966l539q998
$$ 12457 5349 -7437 -8468 -1244 9426 10097 -3867 -10781 -2127 2591 1255 4221 682 -8316
1984h316N07P632N992J231r887j0157Q337J2534j623n852l693l103L994R073p2
$$ -8316 -7809 -177 5815 7046 -2841 -12998 -4661 7873 6250 398 -3295 -6398 -2404 6669 6597
1999F597m290l691n231L061J2301Q37r578n086n30M751J0180j419j1959l579M537
$$ 6597 2307 -1384 -6615 -3554 8747 9584 6 -5080 -5610 -859 9321 7902 -4057 -7636 -3099
2014c099L437M856m23q074l982K676L471O528K076j2606p782R577J0041o4m744
$$ -3099 338 5194 4771 -3303 -7285 -4609 -1138 5390 7466 -5140 -12922 -3345 6696 6632 1888
2029A888p963q27Q297L486j600J039n023q340O285J2705Rr416q007j10J1546P412
$$ 1888 -6075 -6902 1395 4881 3281 4320 -703 -9043 -2758 9947 9956 540 -7467 -7577 3969 11381
2045A1381q982p227J687R2J678P891r06r172m643J301P933R384o667j4027J303
$$ 11381 2399 -4828 -3141 -3049 -1371 6520 5614 -3558 -8201 -6900 1033 10417 3750 -10277 -8974
2060h974Q960M071J073l650q330Q15O742L044K898j994j1115j799J1382O301l020
$$ -8974 -14 4057 5130 1480 -6850 -6035 707 3751 6649 4655 -6460 -8259 3123 9424 6404
2075F404o307p336J601J1864K768p487l686k139m14P305M778n125n645l604O8
$$ 6404 97 -7239 -5638 6226 8994 1507 -2179 -4318 -4732 2573 7351 2226 -3419 -7023 -6955
2090f955J0842O441r999j0249L132O361M868J264p376m551L528J821L065N803
$$ -6955 3887 10328 329 -9920 -6788 -427 4441 5705 -1671 -6222 -2694 -873 2192 7995
2104G995m934j1421J737J0435N085k047q939o782P765Q703l144l102q89n558l4
$$ 7995 3061 -8360 -6623 3812 8897 6850 -2089 -8871 -1106 7597 4453 1351 462 -5096 -5130
2119e130Q579L906m265o442o937N388J3271j227j1190l089K486L248N666N81p100
$$ -5130 3449 7355 3090 -3352 -10289 -4901 8370 7143 -4047 -7136 -4650 -1402 4264 4845 -2255
2134b255k645M60J795Q588L301j1237p026O110O608M296j751j0115l656Q707M213
$$ -2255 -4900 -4440 -2645 5943 9244 -1993 -9019 -2909 3699 7995 6244 -3871 -7527 1180 5393
2149E393j102l0n632n545N077O653J140k535q005o379R593J0245m703q070k148
$$ 5393 4291 4261 -1371 -6916 -1839 4814 5954 3419 -4586 -10965 -1372 8873 4170 -3900 -6048
2164f048K71N861N705l684m596j263k572L909J1156j733j1609k945M697O983N149
$$ -6048 -5777 84 5789 2105 -2491 -3754 -6326 -2417 8739 7006 -4603 -7548 -2851 4132 9281
2179I281o159r124K257N833N68K643k75q444l501O082N437K512m063j1204k36
$$ 9281 3122 -6002 -3745 2088 2656 5299 5024 -3420 -6921 -839 4598 7110 3047 -8157 -8393
2194h393J1463M068n783l676l379J08P294K518l197j627m805k731R357Q476o902
$$ -8393 3070 7138 1355 -2321 -5700 -5592 1702 4220 1023 -604 -5409 -8140 1217 9693 2791
2209B791q195o63L696P855L055q562m745L288J089K527O064m607q967K51N260
$$ 2791 -5404 -6067 -2371 5484 8539 -23 -4768 -1480 -391 2136 8200 3593 -5374 -5123 137
2224A37N297K880q349r036M682Q456J04j857l500n700K093P095N55n37k713p454
$$ 137 5434 8314 -35 -9071 -4389 4067 4171 2314 -1186 -6886 -4793 2302 2857 2320 -393 -7847
2240g847Q49J1250L075o487n247k538M960R238j069q292n97J314p04O229L785
$$ -7847 -6998 4252 7327 840 -4407 -6945 -1985 7253 6184 -2108 -2705 -1391 -2095 4134 7919
2255G919o315n883n90M350Q459L06j1995m839P471N022l20j148m810l635K968
$$ 7919 1604 -4279 -4869 -519 7940 8246 -3749 -8588 -1117 3905 3585 2437 -2373 -6008 -3040
2270c040L638K726J440p822p523O819J0180j446n428m690j010P073N644l862l265
$$ -3040 598 3324 4764 -3058 -10581 -3762 6418 4972 -456 -5146 -6156 917 6561 2699 -566
2285e66r31k966K495Q921j80p185l767j7N355Q083m544r702K60M424J968L099
$$ -566 -1497 -4463 -1968 6953 6773 -412 -4179 -4196 1159 9242 4698 -5004 -4744 -320 1648 4747
2301D747k008o789j026K861K189M677k37j0305k889Q288N160j078l569o335P86
$$ 4747 2739 -4050 -5076 -2215 -26 4651 4414 -5891 -8780 -492 4668 3590 21 -6314 -5528
2316e528Q033J987l418J26l385l126N565O600j782m556n342n44J0064M962q294
$$ -5528 2505 4492 1074 1200 -2185 -5311 254 6854 5072 516 -4826 -5370 4694 9656 1362
2331A362o005K145J637K938K705l512m313o94j024N590P238o004j0561J922P716
$$ 1362 -4643 -2498 -861 2077 4782 1270 -3043 -3737 -4761 829 8067 2063 -8498 -6576 1140
2346A140K847o66n194m783M138L677L62J997j253q042J80Q824L466k883m708n208
$$ 1140 3987 3321 -1873 -6656 -2518 1159 1521 3518 2265 -5777 -5597 3227 6693 3810 -898 -6106
2362f106L499R091l37n829j727j448M12O767J333n256l117j720N64P967K784q511
$$ -6106 -2607 6484 6147 318 -1409 -2857 -2445 4322 5655 399 -2718 -4438 -3874 4093 6877 -1634
2378a634n755K740M578M661q44p444k316M598K060R23K705m189o196K814N916
$$ -1634 -7389 -4649 -71 4590 3746 -3698 -6014 -1416 644 1567 4272 83 -6113 -3299 2617
2393B617L371j033p981m434Q090P115m024l838p94j759J869M722o3j660m180m894
$$ 2617 5988 4955 -3026 -7460 630 7745 3721 -117 -911 -2670 -801 3921 3858 2198 -1982 -6876
2409f876M841R319k698q915j448L102L618L258l146m884P13P03M50O181M99p718
$$ -6876 -2035 7284 4586 -4329 -5777 -2675 943 4201 1055 -3829 -3116 -2413 -1963 4218 4717 -3001
2425c001l353M650M712K441k309p508J88O552J374m25q00m404k141M906L319j071
$$ -3001 -6354 -1704 3008 5449 3140 -4368 -4180 2372 3746 3321 2521 -1883 -4024 882 4201 3130
2441C130j200n080l203P143N624m216m504k305K40O120K933n420k953J423j591
$$ 3130 1930 -3150 -6353 790 6414 2198 -2306 -4611 -4371 1749 4682 -738 -3691 -2268 -3859
2456c859L100N758j922o396j530K148N992M192o782o903M021N275m45O34j095
$$ -3859 -759 4999 3077 -3319 -4849 -2701 3291 7483 701 -6202 -2181 3094 2649 3283 2188
2471B188m897K9L253K569K521l613q816J868R481R69n494k587j928J766M869o0
$$ 2188 -2709 -2680 573 3142 5663 2050 -6766 -4898 4583 5552 58 -2529 -4457 -2691 2178 2118
2487B118k029o53l954r67Q406L092o481m112M57K879N792M65o835j961K731J297
$$ 2118 89 -564 -4518 -5485 2921 6013 -468 -4580 -4123 -1244 4548 5013 -1822 -3783 -1052 245
2503B45K801K025n119l938L084K038K163K195n979n396M252N189l0j462m533l205
$$ 245 3046 5071 -48 -3986 -902 1136 3299 5494 -485 -5881 -1629 3560 3530 2068 -2465 -5670
2519e670N409L675k628q07n80m660J469O973O95l876l550k433N594O919l730o589
$$ -5670 -261 3414 786 -21 -601 -5261 -3792 3181 3876 0 -3550 -5983 -389 6530 2800 -3789
2535c789J945J657q8L539Q90m124k354k25K498O737j284r179j187O195J885k97
$$ -3789 -1844 -187 -275 3264 4154 30 -2324 -2549 -51 6686 5402 -3777 -4964 1231 3116 2819
2551B819j241l921j052L367O21J283R54n851l945O243M741k226k691l037q60O096
$$ 2819 1578 -2343 -3395 -28 593 1876 2830 -3021 -6966 -723 4018 1792 -899 -3936 -4796 1300
2567A300L095l885j841l77j609M018M580k760l770k51p05L787N345l930o623R79
$$ 1300 4395 510 -1331 -1708 -3317 701 5281 2521 -1249 -1500 -2205 1582 6927 2997 -3626 -2647
2583b647K524K630K192l961n131K719K145n81K845p45o232j085N035L106R0l866
$$ -2647 -123 2507 4699 738 -4393 -1674 471 -110 2735 1990 -4242 -5327 -292 2814 2904 -962
2599i62n430K430P664j330l575J174j795j298M073K748j361k016m120L24Q295
$$ -962 -6392 -3962 3702 2372 -1203 -29 -1824 -3122 951 3699 2338 322 -3798 -3474 4821
2614D821J703p530j956K641P71K137J165l843j936M68k37L402L479n883n118L700
$$ 4821 6524 -1006 -2962 -321 450 2587 3752 -91 -2027 -1559 -1796 1606 5085 -798 -5916 -2216
2630b216L053P69L79l646l677L550L314p14P80k245l832K291N101o70o12j798
$$ -2216 837 1606 1985 -1661 -5338 -1788 1526 812 1592 -653 -4485 -2194 2907 2237 1625 -173
2646a73l905K456O551r58m253j033n95J917M504k050l819O00n69p35M810J532
$$ -173 -4078 -1622 4929 3971 -282 -1315 -1910 7 4511 2461 -1358 -758 -1327 -2062 2748 4280
2662D280n781k875K004K368L618j908o321M33N078q36j04K156l168k907K440L034
$$ 4280 -1501 -4376 -2372 -4 3614 1706 -4615 -4182 896 60 -44 2112 -1056 -3963 -1523 1511
2678A511J547j41n929k097P090L221l862j372j56j586K576K712j581j238j657
$$ 1511 3058 2917 -3012 -5109 1981 5202 1340 -32 -188 -1774 802 3514 1933 695 -962
2693i62k596L945M968l834m617O44J004J615L364k919m458J487J170O17L242j671
$$ -962 -3558 387 5355 1521 -3096 -2452 -1448 167 3531 612 -3846 -2359 -1189 -572 2670 999
2709I99m736J243K492O91K554j646n198N72N173J023j126j437l151J269M449q29
$$ 999 -3737 -2494 -2 689 3243 1597 -3601 -3029 2144 3167 2041 604 -2547 -1278 3171 2342
2725B342j653J287l204k281N147K684l251k589j626P94N214j11n084MJ766j667
$$ 2342 689 1976 -1228 -3509 1638 4322 1071 -1518 -3144 -2350 2864 2753 -2331 -2327 -561 -2228
2741b228J908L210k715k969K08P87L828K183n469l180M323K191j113J339j487
$$ -2228 -320 2890 175 -2794 -2586 -1799 2029 4212 -1257 -4437 -114 2077 964 2303 816
2756H16k886J564J890L45J354k107m920K790M822j235k300q31k218J690M168j931
$$ 816 -2070 -506 1384 1729 3083 976 -3944 -1154 3668 2433 133 -698 -2916 -1226 2942 1011
2772A011k116K63j974L03M625O4l809l36m14P90M264M05n014r98K746N84K075
$$ 1011 -1105 -842 -2816 -2513 2112 2176 -1633 -1969 -2383 -1593 2671 3076 -1938 -2936 -190 394 2469
2789B469L8l995K0K417k74J025J955l625l643L689K665j89j107l880j172N047
$$ 2469 2507 -1488 -1468 949 675 1700 3655 30 -3613 76 2741 2552 1445 -2435 -3607 1440
2805A440Q19l275R97p7l263J624L877j201j599j954j317M192L648l589l270K246
$$ 1440 2259 -1016 -19 -96 -3359 -1735 2142 941 -658 -2612 -3929 263 3911 322 -2948 -702
2821g02K67K99K845r65k980N96K12J223L142j692m876J428L049l18O17m19m035
$$ -702 -435 -136 2709 1744 -1236 -640 -428 795 3937 2245 -2631 -1203 1846 1528 2145 1726 -2309
2838b309N42L285q77J50L18l728k36L830J35j137K95k611j444N258Q86l167o17
$$ -2309 -1767 1518 641 791 1109 -2619 -2855 975 1110 -27 268 -2343 -3787 1471 2357 -810 -1427
2855a427j64k51L148J281k751l0J65j647K603L528l511l142J736J263J292J149
$$ -1427 -1591 -1842 1306 2587 -164 -194 -29 -1676 927 4455 944 -2198 -462 801 2093 3242
2871C242l533k076L052K77j292K365j175l913R18K937J17M04k510l409L360L884
$$ 3242 -291 -2367 685 962 -330 2035 860 -3053 -2135 802 919 1323 -1187 -4596 -1236 2648
2887B648k569j115J249k185J42L681n66j105P8k365Q32M586m15m129M88P24L8
$$ 2648 79 -1036 213 -1972 -1830 1851 1285 180 258 -2107 -1275 3311 2896 -1233 -745 -21 17
2904A7K568J30l605k35J874j217J603J582m110j105K617l86N41K004l674k636
$$ 17 2585 2715 -890 -1125 749 -468 1135 2717 -1393 -2498 119 -267 274 2278 -1396 -4032
2920d032L784J406j578R22j942j338K853J450j997J232o19l002K397M017k137
$$ -4032 -248 1158 -420 502 -1440 -2778 75 1525 -472 760 141 -2861 -464 3553 1416
2935A416j915L18p48K122K260l109j070J961j672n15L772p62l693L15Q52L70K049
$$ 1416 -499 -181 -929 1193 3453 344 -726 1235 -437 -952 2820 2058 -1635 -1320 -468 -98 1951
2952A951j166m163J904K205j604N92J490l233l93K622J99K36N06l101n83M306
$$ 1951 785 -3378 -1474 731 -873 -281 1209 -2024 -2417 205 404 640 1146 -1955 -2538 1768
2968A768J29j874Q18j155j089L020Q43k559K11J66j594K299J720k664j052J054
$$ 1768 1897 23 841 -314 -1403 1617 2460 -99 112 278 -1316 983 2703 39 -1013 41
2984D1j537J465K904l615k290K296L68m32K065j588k200K321J78p42J995l78l561
$$ 41 -1496 -31 2873 -742 -3032 -736 -368 -800 1265 -323 -2523 -202 -24 -766 1229 851 -2710
3001b710J483L184r82k00m07j941J308K728k215L8J574k651m66L295J20j927p9
$$ -2710 -1227 1957 975 775 368 -1573 -265 2463 248 286 1860 -791 -1257 2038 2158 231 152
3018A52j262K17K994r34l246J188J157j775J588J272k773m72J157l38J335J594
$$ 152 -1110 -893 2101 1167 -2079 -891 266 -1509 79 1351 -1422 -1894 -737 -1075 260 1854
3034A854l489p02L456r38m86J906j673k069L087N49p15N31q46j959K150J585j972
$$ 1854 -1635 -2337 1119 181 -305 1601 -72 -2141 946 1495 780 1311 465 -1494 656 2241 269
3051B69N41l48k597J901K757k489j095R28q38J66K043j519j192R37o36m42L378
$$ 269 810 462 -2135 -234 2523 34 -1061 -133 -971 -805 1238 -281 -1473 -536 -1172 -1614 1764
3068A764n61l499J110J426n72J343J68k568R85J581j318J094J408l127k61K760
$$ 1764 1203 -2296 -1186 240 -332 1011 1179 -1389 -404 1177 -141 953 2361 -766 -1027 1733
3084A733o55m35Q07k091j001L187o84j760J355k39k085J857J461k334N12r1j776
$$ 1733 1078 643 1450 -641 -1642 1545 861 -899 456 217 -1868 -11 1450 -884 -372 -463 -2239
3101b239K177J542k505m48J153p98P41K092j946j085J801j58n65K179j207k044
$$ -2239 -62 1480 -1025 -1473 -320 -1118 -377 1715 -231 -1316 485 327 -238 1941 734 -1310
3117a310J672O12q35J578l99k574J459J584j682K79N1j812P82J679j253m89J204
$$ -1310 362 974 139 1717 1318 -1256 203 1787 105 384 435 -1377 -595 1084 -169 -658 546
3134E46k217k67L008l85k055J001l27p26K427k4k331J670K17k025J944J751k629
$$ 546 -1671 -1938 1070 685 -1370 -369 -696 -1422 1005 981 -1350 320 537 -1488 456 2207 -422
3151d22k59J566p00J038M56k167k97J953q58n17J741j204j965K032K55j224J179
$$ -422 -681 885 185 1223 1679 -488 -785 1168 310 -207 1534 330 -1635 397 652 -572 607
3168F07p20j849J547J357k176J123K72k223J375J972j828n95J686j226l30K551
$$ 607 -113 -1962 -415 942 -1234 -111 161 -2062 -687 1285 -543 -1138 548 -678 -1008 1543
3184A543q51j512J558n50o58K332n08k385J394R25j367Q46N67k254M90J413j711
$$ 1543 692 -820 738 188 -470 1862 1354 -1031 363 1288 -79 767 1334 -920 -430 983 -728
3201g28P97J043k234o37K290p70p64J264j296l42J864n37j184J411m1j973K190
$$ -728 69 1112 -1122 -1759 531 -239 -1003 261 -1035 -1377 487 -50 -1234 177 136 -1837 353
3218C53Q36j862O43P19j194J036J199j974n8K233k166J12J925j400j016J430q16
$$ 353 1189 -673 -30 689 -505 531 1730 -244 -302 1931 -235 -123 1802 402 -614 816 0
3235@q87K307j331k010J820O83j729J075O93k217Q35J326j602Q92R70k388N05
$$ 0 -887 1420 89 -1921 -101 582 -1147 -72 621 -1596 -761 565 -1037 -145 825 -1563 -1058
3252a058J999j131l91J515j398m00K204p41j074J588l28j198J356K29j747J241
$$ -1058 941 -190 -581 934 -464 -864 1340 599 -475 1113 785 -413 943 1172 -575 666
3268F66L84j505L99J587k519l7J921j430l03J495j599m86J858j035r64J871o56
$$ 666 1050 -455 -56 1531 -988 -1025 896 -534 -837 658 -941 -1427 431 -604 -1568 303 -353
3285c53j222J816L83j490J394K36j968J687Q93j808N37J554j858K62J775j766
$$ -353 -1575 241 624 -866 528 764 -1204 483 1376 -432 105 1659 -199 63 1838 72
3301G2k71J700j392o66J778q04j553J682n35j384J818l26j826J745J30j487R33
$$ 72 -199 1501 109 -557 1221 417 -1136 546 11 -1373 445 119 -1707 38 168 -1319 -386
3318c86J102j782L44J485j691M73J228j462m7K015j073r65J757m68j107J637j63
$$ -386 716 -1066 -722 763 -928 -455 773 -689 -736 1279 206 -759 998 530 -577 1060 897
3335H97j571J733q0j452J256K96j699O34J236k058M32J376j875J13J698j924j98
$$ 897 -674 1059 979 -473 783 1079 -620 14 1250 -808 -376 1000 -875 -762 936 -988 -1186
3352a186J623j032r80J872m26j282J606j12j292J579K22j464J346N98j414Q59
$$ -1186 437 -595 -1575 297 -129 -1411 195 83 -1209 370 592 -872 474 1072 -342 517
3368E17J077j772N9J461j402L6J249j345n78J959q56j501J657m54j578J498N08
$$ 517 1594 -178 -119 1342 -60 -24 1225 -120 -698 1261 405 -1096 561 107 -1471 27 535
3385E35j810J231R4j527J231P03j834R07P33j604O87J783j689k21J867q33p35
$$ 535 -1275 -44 50 -1477 -246 457 -1377 -470 263 -1341 -654 1129 -560 -781 1086 253 -482
3402d82J644o26j111J611l56j124J840m56j429Q72O83j858J112N83k051M86J272
$$ -482 1162 536 -575 1036 680 -444 1396 940 -489 383 1066 -792 320 903 -1148 -662 610
3419F10j410j43J458j270j34J790j188r09J364n25r25J560J39j542J047P41j184
$$ 610 -800 -943 515 -755 -889 901 -287 -1196 168 -357 -1282 278 417 -1125 -78 663 -521
3436e21J170N78k134J273P86j351N05J374j788q4J287o11m81R47q88j105J237
$$ -521 649 1227 -907 366 1152 -199 306 1680 -108 -192 1095 484 3 950 62 -1043 194
3453A94j61r21J219m78j238J411L98j470M53R80j744R06J228j607J87J119r24
$$ 194 33 -888 331 -147 -1385 26 424 -1046 -593 387 -1357 -451 777 -830 -643 476 -448
3470d48N5J825j208o44J403o41j19J178l83j616J111K93j312J603r7j878Q46R01
$$ -448 -393 1432 224 -420 983 342 223 1401 1018 -598 513 806 -506 1097 1000 -878 -32 869
3488H69j345L45P41j746L60J409j136j53J002j080l76J747o67j004J271m55j260
$$ 869 -476 -131 610 -1136 -776 633 -503 -656 346 -734 -1110 637 -30 -1034 237 -218 -1478
3505a478K173J89j428P84N45j219J139N92j359k13J376j308N55J302j676o89J517
$$ -1478 695 884 -544 240 785 -434 705 1297 -62 -275 1101 -207 348 1650 -26 -715 802
3522H02q27m27J535j175j302J351J3o65J159m11j918J626O74j252N48N32j362
$$ 802 -25 -452 1083 -92 -1394 -43 -30 -695 464 53 -1865 -239 435 -817 -269 263 -1099
3539a099O65J529j070m12J136j085q4J773q43q35J539p39q01J750k32j757Q28
$$ -1099 -434 1095 25 -387 749 -336 -420 1353 510 -325 1214 475 -326 1424 1192 -565 263
3556B63L88j033J046K02j790L88J018j240M13R66j500n76J806p07n29J580j486
$$ 263 651 -382 664 866 -924 -536 482 -758 -345 621 -879 -1455 351 -356 -885 695 -791
3573g91o47J738J17q39R92l06j548J810O50j411M91K19j155R07J726k043M5Q62
$$ -791 -1438 300 417 -422 570 264 -1284 526 1176 -235 256 475 -680 227 1953 -90 -45 817
3591H17j285L14J744j197j140J193o55l92J195n01j556J016O78j260J319j4j847
$$ 817 -468 -154 1590 393 -747 446 -209 -601 594 93 -1463 -447 231 -1029 290 276 -1571
3608a571P34J309j137M74Q65j383M9J620p75j69R54j203p12K067n2j136N51k20
$$ -1571 -837 472 -665 -191 674 -709 -660 960 185 16 970 -233 -945 1122 1070 -66 485 265
3626B65j024J616L59j847L61L77j081J046J047j801l07R56o50OJ642j724q87J463
$$ 265 -759 857 1216 -631 -270 107 -974 72 1119 -682 -989 -33 -683 -677 965 -759 -1646 -183
3644a83r1l40J346m58j315J263N40p15O61k01j417J031J379j408O95Q0j290R0
$$ -183 -274 -614 732 274 -1041 222 762 47 708 507 -910 121 1500 92 787 867 -423 -333
3662c33K126j045q84M00p42k24J474q1j627J194p33n40J347M41k197N29O48r18
$$ -333 1793 748 -136 264 -478 -702 772 691 -936 258 -475 -1015 332 773 -1424 -895 -247 -1165
3680a165J202N07j651K98J325q09M32J032j036j585J961L04o86R10p59j280J742
$$ -1165 37 544 -1107 -809 516 -293 139 1171 135 -1450 511 815 129 1039 280 -1000 742
3697G42O16j459R65p46j284J356R84j533K27L11j497R07J690j403q67P12p81M38
$$ 742 1358 -101 864 118 -1166 190 1174 -359 -132 179 -1318 -411 1279 -124 -991 -279 -1060 -622
3715f22J411q58j058R29j52k29J422O6j957O55J125o15M59P01j803L29J122l01
$$ -622 789 -69 -1127 -198 -350 -579 843 909 -1048 -393 732 117 576 1277 -526 -197 925 624
3733F24n5O31j967J01J565k02p73L86j149n40J936K25j456J46k11o08J727M79
$$ 624 569 1200 -767 -666 899 697 -76 310 -839 -1379 557 782 -674 -528 -739 -1347 380 859
3751H59j562ON94r78J305J254j718m56P79m48P19J379j660o42J052J43l27R92
$$ 859 -703 -697 -103 -1081 224 1478 -240 -696 83 -365 354 1733 73 -569 483 626 299 1291
3769A291o70j706J258O69r51O31r0j672O92J167p46k9P7j534R17J419o92p31O30
$$ 1291 621 -1085 173 842 -109 522 432 -1240 -548 619 -127 -156 -79 -1613 -696 723 31 -700 -70
3788g0q23N6J761k97j015M17qq19J836P4j459J50N05l11R97L70j727k54J301l79
$$ -70 -893 -837 924 627 -388 29 21 -798 1038 1112 -347 -197 308 -3 994 1364 -363 -617 684 305
3808C05L75L17j283q80J301K63m33M11q50j131J788K84r39M38k32j217J051J294
$$ 305 680 997 -286 -1166 135 398 -35 376 -474 -1605 183 467 -472 -34 -266 -1483 -432 862
3826H62j002k31L61q76P10J651j056j140J043m40J48J280m60j528Q68K80p13J537
$$ 862 -140 -371 -10 -886 -176 1475 419 -721 322 -118 30 1310 850 -678 190 470 -243 1294
3844A294m33j681N51P33m88N80J39j994J79J514m57o7O75j982k99J928k9o41N95
$$ 1294 861 -820 -269 464 -24 556 695 -1299 -1120 394 -63 -130 545 -1437 -1736 192 163 -478 117
3863A17n07p91K038J76j429N47k84l86J471O03j431m04N81o17R58R54j585r18
$$ 117 -390 -1181 857 1033 -396 151 -133 -519 952 1555 124 -280 301 -316 642 1596 11 -907
3881i07J193n53K95R56j064j256J287r1k53J160j128j502J194Q25n09L52J09j604
$$ -907 286 -267 28 984 -80 -1336 -49 -140 -393 767 -361 -1863 -669 156 -353 -1 108 -1496
3899a496Q94J422n57J22j9j286N99J654n03r20Q41o72o88J982k47j535N02l42
$$ -1496 -602 820 263 385 366 -920 -321 1333 830 -90 751 79 -609 1373 1126 -409 93 -249
3917b49l77J467N44k321qJ159o83Q90M75k057m5R34k45N32O68j425n70J135J68
$$ -249 -626 841 1385 -936 -944 215 -468 422 897 -1160 -1205 -271 -516 16 684 -741 -1311 -176 -8
3936hK60O78j215r80J582R52j086O29m12j308J115J455j198l30M01j300Q23J329
$$ -8 252 930 -285 -1265 317 1269 183 812 400 -908 207 1662 464 134 535 -765 58 1387
3954A387r22j196R55j001K44J603o50j632P12j93n8J664m51j856O43O33j1N01
$$ 1387 465 -731 224 -777 -533 1070 420 -1212 -500 -693 -751 913 462 -1394 -751 -118 -129 372
3972C72N61k264M80J787j49k62L00j346l51J971P4r54K80p30l63J506P16j790
$$ 372 933 -1331 -851 936 787 525 825 -521 -872 1099 1173 219 499 -231 -594 912 1628 -162
3990a62K75j90j180J533J036j445n15K59q33R62J518j309r70P35l04N77J018j167
$$ -162 113 -77 -1257 276 1312 -133 -648 -389 -1222 -260 1258 -51 -1021 -286 -590 -13 1005 -162
4008a62j111J012Q17o66J121o17j185O07Q94j86K48j98j397L39J662p54m9K10
$$ -162 -1273 -261 556 -110 1011 394 -791 -184 710 524 772 574 -823 -484 1178 424 375 585
4026E85j589L60J603n13j044O56r06m76J964j74j351J38L98n04J486l5j453M7
$$ 585 -1004 -644 959 446 -598 58 -848 -1324 640 466 -885 -747 -349 -853 633 598 -855 -808
4044h08O85l79J031R73j734q74J331K98J83P37j171j271J303O14m91K78o58q75
$$ -808 -123 -502 529 1502 -232 -1106 225 523 706 1443 272 -999 304 918 427 705 47 -828
4062h28P70Q14r85N48j17j530Q73J460r17n14M5p72N80J633q69j167P85j60m47
$$ -828 -58 756 -229 319 202 -1328 -455 1005 88 -426 -381 -1153 -573 1060 191 -976 -191 -351 -798
4081g98K065o77j289L36M60l30J627n78j608J94J239l84N78j55j506J22R96K65
$$ -798 1267 590 -699 -363 97 -233 1394 816 -792 -598 641 257 835 680 -826 -704 292 557
4099E57k86K85j076p68J505M47p73Q9q02o82J793P60j948M74M56j211J019J411
$$ 557 271 556 -520 -1288 217 664 -109 -20 -822 -1504 289 1049 -899 -425 31 -1180 -161 1250
4117A250j235l50L17o44Q38J634j622j023J084K33k30J031o52j622J053K15l30
$$ 1250 15 -335 -18 -662 176 1810 188 -835 249 482 252 1283 631 -991 62 277 -53
4134e3J006k72k397J379P78k54j06N3j702P51J441q94j54N97j039k06J863o1j222
$$ -53 953 681 -1716 -337 441 187 81 134 -1568 -817 624 -270 -424 173 -866 -1072 791 730 -492
4153d92M01k50m67J769K58j765J43O94n46J003O79j536k42N38n07J074M45j535
$$ -492 -91 -341 -808 961 1219 -546 -403 291 -255 748 1427 -109 -351 187 -320 754 1199 -336
4171c36r16J422N2k27O42j285p82J445Q02j163N75m89j282R81J114n42P3J64j653
$$ -336 -1252 170 222 -5 637 -648 -1430 15 817 -346 229 -260 -1542 -561 553 11 84 248 -1405
4190a405J441J647j122r70N48o24N23J305q65n53M78n33j71J711k93j683rL48
$$ -1405 36 1683 561 -409 139 -485 38 1343 478 -75 403 -130 -301 1410 1117 -566 -575 -227
4208b27k7P55o7j609N38P56p72O26P18j616k60J407j70k03P32j628j37J693M20
$$ -227 -254 501 434 -1175 -637 119 -653 -27 691 -925 -1185 222 52 -151 581 -1047 -1184 509 929
4227I29r31L35n49l30J100M98j127J61K17j260J241J435j344o55j0n6L99J191
$$ 929 -2 333 -216 -546 554 1052 -75 86 303 -957 284 1719 375 -280 -290 -346 53 1244
4245A244j448q46J036l65NJ403q47j223K88Q20j24R16j132j072N29J410k51k37
$$ 1244 -204 -1050 -14 -379 -374 1029 182 -1041 -753 67 -57 859 -273 -1345 -816 594 343 106
4263A06k6o43l4J286P1l24J12j385K47J625J08j173J6j80l80J634m04j161L68
$$ 106 80 -563 -597 689 760 436 548 -837 -590 1035 1143 -30 -14 -194 -574 1060 656 -505 -137
4282a37L5n73N62J061j435l89K09oQ23N02j200p90J382J68n57J012p64n31O86
$$ -137 -102 -675 -113 948 -487 -876 -667 -673 150 652 -548 -1338 44 212 -345 667 -97 -628 58
4301E8Q13p70Q83o52j359J012J178n26l08k34r81J068J133j083m51M89q14k23
$$ 58 871 101 984 332 -1027 -15 1163 637 329 95 -886 182 1315 232 -219 270 -544 -767
4319g67J298j11j125L51k50k58J599k92j764O43P19k29Q68J02j580M07Q50m07
$$ -767 531 420 -705 -354 -604 -862 737 445 -1319 -676 43 -186 682 784 -796 -389 461 54
4337E4K81J055k500Q1J492M66o44L31o91r15J978n0o75K03n02j043R34Q98q74
$$ 54 335 1390 -1110 -1029 463 929 285 616 -75 -990 988 938 263 466 -36 -1079 -145 753 -121
4356a21n5j93p56J028R14j561l06P96l99J06J266o75o79M43j11L17J423n85j798
$$ -121 -176 -369 -1125 -97 817 -744 -1050 -254 -653 -547 719 44 -635 -192 -303 14 1437 852 -946
4375i46Q47P42m43N77j96j392Q47N44l27K95J36j464J9J478l93k90o2o55k36J729
$$ -946 -99 643 200 777 581 -811 36 580 253 548 684 -780 -761 717 324 34 -28 -683 -919 810
4395H10k46j266M42k64l93J088K12o77Q1J34q83J175J284j762m07J072l52M58
$$ 810 564 -702 -260 -524 -917 171 383 -294 -213 -79 -962 213 1497 -265 -672 400 48 506
4413E06N83j103n40J078l61j29J007q72j297J149N70k72M37q74j093R27R12r31
$$ 506 1089 -14 -554 524 163 34 1041 169 -1128 21 591 319 756 -118 -1211 -284 628 -303
4431c03L25j52p30K15J329n29k50L54r84J02J555k60j275L97K69l83J221k68j367
$$ -303 22 -130 -860 -645 684 155 -95 259 -725 -623 932 672 -603 -206 63 -320 901 633 -734
4450g34P95L93l90M88K51r76n98Q13O4N20j03j420RJ472l66n47M86o55n34R32
$$ -734 61 454 64 552 803 -173 -771 42 106 626 523 -897 -888 584 218 -329 157 -498 -1032 -100
4470a00P03n81j4k12r35R93J098j075j20J92l71Q40L28j037K81O80o61O1J216
$$ -100 603 22 8 -204 -1139 -146 952 -123 -243 -51 -422 418 746 -291 -10 670 9 70 1286
4489A286q50j022Q81j21j55J097p07j095M74L31m64O08j04q23K31M20k04N85M2
$$ 1286 436 -586 295 174 19 1116 409 -686 -212 119 -345 263 159 -664 -433 -13 -217 368 410
4508D10j550J14J890o8q27q6k56K28Q37j54n50N36m57o99J042P19r93m21J10j89
$$ 410 -1140 -1026 864 796 -31 -117 -373 -145 692 538 -12 524 67 -632 410 1129 136 -285 -175 -364
4528c64P49Q64j751j72O64k36K41K77k62p94M78o1J89R38j211o68P35J022o44
$$ -364 385 1249 -502 -674 -10 -246 -5 272 10 -784 -306 -367 -178 760 -451 -1119 -384 638 -6
4547fK59j10q68P56N75n52J01M17j000k00J502k74l75J51p81K29J450p53j134
$$ -6 253 143 -725 31 606 54 155 572 -428 -628 874 600 225 376 -405 -176 1274 521 -613
4566f13N47M23m59M95J77j151K39L5k23P60P74j982j06J261q5rM03j061r7J208
$$ -613 -66 357 -102 393 570 -581 -342 -307 -530 230 1004 -978 -1084 177 92 83 486 -575 -672 536
4586E36l69k89Q77o71j220J566O16o29j05l95m33J112L16r79j1K49m93J46P43
$$ 536 167 -122 755 84 -1136 430 1046 417 312 -83 -516 596 912 -67 -78 171 -322 -176 567
4605E67m42k29q2l37K33J167j030n31M37J26j45Q85o03p04M45P55r09O60M14j109
$$ 567 125 -104 -186 -523 -290 877 -153 -684 -247 -121 -266 619 16 -688 -243 512 -397 263 677 -432
4625d32L8P14J94n3r8p44M44J034o97n57M79k57q76J296l47n50O60l65q58J123
$$ -432 -394 320 514 461 363 -381 63 1097 400 -157 322 65 -811 485 138 -412 248 -117 -975 148
4645A48L87j132N0M19l15K18P15r70m20J173o52L55J119j021q96R75J36j17M49
$$ 148 535 -597 -547 -128 -443 -225 490 -480 -900 273 -379 -24 1095 74 -822 153 289 172 621
4664F21n67q84J018N96p58M00R5q22O3Q13m65o0Jq84M47P66p42L6J57k22l64R55
$$ 621 54 -830 188 784 26 426 521 -301 -238 575 110 50 51 -833 -386 380 -362 -326 -169 -391 -755 200
4686B00K9o49N07m63j97Q31N01j326K09O58l45N06L47j131L05O31l23j32O56q06
$$ 200 229 -420 87 -376 -573 258 759 -567 -358 300 -45 461 808 -323 -18 613 290 158 814 8
4706Hn08Q07j85Q1K51n38p79J136N9o35K65n5m02L74L04p79O0O85r13N92Q60m03
$$ 8 -500 307 122 203 454 -84 -863 273 332 -303 -38 -93 -495 -121 183 -596 -536 149 -764 -172 688 285
4728B85p72N21N4m13J471j333k34P66K2n03P24k6q77J19N79l58N99J70j263K35
$$ 285 -487 34 88 -325 1146 -187 -421 345 367 -136 588 562 -315 -196 383 25 624 794 -469 -234
4748b34P14m89k35O38q91j38O65j76n3N53q80k63R94N1n02R4K8k41N40N38p93
$$ -234 480 -9 -244 394 -497 -635 30 -146 -199 354 -526 -789 205 256 -246 -152 -124 -365 175 713 -80
4769h0r9N83p46M47R85p76n63L77j75J78O82r17m43N73M17n88L54j7j105Q22J7
$$ -80 -179 404 -342 105 1090 314 -249 128 -47 131 813 -104 -547 26 443 -145 209 192 -913 -91 -74
4790g4k80J03O42j503P33O38n37r6L01o00M83R29m30o69Q71k93p85R93L48p85
$$ -74 -354 -251 391 -1112 -379 259 -278 -374 -73 -673 -190 739 309 -360 511 218 -567 426 774 -11
4810a1j57K74k14O15o6r30J97P51m74O0L61q69J1M95q7m1L92n89n21Q09J33k42
$$ -11 -168 106 -108 507 441 -489 -292 459 -15 45 406 -463 -452 43 -44 -85 307 -282 -803 6 139 -103
4832a03M48o97n08J004L36p56J81Q14o92l31J114o94O9q5l24L23P28m75o16M04
$$ -103 345 -352 -860 144 480 -276 -95 719 27 -304 810 116 185 100 -224 99 827 352 -264 140
4852A40p2l90L09L92r22O37j58k38M24K55j217M87N05l11K09N7r39O80L73l95
$$ 140 68 -322 -13 379 -543 94 -64 -302 122 377 -840 -353 152 -159 50 107 -832 -152 221 -174
4872a74J9O97o01l91Q95L2l97K4p9l77O93J5n24K84K00o57M05L49o02l80P92n00
$$ -174 -155 542 -59 -450 445 477 80 104 25 -352 341 356 -168 116 316 -341 64 413 -189 -569 223 -277
4894b77J96L07n42l98N07L5j00O39l44m01P38n24l31M65K05p21M62K96r1n6M74
$$ -277 -81 226 -316 -714 -207 -172 -272 367 23 -378 360 -164 -495 -30 175 -546 -84 212 121 65 539
4915E39j055P91N36q40K64J92k77k97P38o83J20L36o48k47O93K00r69L80R5j69
$$ 539 -516 275 811 -29 235 427 150 -147 591 -92 28 364 -284 -531 162 362 -607 -227 -132 -301
4935c01K89J66o18K99N85o81P5O46m75l50N75J1p3J38j54n07O32O9k20K51l07
$$ -301 -12 154 -464 -165 420 -261 -186 460 -15 -365 210 221 148 286 132 -375 257 326 106 357 50
4956E0m53P70J16n99K91k98l46M49L84n01j33J9N8o3M53j71n23N55l60O0N54k47
$$ 50 -403 367 483 -116 175 -123 -469 -20 364 -137 -270 -251 -193 -256 197 26 -497 58 -302 -242 312 65
4978F5o20M99K39l16K31L38o89N23J18n00K51L42o41O6O68o05J27N21o83m96J033
$$ 65 -555 -56 183 -133 98 436 -253 270 388 -112 139 481 -160 -94 574 -31 96 617 -66 -562 471
4999D71k59m92M46l77k85M85j38m26N45K61q27O75j87j72q8L30j37P4M16l52k50
$$ 471 212 -280 166 -211 -496 -11 -149 -575 -30 231 -596 79 -108 -280 -368 -38 -175 -101 315 -37 -287
5020b87P46o43J8M90j54l90J75M15n23O61l40q03Q42L02l55l44M28n90L38K17
$$ -287 459 -184 -166 324 170 -220 -45 370 -153 508 168 -635 207 509 154 -190 238 -352 -14 203
5040B03m08j20O32o94j81P22j87k22N04p22j32R12J88n67N5J81k86L82J33k65
$$ 203 -205 -325 307 -387 -568 154 -33 -255 249 -473 -605 307 495 -72 -17 164 -122 260 393 128
5060A28j33J12k52N78j34n71j78Q28o3l08K11k83l39L70J79n32K61L31p16L11
$$ 128 -5 107 -145 433 299 -272 -450 378 315 7 218 -65 -404 -34 145 -387 -126 205 -511 -200
5080b00M88p27K85N08r23K30P30m79j47Q06n30l99N94J2l04L99l29j86P24k04
$$ -200 288 -439 -154 354 -569 -339 391 -88 -235 571 41 -358 236 248 -56 343 14 -172 552 348
5100C48q70J026k46j53O8R5n97K82K37m65q3N90n30l38R33k79r5J05k57m9M83
$$ 348 -522 504 258 105 173 268 -329 -47 190 -275 -358 232 -298 -636 297 18 -77 28 -229 -278 205
5121B05j50k99M07K23o40K48L35k77J40J05n72L33L90m18K26K24l55mL09q25L25
$$ 205 55 -244 163 386 -254 -6 329 52 192 297 -275 58 448 30 256 480 125 121 430 -395 -70
5142g0O18n74l07O38k07p48Q96k23n24M17J36n64L74L76m02QL48l52P3K09r7k36
$$ -70 548 -26 -333 305 98 -650 246 23 -501 -84 52 -512 -138 238 -164 -156 192 -160 -87 122 25 -211
5164b11M20l09j86M80J96n53K87K46m04L24R0m08L50l8n97J63O02n90j06L62k63
$$ -211 209 -100 -286 194 390 -163 124 370 -34 290 380 -28 322 284 -313 -150 452 -138 -244 118 -145
5185a45J27N8k86k14N89p1n85M99J91n50K94L96l99M63r0m01J91K38n40N64R0
$$ -145 -18 40 -246 -460 129 58 -527 -28 163 -387 -93 303 -96 367 277 -124 67 305 -235 329 419
5206D19o57K83K67l97j47O21o01j66Q10m50l7K03k57k09L07R9o02L24M45p47L73
$$ 419 -238 45 312 -85 -232 389 -212 -378 432 -18 -55 148 -109 -318 -11 88 -514 -190 255 -492 -119
5227a19J74l07J99o9P3j34N91n35l19L93j21o8P61m25l37N71j00Q2k98K78q07
$$ -119 55 -252 -53 -122 -49 -183 408 -127 -446 -53 -174 -242 519 94 -243 328 228 310 12 290 -517
5248e17O77L12p12N02j13k90r8N07n31j35N37n33j80Q08l71j36L42l15L7J98l0
$$ -517 160 472 -240 262 149 -141 -239 268 -263 -398 139 -394 -574 234 -137 -273 69 -246 -209 -11 -41
5269d1j78L36Om90N76K29m98J53J49l54L20K52m97j15P13m37l20P14k64o07M95
$$ -41 -219 117 123 -367 209 438 -60 93 242 -112 208 460 -37 -152 561 124 -196 518 254 -353 142
5290A42m96R3M92L7q15O29k18J1k16N45m58l7O13n44l0M24j90k22K76l81L29O09
$$ 142 -354 -261 231 268 -547 82 -136 -125 -341 204 -254 -291 322 -222 -252 172 -18 -240 36 -345 -16 593
5312E93l34n93Q19j7m36L66J04p85J76K34n82M50R3k92N9N20o15j04J49l33J59
$$ 593 259 -334 485 468 32 398 502 -283 -107 127 -455 -5 88 -204 -145 375 -240 -344 -195 -528 -369
5333c69N18l93M3M43p84J57P19k61j09j01j31j4P31j14m36N3K79m04K34J85k70
$$ -369 149 -244 -201 242 -542 -385 334 73 -36 -137 -268 -282 449 335 -101 -48 231 -173 61 246 -24
5354b4o3K85j33k47N27n82K69J79n4k07j34N6j19N65l45l04J69l0n2J21J65n7
$$ -24 -87 198 65 -182 345 -237 32 211 157 -50 -184 -128 -247 318 -27 -331 -162 -192 -244 -123 42 -15
5376a5j28K92k10j07J06J61o13P14k46J44K43l51l7P8L15n88J81K39l96J68L17
$$ -15 -143 149 -61 -168 -62 99 -514 200 -46 98 341 -10 -47 31 346 -242 -61 178 -218 -50 267
5397B67j35l80J0k86L30K00j87K21Q0k26j08J97K28m25K06L05n09K45K21m38J55
$$ 267 132 -248 -238 -524 -194 6 -181 40 120 -106 -214 -17 211 -214 -8 297 -212 33 254 -184 -29
5418b9M89o71L71L45j77k70L87n51J32P45p55k65K68m6l27L95j43k54J15K18k2
$$ -29 460 -211 160 505 328 58 445 -106 26 771 16 -249 19 -27 -354 41 -102 -356 -241 -23 -45
5439d5K38o05J6R3L20P2qj54j32M26k3k88o0L35j10k02M62k44j81L04k01J03P5
$$ -45 193 -412 -396 -303 17 89 81 -73 -205 221 198 -90 -150 185 75 -127 335 91 -90 214 13 116 191
5462A91N4m96L7L7m6J91n8j69l4J95j40QO79r03oM02J88p6p5j85J8L52n0k40N81
$$ 191 245 -251 -214 -177 -223 -32 -90 -259 -293 -98 -238 -230 449 -454 -460 -58 130 54 -21 -206 -188 164 114 -126 455
5487D55l41n17O83l10pM70k43m62J29P24n89j21M57k25j40K89k92l2J2J29J19
$$ 455 114 -403 280 -30 -37 433 190 -272 -143 581 -8 -129 328 103 -37 252 -40 -72 -60 69 188
5508A88M6j15n37N6L11n4r5J61j80K57N6l05K51J34M6n35N90j63n4M5j50j38O14
$$ 188 234 119 -418 -362 -51 -105 -200 -39 -219 38 94 -211 40 174 220 -315 275 112 58 103 -47 -185 429
5531D29l75K4Ml34K39J05K25k61k93K5Q5L55k72k31m41P18j65J06K13q79N37J58
$$ 429 54 78 82 -252 -13 92 317 56 -237 -212 -127 228 -44 -275 -716 2 -163 -57 156 -723 -186 -28
5553b8j06j47M73l09l92L27M26l11K97j72m96Q04l17J43k75K18o4J19J42k71N
$$ -28 -134 -281 192 -117 -509 -182 244 -67 230 58 -438 366 49 192 -83 135 71 190 332 61 66
5574F6J7n99N8O33k05l85J16R1n4L94k8n28J81L00J2O0P2m16R5M79m94M61j96
$$ 66 83 -516 -458 175 -30 -415 -299 -208 -262 132 104 -424 -243 57 69 129 201 -215 -120 359 -135 326 130
5597A30m18J87K80J89k74K08k19k37N12J08m51P9p6L9k5j31P5k12L80m30M76j33
$$ 130 -288 -101 179 368 94 302 83 -154 358 466 15 94 18 57 32 -99 -24 -236 144 -286 190 57
5619E7pl28L20k75R3N91o75l73N44K72j93Q0J71o31K65K14j0M4J75n01M9L60o21
$$ 57 50 -278 42 -233 -140 451 -224 -597 -53 219 26 106 277 -354 -89 125 115 159 334 -167 -118 242 -379
5642c79O35j64j63k9L71j98l42K83l13n4N53q6j75J84P7o56P21k19j19j16M2k54
$$ -379 256 92 -71 -100 271 73 -269 14 -299 -353 200 114 -61 123 200 -456 265 46 -73 -189 -147 -401
5664d01L32L7l59M49O5J8J73l7j88j93L15o01O16N4k02l47M36k7j21J03Kl43l24
$$ -401 -69 -32 -391 58 123 141 314 277 89 -104 211 -390 226 280 78 -269 167 140 19 122 124 -219 -543
5687e43Q05m14J19j26p4J64K52l4j91pm58K92M86j23l42J94m8q4L33J73l27L02
$$ -543 262 -152 -33 -159 -233 -69 183 149 -42 -49 -507 -215 271 148 -194 0 -48 -132 201 374 47 349
5709C49l01J35Q7J2k84j89M71j99j28R4o00L27J51L6k05J71k04J2O07j83K00j78
$$ 349 48 183 270 282 -2 -191 280 81 -47 47 -553 -226 -75 -39 -244 -73 -277 -265 342 159 359 181
5731A81p8q06Q51J11k37k42L43m25K75M06l24j3K92l20j84Q60n91n23L50O6R7
$$ 181 103 -703 148 259 22 -220 123 -302 -27 379 55 42 334 14 -170 690 99 -424 -74 -8 89
5752H9j69L59p17N58J21k32J02k06o0l43N50K94l92J12k15j80M83J1k05K88l01
$$ 89 -80 279 -438 120 241 9 111 -95 -155 -498 52 346 -46 66 -149 -329 154 165 -40 248 -53
5773e3J1LM50k61r3L16n99O37q6k91k14J79k16L31M11o03p2N57n95J82J92m73
$$ -53 -42 -39 411 150 57 373 -226 411 325 34 -180 -1 -217 114 525 -78 -150 407 -188 -6 186 -287
5795b87P1K0J30j96M71l22j52L65K07j96j75o2J66j01M48m05J4j62P9j72P80o64
$$ -287 -216 -196 -66 -262 209 -113 -265 100 307 111 -64 -126 40 -61 387 -18 -4 -166 -87 -259 521 -143
5817a43M2oN7P9L19n4m59L99J2l29J51O2o60K65L23l51O18m16l33J66K44j08O3
$$ -143 -101 -107 -50 29 348 294 -165 234 246 -83 68 130 -530 -265 58 -293 325 -91 -424 -258 -14 -122 -59
5840e9r6K34n89N30Nk04J48l21J53N80j83l81K69k45J79j36N43m67K52P4p16M74
$$ -59 -155 79 -510 20 25 -179 -31 -352 -199 381 198 -183 86 -159 20 -116 427 -40 212 286 -430 44
5862D4O1P2j02k31k10M80k01K19n86P17n04J18J28j05m6J08K36l08K80M4n77K06
$$ 44 105 177 75 -156 -366 114 -87 132 -454 263 -241 -123 5 -100 -146 -38 198 -110 170 214 -363 -157
5884a57J45N3j47L45m24j38L63J20l18N65n18oL6K86l53J34P1j28K89N5j28k52
$$ -157 -12 41 -106 239 -185 -323 40 160 -158 407 -111 -117 -81 205 -148 -14 57 -71 218 273 145 -107
5906a07Q2o4L14j06r0j27L6K55k23J30k21m76Q22j59J44K7j05m65N51J42j11o3
$$ -107 -25 -89 225 119 29 -98 -62 193 -30 100 -121 -597 225 66 210 237 132 -333 218 360 249 186
5928A86j93j94J72M09m68k0N1k2j58O61n06QJ50M3k81L51r5mm4j72j13K93J71
$$ 186 -7 -201 -29 380 -88 -108 -57 -79 -237 424 -82 -74 76 119 -162 189 94 90 46 -126 -239 54 225
5951B25k26n9k98K02K88M39m35l79J93K68J4O7l64j87K17L73k79r8L6m7M00m22
$$ 225 -1 -60 -358 -156 132 571 136 -243 -50 218 232 299 -65 -252 -35 338 59 -39 -3 -50 350 -72
5973g2J47J31l28k00p1L24K71j01q2m96K66L19k63J58L24m66P2J42R8m22O09l11
$$ -72 75 206 -122 -322 -393 -69 202 101 19 -477 -211 108 -155 3 327 -139 -67 75 173 -249 360 49
5995D9PK62J30o82l1N16Qj36K14m80J90M32l10k19K03l21j80L73L90l93k66J14
$$ 49 56 318 448 -234 -265 251 259 123 337 -143 47 479 169 -50 153 -168 -348 25 415 22 -244 -130
6017a30j79M21j20l94J02m3J24pN28m21k96M59L4j65P29n02K3q7l15O47j04k24
$$ -130 -309 112 -8 -402 -300 -343 -219 -226 302 -119 -415 44 78 -87 642 140 163 76 -239 408 304 80
6039H0k55Q0L11j99j74j46m2M43n75K83K99r2j92j70N75k78p1K86l08J63R2j34
$$ 80 -175 -95 216 17 -157 -303 -345 98 -477 -194 105 13 -179 -349 226 -52 -123 163 -145 18 110 -24
6061b4N3J3j52J21J79k2j98j13K03j11K40K74n46K27k57k7K87O7j95j19J10M3
$$ -24 29 42 -110 11 190 168 -30 -143 60 -51 189 463 -83 144 -113 -140 147 214 19 -100 10 53
6083E3J70k00k55O1J72k55L57l66K53j60K2m3J58J19J16l63J42L40k25N3r6j78
$$ 53 223 23 -232 -171 1 -254 103 -263 -10 -170 -148 -191 -33 86 202 -161 -19 321 96 149 53 -125
6105a25K73J32m53RK11J87r8L66j84m75K27k3K26L48n69m27L01J46o32P80k21
$$ -125 148 280 -173 -164 47 234 136 502 318 -157 70 47 273 621 52 -375 -74 72 -560 220 -1
6126ak00m5N82m93P3L80n73R7L01K85l61J03j74l24M89j39l5L45j81l55L91L10
$$ -1 -201 -246 336 -157 -84 296 -277 -180 121 406 45 148 -26 -350 139 0 -35 310 129 -226 165 475
6148D75o10P3K08k48Q9J51k60j15J38J88k90K58J41k45J61J61l37M78k80j61J38
$$ 475 -135 -62 146 -102 -13 138 -122 -237 -99 89 -201 57 198 -47 114 275 -62 416 136 -25 113
6169A13k7j29r9O67o71L11J8j35Jk1m74Q7P33m87Q6r7k26L56J89l42j10o1K84
$$ 113 86 -43 -142 525 -146 165 183 48 49 28 -446 -359 374 -113 -27 -124 -350 6 195 -147 -257 -318 -34
6192c4J50M4n3l67J8K42O8j97M12p10M03j68J23J83J51l41J90p9K45k33N48q88
$$ -34 116 160 107 -260 -242 0 68 -129 283 -427 -24 -192 -69 114 265 -76 114 35 280 47 595 -293
6214b93K33OJ24K61k00r6m3N9j12M2R1M1j63k45J3K0O5M30l96q0N50k80l80N58
$$ -293 -60 -54 70 331 131 35 -8 51 -61 -19 72 113 -50 -295 -282 -262 -197 233 -163 -243 307 27 -353 205
6238B05j73k73Q4N03n10L31J34p06K50J36k07M01p4J75J26m22K5j09R2Q4o36O25
$$ 205 32 -241 -157 346 -164 167 301 -405 -155 -19 -226 175 101 276 402 -20 5 -104 -12 72 -564 61
6260F1L11o68J49P6r7J68j94j8M1L28m53j7M6j27K30J81k73J73J76k36J09P4j3
$$ 61 372 -296 -147 -71 -168 0 -194 -212 -171 157 -296 -313 -267 -394 -164 17 -256 -83 93 -143 -34 40 27
6283B7k71J88k14K62M68l44m30M29k83K93J08q7j51K22k20J09n5L59l77k63M90
$$ 27 -244 -56 -270 -8 460 116 -314 115 -168 125 233 146 -5 217 -3 106 51 410 33 -230 260
6304B60l23K61m10J58J53L17l38j87L2K39r3K0k48J70J41j86J59j60L75k63K0
$$ 260 -63 198 -212 -54 99 416 78 -109 -77 162 69 89 -159 11 152 -34 125 -35 340 77 97
6325I7k15J80j12L9L8o6O6Q3m71M42j24o3J99K06l18K53l71J64l70L03J14K4J43
$$ 97 -118 62 -50 -11 27 -39 27 110 -361 81 -43 -106 93 299 -19 234 -137 27 -343 -40 74 98 241
6348B41m63L68J20j37j80m2k52J42O72r2n76L72p0q9K64k95j05O2M8K76m85J21
$$ 241 -222 146 266 129 -51 -93 -345 -203 469 377 -199 173 103 14 278 -17 -122 -60 -12 264 -221 -100
6370a00m5r7OL66l40J43k57K10K21k86K46J32m65k08O56m0k98L6K74m94L65J18
$$ -100 -145 -242 -236 130 -210 -67 -324 -114 107 -179 67 199 -266 -474 182 142 -156 -120 154 -340 25 143
6392A43l21K3K51j29J38L45o04j53J88q9j4K73j7k7j52J88k57M99j74r8J37k6
$$ 143 -178 -155 96 -33 105 450 -154 -307 -119 -208 -222 51 34 7 -145 43 -214 285 111 13 150 124
6414A24l7l34J36K28k26O1Q9L6K93k42m5J32k96L32m7l37J53o1J62Oj62p2N8K12
$$ 124 87 -247 -111 117 -109 -48 41 77 370 128 83 215 -81 251 204 -133 20 -41 121 127 -35 -107 -49 163
6438A63l55J28Q6o0J39m7j63l7l1Q7K74r8J09j93O0k19M36j33J3k39k1NN26m56
$$ 163 -192 -64 22 -38 101 54 -109 -146 -177 -90 184 86 195 2 62 -157 279 146 159 -80 -101 -96 430 -26
6462b6J08k44K37p6N9K37j79K5k50j72L41l1q1J57j24O9J31n16M71J56j54j52
$$ -26 82 -162 75 -1 58 295 116 141 -109 -281 60 29 -52 105 -19 50 181 -335 136 292 138 -14
6484a4k73M80j68k24L33o1m23K21j94L55P7k90L24M3l32P2J25j9j09L9j22n8N43
$$ -14 -287 193 25 -199 134 73 -350 -129 -323 32 109 -181 143 186 -146 -74 51 32 -77 -38 -160 -218 325
6507C25l32Kj9K74j10k11K04l96P1O6L12l17J90J56k33Nn0K14j31q1j25M69n41
$$ 325 -7 -5 -24 250 140 -71 133 -263 -192 -126 186 -131 59 215 -18 -13 -63 151 20 -61 -186 283 -258
6530b58J86K78M1k08j25lK10k98K97Q4J59l40N7j95M2J78j67J7M3q0J08p0J18
$$ -258 -72 206 247 39 -86 -89 121 -177 120 204 363 23 80 -115 -73 105 -62 -45 -2 -82 26 -44 74
6553G4l67K86P7k35j37L66J46j2o2l18J6L46l4O8j22k88N34j81n3j3Mk35L06N6
$$ 74 -293 -7 70 -165 -302 64 210 198 136 -182 -166 180 146 214 92 -196 338 157 104 91 95 -140 166 222
6577B22k19q1P5j69J49K06k66J47M8Qj00Njr9jK53k70r1L11j24j96K3L38k49j87
$$ 222 3 -78 -3 -172 -23 183 -83 64 112 120 20 25 24 -75 -76 177 -93 -184 127 3 -193 -170 168 -81 -268
6602b68o1N43k99J46J00J05k16L8lj15K30j20j83O9j3m1J76K30r9k35L23j01m64
$$ -268 -329 214 -85 61 161 266 50 88 85 -30 200 80 -103 -34 -47 -88 88 318 219 -16 307 206 -258
6625b58M34m6l13K17q2R2j17j03K85nK0l9k64J99j30L53k00k15L63L2l35j96J88
$$ -258 176 130 -183 34 -48 44 -73 -176 109 104 124 85 -179 20 -110 243 43 -172 191 223 -112 -308 -120
6648a20M30q8k33o0K51k11R1j81K47j53J71m07J93OJ27Q5n06K85J76J50k30n0
$$ -120 310 222 -11 -71 180 -31 60 -121 126 -27 144 -263 -70 -64 63 148 -358 -73 103 253 23 -27
6670b7K76k41j41K18j16k3L0L4K4O4j13J33J7r7K16j14j36p1l7K42m0J53l72J76
$$ -27 249 8 -133 85 -31 -54 -24 10 34 98 -15 118 135 38 254 140 4 -67 -104 138 98 251 -121 55
6694E5j54j30j07K21L02j82k00J79L8L1j77L25k08j09N3r4K54J02r9k10J95J67
$$ 55 -99 -229 -336 -115 187 5 -195 -16 22 53 -124 201 -7 -116 -63 -157 97 199 100 -110 85 252
6716B52k52O8o9L04j55j45Mj29J43q0mJ76J07m96n2J73J88l5L2R3r2J08k72J02
$$ 252 0 68 -1 303 148 3 7 -122 21 -59 -63 113 220 -276 -328 -155 33 -2 30 123 31 139 -133 -31
6740c1L40l19l4J09j08m2O1k6L37l45r9L07J12p7l62J83pj03r1K45j63P6j10K28
$$ -31 309 -10 -44 65 -43 -85 -24 -50 287 -58 -157 150 262 185 -177 6 -1 -104 -195 50 -113 -37 -147 81
6764H1N1l17K4M1J54j62Jj84O25r9k92J28k80M01j80O8O5l18L16k06r4M98jj32
$$ 81 132 -185 -161 -120 34 -128 -127 -311 314 215 -77 51 -229 172 -8 60 125 -193 123 -83 -177 321 320 188
6788A88k53k26L22k9n8J41j3R9m65K7O38l76J59j75j42K08J32k77K92ol15m6K36
$$ 188 -65 -291 31 2 -56 85 72 171 -294 -267 371 -5 154 -21 -163 45 177 -100 192 186 -129 -175 61
6811F1k7k82n9M19k26L11j26P4l69K76J21j54L89n80N65l08k71j40R7J87L4r3
$$ 61 34 -248 -307 112 -114 197 71 145 -224 52 173 19 408 -172 393 85 -186 -326 -229 -42 -8 -101
6833a01J67mL1l14K23O8l0N4J27k6l41J39K01j95r2j54J85R9Q1K1o5n0k22L09
$$ -101 66 62 93 -221 2 70 40 94 221 195 -146 -7 194 -1 -93 -247 -62 37 118 139 74 24 -198 111
6857A11j60N4J23m2k7P8j48J48J6j36m8k07N77n11J89J15j01J67l93k0P8L7J09
$$ 111 -49 5 128 86 59 137 -11 137 153 17 -31 -238 339 -172 17 132 31 198 -195 -215 -137 -100 9
6880IJ36n4r2K17k44J19k76L07K68n57K93r7j07L22m58J35M1p8j5J13J43P5m4
$$ 9 145 91 -1 216 -28 91 -185 122 390 -167 126 29 -78 244 -214 -79 -38 -116 -131 -18 125 200 156
6903A56l35J76r1O9L11m97lN12k20J26p2j18L00j15m55M83n6j06rJ00o1j17K16
$$ 156 -179 -3 -94 -25 286 -211 -214 298 78 204 132 14 314 199 -256 227 171 65 56 156 95 -22 194
6926A94l80K6M9O3K54m52J79r3L30k00K43j54J32o1l77K46j96K20k84J79j06o0
$$ 194 -186 -160 -111 -48 206 -246 -67 -160 170 -30 213 59 191 130 -247 -1 -197 23 -261 -82 -188 -248
6948b48L48k97J08K93j94p4L88m21L20j70r9j53J60J50N6o2k6m1p1J81l53K46
$$ -248 100 -197 -89 204 10 -64 324 -97 223 53 -46 -199 -39 111 167 105 79 38 -33 148 -205 41
6970D1j0o2K28k05j91K61J41l32q4J41p7L68J69k07m05L96j78j33L46l78M34k27
$$ 41 31 -31 197 -8 -199 62 203 -129 -213 -72 -149 219 388 181 -224 172 -6 -139 207 -171 263 36
6992C6l40P4L41J87j63L5j28k98L43J25n7j69k03R7J46J72k86J29j19R9K95j82
$$ 36 -304 -230 111 298 135 170 42 -256 87 212 155 -14 -217 -120 26 198 -88 41 -78 21 316 134
7014A34Mj61L00j99k3J71l11J79q4j03K68k05K14m00K31j05P3J48P2k06l5J97
$$ 134 138 -23 277 78 55 226 -85 94 10 -93 175 -30 184 -216 15 -90 -17 131 203 -3 -38 159
7036A59m01K48j1J70j72J12k90M48r6j42l37K33qP8j60K78j30R7j47K51m30K24
$$ 159 -242 6 -5 165 -7 105 -185 263 167 25 -312 -79 -87 -9 -169 109 -21 76 -71 180 -250 -26
7058b6k5L18j79j22K83l78R3J95R1l70P9L07j94k76K01k4K98k21K10k51j96J52
$$ -26 -51 267 88 -34 249 -129 -36 159 250 -120 -41 266 72 -204 -3 -27 271 50 260 9 -187 -35
7080c5r8J92l5rJ9j65K86j2j06j91J34K08O9k31j02j29K08k57J40L19k17J46k68
$$ -35 -133 59 24 15 34 -131 155 143 37 -154 -20 188 257 26 -76 -205 3 -254 -114 205 -12 134 -134
7103a34J97k44L4J86Q2l35L93l73k88M50Qj07K03N0j87K12m4n5n6k33M84l82m4
$$ -134 63 -181 -147 39 121 -214 179 -194 -482 -32 -24 -131 72 122 -65 147 103 48 -8 -241 243 -139 -183
7126a83J47K40k7k26q0l1O6q4L91l76K00j46K39j2J10j84J41j55J7M7j59J2QL0
$$ -183 -36 204 177 -49 -129 -160 -94 -178 213 -163 37 -109 130 118 228 44 185 30 47 94 -65 -53 -45 -15
7150a5J11k61O1J47j70L21r4j09j2L91m55K88j40k17J29q3J95O3k23j9r2J41M6
$$ -15 96 -165 -104 43 -127 194 100 -9 -21 370 -85 203 63 -154 -25 -108 87 150 -73 -92 -184 -43 3
7173CJ52k30k09K21M3L44m21l6N04n55J59L14m5j71k22J62p6L49l34N9N0j55O7
$$ 3 155 -75 -284 -63 -20 324 -97 -133 371 -184 -25 289 244 73 -149 13 -63 286 -48 11 61 -94 -27
7196b7j58K09k72J73K24K21n89K78J2j61kJ52NP3l87K77M3%J42k71M26l99J50
$$ -27 -185 24 -248 -75 149 370 -219 59 71 -90 -92 60 65 138 -249 28 71 71 213 -58 368 -31 119
7219A19l34K04k1m6L49n13J79l2k7J03R2jk04Rj24K91P1j67J53M62o11k6L26l86
$$ 119 -215 -11 -32 -78 271 -242 -63 -95 -122 -19 73 72 -132 -123 -247 44 115 -52 101 563 -48 -74 252 -134
7243a34R8K1L4j2k23K38LJ80j78k20R8J63j81O31n01K82l32j13L43m18L63k27
$$ -134 -36 -15 19 7 -216 22 25 205 27 -193 -95 68 -113 518 17 299 -33 -146 197 -221 142 -85
7265h5l3K96n8Ok15J15q0l7K3j74K22K6k80O4M21l89K46j16M8J74O6l76L71Q6
$$ -85 -118 178 120 126 -89 26 -54 -91 -68 -242 -20 6 -274 -210 211 -178 68 -48 0 174 240 -136 235 321
7289C21n87M05KM7o1R3j43k18K89m92J76J98l45M12n5O8j93J39p3n3k58M19K5
$$ 321 -266 139 141 188 127 220 77 -141 148 -344 -168 30 -315 97 42 110 -83 56 -17 -70 -328 91 116
7312A16k96L76j30q7MJ02n7j76L01m1M45m82j34K24j60Q7k29K92l49J07K32j10
$$ 116 -180 196 66 -21 -17 85 28 -148 153 112 557 75 -59 165 5 92 -137 155 -194 -87 145 35
7334C5j83k02J68R6K1L44m60Q5K19K2Jj00j57L36k02J83j77j66K1J08j65P7M1
$$ 35 -148 -350 -182 -86 -65 279 -181 -96 123 145 146 46 -111 225 23 206 29 -137 -116 -8 -173 -96 -55
7357e5M6j11j55K42KN8Jj81K29r1K00l62Q3R3j97M6J44j55J77L0m28M81k9j38
$$ -55 -9 -120 -275 -33 -31 27 28 -153 76 -15 185 -177 -94 -1 -198 -152 -8 -163 14 44 -384 97 68 -70
7381g0J6N2J4K38n74L83j29N9J07l98N87j67k11J32j70m0K51o9k75L8K72m8Q1
$$ -70 -54 -2 12 250 -324 59 -70 -11 96 -302 285 118 -93 39 -131 -171 80 11 -264 -226 46 -2 79
7404G9Q6n06o4K28L13j55J66m05J49j31K66J46q4j9k00M61l85l40K69K65j44J60
$$ 79 165 -341 -405 -177 136 -19 147 -258 -109 -240 26 172 88 69 -131 330 -55 -395 -126 139 -5 155
7426A55k55M47m58m2n4K62j39j3Q1J4k52L30L7j85K93n22J57Q8J20p0j65J90K41
$$ 155 -100 347 -111 -153 -207 55 -84 -97 -16 -2 -254 76 113 -72 221 -301 -144 -56 64 -6 -171 19 260
7449B60l47K60j11j79J19K23l8k6j06O8k97K94o9l91L16q5J4J88j57J60J09r3
$$ 260 -87 173 62 -117 2 225 187 161 55 123 -174 120 51 -340 -24 -109 -95 93 -64 96 205 112
7471A12j39K24J77n17N9J67k37N9K05k9k49K9M6J1Q2O3p2j60pj40J09P7J30K80
$$ 112 -27 197 374 -143 -84 83 -154 -95 110 81 -168 -139 -93 -82 0 63 -9 -169 -176 -316 -207 -130 0 280
7495B80l57K19L4j1l50L04M91l92k74k05K31j15k7J58j68J36J32L9N0jk57K3K55
$$ 280 -77 142 176 165 -185 119 610 218 -56 -261 -30 -145 -172 -14 -182 -46 86 125 175 174 -83 -60 195
7518A95k61qL17n51J83J76J26J3j45j9qN0J16j48k43P5J06J90j29Q0j75L3o0M3
$$ 195 -66 -74 243 -308 -125 51 177 190 45 26 18 68 184 36 -207 -132 -26 164 35 115 -60 -27 -87 -44
7542d4L6j10J20j21k2J64P7M2k11J14l04J05J50J43k1j34L24m16M51j15k30J5
$$ -44 -8 -118 2 -119 -141 23 100 142 -69 45 -259 -154 -4 139 118 -16 308 -108 343 228 -2 13
7564A3j76J21M39l39pp2j04J39K80q5k64j68L94k81O9N3j44N1J96j34J00J72o25
$$ 13 -163 -42 397 58 51 -21 -125 14 294 209 -55 -223 171 -110 -41 12 -132 -81 115 -19 81 253 -372
7587c72K96j08K97l2j68j06j0J80L8L2k78M06k02o8K97m8Q4r0k48K86p4p5j34
$$ -372 -76 -184 113 81 -87 -193 -203 -23 15 47 -231 175 -27 -95 202 154 238 148 -100 186 112 37 -97
7610i7L05K11o54K34K2m3K05j63r4O0pk99K89K9o3O5j97J57k83N06r1j79j11J36
$$ -97 208 419 -235 -1 21 -22 183 20 -74 -14 -21 -320 -31 -2 -65 0 -197 -40 -323 183 92 -87 -198 -62
7634f2k17M84j41j50K59k89J06L02k53k44J93q0N8R3K70l23K09l35L13k61q4K71
$$ -62 -279 205 64 -86 173 -116 -10 292 39 -205 -12 -92 -34 59 329 6 215 -120 193 -68 -152 119
7656A19l25K21J40K28l17j7k11J32M1J42k66O0M0m9K07n7n9KL4j75P3L06k79j61
$$ 119 -206 15 155 383 66 49 -162 -30 11 153 -113 -53 -13 -62 145 88 29 31 65 -110 -37 269 -10 -171
7680a71j15L42J89J38l88k3J62o6J42j75j20p5K88k90K65k09k9K87m74P21o18
$$ -171 -286 56 245 383 -5 -28 134 68 210 35 -85 -160 128 -162 103 -106 -135 152 -322 399 -219
7701b19M37j42j33L34j95j63L67k40l2j06K77j6k37J11J51q6j87q3K87k64r9N
$$ -219 218 76 -57 277 82 -81 286 46 14 -92 185 169 -68 43 194 108 -79 -162 125 -139 -238 -233
7723b33J81N4k35J85K37k5k93j77K44Q4J83n23L34R6l76L48k89J65R8n35O51l69
$$ -233 -52 2 -233 -48 189 164 -129 -306 -62 22 205 -318 16 112 -264 84 -205 -40 58 -477 174 -195
7745a95J41Q8L6l5l00J48J51n0j49L28o7l18L67j97j87K28m07N58m2K01m95o7
$$ -195 -54 34 70 35 -265 -117 34 -16 -165 163 96 -222 145 -52 -239 -11 -418 140 98 299 -196 -263
7767b63K62j02K48k85J4J57j53K11n5P7P0j69QJ57m8K24l50K5nJ12l18L86k94
$$ -263 -1 -103 145 -140 -126 31 -122 89 34 111 181 12 20 177 129 353 3 28 23 135 -183 203 -91
7790i1j66L13m4l0k50L37j66L10M8k59j79R9l0p4K65mk45K68k07N0L47r9l33J60
$$ -91 -257 56 12 -18 -268 69 -97 213 261 2 -177 -78 -108 -182 83 79 -166 102 -105 -55 292 193 -140 20
7814B0Q0J05l38L39k18K4M7j97P5j01o6M3J7J54Q2p5k0m6M4n3L52o12J19k5K45
$$ 20 100 205 -133 206 -12 12 59 -138 -63 -164 -230 -187 -170 -16 66 -9 -29 -75 -31 -84 268 -344 -225 -250 -5
7839ej04Q5n2O1k4k9K26k23J04j03j1J04K66n85K69J71j15j71P2N16n51O4K34
$$ -5 -109 -24 -76 -15 -39 -68 158 -65 39 -64 -75 29 295 -290 -21 150 35 -136 -64 452 -99 -35 199
7862A99l60N23k67k81p2K97J1k36L47l87j2M92l25l1M11k96m99O67k04rq7K49
$$ 199 -161 362 95 -186 -258 39 50 -186 161 -226 -238 254 -71 -102 309 13 -486 181 -23 -32 -119 130
7884A30p1O2K07l39n0j2n7J49K01m24j6M78l05L19l63J51J04J89k10m45L50o6
$$ 130 59 121 328 -11 -61 -73 -130 19 220 -204 -220 258 -47 272 -91 60 164 353 143 -302 48 -18
7906a8m25N69l60K26K78j05j97l13N12l3k03r2J30R9J87j60k55K87q5L45r0l17
$$ -18 -443 126 -234 -8 270 165 -32 -345 167 134 -69 -161 -31 68 255 95 -160 127 42 387 297 -20
7928b0o8K59n7Pj95m9k65J53L84m8j09J79k27J9L15n47J53L36l77j01M10j31J75
$$ -20 -88 171 114 121 -74 -123 -388 -235 149 101 -8 171 -56 -37 278 -269 -116 220 -157 -258 152 21 196
7951A96k01J23k07J36M2PJ60r6l04K24L0l52K35J28k66K53k21j50J88J03k8R4
$$ 196 -5 118 -89 47 89 96 256 160 -144 80 110 -242 -7 121 -145 108 -113 -263 -75 28 0 94
7973I4k26Q4L33k47NK5j42J34k33J8L12j35p4j34j35L34p0j9k0J87ol18M62r2
$$ 94 -132 -48 285 38 43 68 -74 60 -173 -155 157 22 -52 -186 -321 13 -57 -76 -96 91 85 -233 229 137
7997A37m4j81p8J22J43%n0k81L02K9J19j01l25J60K6K50j1l71J91n29M76j01Q0
$$ 137 93 -88 -166 -44 99 99 49 -232 70 99 218 117 -208 -48 -22 228 217 -154 37 -492 -16 -117 -37
8020c7p4J94k22N65l43l11O70m66p7J00Q3m15K19K74j92K20l67L8K23N7j13m6
$$ -37 -111 83 -139 426 83 -228 442 -24 -101 -1 82 -333 -114 160 -32 188 -179 -141 82 139 26 -20
8042b0L8j05l17N16k80P6P0L43n23K12j15m8J22J56k97O6K9j97K82J73j38k06
$$ -20 18 -87 -404 112 -168 -92 -22 321 -202 10 -105 -153 -31 125 -172 -106 -77 -274 8 181 43 -163
8064a63L62k80K91m0n28J23K23L35m23q2M58k24o8k83K77M6k17J66M21k42n49
$$ -163 199 -81 210 170 -358 -235 -12 323 -100 -182 276 52 -16 -299 -22 24 -193 -27 394 152 -397
8085c97O99l09j85L68m29j01J54P3p8j51O50k77j14M09N0l94J72J77l11J28K33
$$ -397 302 -7 -192 176 -253 -354 -200 -127 -205 -356 294 17 -97 312 362 -32 140 317 6 134 367
8106C67n12J73p1n6J76J72P3k68L84k90l6j29j87n4L49K0l04K30N1l41M27m50
$$ 367 -145 28 -43 -99 77 249 322 54 438 148 112 -17 -204 -258 91 111 -193 37 88 -253 174 -276
8128b76L37J0J23n97rN84k83K30j64k3j27O01k41k14K7l29M6L74j03N8k7L1q2
$$ -276 61 71 194 -403 -412 172 -111 119 -45 -68 -195 406 165 -49 -22 -351 -305 69 -34 24 -3 28 -54
8151e4K14M6j73j00M30l60M8j10J90L31l39l71M18j9m2q2l94j28L48K80k57L8
$$ -54 160 206 33 -67 363 3 51 -59 131 462 123 -248 170 151 109 27 -367 -495 -147 133 -124 -86
8173h6K60Qj00n5j38N7J7j26K80o2j71m8O6N37j58k06q8j5
$$ -86 174 182 82 27 -111 -54 -37 -163 117 55 -116 -164 -98 439 281 75 -13 -28
8191b8
$$ Imaginary data points
##PAGE= N=2
##DATA TABLE= (X++(I..I)), XYDATA
0@%%%Oj4QqJ6j6J6k4L8m6M8n6P5r1J02j21J47j72J95k25K63l02L43l88M43n04
$$ 0 0 0 0 6 -8 0 -8 8 -8 8 -16 22 -24 24 -32 43 -48 54 -67 80 -92 103 -122 141 -161 182 -206 237 -267
29b67N64o33P15q01Q90r92J107j230J364j512J677j857K052k270K514k788L093
$$ -267 297 -336 379 -422 468 -524 583 -647 717 -795 882 -975 1077 -1193 1321 -1467 1626
46A626l439L836m296M835n468O238p198Q418j0034J2288j5640K1135l1645N8478
$$ 1626 -1813 2023 -2273 2562 -2906 3332 -3866 4552 -5482 6806 -8834 12301 -19344 39134
60C9134k41570n02135P75545N14144n81679m75651M83763L62377m63547l34098
$$ 39134 -202436 -704571 70974 585118 3439 -472212 11551 373928 -89619 -423717
70d23717N44403L84419n81035m97532N30668N41731l77458m70622K44236L17505
$$ -423717 120686 505105 -75930 -573462 -42794 498937 121479 -349143 -104907 212598
80B12598j85512j86787K32712J54337k99265k19272L12508K81178k41210k52741
$$ 212598 27086 -159701 73011 227348 -71917 -291189 21319 302497 61287 -191454
90a91454J45880J13953j06408M3286J51544j27334k42544Q7720K96180P500k80030
$$ -191454 -45574 68379 -38029 5257 156801 29467 -213077 -125357 170823 178323 -101707
101a01707o4378K15196J4598j76606J04639K11283j91289k89448J76139L46321
$$ -101707 -166085 49111 63709 -112897 -8258 203025 11736 -277712 -101573 244748
111B44748o7672l25021m4094K44176P8109j61874j0452J52792p6698k03035J00478
$$ 244748 177076 -147945 -192039 52137 130246 -31628 -42080 110712 34014 -169021 -68543
122f8543K48477l4600k24225p3421J16764J34948Q781j02736p5348P727M7319
$$ -68543 179934 145334 -78891 -152312 -35548 99400 108181 5445 -69903 -62176 -14857
133a4857N7802R730n0460k2320j8221n9725P4885J96618n7923k95805k7324K95352
$$ -14857 42945 52675 2215 -20105 -38326 -98051 -23166 173452 115529 -180276 -207600 87752
145H7752J16429k13940j40389J44132J00460j55596m1062K59255L6172l72931
$$ 87752 204181 -9759 -150148 -6016 94444 -61152 -102214 157041 193213 -179718
155a79718r5877M12832J79179l48557k16940K43167J79962j92473j12457K38148
$$ -179718 -275595 137237 316416 -32141 -249081 -5914 174048 -18425 -130882 107266
165A07266P5990l49104j12375M28357J87870m16345k42018L21592K19192k33841
$$ 107266 183256 -165848 -278223 150134 338004 -78341 -320359 1233 220425 -13416
175a3416j44989K24945Q5201k99676r2934L96147J68155m27934k43523L71352
$$ -13416 -158405 66540 151741 -147935 -240869 155278 323433 -104501 -348024 23328
185B3328K55211k71520j85774K17217J03456k39938p2804L14266J22814l65068
$$ 23328 278539 7019 -178755 38462 141918 -98020 -170824 143442 266256 -98812
195i8812k09389L40607K50654k57102k05183J79481J02205j68660k7239K14294
$$ -98812 -308201 32406 283060 25958 -179225 256 102461 -66199 -93438 120856
205A20856K8694k72080j01338K75744J68464k21779j60776J53709P3250j30617
$$ 120856 149550 -122530 -223868 51876 220340 -1439 -162215 -8506 64744 -65873
215f5873K8347J70313o7621k28748K2625K57694O4113k25243j06455J68598P1504
$$ -65873 -37526 132787 65166 -163582 -140957 116737 180850 -44393 -150848 17750 89254
226H9254j39071J5386J68659p3378k28024N1485K63157L3419k37876j18696J65825
$$ 89254 -49817 -34431 134228 60850 -167174 -115689 147468 180887 -56989 -175685 -9860
237i860J37162j08314q8260J02910K3123j49355j3441J84843O9526j62886j52474
$$ -9860 127302 18988 -69272 33638 56761 -92594 -106035 78808 148334 -14552 -167026
248a67026P7356J96562K2179j68383o9600R8103M8978m6509P2N7376m791j06137
$$ -167026 -89670 106892 129071 -39312 -108912 -10809 38169 -8340 -8268 49108 44317 -61820
260f1820n7724J46226J64762j25720k41591N1477K40102K2772j74974n0088J14520
$$ -61820 -119544 26682 191444 65724 -175867 -124390 115712 138484 -36490 -86578 27942
271B7942K4101j18735J0592J86859j0528k68881m5228K86688J11938k26906j43464
$$ 27942 52043 -66692 -56100 130759 120231 -148650 -193878 92810 204748 -22158 -165622
282a65622J33986J17161q0667o2421J02581L2220j72063n0924K24003R9320k03603
$$ -165622 -31636 85525 4858 -57563 45018 77238 -94825 -145749 78254 177574 -26029
293b6029j22794J29739R4839n8184k3022N1312l4723j08881M0789J84518j317
$$ -26029 -148823 -19084 75755 17571 -5451 45861 11138 -97743 -56954 127564 126247
304A26247k17896m0212J89063L2523j34870K4284J10882r0526j49028J06442K18559
$$ 126247 -91649 -131861 57202 89725 -45145 -20861 90021 -505 -149533 -43091 175468
315A75468o4926k74203n515K74504M4090k31578j9926J93217l8004j96300P2919
$$ 175468 110542 -163661 -169176 105328 149418 -82160 -102086 91131 53127 -143173 -70254
326g0254K39025m4114k78960l1137K81904J03710k36071j13360J82901O4429j58699
$$ -70254 168771 124657 -154303 -185440 96464 200174 -35897 -149257 33644 98073 -60626
337f0626m900J74720r302k02728l8860K01373J10205j58744j45427R5754J11138
$$ -60626 -65526 109194 99892 -102836 -141696 59677 169882 11138 -134289 -38535 72603
348G2603o2475l9620P0778j6564j06291J0308J21786M3641r2842r2850L5780R1463
$$ 72603 10128 -29492 41286 24722 -81569 -71261 50525 94166 1324 -91526 -55746 35717
360C5717P506l5503k07k7926m5604N2244Q7722j6968q0535l7836L0783O8243K7425
$$ 35717 43223 7720 7513 -20413 -66017 -13773 73949 56981 -23554 -61390 -30607 37636 65061
373F5061m7418m4114l308O619L4043M7379j8894o7958l0875K8179P1799M2906
$$ 65061 17643 -26471 -29779 -23160 10883 58262 39368 -28590 -59465 -31286 40513 83419
385H3419p6776r6049L9408Q9897m629m0218J531j689l3525o837P1204P0522p8433
$$ 83419 6643 -89406 -49998 39899 35270 -4948 -3417 -5106 -38631 -45468 25736 96258 17825
398A7825j41126M8661J69970n843j35196r612P8597r630m8449M6211P5649n8740
$$ 17825 -123301 -74640 95330 89487 -45709 -55321 23276 13646 -34803 11408 87057 28317
410B8317j39123L4479J83713R331j76367l5111J21520J7844o9972K4985O0014
$$ 28317 -110806 -76327 107386 116717 -59650 -94761 26759 44603 -25369 -384 59630
421E9630n8892j00314M9619J48455r239j66746k6122J37982K0698q8872K6561
$$ 59630 738 -99576 -49957 98498 89259 -77487 -103609 34373 55071 -33801 -7240
432g240O5699p7386q5057R2339J31860n7605j64113R029J60726J5393j26501J1827
$$ -7240 58459 -18927 -103984 -11645 120215 62610 -101503 -92474 68252 83645 -42856 -31029
444c1029J01075o5542j07221R7116J41409p9412j74311K1057J76374L0295j49582
$$ -31029 70046 4504 -102717 -5601 135808 56396 -117915 -96858 79516 109811 -39771
455c9771l9366J16009m56j08853M4449J27724n2757j53349J1877J52816M9322
$$ -39771 -79137 36872 36416 -72437 -27988 99736 46979 -106370 -94493 58323 107645
466A07645j20348q2616P7806O5500n3147j5246O4531k0408q8912J4908R8190L0141
$$ 107645 -12703 -95319 -17513 47987 -5160 -20406 44125 23717 -65195 -50287 47903 78044
478G8044p1116o9712K3234P3027J1066l4094p226j5211k8686L3979N8475j3682
$$ 78044 6928 -62784 -39550 33477 44543 10449 3223 -11988 -40674 -6695 51780 38098
490C8098n5492k5309J4898M3124K6579k8031l6446j0213K641L4665M5594k4806
$$ 38098 -17394 -42703 -27805 15319 41898 13867 -22579 -32792 -30151 4514 50108 25302
502B5302o7110r137M4659L9526M218m1149l5841K1365K7994q04J5920P486n1306
$$ 25302 -41808 -50945 -6286 33240 37458 -3691 -39532 -18167 9827 9023 24943 32429 -18877
515a8877l6246M7009O6390k035p4770m9516N6633O9840l4245m9626K9641J0648
$$ -18877 -55123 -8114 58276 56241 -18529 -68045 -11412 58428 24183 -25443 4198 14846
527A4846n2369L464P8044K0981q6294p1115O3347J07666k8936j06207J0471P2909
$$ 14846 -37523 -34059 43985 64966 -21328 -92443 -29096 78570 49634 -56573 -46102 26807
539B6807k1759l9747N0905L8820o5669o7126N0474J02813r389j10822k2121Q7617
$$ 26807 5048 -34699 16206 55026 -10643 -77769 -27295 75518 66129 -44693 -66814 20803
551B0803K2259n0476J1068K9579m5375m1260N0721O7339k1442q4153j8776P2289
$$ 20803 43062 -7414 3654 33233 -12142 -53402 -2681 64658 43216 -40937 -59713 12576
563A2576L2731m4398r836K1301l7185k5477O4702M9775n4677p0534J5620P1428
$$ 12576 45307 909 -8927 12374 -24811 -50288 14414 64189 9512 -61022 -45402 26026
575B6026J8044n1774j6971L3129j6486l2946N5559N7473o3002q0822L5754Q6305
$$ 26026 44070 -7704 -24675 8454 -8032 -40978 14581 72054 9052 -71770 -36016 50289
587E0289Q947o8200l4114M4404K2396l6532J0130N2311l3218p7662K1979Q5464
$$ 50289 59236 -8964 -43078 1326 23722 -12810 -2680 49631 16413 -61249 -39270 46194
599D6194J3128o8530m8217L3715N4602j2442l2856J6369L958m1250N501O1019
$$ 46194 59322 -9208 -57425 -23710 30892 18450 -14406 1963 5921 -35329 -29828 31191
611C1191J2402n2094l9532J9466N4031J5109m1372k2413J5663J380M203L1905
$$ 31191 43593 -8501 -48033 -28567 25464 40573 -799 -23212 -7549 -6169 -1966 29939
623B9939J036m4150j9825K4065L3986J1011l0824l3484J1699K2549L778J2114
$$ 29939 30975 -13175 -33000 -8935 25051 36062 5238 -28246 -16547 6002 9780 21894
635B1894m070m2604j5166M1211L0619j2973l3332j9745J9948K9336n694p774O748
$$ 21894 17824 -24780 -39946 1265 31884 18911 -14421 -34166 -14218 15118 9424 1650 8398
648H398k3603k5560L9547M7038k1965n1298j1209L7905L8440j6711l6591J0095
$$ 8398 -15205 -40765 -1218 45820 23855 -27443 -38652 -747 37693 20982 -15609 -5514
660e514J4158k4229P656M7516o525o0464j7086M6218M4637j8266n5999m844M2634
$$ -5514 8644 -15585 -7929 39587 33062 -27402 -44488 1730 46367 28101 -27898 -32742 9892
673I892J897k1908K0586Q880m3003j8333M2231L7333j6194m8526j4825M3165K8494
$$ 9892 11789 -10119 10467 19347 -23656 -41989 242 37575 21381 -27145 -41970 1195 29689
686B9689k4099j2030R684j7898q892L7332K3048k7179l2175j610L0065K6415j6224
$$ 29689 5590 -6440 3244 -14654 -23546 13786 36834 9655 -22520 -24130 5935 32350 16126
699A6126k5778L545j905l611L1062J6322m0642l1109K2167L0776N286j9606k1569
$$ 16126 -9652 -6107 -8012 -11623 19439 35761 -4881 -35990 -13823 16953 22239 2633 -18936
712a8936N466J0996n131J4297K0619l2917l9766K8987M6135m753l3126j7480J3565
$$ -18936 -13470 -2474 -7605 6692 27311 -5606 -45372 -16385 29750 24997 -8129 -25609 -12044
725a2044K5007k620j1053J3517o221l4893J2672M8883M27m1243j9800J5895L1106
$$ -12044 12963 10343 -710 12807 6586 -28307 -15635 33248 33675 -7568 -27368 -11473 19633
738A9633O068k7615j0297J3141q331m526L0215O730l6790j9149J7953K6033R590
$$ 19633 25701 -1914 -12211 930 -7401 -11927 18288 25018 -11772 -30921 -12968 13065 22655
751B2655k2845k6900J1865K0382k294N815L661k6432j2360K6122K0040l557j5342
$$ 22655 -190 -27090 -15225 5157 2863 8678 12339 -14093 -26453 -331 19709 16152 810
764H10j9035M161K6194O699r700m533j5807q910K9585K1096k1515k2447q18R034
$$ 810 -18225 -14064 12130 18829 9129 4596 -11211 -20121 9464 30560 9045 -13402 -14220 -5186
778e186J6752M594j6504q344j872n765J8766K5202k1755l4815P846K5477J0849
$$ -5186 11566 16160 -344 -8688 -10560 -16325 2441 27643 5888 -28927 -21081 4396 15245
791A5245n644j9485p469J4422M273p82J6411n473l3243J068L4728J1131j5142
$$ 15245 9601 -9884 -17353 -2931 1342 560 16971 11498 -21745 -20677 14051 25182 10040
804A0040j9635p807J9153J7653j1753p411M664j4493o035K6232J1813j9832j6747
$$ 10040 -9595 -17402 1751 19404 7651 240 4904 -9589 -15624 10608 22421 2589 -14158
817a4158l266J3545K0925n807k4344LQ023j733J2550R328j9478j3471Q861J0038
$$ -14158 -17424 -3879 17046 11239 -13105 -13102 -5079 -6812 5738 15066 -4412 -17883 -9022 1016
831A016R934J786k0203q689J5898Q031K197L780j6091j5032J6654J5934m891n687
$$ 1016 10950 12736 -7467 -16156 -258 7773 9970 13750 -2341 -17373 -719 15215 10324 4637
845D637q261q184J1377J2626m561l646p932j4573J1609K4483p477j9557k862K685
$$ 4637 -3624 -11808 -431 12195 7634 3988 -3944 -18517 -6908 17575 10098 -9459 -12321 -9636
859i636Q733J1877p755j1607K017k594J724K0539J679k4403o682J2777J1282P174
$$ -9636 -903 10974 3219 -8388 -6371 -8965 -7241 13298 14977 -9426 -16108 -3331 7951 15125
873A5125q164j8156L803J3881j182K933L556j5986j0666J5230J1353r65o792j5862
$$ 15125 6961 -11195 -7392 6489 5307 8240 11796 -4190 -14856 374 11727 10762 3970 -11892
887a1892k532K1324O469j3960l979l044n368J2322J1149q456p526m225l130J5694
$$ -11892 -14424 6900 13369 -591 -4570 -7614 -12982 -660 10489 2033 -5493 -9718 -12848 2846
901B846J3621j5468j3643N742M884O940Q679j0627j1721N675N126L250R216r242
$$ 2846 16467 999 -12644 -6902 -2018 4922 13601 2974 -8747 -3072 2054 5304 14520 5278
915E278j7452O731J2807K58P58n616j4446M491J3912r21l017m394j1819M215J7237
$$ 5278 -12174 -5443 7364 7622 8380 2764 -11682 -7191 6721 5800 2783 -1611 -13430 -9215 8022
930H022k611r461M36n092l98J3673L763r750l658l224K679J5928J390j8068p59
$$ 8022 5411 -4050 -3614 -8706 -9104 4569 8332 -1418 -5076 -8300 -5621 10307 11697 -6371 -7130
945g130R487j389L340O010p624o499J839R14J0033N203j8462r840J6460O156p663
$$ -7130 2357 968 4308 10318 2694 -3805 -1966 -1052 8981 14184 -4278 -14118 2342 8498 835
960H35K00j692p243L616L538J658M770q822j4168J2757J6572j0072q562L586j480
$$ 835 1035 -657 -7900 -4284 -746 912 5682 -3140 -17308 -4551 12021 1949 -6613 -3027 -4507
975d507K094P515j864j561n05r210M514J8598n341j6960M060O483j386M627L92
$$ -4507 -2413 5102 3238 1677 1172 -8038 -3524 15074 9733 -7227 -3167 3316 1930 6557 6949
990F949q414r46N59j36J1011n98j9137n1J5751k237n024L507n037m436N243L006
$$ 6949 -1465 -2411 -1852 -1988 9023 8425 -10712 -10763 4988 2751 -2273 1234 -3803 -8239 -2996 10
1006A0K646J647j2945m494J8601M499j3982P19N276m567K551N871j631J1m776
$$ 10 2656 4303 -8642 -13136 5465 9964 -4018 -3299 1977 -2590 -39 5832 4201 4212 -564
1021e64p079J2551J1272j5681r752J1614K435n109L047p53l535N12m253K346J2762
$$ -564 -7643 4908 16180 499 -9253 2361 4796 -313 2734 1981 -1554 -1042 -5295 -2949 9813
1036I813q121j7142R114J3371p472m271L832k777J130J515j984P004J980j5470
$$ 9813 1692 -15450 -6336 7035 -437 -4708 -876 -3653 -2523 -1008 -2992 4012 5992 -9478
1050i478K118J8562l395j3134M969M456l010J725k30o0M153q237o347J5687M106
$$ -9478 -7360 11202 7807 -5327 -358 4098 1088 2813 2583 2523 6676 -1561 -7908 7779 11885
1065A1885j8492j167J2745k631n967K564L31R34l071o284Q927J0524j5974r652
$$ 11885 -6607 -7774 4971 2340 -3627 -1063 -732 202 -2869 -9153 -226 10298 -5676 -15328
1079a5328J8251N121j4126J010Q111j473l016k223L774J0711q047j5207J4119
$$ -15328 2923 8044 -6082 -5072 3039 1566 -1450 -3673 101 10812 2765 -12442 1677
1092A677J4984j6091q728J3328K571q968q39L568N131k448j3614M023J7909q989
$$ 1677 16661 570 -8158 5170 7741 -1227 -2066 1502 6633 4185 -9429 -5406 12503 3514
1106C514j8270J1807J1253j1837m914P906K837k742o539m28J4020K43j8634M477
$$ 3514 -14756 -2949 8304 -3533 -8447 -541 2296 -446 -6985 -7413 6607 6850 -11784 -7307
1120g307J8691q206j2231R981O607o116l469N91O761L885j2668l844J7535l93
$$ -7307 11384 3178 -9053 928 7535 1419 -2050 -1459 5302 9187 -3481 -7325 10210 9817
1134I817j8772N300J3756p882p863M453L102R70n310o770J0257P285j6252l874
$$ 9817 -8955 -3655 10101 2219 -5644 -1191 1911 2881 -2429 -9199 1058 8343 -7909 -11783
1148a1783J7528j007j4187M377P622j479k091l696K845R608p021j0689J3646Q783
$$ -11783 5745 4738 -9449 -5072 2550 1071 -1020 -4716 -1871 7737 716 -9973 3673 12456
1162A2456j5433l745J2710O82n661j778m55O100J258j1460K032J4148r188j2901
$$ 12456 -2977 -6722 5988 6670 1009 -769 -1224 4876 6134 -5326 -3294 10854 1666 -11235
1176a1235J1332P896r378m731K034L346M357o783n921J1670K522j5401L782J6377
$$ -11235 97 7993 -1385 -6116 -4082 -736 3621 -3162 -9083 2587 5109 -10292 -6510 9867
1190I867p273j1441N026P455J547l948o985O465R571j1823n530J6958Q27j8490
$$ 9867 2594 -8847 -3821 3634 5181 1233 -5752 713 10284 -1539 -7069 9889 10716 -7774
1204g774J884J4399o56q245m827L435R439n869j1640J1181R222j8846n619K0129
$$ -7774 -5890 8509 7853 -392 -5219 -1784 7655 1786 -9854 1327 10549 -8297 -13916 6213
1218F213L353j6046m295Q325P583l094j0879M596J4161j1304j2835J8356J1567
$$ 6213 9566 -6480 -10775 -2450 5133 2039 -8840 -4244 9917 -1387 -14222 4134 15701
1231A5701j9149q666J4445P712n513q347N62J1384j782j5159Q555J6634j5159
$$ 15701 -3448 -12114 2331 10043 4530 -3817 -3255 8129 6347 -8812 -257 16377 1218
1244A218j6710J5581J2267j0462q426J564O475K592j0154n81J4563n456j8986
$$ 1218 -15492 89 12356 1894 -6532 -4968 1507 4099 -6055 -6636 7927 2471 -16515
1257a6515J0695J8516j0239j2732N081P226J169l500l515P682K131j3912K121
$$ -16515 -5820 12696 2457 -10275 -5194 2032 3201 -299 -3814 3868 5999 -7913 -5792
1270e792J9746m309j8722M283J1926j212l995k874J103M129o070m649J4090K664
$$ -5792 13954 9645 -9077 -4794 7132 5920 1925 -949 154 4283 -1787 -6436 7654 10318
1284A0318j9708l119J7721J982r462l173O80M293J305o474M719R274j3776j0217
$$ 10318 -9390 -12509 5212 7194 -2268 -5441 -4761 -468 837 -5637 -918 8356 -5420 -15637
1298a5637J8496J0977j4329q240N745O512K536n682k590Q914l498j3799J1275
$$ -15637 2859 13836 -493 -8733 -2988 3524 6060 378 -2212 6702 3204 -10595 680
1311F80J7280j3387j7061Q774J1506r75o343n493M552M245r964J054J6863o650
$$ 680 17960 4573 -12488 -3714 7792 6817 474 -5019 -467 3778 -6186 -5132 11731 5081
1325E081k2264P221J9281k886j0940l152M312O173l462l968J0745Q10j9747K202
$$ 5081 -17183 -9962 9319 6433 -4507 -7659 -3347 2826 -636 -4604 6141 6951 -12796 -10594
1339a0594K4344r08j9144q65R667L583k498m415L825L837j2560m196K1719M218
$$ -10594 13750 12842 -6302 -7167 2500 6083 3585 -830 2995 6832 -5728 -9924 11795 16013
1353A6013k4149n833J7066M609p313m079R21M077m639o500J3239J0019k0064j2758
$$ 16013 -8136 -13969 3097 7706 393 -3686 -2765 1312 -3327 -9827 3412 13431 -6633 -19391
1367a9391J9894J1346j1182o480K458L389J593l434K737R622r533j5605J3784
$$ -19391 503 11849 667 -5813 -3355 34 1627 -1807 930 10552 1019 -14586 -802
1380h02J8356j0925j3709L786N216K255l46l464K024p75j1020M723J8515o806
$$ -802 17554 6629 -7080 -3294 1922 4177 3831 367 2391 1616 -9404 -4681 13834 7028
1394G028j9183L162J1158N40j155k971l264J959k066O18J3084q43k0764J11J9542
$$ 7028 -12155 -8993 2165 2705 1550 -1421 -4685 -2726 -4792 -4174 8910 8067 -12697 -12586 6956
1409F956K164q861j841p01J687K861o93N519K490j6889o437K3009Q364j8780q109
$$ 6956 9120 259 -1582 -2283 -596 2265 1572 7091 9581 -7308 -13745 9264 17628 -1152 -9261
1424i261P426M486J14j733p42L350q705j0056J7628J6258k0107j7790J3300J2818
$$ -9261 -1835 2651 2765 1032 290 3640 -5065 -15121 2507 18765 -1342 -19132 -5832 6986
1438F986l347o103j641L195O79o918O598J6586j1439k2584J0311K2150m390j2069
$$ 6986 3639 -2464 -4105 -910 -231 -7149 -551 16035 4596 -17988 -7677 14473 10083 -1986
1452a986j476K544L718l65j168P354k876j9268M362K3276k357j8596q60O148J565
$$ -1986 -3462 -918 2800 2435 1267 8621 5745 -13523 -9161 14115 11758 -6838 -7698 -1550 15
1467A5K086p20j500j405q675J476J9360R29k2270k268J5269J435l443K403j812
$$ 15 2101 1381 -119 -1524 -10199 -8723 10637 11566 -10704 -12972 2297 3732 289 2692 880
1482H80l879j864K294J3178L367k1294p840K1122P906j2887k314L142l591q10
$$ 880 -2999 -4863 -2569 10609 13976 -7318 -15158 5964 13870 983 -1331 1811 -1780 -2590
1496b590L147O042K867j4582j3162J8244J7246j4810j4005O283L958o99L299Q52
$$ -2590 557 6599 9466 -5116 -18278 -34 17212 2402 -11603 -5320 -1362 -2061 1238 2090
$$ [...]
8191d8
##END NTUPLES=NMR FID
##END=
