##TITLE=1H_CA-8579-1
 CDCl3, 8 sc, 
 2.4.2019
##JCAMPDX= 6.0         $$ Bruker NMR JCAMP-DX V2.0
##DATA TYPE= NMR FID
##DATA CLASS= NTUPLES
##ORIGIN= UXNMR, Bruker Analytische Messtechnik GmbH
##OWNER= root
$$ XWIN-NMR		Version 3.5
$$ Tue Apr  2 14:49:28 2019 Russian Standard Time (UT+4h)  she@DPX200
##.OBSERVE FREQUENCY= 200.1316
##.OBSERVE NUCLEUS= ^1H
##.DELAY= (6, 6)
##.ACQUISITION MODE= SIMULTANEOUS
##.ACQUISITION SCHEME= undefined
##.AVERAGES= 8
##.DIGITISER RES= 18
##SPECTROMETER/DATA SYSTEM= spect
##.PULSE SEQUENCE= zg30
##.SOLVENT NAME= CDCl3
##.SHIFT REFERENCE= (INTERNAL, CDCl3, 0, 15.7039)
##AUDIT TRAIL= $$ (NUMBER, WHEN, WHO, WHERE, WHAT)
$$ ##TITLE= Audit trail, XWIN-NMR		Version 3.5
$$ ##JCAMPDX= 5.01
$$ ##ORIGIN= Bruker BioSpin GmbH
$$ ##OWNER= she
$$ F:/spectra/data/she/nmr/H-F/1/audita.txt
$$ ##AUDIT TRAIL=  $$ (NUMBER, WHEN, WHO, WHERE, WHAT)
(   1,<2019-04-02 14:48:00.59 +0400>,<she>,<DPX200>,
      <created by zg, POWCHK disabled, PULCHK disabled
       configuration hash MD5:
       00 E9 B6 7A A2 85 ED C7 34 08 36 98 17 FE 4E 26
       data hash MD5: 16K
       8F 71 6A 84 AB 6D DB B8 85 C4 9E 36 AF FB 3A 87>)
$$ ##END=
$$ 
$$ hash MD5
$$ 5D 3F 5A 1E B8 45 DA 38 57 FC 6F 50 6A B1 32 18
##$RELAX= 
##$RELAX= 
##$RELAX= 
##$RELAX= 
##$RELAX= 
##$RELAX= 
$$ Bruker specific parameters
$$ --------------------------
##$DU= <F:/spectra>
##$EXPNO= 1
##$NAME= <H-F>
##$PROCNO= 1
##$TYPE= <nmr>
##$USER= <she>
##$AMP= (0..31)
100 100 100 100 100 100 100 100 100 100 100 100 100 100 100 100 100 100 
100 100 100 100 100 100 100 100 100 100 100 100 100 100 
##$AQSEQ= 0
##$AQ_mod= 1
##$AUNM= <au_zg>
##$AUTOPOS= <>
##$BF1= 200.13
##$BF2= 200.13
##$BF3= 200.13
##$BF4= 200.13
##$BF5= 200.13
##$BF6= 200.13
##$BF7= 200.13
##$BF8= 200.13
##$BYTORDA= 1
##$CFDGTYP= 0
##$CFRGTYP= 5
##$CHEMSTR= <none>
##$CNST= (0..31)
1 1 145 1 1 1 1 1 1 1 1 1 1 1 1 1 1 1 1 1 1 1 1 1 1 1 1 1 1 1 1 1 
##$CPDPRG= <>
##$CPDPRG1= <>
##$CPDPRG2= <>
##$CPDPRG3= <>
##$CPDPRG4= <mlev>
##$CPDPRG5= <mlev>
##$CPDPRG6= <mlev>
##$CPDPRG7= <mlev>
##$CPDPRG8= <mlev>
##$CPDPRGB= <>
##$CPDPRGT= <>
##$D= (0..31)
0 1.2 0 0 0 0 0 0 0 0 0 0.03 0 0 0 0 0 0 0 0 0 0 0 0 0 0 0 0 0 0 0 0 
##$DATE= 1554202079
##$DBL= (0..7)
120 120 120 120 120 120 120 120 
##$DBP= (0..7)
150 150 150 150 150 150 150 150 
##$DBP07= 0
##$DBPNAM0= <>
##$DBPNAM1= <>
##$DBPNAM2= <>
##$DBPNAM3= <>
##$DBPNAM4= <>
##$DBPNAM5= <>
##$DBPNAM6= <>
##$DBPNAM7= <>
##$DBPOAL= (0..7)
0.5 0.5 0.5 0.5 0.5 0.5 0.5 0.5 
##$DBPOFFS= (0..7)
0 0 0 0 0 0 0 0 
##$DE= 6
##$DECBNUC= <off>
##$DECIM= 24
##$DECNUC= <off>
##$DECSTAT= 4
##$DIGMOD= 1
##$DIGTYP= 9
##$DL= (0..7)
0 120 120 120 120 120 120 120 
##$DP= (0..7)
150 150 150 150 150 150 150 150 
##$DP07= 0
##$DPNAME0= <>
##$DPNAME1= <>
##$DPNAME2= <>
##$DPNAME3= <>
##$DPNAME4= <>
##$DPNAME5= <>
##$DPNAME6= <>
##$DPNAME7= <>
##$DPOAL= (0..7)
0.5 0.5 0.5 0.5 0.5 0.5 0.5 0.5 
##$DPOFFS= (0..7)
0 0 0 0 0 0 0 0 
##$DQDMODE= 0
##$DR= 18
##$DS= 0
##$DSLIST= <SSSSSSSSSSSSSSS>
##$DSPFIRM= 0
$$ [...]
##$SUBNAM2= <"">
##$SUBNAM3= <"">
##$SUBNAM4= <"">
##$SUBNAM5= <"">
##$SUBNAM6= <"">
##$SUBNAM7= <"">
##$SUBNAM8= <"">
##$SUBNAM9= <"">
##$SW= 24.9336934301222
##$SWIBOX= (0..15)
0 0 2 0 0 0 0 0 0 0 0 0 0 0 0 0 
##$SW_h= 4990.01996007984
##$TD= 16384
##$TD0= 1
##$TE= 0
##$TE2= 300
##$TE3= 300
##$TEG= 300
##$TL= (0..7)
0 120 120 120 120 120 120 120 
##$TP= (0..7)
150 150 150 150 150 150 150 150 
##$TP07= 0
##$TPNAME0= <>
##$TPNAME1= <>
##$TPNAME2= <>
##$TPNAME3= <>
##$TPNAME4= <>
##$TPNAME5= <>
##$TPNAME6= <>
##$TPNAME7= <>
##$TPOAL= (0..7)
0.5 0.5 0.5 0.5 0.5 0.5 0.5 0.5 
##$TPOFFS= (0..7)
0 0 0 0 0 0 0 0 
##$TUNHIN= 0
##$TUNHOUT= 0
##$TUNXOUT= 0
##$USERA1= <user>
##$USERA2= <user>
##$USERA3= <user>
##$USERA4= <user>
##$USERA5= <user>
##$V9= 5
##$VALIST= <valist>
##$VCLIST= <CCCCCCCCCCCCCCC>
##$VD= 0
##$VDLIST= <DDDDDDDDDDDDDDD>
##$VPLIST= <PPPPPPPPPPPPPPP>
##$VTLIST= <TTTTTTTTTTTTTTT>
##$WBST= 1024
##$WBSW= 4
##$XGAIN= (0..3)
0 0 0 0 
##$XL= 0
##$YL= 0
##$YMAX_a= 307189
##$YMIN_a= -373851
##$ZGOPTNS= <>
##$ZL1= 120
##$ZL2= 120
##$ZL3= 120
##$ZL4= 120
##$ABSF1= 10
##$ABSF2= 0
##$ABSG= 5
##$ABSL= 3
##$ALPHA= 0
##$AQORDER= 0
##$ASSFAC= 0
##$ASSFACI= 0
##$ASSFACX= 0
##$ASSWID= 0
##$AUNMP= <proc_1d>
##$AZFE= 0.1
##$AZFW= 0.1
##$BCFW= 1
##$BC_mod= 2
##$BYTORDP= 1
##$COROFFS= 0
##$CY= 11.3945322036743
##$DATMOD= 1
##$DC= 2
##$DFILT= <>
##$DTYPP= 0
##$F1P= 18.9103706918063
##$F2P= -1.10871071338519
##$FCOR= 0.5
##$FTSIZE= 0
##$FT_mod= 4
##$GAMMA= 1
##$GB= 0.15
##$INTBC= 1
##$INTSCL= 1
##$ISEN= 128
##$LB= 0.24
##$LEV0= 0
##$LPBIN= 0
##$MAXI= 10000
##$MC2= 0
##$MEAN= 0
##$ME_mod= 0
##$MI= 1.114404
##$NCOEF= 0
##$NC_proc= 0
##$NLEV= 6
##$NOISF1= 3.799351
##$NOISF2= 2.8
##$NSP= 1
##$NTH_PI= 0
##$NZP= 0
##$OFFSET= 15.70392
##$PC= 1
##$PHC0= -9214.488
##$PHC1= 17.80025
##$PH_mod= 1
##$PKNL= yes
##$PPARMOD= 0
##$PSCAL= 0
##$PSIGN= 0
##$REVERSE= no
##$SF= 200.130013532006
##$SI= 16384
##$SIGF1= 3
##$SIGF2= 2
##$SINO= 400
##$SIOLD= 16384
##$SREGLST= <1H.CDCl3>
##$SSB= 0
##$STSI= 0
##$STSR= 0
##$SW_p= 3612.71676300578
##$SYMM= 0
##$S_DEV= 0
##$TDeff= 0
##$TDoff= 0
##$TI= <>
##$TILT= no
##$TM1= 0
##$TM2= 0
##$TOPLEV= 0
##$USERP1= <user>
##$USERP2= <user>
##$USERP3= <user>
##$USERP4= <user>
##$USERP5= <user>
##$WDW= 1
##$XDIM= 8192
##$YMAX_p= 0
##$YMIN_p= 0
$$ End of Bruker specific parameters
$$ ---------------------------------
##NTUPLES= NMR FID
##VAR_NAME=  TIME,          FID/REAL,        FID/IMAG
##SYMBOL=    X,             R,               I
##VAR_TYPE=  INDEPENDENT,   DEPENDENT,       DEPENDENT
##VAR_FORM=  AFFN,          ASDF,            ASDF
##VAR_DIM=   8192,          8192,            8192
##UNITS=     SECONDS,       ARBITRARY UNITS, ARBITRARY UNITS
##FACTOR=    0.0002004,     1,               1
##FIRST=     0,             0,               0
##LAST=      1.6414764,     0,               0
##MIN=       0,             -373851,         0
##MAX=       1.6414764,     307189,          0
$$ Real data points
##PAGE= N=1
##DATA TABLE= (X++(R..R)), XYDATA
$$ [...]
2604D44k759J532L821j655k229oj136K410M523l582m559K678J645p86K021j009
2620A353l661J318J702j223L066l43n660M62M849q79n25L6l142k26M899r72j741
2637f87J429k206j829M625J044k434j7p39j620L960K495m274j033J170o03J817
2653A098K367l943j146K354j357Q2L895k359m161J783J840R2J864k848l535L273
2669g01K450k174M65J281l865J53L652j15Qr06l395J403N589k000l291J598m84
2686c32r19L349N17k752K94j383r11M771R60n436m60K317n96J700J118l912j081
2703b756K569k0J95J902l094k229L284J240j184J888k338k921L682K827k694o6
2719B85l67j775K311K606k938J28Q50k835N46M590j280l475O01m09J154K662k460
$$ y = [444, -2315, -783, 3038, 1383, -846, -852, -1988, 422, 4945, 1363, -3196, -518, 1127, 341, 2362, 1353, -2308, -990, 712, -511, 2555, 2212, -3448, -2986, 1863, 984, 459, 495, -2647, -2873, 2026, 1054, -687, 742, -1464, -3293, 1332, 2376, -58, -75, -814, -2434, 1526, 4021, -253, -1286, -116, -719, 1098, 3465, -478, -1624, 730, -627, -545, 3350, 991, -3170, -1387, 453, 545, 2409, -439, -3974, -701, 1749, -425, 40, 1321, -2544, -2391, 1261, 1146, 1154, 248, -3147, -1744, 3845, 1845, -1446, 152, -332, -1251, 2098, 2615, -137, 157, -1226, -2137, 2634, 3594, -1842, -2302, 15, -581, 1119, 2237, -1675, -2756, -187, -207, -12, 1890, -1204, -3433, -149, 1091, -93, 1795, -543, -3464, 218, 3045, 351, 285, -82, -1857, 454, 3060, 122, 250, 1100, -1735, -1189, 3401, 2121, -1354, -753, -1162, -8, 2654, 194]
2736A94l067K568P14k313K819J083l950j85J761l5K004K83m512L27L817q54o53
2753AJ559j897j547K853M69j167J388k043k311L710K343l285k67P8j949K353J990
2770B278k879n24J416k324J146L303j983k615J636l21L64K702j517l729J980J589
2786E22n68J772o88l511J990J902j533J158J063m223J6M125m07j263K99k591N76
2803a361L843j090k676J862o18k576L071J779l034k12K48j720L808R66m342J60
2819a892K720j111r1K605j905j935J820j08J88K385k594k629L060J168j861J589
2835A409o90k904J977J892j717L54L44l001R05L229j653o96J183k570m14M317
2851A965q29k960J209M5q09K878j48k729J337K37j738K856J234l670n08K184k12
$$ y = [194, -2873, -305, 409, -1904, 915, 1998, -1952, -2137, -376, -411, 1593, 1876, -2636, -2309, 1508, 654, 1, 1560, -337, -1884, 969, 1438, 271, 1659, -384, -2695, 1015, 3358, 73, -194, -116, -2065, 288, 2278, -601, -1125, 291, -2033, -887, 2416, 433, -2182, -546, -867, -503, 2199, 682, -3047, -1067, 522, -46, 1726, 1038, -2473, -483, 1419, -114, 1044, 2107, -2116, -2100, 2025, 1618, 355, 654, -1937, -1361, 2482, 1392, -1284, 578, -40, -2616, 455, 2234, -800, -1012, -764, -2484, 1324, 2290, -2052, -1892, 828, -283, -374, 2231, 326, -1609, 211, 103, 291, 2676, 82, -2547, 513, 1681, -180, 1409, 719, -2185, -208, 1684, -33, 321, 665, -2336, -1431, 1798, 145, -551, 632, -1938, -2352, 1965, 1136, -1824, -615, -570, -1379, 1499, 1351, -1378, -41, 196, -1542, 1314, 2548, -1122, -1630, 554, 342]
2868C42P11Q89k848o11K853q20r11K226j594k916K608J144j027O32j594k078L201
2885B07K032l042J8J207k062P15K731j660j019J208j864R53L500j826k730J655
2901B3N86j164K585n92k816J372O16j353K185L13l630K92K849j509M24J603l436
2918a652m47K927n44j284J669j662j167K988nj632J518k59k780K947J803k748
2934c28k88Q36j369J691J796k942K6J728j469l90K818j258k367J188P11o74J963
2951A672j264k324J694J312k107J138J079k908M66K224j307L76Q44k470Q7L659
2967B171j101j678J486j628n71L114j76k230J134k15j468K200J117l438P06J077
2983E00j577J367J817l016o09K314j281J03J964k154j437K164l01q31K014o52
$$ y = [342, 1053, 1942, -906, -1517, 1336, 516, -395, 1831, 237, -2679, -71, 1073, 46, 678, -916, -2994, 207, 2239, -803, -785, 422, -1640, -925, 1806, 146, -873, 335, -1529, -576, 2924, 1098, -1632, 23, 609, -555, 2030, 1438, -1378, -6, 610, -743, 1442, 1755, -1875, -1583, 1266, -243, 181, 1784, -1652, -2099, 828, 284, -1000, 669, -993, -2160, 828, 823, -809, 709, 450, -2330, 617, 2420, -328, -616, 220, -1149, 542, 2338, -604, -578, 1150, -319, -709, 2109, 851, -1516, -328, 383, -291, 1672, 408, -1916, -222, 1090, -1017, 121, 1200, -1708, -1242, 982, -325, 51, 895, -1575, -1488, 2171, 1070, -608, 878, -750, -1321, 1793, 1617, -613, 521, 306, -1162, 1038, 2155, -1283, -577, 500, -1077, 290, 2107, -909, -1518, 796, -485, -382, 1582, -572, -2009, 155, -146, -977, 1037, 385]
2999C85k895K161J890j816M33N14k164J643J755k163KJ601k147Q5K687r67j599
3016e95J100q60k95K715j246k513J954K01j780J938P49k767M29R19j271J417J304
3033A399k646j74K176p72o54K139j880j156K433j04j357J705r24j879K554P20
3049A580k158J119J67k071J319J934k319k69J452j442L53J718j717j091J727r08
3065f06q38K786r10k289J833K13j080J494K25k143Q48J566j909J194J450k446
3081f12m6K263j137m80J415j901n15K585o20k212K255j022j144J644P18k182R71
3098b0J21j452J607Q23k057lJ638j906O85K044j809j041K055r11o04K202p54j943
3116a325J917O5p51J152j81k303J515J842k476P64R32j914j93K198j297l69J206
$$ y = [385, -2510, -349, 1541, -275, 158, 672, -1492, 151, 1906, -257, -255, 1346, -801, -716, 1971, 1004, -595, 505, -355, -650, 2065, 819, -1694, 260, 461, -1319, 619, 1368, -1399, -970, -51, -1322, 95, 1399, -1247, -1421, 755, -17, -671, 1468, -412, -1568, 865, 761, -596, 1109, 185, -1694, 860, 1580, -578, 541, 708, -1363, -44, 1890, -429, -698, 754, -688, -335, 1383, -334, -1425, 302, -606, -1444, 1342, 432, -1857, -24, 189, -891, 603, 828, -1315, -467, 1099, -810, 384, 1834, -612, -658, 1605, 468, -12, 1403, -498, -1013, 1572, 952, -1260, 995, -27, -1171, 473, 1191, -991, -20, 101, -1351, 256, 1079, -978, -981, 657, -1249, -564, 1480, -329, -1370, 685, -226, -830, 1372, 618, -1325, 592, 657, -94, 1058, 877, -1426, 89, 1931, -545, 219, 1151, -763, -956, 1242, -55, -424, 782]
3133G82j483q62K432o94j496J313l45o96J855k30k030J278M76j399J253J440k269
3150f75J0J644j216J39J648j751p18K576j814l31J736p32j640J634J69j687J655
3167F47l64j783J394J112k008N70J324k162O87J447j452m74J826j551k42K353
3183A324j166j056J476o73j117K420j25k124J053R83j747J617M46j641J07J228
3199A005j543L15J486j860o99K167r74p31J459r20q36J433r8j338J325J81j712
3216a340J518J147k239P53R26j674P46J511j439l95J804j606J7J797j252j226
3232i52J740n07q63J206j47j676J483L91j767J102L31j680Q78J526k042M32J164
3249F19j567j9J750p71q17J447o84q44J804mj734J569K85j864J175O83k063J451
$$ y = [782, -701, -1563, 869, 175, -1321, -8, -353, -1049, 806, 576, -1454, -176, 300, -1099, 154, 1594, -675, -665, 979, -237, -98, 1550, -201, -919, 1657, -157, -488, 1248, 516, -1124, 510, 679, -1008, 647, 283, -1500, -106, 1006, -1002, -432, 892, -1270, -583, 864, -588, -1062, 764, -787, -1029, 1324, 158, -898, 578, -95, -1212, 1208, 1083, -1041, 12, 995, -752, 865, 1311, -330, -223, 1005, -538, -223, 1263, -597, -1296, 871, -103, -834, 625, -295, -1131, 302, 204, -1134, 191, 372, -1340, 178, 1325, -914, -161, 765, -909, -163, 1348, -91, -486, 1318, -288, -271, 1526, 274, -952, 788, 281, -582, 624, 477, -1199, 284, 675, -1092, 10, 341, -1339, -461, 1065, -977, -545, 619, -948, -967, 783, 12, -805, 642, -42, -886, 918, 914, -820, 749, 1034, -830, 345, 1028, -1035, 416]
3267D16O49j868O34J484j571l22J773j463n05J630j201q77J567o86j042K072m18
3284B72j782J477N57j904J422R48k049P46J515j662L87J080j518n6J731j030o29
3301d95J638r99j149J623R3j572J893l63j696J185M89j988J249Q93j592M33J053
3318F95j549L17J374j640k82J935r73j120K255o76j303J683m59j275J634N90j664
3335d58R49Q03k048P98J541k120L03J563j764k38J679j548q9J242m41j144J367
3352C95l58j447J570k18j106J218L81j438J068P70j811R81J087j661M05J257j497
3369d04j65J709r95m16J677r21j442J777k45j383J167K59j377R27M06j373K48
3386e51J129j446N14J084j346l00J662j159m07J576q32q17J650o13q52J379l55
$$ y = [416, 1065, -803, -169, 1315, -256, -578, 1195, -268, -773, 857, -344, -1221, 346, -340, -1382, 690, 272, -1510, -33, 524, -1380, 42, 990, -1059, -313, 1202, -460, -73, 1007, -511, -567, 1164, 134, -495, 1143, 144, -1005, 618, 711, -861, 1032, 669, -1027, 158, 647, -1341, -92, 801, -791, -358, 695, -854, -537, 837, -803, -1085, 850, -123, -1243, 1012, 336, -967, 716, 257, -1018, 616, 1206, -458, 491, 1294, -754, 44, 1585, -535, -232, 1331, -433, -671, 1008, -540, -629, 613, 172, -972, 395, 37, -1410, 160, -58, -1164, 54, 435, -1003, 65, 835, -976, 5, 1092, -569, -164, 1093, -404, -569, 1140, 145, -271, 1406, 485, -957, 820, 575, -808, 359, 618, -759, 168, 574, -799, -551, 578, -868, -354, 730, -616, -916, 746, -413, -820, 756, -76, -893, 757, 144, -708, 671, 316]
3403C16r79J102L01j541J045Q64j264K87R70j610N09J383j767r8J307j143m51
3420g69J384m84j580J814k42j020R69O7j499J460P58j637O11Q36j406P37J181
3437A180j567K49R12r08NJ325j237m43J358q83p14J437n07j324J393K55j111Q98
3455C18J61j611R92R41j405M5J115j286p1J060m10o55J365j169j35J697q00r44
3473g92R93L04j110J080K48j519J145Q69j685L89Q72j118qJ205q74l93J308j198
3491b84p15J700l94j095J157m29j029J206P4j201J142N69j966J081J335j704M62
3508i1P41j181K31J182j038j10J300j005p78J917n43j673J029M10j167J215M58
3525H97j652N46N92j009M64Q81j468J95J083j136m6J399j155p83J887r5r67R88
$$ y = [316, -663, 439, 740, -801, 244, 1108, -156, 131, 1101, -509, 0, 1383, -384, -482, 825, -318, -769, 615, 131, -1449, 365, 123, -897, 72, 139, -1360, 100, 858, -779, -168, 668, -738, -1, 1180, -387, -138, 774, -134, -129, 1196, -41, -484, 874, -9, -723, 714, 207, -1117, 276, 531, -580, 318, 479, -1132, -140, 801, -604, -559, 556, -730, -801, 259, -151, -806, 559, -610, -745, 952, 152, -792, 201, 505, -605, 475, 723, -796, 349, 1218, -467, -78, 794, -324, -332, 873, -1, -394, 914, -284, -999, 701, 307, -788, 369, -60, -1089, 117, 191, -1010, 132, 701, -1265, -184, 1151, -553, -91, 650, -531, -300, 882, -156, -266, 1034, 29, -749, 1168, 625, -1048, -19, 391, -776, 439, 897, -755, -209, 383, -626, -162, 719, -749, -554, 529, -607, -653, 746, -409, -1192, 695, 600, -367, 621]
3543F21n02j004J642j29j275P83M15j692J624P23j362k84J110j163L92R51j198
3560c48m65J271n07q63J517r61r72J720k25j222J394%j519J360L73j121L34O64
3578D30j172M23J196j043k95J573j175m96J302l84o85J325o19j043J415k86j043
3595e77Q55K62j532J034N55r75J86O21r59kJ316j501j06J165p71j45J621j147
3613a00r23J334j13l72Q36j49j303O45Q57r26P81P2j622N01J701j484O0R55j172
3632d22k50J678r56n71P63o02n63J417n7j328O72M68j108Q28O17j422M17J036
3650F17p93L31R23j598k42J648o11m62J057o70p10R76K05r41N16J7j160R44J116
3669A163j611O59K12j274N98J182j436j87R63j017M11R44p40r33J514r04k06J274
$$ y = [621, 119, -885, 757, 628, -647, 136, 551, -1141, 483, 1206, -156, -440, 670, -493, -101, 850, -348, -813, 458, -49, -912, 605, -356, -1328, 392, 167, -1055, 339, 339, -1180, 180, 553, -568, -234, 430, -742, -319, 877, -166, -461, 1112, -63, -559, 743, 359, -326, 999, 380, -663, 752, 466, -577, 278, 540, -992, 42, 597, -378, -192, 429, -530, -532, 784, -717, -823, 342, -429, -574, 1047, -100, -1023, 311, 198, -174, 662, 513, -790, -145, 712, -214, 567, 639, -983, -482, 1219, -265, -205, 750, -422, -672, 1006, 50, -521, 242, -360, -923, 494, 437, -891, -219, 249, -859, -31, 586, -836, -419, 617, -176, 155, 1078, -520, -762, 886, 275, -187, 870, 200, -510, 466, 671, -270, 246, 263, -897, 47, 1163, -448, 211, 423, -851, -253, 929, -507, -694, 269, -748, -337, 607, -133, -1066, 448, -456, -662, 612]
3687F12j89j255J016K32r63Q47O24j256K86O34q91N76Q66j723r5J410o17l23O81
3706D72q31o81J539k78q95O17k85r87J581L01j115L06M62j028Q56Q58j085n18
3724g11R96n48J64J150j062p79J327k85l72J330p38j439J043O00q85M58L4j302
3742a019P97P44r56J87O52j385N36R99q53k61O74n21p2J199l65j253R36J90p82
3761e53J370k86j302J054N3p76P19P28j349l23J513q45J0N79q39k51P64k77l41
3780c52P78l57o30N94K57p70O52j48j305J155Q63r66j77O90q68K59J188j070l35
3799e42J002q41J30J096n07p37Q35m11n95J519k23j381K01P13q03Q06O01j341
3817d78l69J183m66j08N23j011m84J749j77o83N71o23o29J419O97j570O00r8q94
$$ y = [612, 423, -832, 184, 416, -547, 300, 924, -332, -46, 588, -303, 273, 1139, -584, -679, 731, 114, -209, 472, -359, -1040, 499, 221, -674, -57, -342, -1329, 252, 553, -562, -256, 206, -822, 34, 892, -193, -711, 285, -263, -99, 1051, -11, -790, 537, 252, -120, 1210, 472, -967, 76, 676, -209, 249, 283, -1019, -222, 522, -434, -247, 405, -980, -444, 555, -298, -559, 115, -406, -478, 721, 356, -897, 39, 229, -553, 817, 531, -771, 283, 336, -440, 279, 1007, -342, -665, 848, 3, 13, 592, -247, -498, 266, -11, -352, 426, 69, -561, 33, 290, -480, 172, 24, -1281, -126, 737, -229, -406, 284, -584, -325, 863, -207, -542, 460, -381, -251, 845, 338, -399, 436, 25, -570, 949, 726, -655, -454, 259, -544, 262, 863, -478, -847, 336, -130, -238, 285, -726, -1210, 539, 362, -321, 250, -373, -1002, 417, 1114, -456, 144, 46, -848]
3836h48J110Q12j037p8K87r42P09J096j450k19J103m37m26J302o92j370J157J67
3854B44p71J055l57j427J047N31j052O68M73j195N32Q08o65k9P26j025k72J837
3872A128p71n01O65n66n29J293k16o52N39o5r44R89K02j080K60M09q61O72Q37
3891H09j357j17O37M3m43J022l87j292R47K34n66J088m53r49R34K86q71J000J08
3910F73j296J95J093o82K21L21j117R6J391n87q64N91j75n03J326J83j578N47
3928a65L62r49Q67N05j455L06O00l04L83P89j315m56J216m53r5J094j006o04J109
3947D29J64n74M89j88j110J090M22r85N14j10p28N15N78j068n9Q39n46k70J305
3966G07o97n92P13m46m88J279q3r30N29J73m17M21N21j263M09M62m19M94M38j403
$$ y = [-848, 262, 1074, 37, -41, 246, -696, 13, 1109, -341, -560, 543, 106, -320, 982, 290, -1080, 77, 244, -527, 528, 171, -1256, -209, 322, -730, -62, 411, -784, -252, 556, -109, -138, 588, -437, -709, 1128, 357, -144, 521, -45, -574, 719, 503, -149, 390, 325, -619, 370, 572, -508, -248, 161, -700, -28, 809, -548, -665, -28, 15, -428, 594, 207, -1085, -138, 96, -470, 618, 165, -784, 150, 436, -435, 565, 673, -623, -428, 665, -17, 204, 525, -592, -496, 895, 308, -556, 35, -140, -643, 683, 866, -712, -165, 197, -752, 115, 620, -835, -529, 71, -233, 150, 939, -376, -832, 384, -69, -164, 930, -76, -680, 429, 593, 19, 508, 320, -790, 300, 722, -263, 251, 141, -587, -72, 506, -562, -621, 218, -328, -598, 707, 10, -582, 131, -315, -803, 476, 393, -537, -8, 165, -252, 169, 690, -573, -164, 298, -121, 373, 811, -592]
3986e92K53O37Mo00P21q56m21J282n6j078R83m45r01J325K07q50K87J97q24Q25
4006I8Q59j213k52M05k15P4J106p24p34P11J52k37P12m99q19M70N09l30Q19q32
4026F0p51N75M30j01k61K60j017J79J097m70n92L79m11p8J372l04q99N77j33l10
4046c98O53J79n99j36N50n40O89L51j163N7J044o70R9M24o93n41R82k02n08P82
4066C60r1j091Q08J51k69K61p0j080P92M29o52M23M36r75r8J230k17o12O34q51
4086d82n3J540r01m02M35P1m31J012k58r72K75K81n66N29O19j373K16O61j16J7
4106A02J87q12j33R39j79l13J73K5q85J163J69o18K58pp13Q47O14j094J98J80
4126A01n21M48Q27p86n20P21n93KR60m03o05L72J74l25P27j60j166P41R0n07N30
$$ y = [-592, -339, 298, 302, -298, 423, -433, -854, 428, 372, -706, 277, -168, -1069, 256, 463, -387, -100, 97, -727, 98, 957, -256, -508, -103, -318, -244, 862, 138, -596, 115, 267, 30, 742, 243, -576, -106, 403, 73, 892, 60, -691, -116, 314, 213, -48, 212, -805, -626, 471, 1, -591, -212, -623, -701, 671, 367, -532, 45, -88, -398, 255, 434, -165, -301, 249, -291, 398, 749, -414, -357, 687, 17, 116, 540, -153, -694, 288, 86, -422, 360, 269, -822, -14, 137, -132, 129, 59, -1021, -229, 200, -452, -29, 407, -568, -666, 564, 347, -265, 369, -482, -535, 1005, 104, -298, 137, 208, -223, 789, 531, -441, -166, 115, -451, 78, 697, -676, -460, 201, 85, 102, 289, -523, -656, 283, 104, -209, -36, -11, -896, 267, 436, -182, 76, 69, -644, 203, 817, -277, -79, 101, -420, 28, 855, 69, -451, 270, -323, -321, 639, 236, -369, 3, 177, -148, 579, 419, -747, -6, 84, -423, 107]
4147A07L45q47j50P76j70l04M80o73j31J297m85l64L94k70m93J025o8q21N90j78
4167F0o47Q06L79p03j29L47m40J32P77r90n8O20m42k40J149m82o47L72l4K44L63
4188D37l87r55Q52P27q17K78J43j215P03R11l49k55L76p78j29J351n93j65j5l28
4208b08k2Q34j23j140M68N34q84P15M35j258K5P64m04MN84p07j64J017n56O3K56
4229B33j96q60J314jn51O03m22n27N23M38o49L15r6m28L06N80m69k82J82m72J77
4250b82R83q36j28L18l98q9Q67k52q54J015j14m31O68l57r61O84L10j80J44N67
4270F74j104J43R02n10r8N82q41l1N94m60l50R73k15r15P39Q69j278M64l26o53
4290h41Q42O65q37l49N01J06o67R35k84p78R49n49M79K57p6j403J164L40n24P60
$$ y = [107, 452, -395, -545, 231, 61, -243, 237, -436, -567, 730, 245, -119, 275, 5, -488, 537, 469, -352, 238, 60, -587, 219, 598, -105, -234, 113, -327, -195, 582, -408, -466, 154, -288, -528, 621, 139, -508, -136, -170, 74, 437, 50, -905, -53, 674, -143, 135, 278, -937, -234, 677, 328, 73, 449, -329, -458, 893, 300, 135, 120, -208, -230, 604, 481, -659, -191, 343, -541, 174, 609, -649, -624, 140, -264, -260, 324, -383, -547, 470, -86, -23, 233, 37, -823, 491, 490, -61, 542, 120, -407, 116, 554, -95, 220, 124, -304, 2, 582, 113, -169, 13, -459, -282, 701, -135, -263, 55, -343, -432, 435, 183, -671, 344, 230, -201, 467, 110, -851, -167, 143, -37, 107, 674, -430, -287, 615, 105, 7, 589, -252, -283, 311, -149, -499, 474, 259, -656, 83, 952, -326, 138, -188, -841, 1, 666, -171, -520, -19, 87, -580, 355, 71, -707, 242, -307, 172, 429, 353, -1050, 114, 454, -70, 690]
4310F90m12q60N62P15q32J62N58j170J43R63m42j92M2l72j00Q62j13o67O97l34
4330a00k34P36j23n85L37J69l42M91K56n81l87R68n85K37K02l97k79P35o44j95
4350c21R28m30q36P81K26k98P6rq21O83K76n77J37J45j98l7N02Ml02lN8n09J068
4373E43l94l05N80l55m66Q05K9q04L51M53p80M21M99p10j08O45o15K69L89p91
4393c44l77J104j84k56M86k26p28P41q6l12J65K33p90O91P15j253J72K57k73J32
4413a33N82n80r5L87j83pN31l58m88N81j22j61L04L0j185N80O1k0L58L5p33K45
4435c71K82r4K41J3n54J7L53J81k54L10Rj30L65l68p1M05j85o36O97K06n39L6
4457h7O3l80O48L18q71j13M46q3n80P49k20j38M7J70o34J169j76r66O43K23q9
$$ y = [690, 278, -582, -20, 695, -137, 25, 583, -587, -444, 519, 77, -115, -73, -445, -545, 317, 204, -463, 234, -100, -334, 402, 279, -306, 31, 200, -142, 349, 605, 24, -363, 605, 20, 257, 459, 62, -217, 518, -126, -321, 607, 177, -659, 122, 348, 50, 126, 117, -704, -21, 255, -322, -185, -40, -238, -275, 227, 231, -71, -74, -16, -525, 543, 149, -156, 424, 69, -397, 408, 437, -367, -16, 437, -343, 78, 577, -133, -241, 404, -211, 58, 447, -344, -721, 383, 199, -57, 429, 203, -525, 216, 130, -182, -17, 216, -574, 117, 832, -421, -249, 8, -265, -133, 449, -131, -226, 161, -22, -29, 502, 144, -344, 237, 115, -46, 258, 288, -897, -317, -256, -276, 82, 117, -616, -371, -89, -183, 58, 71, -483, -466, -113, 68, -186, 124, 133, 3, 368, 0, -71, 334, 149, -487, 210, 416, -123, -87, -24, -404, 244, 562, -309, -422, 24, -59, -639, 110, -110, -248, -201, -31, -665, 504, 328, -638, 5, 228, 139]
4478A39j0J10r51P19L12m91Q1M54p24P4O84l77N7L45p09k28P84r3j99K20J3l47
4500a37L59K8k55l34O64o29M70R2k87l28M32n2R2L79m72m68M87q4j30N23q3n09
4522b42L91M59q48N93n91R9J84J34l89J47K84m84O7N28j97k62J77l79k20Q00j91
4543F0k83J41N3l33l6P39p17M87J0l42K22P90j095r7O83k82r9M82k44k81M84p6
4565B66l22K95m62n50R94J0l44R6N8m74M00L71m18k69M30o39O23K27m95K66k3
4586D0k15R1K95kk19K00J3p5J16j10l56rN19j32r3J58m56m0P21m34k19M77l70
4609a00m17Q10J65p66L85j0k58K64m4m51O5L20j62L63J92l50L7J69m17K22L01
4630C18l01j14M90o98k29J152n94m99O52l62l01N97j90k44M03L22k72k75K18l39
$$ y = [139, 129, 239, -712, 7, 319, -172, -91, 363, -361, -287, 397, 20, 77, 422, -287, -515, 269, 176, -23, 197, 210, -137, 222, 250, -5, -339, 325, -304, 166, 258, -29, -357, 75, 23, 115, 494, 22, -446, 41, -43, -173, 350, 267, -242, 149, 608, -240, 353, -238, -139, 45, 179, -210, -63, 221, -263, -196, 332, 135, -127, 50, -329, -549, 251, 60, -223, -82, -29, -362, -398, 341, -376, 111, 121, -221, 1, 791, -304, -401, 282, 0, -99, 383, 139, -142, 342, 266, -56, 239, -223, -773, 221, 231, -113, -17, 41, -433, -33, 338, -80, -349, 81, -558, 65, 292, -203, 63, 40, -175, -84, 211, 209, -10, 190, 203, 128, 244, 134, -222, -231, 288, 156, 63, 221, -235, -275, 446, 12, -207, 270, -100, -517, 293, 458, -308, 77, 67, -191, 73, 29, -422, -357, -37, -199, 164, 356, 6, 43, 212, -205, 17, 318, 17, -97, 393, -305, -534, 618, 24, -475, 177, -185, -486, 111, -79, -323, 80, 402, 130, -145, 73, -266]
4650b66Q7K88m47J83M93l92P1K50k8n98L08K45o51P43k53m06O65R2n48j01R31
4671F66n88j33Q1Q9j50M90o58j88O90l70J4Q6k60k3L49q8m35M41L1p21O99L87
4693D09o05K98K00l87J57L70m14k15J29K76k75J61J22l73L52m92OM35M6l2l8K1
4715A51k66J20J76o03O99jp21L88K29p40K98M22k45m8J63P0k79N53r2m09M72j57
4737A80n71P73J09m83J6L28m11r8L90k39l83L99j14O5K36n54M23l6m6k10K14M4
4759C2m02L43J81k55p3J79l32M19Q8l38J16J77l70j5M28K27m25M43o51n1M95j38
4781G8m30L46M6k64K76P3l25K1L36n13J95K76n32P9L63l04J0N45l11m99Q57k37
4803H6l94L98K42n49M10L17m10r7K4k04J00K42k39M2Q2j40j39L98o2m82N60l29
$$ y = [-266, -179, 109, -338, -155, 338, -54, 17, 267, 239, -359, -51, 194, -457, 286, 33, -373, 292, 384, -164, -265, 666, 78, -55, 26, 115, -35, 455, -203, -391, 299, -71, -57, 29, -231, -254, 95, 7, -428, 13, 44, -677, 22, 409, -196, 102, 302, -85, 72, 442, 28, -187, -58, 218, -57, 104, 226, -147, 205, -287, -281, 154, 200, 168, 130, 151, -115, 5, 181, -422, 277, 276, -445, -57, 172, -568, -270, 152, -93, -141, 22, 92, -187, 366, 274, -135, 337, 180, -391, 382, 491, 8, 24, 352, -59, -157, 233, -6, -389, 10, -104, -39, 197, -357, 66, 30, -16, -226, -12, 32, -370, -27, 154, -101, -174, 5, -327, 92, 180, -158, -42, 135, -235, -250, 178, 405, -20, 423, -228, -279, 216, 78, -352, -6, 40, -224, 52, 125, -200, -179, 157, -356, -161, 115, -417, -338, 25, -279, -269, 276, -35, -534, 323, 86, -308, 90, 332, -217, 193, 510, 100, 3, 27, -177, -77, 165, -74, -32, 50, -90, -229, 169, 107, -375, 185, -144]
4825a44k44N44k73j05j71M63j69m2nk47K90M44m27oM11m90O3j60j9K16r0K89j63
4848c5L92m31J9K20j66r7K23k85Q2R5m5nm9O41n93J38P8k9n07O38l76n8J79K8
4872E7k56L89j57k97N25o38L29J39Om16J45J60R8l27O73n56j23L61r1J08j84P2
4894A7KK82J34j62l54L1j48n8M33l98K21j13m13L64L83l82L02j49m7K43L5j68
4916E5q7L44n58K37k36O49m29Q8l20K40L95j35m47j47P29l88J33m2k58K53K19
4937B95l47K2K83l64J96j87J38j87J01O0n55N87J2q8J59j58j44N08j11j46l6M1
4959G9n6rj98j3J04O4J50j63K74l75K03p1J43m62M47k50K42l42M24l86K79M4j66
4982c8N8O0l30M69j33j60L14J41l52J82j72Q4k34K27q7m20N95j02k00R0J29O3
$$ y = [-144, -388, 156, -117, -222, -393, 70, -99, -141, -146, -393, -103, 341, -86, -92, 319, -171, -108, -268, -287, -71, -161, 128, -35, 357, -74, -55, 165, -1, -98, 125, -160, -78, 17, -28, -33, -82, 559, -34, 104, 182, 153, -354, 284, -92, -150, 29, 57, -199, 190, 33, -264, 261, -377, -48, 91, 97, -319, -174, -14, 84, -243, 430, -126, -249, 112, 21, 129, -55, 17, 19, 301, 435, 273, -81, -50, -198, -256, 177, -221, 0, -113, -526, -162, 221, -161, 141, -8, -55, 188, 223, 55, -32, 312, -246, -9, -245, 404, -25, 63, -257, -17, 378, 243, -204, -351, 378, -10, 123, 81, -177, 76, 295, -52, -30, 253, -111, 85, -102, 36, -151, -50, 10, -545, 42, 54, -34, 125, -33, -177, 331, 220, 74, 38, 79, 23, 14, -184, -197, -93, -29, 121, -42, 232, -143, 60, -11, 132, -330, 117, -133, 109, -233, 191, -195, 84, 128, -38, 20, 80, -250, 219, 86, -74, 240, 381, 29, 211, 39, 123, -111, 116, 29, -391, 204, 102, -98, -8, 121, 184]
5004A84r0j21l4q7K03k43N15j03j76j11J96J21o76O60k91k3J69j29k36K14K11
5025A53j54K31j30l57K69K04l12o8j16K64J6K39k9l78L4P3K22o4l5o1J5K45l19
5048e8R6n5k53L05P8K18j34k10p9L45k13pk95N57K07p76K51m80N20L8k7L19n69
5071b22K65o1N2K6l78K89K76q1j08J36K2m32L27l4l81K74J81k70K26K44p08N65
5093B08m04K78k6k7n14N24k47j04L49p3O5L2j61O9J58m4k76L60o9q6j22J67j26
5116f9J50k08J84j35K79k72M8K2R7J3O2l4m26J81M61k02j85j1M1j14K51p8k74
5139b19M71k07j62J62OoJ29j7j38j67L87l77n1J61J32p0Q4j36j29J62J00j12j00
5162i7L71n07M05j87k15K01m1J80J3j56j74J72L4P4K41l45rJ04P6J20j12l20L6
$$ y = [184, 94, -27, -61, -148, 55, -188, 327, 224, 48, -63, 133, 254, -422, 238, -53, -76, 93, -36, -272, -58, 153, -1, 230, 100, -257, 12, 216, -96, -164, -280, -16, 0, 239, 210, -168, -134, -61, 161, 97, 62, 1, 16, 261, -58, 38, -17, -270, 35, 113, 331, 197, -13, -92, 253, 40, 33, -262, 295, 502, -274, -23, -503, 17, 55, 28, 347, -222, 43, -18, 34, 60, -318, -29, 247, 166, 58, 194, 216, -216, 111, 77, -304, -30, 151, -119, 107, 351, -357, 208, -196, 82, 56, 29, -485, 39, -208, -312, 37, -36, 29, 61, -100, -31, 127, 83, -193, 167, 98, 12, -110, 57, -69, 81, -127, 57, -78, 201, -71, -23, -1, 96, 109, 171, 137, -289, -108, 353, 151, -34, -45, -4, -118, 133, 55, -219, 252, 45, -117, 45, 51, 45, 174, 157, 19, -148, 239, -138, -189, -28, 104, 34, 118, -18, -147, 15, 115, 3, -97, 274, -233, 172, -15, -230, -29, -70, 110, 123, -33, -207, -35, -1, 73, 314, -31, -40, 64, 140, 260, 148, -172, -136]
5185a36k44K71J87k57M13M2k65m5n8K25m53N34m16k0K90j07k07q9L47Ql5j33K48
5208A00l5j2l60L09N2j66L39m84L79J2n1m99K02J5K43n0l25L14J8P3m44l4N02
5231I8K02j37J04l69oP9K59k51k22K00R4k03K28j06K10j22k9j84M21j73m9M4l4
5254E4Q0P9l67n7L57k03m1K27r5k11K23J7q9j6j96P4J93k38J94L3j33O1l7P2J0
5279iP5m0m5m4rRmK58l16K25j5k93J87K11mj78J77j9j66j23J28L0jq7l48L82r7
5306a16K72j82J72k61J47K3j52J66J36l16K7J27m3j1j30k72L91o4j9J39J43L0
5328B07k45L21l2n39L66Q3j67J43k74j68J82J31k84P6L40J0k98R6M64k66l63N70
5350C53n59M11n78L79J19K4K2l03j12L75J4j85j7L2L43k16l84L03J81k40R1j63
$$ y = [-136, -380, -109, 78, -179, 234, 276, 11, -34, -92, 133, -320, 214, -202, -222, 68, -39, -246, -335, 12, 20, -15, -148, 100, 65, 53, -307, 2, 54, -112, 227, -257, 122, 134, 83, -416, -214, -199, 44, -6, -331, -17, 1, 74, -370, -404, 98, 300, 163, 267, -102, -108, -29, 230, -21, -243, -43, 51, -152, 76, -30, 180, 58, 29, -155, 266, 93, 44, 88, 54, 134, 213, -154, -211, 146, -57, -98, 129, 34, -177, 46, 63, -26, -42, -238, -164, 29, -209, -15, 18, -115, -54, -91, -19, -9, 66, 26, -19, -63, -72, -63, -67, 191, -125, 100, 85, -208, -21, 190, 186, 8, 185, 166, 0, -123, 5, 35, 34, -53, -401, -19, -116, 156, -26, 146, -115, 32, 55, -97, 69, 205, -111, -84, 43, 0, -11, -141, -413, -22, -86, -105, 34, 177, 207, -38, 283, 251, -288, 78, 161, -6, 137, -137, -305, -123, 8, -276, -200, 140, 150, -148, -52, 412, 146, -217, 353, -206, 205, -373, 6, 125, 149, 171, -132, -244, 131, 145, -40, -57, -25, 318, 102, -282, 21, 202, -38, 53, -110]
5372a10J23K58l29R9J45q3j98M9n0J68j33J45o6j36o4j3m5RO1K81k11J03j59L3
5396a23R8J39j32J39j99k25M98k9j46K3l3Q0K63N1k52R7n53L60J78j62k13K65
5418A24j56k17M07j37j60J79j7m57L76oK9R4k20J63K32q9m0N8j24k4K38k32j13
5441i2k49L92K8J57l73K7K20%L0j15j95L08j15J8K91m02j0J52j87j42L79R7n07
5464b88N94l95n8K1O7PkM78n30R4K25l14Q0k3j49J33l6j14J56R9j2o0Q4k12J29
5489b6Q6Pj37J69k11J02J57j12L22k00j06m0m2R3j30j16P6J29l38M64k35O7J69
5512A48j91j56M64j19l83M38m31L34J29R4j61r3j77m8M13k31K8j89K57o04N18
5533D0Pk15J64p1j11m6K58o7J37k8m0l98N15k82J43J01J09jj12n6p1J50o3r0O7
$$ y = [-110, 13, 271, -58, 41, 186, 103, -95, -46, -96, 72, -61, 84, 18, -118, -182, -195, -240, -231, -170, 111, -100, 3, -156, -123, -25, 114, -18, 121, -78, -303, 195, 166, 20, 43, 10, 90, 353, 404, 152, 249, -304, 56, 234, 72, -141, 124, -32, -249, 158, 21, -139, 40, 23, -434, -58, -64, -35, 59, -161, 2, 234, 145, 105, 163, 39, 15, 253, 21, -92, -341, 51, 79, 236, -137, -110, 110, 110, 140, 25, -170, 138, 23, 41, 332, -70, -80, 72, -115, -257, 122, 219, -288, 306, -89, -147, -126, -59, -52, -54, 424, -106, -12, 213, -101, -21, -44, -193, -60, -96, -210, -54, 45, 33, -27, 57, -155, -26, 60, 67, -70, 99, -112, -10, 147, 35, 357, 157, 51, 11, -31, 62, -68, -184, -108, 21, -317, 147, -88, -21, 148, -43, -199, 265, 146, -237, 201, -230, 104, 233, 327, 166, 73, -104, -152, 261, 30, 58, -131, 126, -478, 40, 47, -168, -4, -75, -186, -232, 26, -41, 96, 68, 28, -370, 145, -137, 6, 107, 216, 215, 103, 47, -24, 126, 63, -27, 40]
5558D0p7K37k66J22j96j11J49l4J20K76l38j73j9J83K8K12j40k34K24q7J93k47
5580a38j23K74J55j50Q9l44L70m7j44p4J38j26K92l9k28L50m70K69Ko4r9j24L35
5603A04l12j6K35lo2K30j92q6J12Q5N0q5J65l73J01O3r7J90j28J56j51M0j70L5
5627a09J62q0j2K27Rm45J7J15M6K9K10l76K37K13o19K28L61n30J86M7n51P27Q0
5650A72l94M48k83k10K95l8j33Q8J4K82j24J84m38p0J75M3k66N57j11k59L56k17
5672G1l49K56J01p1k23K70j45J88q8l00K73KR4n08N94j48K94j70k81L57j08k7
5694H2j67K04J83l48J57K7j53m8M50n29J94j04j71oK79j16L28k74J08l77M29K7
5716A75l52M28j00m29R1K95j15No6J42k12J99k74K08J65j90k90O01O3n48r5N93
$$ y = [40, -37, 200, -66, 56, -140, -251, -102, -136, -16, 260, -78, -251, -270, -87, -59, 153, 13, -221, 3, -84, 109, -138, -261, 13, 168, 18, 107, -237, 133, 86, -58, -132, 6, -120, 172, 133, -95, 255, -215, 54, 56, -8, -107, -231, 104, -208, -224, 11, 8, -54, 176, -16, -102, 10, 95, 145, 60, 225, -148, -47, 16, -81, 109, -19, 137, -14, 26, -144, -109, 53, -27, -39, 188, 197, -248, -231, -116, -70, -41, 169, -207, 30, 243, -376, -148, 213, -317, -131, -84, -635, 92, 172, -222, 226, -57, -267, 28, -10, -143, -55, -41, 241, 117, 301, -137, -207, -32, 11, -255, 302, 191, -68, 288, 71, -278, -22, 79, 8, -215, 55, -90, 98, 10, -290, -17, -15, 79, -429, 165, 17, 311, 141, -140, 217, 109, 82, -85, 119, 302, -46, 111, 138, -15, -63, 387, -142, 52, -52, -223, -229, 50, -66, 262, -12, 96, -281, 148, 175, -177, 251, 151, -278, -187, 108, -7, -2, -68, 74, -138, 61, -213, -5, 160, -30, -320, 281, 344, -204, -299, 294]
5738B94n70K40k1j93M17p4j73j38L76l38J75L4m9l80L61l0j60K15j44M6N43k61
5760A70k79J41P0k12J66K07m33N9J75j76L96j65K74l83k49L55l15J76p2l4J64
5781C5L9k68L21l61J17N7j54Q1J50l0j81K40J47m34MK70M5K18j61j33j90M27k17
5804B2p2K58k61j07p4N25r0k02l3k65K56Q6l05J06K92n07K18L75J8k38O9ll05
5827b37K32J23o5j04j8J53L58k04k83J75q7PJ4K67k79K21m77j69L06N33m66l65
5849c65K64M3k02J55J14q6Q9K51j28j98j8j02O4L50k52K4J04m22Q4N57j81k75
5871a30L35m53J86M69m81o4K41Q8m44L07L01n17J46K59k58J5J64k53j28K22k61
5892b56O57m50K89m48M40j87Q3N14j042K86qL45m84L55K19n05M55K36m60p8R0
$$ y = [294, -276, -36, -57, -250, 167, 93, -80, -218, 158, -180, -5, 29, -20, -400, -39, -69, -229, -14, -158, -112, 431, 170, -109, 32, 102, -110, 56, 263, -170, -111, 64, -112, 284, 119, 393, 10, -239, 116, -199, -23, -95, -129, 35, 74, -194, 127, -234, -117, -60, -214, -133, 17, -13, -194, 46, 193, -241, -237, 33, 78, 296, 135, 2, -188, 239, 22, -50, 208, -53, -160, -234, 291, 201, -1, -34, -299, -43, 43, -262, -156, 136, -371, -153, 222, 240, 2, 71, 68, -237, -5, 118, 53, -51, -69, 84, 442, 238, -45, 130, 43, 50, 64, 331, 52, 273, -204, -373, -67, 466, 0, -365, -101, -58, -260, -105, 9, -77, 12, 263, 135, -63, -81, -183, -119, 231, -21, 3, 107, -315, -231, 326, 145, -130, 205, -248, -62, 407, -74, -138, 103, 191, -253, 54, 355, -162, -16, 243, -15, 0, 164, -89, -217, 5, -256, 401, -49, 240, -208, 232, 45, 128, 642, -400, -114, -122, 223, -261, 94, 313, -192, 263, 499, 39, -39, 51]
5913E1j80L05J48n08j35N89k5j87N12n27J02pr4j32J0J56m12N02k01N8k13L86
5935A98m23N31j70k25lQ5m9j43K49j16K20l2k48r6K58J07j04J46j59l97L27M1
5957ck60J90Q5p5J14M64m76l60N79m50J88J26j91j76L57J70n11L23O5l23q3K57
5979A0J85L63n43l34p2N05m1L19l36m00L53L82l88P9J5J01k72L61R4n38M02k68
6001b3n4L06j22m47J90N0J64p3K11j06k96M50j94j60o8J62n03N55J02J8K58o63
6023b43K02K51k24p2J03J25k90J23k0j49L94l2k22m5N96o18J3K68pl39K35j66
6045a17M3l3j44r8O18j02m81K51Q5J9K99j21l35Q6L92l77j91N52k01n04M79k27
6067a07n9L79j63m41M99j33j49L52o2m37L75M5o2l09j18L56L38n6l22l03J72j04
$$ y = [51, -129, 176, 324, -184, -319, 270, 245, 58, 570, 43, 145, 138, 44, -88, -78, 78, -334, 168, -33, 25, -188, 198, -225, 306, 136, -89, -92, -7, -56, -199, 50, -66, 154, 122, -126, -222, 36, 143, 39, 185, 26, -371, -44, -3, -263, -73, 12, -63, 51, 515, 39, -321, 258, -192, -4, 122, -69, -245, 112, 282, -229, 94, 159, -164, -247, 10, 195, 558, 15, -319, -391, 114, 73, 392, 56, -344, 9, 391, 3, 82, 97, 198, -74, 287, 381, -157, 245, -23, -77, 229, 107, -340, -150, -100, 64, -9, 202, 96, -200, 250, 56, -104, -172, -10, -513, 42, 144, 162, 420, -243, -41, 210, -14, -86, 17, 142, -148, -25, -45, -194, 200, 168, -54, -99, 497, -121, -108, 160, 153, -186, 49, -117, -74, -107, -251, -349, 269, 167, -314, -63, 22, 41, 340, 219, -116, -30, 362, -15, -206, 346, 145, -359, 120, -107, -166, 213, 50, -391, 108, -25, -174, 178, 116, -321, 54, 99, 37, -272, -390, -34, 304, 248, -74, -377, -205, -309]
6089c09J23J61R5m2k0P6r7J31J64o85L38L61k19r8n4l20L87J46r8m0q6l32L02
6112a16M68j10j60j70N2j36J88J56o42O36j3m24O35L1l82n3J46k00J55K38q1l91
6134a73J61n0N1K90n45oL1L89l91K85j07j05j01J97q1L02P2k23K34j93n8J17N8
6157A54j56P4J96m5m9O1j21k83L69R1j01Rk58l46M79J16n66OP41o09K80J93m40
6180b05k16L50k93M38K42l66j84K15j17J88J96k76l88L59K99l46L24n1m22J16
6200a37L78j64k47K63k76K12P5K65m74j15L61m31N85j50k18k19M61n27M51nm5
6221D3k29N55n97K26K40m13J37O1K57k76J80j33lL73n12J4K73n8m66Q49k89k75
6243d3K71r7l70J73K94l38j55J73l37J88K35k71J70Q6q7K24r5J15l53M31l55J32
$$ y = [-309, -186, -25, 70, 28, 8, 84, -13, 118, 282, -403, -65, 296, 77, -21, -75, -395, -8, 138, 40, 0, -86, -418, -116, 352, 242, 82, -88, -36, -172, 16, 172, -470, 166, 153, -271, 364, 395, 13, -40, 106, -94, 61, 299, 218, -173, -12, -62, -11, 279, -266, -272, -241, 148, -243, 42, -65, -170, -271, -74, -155, 147, 219, -4, 230, 37, -21, 96, 154, -2, 72, 268, 223, 174, 235, 114, -169, 200, 291, 190, 199, -59, -405, 74, 190, -376, -370, 371, -238, 42, 235, -205, -421, -71, -364, 74, 316, -50, -234, -19, -136, 52, 248, -28, -416, -57, 242, -104, 220, 169, -253, -137, 241, 77, -170, 93, -183, 29, 104, 369, -105, -220, 141, -290, 295, 145, -73, -292, 169, -358, 93, 88, 43, -186, 369, -228, -2, 238, -175, -38, 23, 280, 4, 184, 51, 48, 421, -91, -77, 196, 138, -328, 521, 232, -43, 228, 131, -239, -66, 228, -110, -265, -92, -429, -241, -6, -277, -107, -21, -108, 116, 21, 136, -217, 214, -141, -9]
6265iJ72N4n30M21J17l83K10K06m47O7N90l80K0R7j55n09M27j75J80n4N6m83N86
6288G8k48k36J58M09l33L22N4n74O4L22j96RK02n0j56M33k03j00K22k67K05j15
6310@l01L28K87q4k10j61J89j86L11O1m11l51O67k54q0M16l02J9M94m01q3n5m04
6333e11M69J04M22p02L54R7j24J12L22o68K19J2l71M08J49l67M1J53j5j6L5J93
6355C16o03M55K74n88J53K43p22K67K66j56J0j7l30K74M84j18l75J54m9J85J1
6376A34j00l00O61n24j04O09j65n66M09K3o2RO6l83R0L19k57J49L23n16l49O99
6398A65r4j06K63l01j35M23L7l29P9l75J10K29L75m86J26L41o55M27K31n71K23
6419b3M25l67k6L90n22j21L42k32J93p8K78p38M10N6j62J24J65n86K82N97n98
$$ y = [-9, 163, 217, -313, 108, 225, -158, 52, 258, -189, -122, 468, 88, 108, 205, 50, -459, -32, -207, -27, -81, -25, -508, 78, -170, -406, -248, 161, -172, 150, 204, -370, -306, 16, -180, -171, 31, -19, -175, 258, 55, -45, 177, -90, 115, 0, -301, 27, 314, 230, 20, -141, 48, -138, 173, 234, -177, -528, 139, -115, -195, 221, -81, -62, 432, 31, -52, -107, -511, -42, 62, 484, -218, 136, 233, 109, 221, 543, -125, 94, 106, -265, 143, 292, -75, -34, 119, 104, 88, 123, 316, -287, 168, 442, -146, 7, 250, -472, -205, 61, -95, -85, -102, -432, -158, 326, 208, -167, -13, -62, 123, 134, 34, -266, 395, -129, -233, 376, 211, -355, 54, 77, 15, 24, 90, -293, -203, 116, -141, 8, 331, -185, -534, 165, 71, -35, 228, -73, -208, 215, 252, -77, 2, -373, -263, -34, 341, -145, -19, 322, -333, 94, 325, -246, -23, 402, 35, 9, 399, -123, -244, 98, -134, 59, -19, 259, -479, -69, -13, -175, -51, 114, -472, -190, 407, -191]
6440a91J45k9j55K07K12j83j19J63o3m8L82j36m02J79Q4k62M22j19m77M31j9m87
6462d65M31L47m97j77M4J77K11L16n44j27M85p9j58q5J86o91P87oj73K21J24n51
6484b24J10L51p6j70J64m83M44J08l34J31J78l99k35Q58m89j16MK40j08L91j98
6505A47l28J0K77k22O7Qk15K49M8j79k22P58l89j06K21n6o5M56n34j62N10k47
6527B6l46N92o9m32p9R77m20o28M92m11L83M12m21k19L20n01K80L36n7l06j76
6548b47N06m51K71j8j67K17J4j35L5L96p99L71J20q3J18K06l42k42N06k95M5j98
6570a72J13m83Q06j22n12J39j06o3L45L22o00J99L34m78K81K10j42p84P44o9j17
6591a55M40l11k51L74m3l42M63m0k87k9M44n67M55Jn58L56J30j27k38K70J0k87
$$ y = [-191, -46, -75, -230, -23, 189, 6, -113, 50, -13, -61, 321, 185, -217, -38, 46, -216, 206, 87, -390, 41, 22, -465, -34, 313, -184, -361, -317, -140, 71, 387, -157, -284, 201, 122, -36, -121, 65, -626, 161, 155, -18, 203, 327, -224, -114, 237, 161, -9, 155, -328, 116, 224, -110, 21, 199, -200, -435, 423, -66, -182, -178, 62, -46, 345, 147, -181, -171, 106, -116, -49, -41, -256, -7, 41, -138, -360, 398, 9, -97, 124, 68, 3, 459, -75, -237, 273, 26, -320, 272, 203, -229, -308, 669, 249, -379, 113, -298, 85, 497, 76, -143, 177, -324, -44, 292, 235, -71, -247, 259, -192, 79, 61, -106, 111, 125, -10, 25, 421, -378, -7, 113, 30, 148, 354, 12, -230, 276, -19, 26, -172, -59, -542, 264, 142, -370, -231, -337, -400, -55, 267, -333, -134, 200, -278, 3, 213, 71, -713, 31, -38, -155, 285, -26, -277, 97, 54, -288, 175, 135, -152, -181, 263, -304, 151, 152, -406, -50, 80, -47, -285, -15, -5, -292]
6613b92Q59p90M2J79P0p30R72n0l84K21J96l05L62k44k4rP6j71j46O87m44l59
6635b84M99k45j27L16k16l66L96k4m21P53Lq23M54M00o20M94j40l44j46Q47m75
6656f9J00j14k63M41L38k87k99M29k46k67J20K26r6J41L4j93J49q4k22M5M92o02
6678b27J68M07m75q9K70l04n5L95n28J63N19l76j01K37J07n88P03k63k76K43M66
6699C96m03K07p2j36n6L60k38j25M35m77j56K63l9l30O79k94k97K48K0o1M08j60
6721A72n45L67M00l17k58M8k57K75K28n1k86M90m06j7J81J18l67L28n0m60N47
6742A40L2j51j83J93j54l2O01o22k6K93r8J33L20l62m44Q66p28O8K38l7m66K69
6764a50J06O3K04J61m49j03J01j45K30%k9j19N49n10r1N01j95l12N20n84j18N49
$$ y = [-292, 567, -223, -181, -2, 68, -662, 310, 260, -124, 97, 293, -12, 350, 106, 82, 73, 149, -22, -168, 519, 75, -284, 215, -30, -157, 159, -57, -423, -27, -51, -472, 281, 284, -539, -85, 315, -305, 189, 49, -295, -441, 406, -69, 31, -83, -346, 95, 433, 146, -153, 276, 30, -237, -117, 109, 13, 154, 188, -5, 144, 60, -162, -117, 375, -227, -59, 348, -127, -216, 54, -250, -305, 90, -438, -275, 244, -132, -233, 4, 111, -477, 226, -37, -313, -70, 396, -7, 200, 128, -8, -64, 296, 58, -67, 368, -109, -265, -2, -41, -371, 308, 14, -283, -35, -15, -76, 332, 172, -373, -6, 394, 77, -181, -133, -390, -115, 113, 62, -224, 266, -140, -157, 24, 142, -225, 103, 53, -407, 140, 172, 21, -162, 31, -123, -155, 446, -176, -202, 91, -7, 126, 446, 84, -360, 506, -222, -154, 84, 47, -419, -150, -44, 19, 223, 384, -65, -168, -67, -212, 18, 18, -11, -130, 419, -91, -182, 319, 124, -188, 332, -252, -370, 179]
6786A79j51O2J03M3p22P04l54j6r2L23j45o3J22J11j25N2M2p2J04l19L07O3O9
6809B25m21L95N6k59J90on16K59L90n00J49M43n23M5N54p64%J32k20m7O09k53
6831f2l61N02m6p6J3J41n59P11R1m58j68M34l18L97R1n88L51K8m97K06M67m80
6853a81J79J67k19q8K55n9n5K58k32l32L17rk63K30L08n57J87K60l26k57J93L38
6875A14j98J30J13k79M63Ko41M90n5j66K41P1l59M70k99n11L31L73l70j53N32
6896B99j92m09N15l96j52N73o34L26L70k11j34L25j47l31L94L44o43J59K05p02
6916d41L80L18n57M64K52k96k83M66j92n16L39P2m00N62l1j84O4J62o34M97J07
6937A49m13Q7K89p8n88O75l87J24L22j14m70P11k17j61K83p9n44N18j21n4J9K0
$$ y = [179, 28, 90, 193, 236, -486, 218, -136, -152, -244, 79, -66, -129, -7, 104, -21, 31, 73, 1, 105, -214, 93, 156, 225, -196, 199, 255, -4, 186, 180, -336, -77, 313, -187, -38, 405, -118, -73, 481, -283, -283, -151, -371, -418, 191, -62, -423, 79, 33, -43, -30, 111, -448, 263, 354, -104, -272, 162, -156, 241, 332, -256, 95, 123, -374, -168, 299, -181, -2, 165, -54, -142, 113, 54, -1, 257, 25, -307, 10, 1, -262, -32, 276, -281, -94, 166, -160, -417, -224, 114, -84, 46, 159, -120, 343, 345, -296, 194, 139, -27, 214, 285, -74, 396, 97, -414, -83, 290, -80, -233, 299, 107, -302, 213, -183, -335, 238, -396, -70, 300, 89, -45, 280, 133, -198, 196, 540, -103, 56, 261, -441, -61, 257, -300, 164, 416, 120, -163, 303, 111, -405, -66, 6, -394, 168, 137, -47, 17, 179, -455, 42, 149, -264, -177, 112, 34, -554, 121, -266, -142, 180, 66, -404, 307, 90, -71, 212, 133, -411, 107, -14, -68, -49, -29]
6959b9L5p2K77j20K56l2m82K68M28l95k86L18km21O38l60p0J04k97M6L8M52p34
6982d40N64J01l89J22J70J49j53J99l78R6L62m73j00M74k94l59M21L3n3r3K23
7003A82l17K53Q9o29N1N80m50L31M7m17o7N93n26n0O53j79m25O65k08o59P52m59
7025a90l9M41l98J61k77Q55j024R91k74m37J73L75n86j64P03k65l15M75j92j08
7045i5K34k55k31N07k02l75N47j25k83L89L41p86K8O29o62K74K79n58M74J2k07
7066f5j69N53l24j93O70j1r19P33j42m77M08J22m12M6Q0j42J25O12p86J69K61
7087A39k93j51M25l02l31M89j07j03O77m66j03J05J39j1j95M49o62L83M6k54N2
7108g4J32mj11K98k36k59N40k15m68M25j79j76L44j76L0NL81n93N32p0l75K74
$$ y = [-29, 6, -66, 211, 91, 347, 315, -167, 101, 529, 134, -152, 166, 164, -257, 381, 21, -49, 55, -242, -196, -158, 294, -440, 124, 225, -164, -42, 128, 277, 124, 323, -55, 41, 403, -70, -170, 304, 10, -349, 72, 105, 52, -41, 182, -135, 118, 207, -422, -371, 209, -241, 90, 137, -280, -347, 246, -280, -330, 323, 144, -281, 384, 176, -483, 269, -190, -229, 212, -186, -25, -302, 553, -471, 520, 246, -191, -18, 357, -229, -393, 310, 45, -270, 205, 13, -95, 139, -116, -347, 160, -42, -417, 130, 5, -278, 111, 452, -334, -306, 323, -339, -65, 214, -344, 130, 142, -65, -234, 319, -5, -198, 472, 461, -458, 275, 133, -344, 64, 186, -226, -180, -100, -242, -117, 495, -291, -122, 139, -154, -305, 120, -182, -513, -24, -131, -234, 443, -23, -126, -21, 118, 107, -88, 361, -301, 82, 128, -126, -74, 58, 54, -57, 241, 5, -254, 286, 71, -397, 28, -151, -327, 17, -159, -129, -124, 257, -336, 196, 126, -249, 25]
7130B5N66o56j2O9N4K0J56j64k2L49n8o79O19m2n09M05m3n8k15K70m84N18J25
7153B34n62M30j4l69L28J09m78p5O68m55P2M37k52j77L15j33l09N07j19k85N1
7174g7J05j06J79L74m39k93O53m13J0K54k82o05N65L87q02P22m21k17M81j56k61
7195c42M71K24o56L61L63m94K37k52M3J43K59l88m14P70k98O2j90J05j87J25K48
7216A90l38L75P8j025P75L01n80P4N4k34p7N99l32k0N33m39j71L78k8n06J11L00
7238A8m62P67j91n05M38J85l25K94P1m80J26N12m93k29L61p0o1K55ln76M93K00
7260C25o22L33K34k66j48L90o93L10L30m62J57J76l14K95K29k89kL31k09q0J34
7281A59P9k84k2J56l60O64r5q48O48K8k35J81K32l47l87J006m97j76K97m22m39
$$ y = [25, 591, -65, -77, -8, 46, 66, 222, 58, 36, 385, 327, -352, 267, 225, -284, 121, 78, 20, -195, 75, -409, 109, 234, -328, 102, 88, -281, 47, 156, -322, -397, 271, -184, -112, 325, 73, -104, 211, 78, -231, 276, 157, -128, -77, 28, -78, 101, 475, 36, -257, 396, -17, -7, 247, -35, -640, -75, 312, -490, 232, -189, -406, 75, -81, -342, 129, 353, -303, 58, 421, -73, 164, -88, -45, 98, 357, -31, -445, 325, 27, 89, -101, 4, -183, -58, 190, -148, 227, 305, -720, 55, 356, -224, -150, -96, -330, -407, 192, -140, -160, 373, -66, -237, 141, 113, -393, -282, 18, -444, 323, 132, -373, 65, 250, -75, 219, 290, -190, -64, 448, -45, -274, 87, 17, -44, 211, 208, -368, 125, 325, -297, 36, 270, 4, -144, 246, -447, -137, 193, -269, -112, 64, -250, 45, 274, -15, -17, 314, 105, 25, 159, 238, -46, -68, 88, -272, 392, 297, -551, 97, 125, -110, 71, 303, -44, -431, 575, 78, -98, 199, -223, -662]
7302f62O29N8k10N84m08j09Q9J83l96N24k89k98K67L19l27L55m23n5L55K41m26
7323Am52O97l69%L08n9o01N09p4j61K70K06n44J29M30k42o8L89o45L7P59l57n08
7346c45M32Q9l25Q6k7j60M10k83K03K03m5l87L24K73q78L83K81m91M60%n12J49
7368a60N21o72k2N90l22k08N57m11k52J66K24m18Q20j12p34J51M57k61l6K12m81
7389c91M87K73k11l68K88j54M4O09n14l27P59o13k12P12l68l98L81l71l6P47n86
7410b49kJ33J87l53L64M53o43Q4L0n8L85q5k15k09M12j52j66M67m73k58M68J90
7432C10k75n7n7k7J27M14o70O2J54k24L67J40m04J34J31k6n89K76M27n72M80k83
7454a62J27K54L6p26M14L73l85K69J66l22m35N52j14M1J72k81k15N78j32m70K66
$$ y = [-662, -33, 25, -185, 399, -9, -118, -29, 154, -242, 282, -7, -305, -38, 281, -46, 309, -114, -169, 186, 427, 1, -451, 246, -123, -123, 185, 126, -475, 34, -40, -201, 69, 275, -269, -140, 290, 48, -20, 369, -276, -239, 520, 163, -345, 87, 176, -149, -63, -90, -250, 160, -123, 80, 283, 238, -149, 175, 448, -430, -47, 234, -257, 203, 203, -309, -160, 361, -311, -333, 257, -65, -273, 284, -127, -379, -213, 11, -407, 413, 301, -433, -282, 175, -86, -122, 90, -391, 96, 369, 158, -210, 78, -76, -32, 577, 63, -264, 495, -118, -330, 382, 14, -384, -3, -374, -410, 337, -249, -251, -118, 69, -284, 80, 533, -110, -26, 4, -54, 331, 246, 31, -178, 234, 82, -84, 383, -90, -348, 120, 310, 35, -22, -79, -106, 21, 435, -235, -173, -19, -243, 124, 264, -140, -6, 125, 99, -490, -214, 213, -359, 121, -162, -35, 219, 255, -471, -57, 316, -69, 200, 366, 44, -391, 161, 47, 88, 260, -21, -236, 342, 210, -260, 6]
7475FL2l90P51l71o27N13K47n84L53L51m72p8N48m27K99J83m74n3P06m43p0J30
7497A30j24j40M56j45j45M58l30o76M16N84n76L07m5o12Q1M77p74L84K63j10l10
7518d31O78l05r0J42j75l00P38j36o78J95N12N1l50P65q26K14K71n51J09N19k90
7539F2m48M33r4P5K42m27l63M30p2O9n4L65p36M52K95l15j65M60l29j67O28k27
7561A14l32M04m81K56O56l81m13J41Q8k30N80k86m30L68R9o2Q0K02l65J13Rj27
7583Ck86O16o85N5L16J00l29N47j88o91N30M90p65L92P3n99P30P5k32p5J39n85
7605c69K48P70l13o58M77m27M53J65k63k21R1J83l53R9Pn43M19K74l78J41K64
7626F6k47J35K42k69J42j01o3k08M94j83R0J60j59l96P23l19m61P01J4n37K51
$$ y = [6, 38, -352, 399, 28, -599, -86, 161, -423, -70, 281, -191, -269, 279, -148, 151, 334, -140, -193, 513, 70, 0, 130, 6, -134, 322, 177, 32, 490, 160, -516, -100, 484, -92, 215, 170, -442, -361, 116, -658, -274, -11, -121, -431, 247, -58, -148, -6, -181, -481, 257, 121, -557, -362, 150, 201, -149, 616, -210, 4, 275, -276, -167, 352, 62, -386, 47, -47, 28, 270, -157, -520, -90, -162, -93, -147, 218, -518, -66, 229, -86, -251, 209, -120, -287, 341, 114, -218, 186, -295, -39, 617, 236, -177, -36, 52, -178, 402, 116, -314, 54, 153, 91, 171, 373, 8, 121, 130, 3, -283, 333, -352, -297, 19, 119, -210, 337, 149, -542, -12, 478, -287, 105, 178, -421, 309, 384, 152, 77, 216, -369, -121, 649, 336, -322, 155, -272, 181, 346, 83, -138, -47, 136, -217, -118, -111, -654, -235, 39, -339, -198, 66, -181, -46, 196, -73, 69, -32, -95, -303, 191, 8, 98, 258, 99, -297, 426, 107, -354, 347, 361, -176, 75]
7647G5L26k85M6J44n80l1O43o73J07R3q6J84M92o16n2M75k39q3K59k02Jl10O16
7670C04l56N40j81q15K06O01l48J51J07k25j32O51l47o32P91l95j09N27k39l63
7690b64K50m10K9M85L38o90Q8M45p42L72K37j99j44J29j85J58O70o18k23M65K10
7711D01n99M10j82m85P04J80n69N56j28o93L40O28m49j09K4j84k4N35m68o8pJ31
7733e6k51N12ln94N97n28Q6P31l32q37N19N76m38L12L5l71L7N21n74L0K44k62
7755d6k94M49J27m11N80m60l94O25P1k64J03ll70J8P37n70J20j09m43R6J030o20
7777b8m90N60j60n9M98l71J4L8QlJ21K87q02L02L69k41L4M67p77R6L13l15l8K15
7801C8j9l90L25J58m90O81m80m26P45p6p8J7R0k57J36M22n42N1L61m99J49P65
$$ y = [75, 401, 116, 162, 306, -274, -305, 338, -335, -228, -135, -221, -37, 455, -161, -213, 262, 23, -60, 199, -3, -2, -312, 304, -52, 488, 307, -508, -302, 299, -49, 102, 209, -16, -148, 503, 156, -476, 315, -80, -189, 338, 99, -264, -14, -424, -395, 90, 428, -262, -174, 271, -471, -99, 138, -61, -205, -76, -261, -103, 567, -51, -274, 191, 401, -198, 212, 30, -455, 249, 429, -140, 416, 288, -405, -65, 563, 114, 5, 29, -155, -179, 356, -112, -180, -187, -56, -307, 205, 202, -392, 205, -323, -237, 494, 162, -675, -156, 420, -18, 294, 329, -42, -5, 516, -58, -28, 216, -46, -340, 109, 236, -175, 405, -55, -449, 176, 247, -17, 86, 83, -287, -269, 468, -102, 18, -91, -534, -438, 592, -28, -518, 42, -118, -177, 321, -50, -36, 2, 10, 7, 128, 415, -387, -85, 284, 43, 77, 544, -233, -137, 176, -139, -177, 38, 19, -371, -46, 112, -378, 303, -177, -603, 142, 66, -12, 5, 95, -162, -26, 396, -146, -95, 266, -233, -84, 681]
7823F81l43m73J48L25m82L2L20k74J43N6k60L06J6n12J80L48k28Q2n1n10M69K50
7845B23k09k06L82m13K18L34j91l18O8J18j89N36J6m55J71m4j27M67J17p69j48
7866d19O45k47L60j53l26mk9J52K44o3Ln33M38J05j76P5k78k76M96J80m79L02
7888A7Q3l56j05J219q72k21K69k45K31O03k32p12N36j43m71N39r1j97j63L49k66
7909b28L95J9m72N6N43n89J02M24m61l29P57j60J34L35m88k55O18k12n35O74l57
7930b9l4M95R0n46P8K36o67J11N41j96l45J54l15M42J98l98j13K28r6j85L04J29
7952H2k64PO22n44K50L14p94J49M85k29L38r4m88j36J200p57m61O27o19j67Q19
7973C40K00p91K57j19jR3L35o74J76O7l77J78M67j68n7J04k1j06J41R6m59L84
$$ y = [681, 338, -135, 13, 338, -144, -112, 208, -66, 77, 133, -127, 179, 195, -317, -137, 211, -17, 65, 14, -496, -27, 223, 14, -192, 190, -223, -5, 329, 138, -180, -112, 6, -183, 353, 369, -86, 85, 41, -86, 381, 498, -271, -419, 226, -21, 339, 186, -140, -144, -173, -21, 223, 160, 163, -370, 68, 173, -3, 72, -206, -482, 14, 194, -285, 17, 100, -256, -361, 858, -14, -235, 34, -211, 20, 623, 391, -321, 215, 72, -399, 140, 49, -148, -311, 38, -228, 167, 186, -286, -230, 313, -276, -174, 250, -211, -540, 217, 57, 191, 526, 38, -217, 401, 189, -346, 328, -29, -63, 432, 522, -24, 54, 290, -377, -266, 275, 79, -266, -112, -427, 15, 213, -185, -298, -70, -166, -351, -47, 82, -182, -175, 447, -97, 153, 467, -327, -178, 307, 78, 416, 322, -166, -302, 898, 141, -320, 307, -312, -479, 340, 540, -251, 6, -113, -114, -21, 314, -360, -184, -117, -494, -316, 151, -17, -74, 30, 9, -97, 44, 140, -319, 65]
7995F5K06m11L65j27l24M86q0k61M29j71m25M78j78n9R4K18n71J85K56J55l67
8016c7J03K7n12N41P5n48L54L7k37M75r8m95j14O57l04P4L57n32L17L85p37Q1
8038a31O48k40m14K04jj51M26k19m46L74On23K51J94l13K88M09m08J11K7m71M2
8060c37Q63n36k10K96p4l9M40k20m70J92J50MM01k09m57L71m7k36L24J00p31L14
8082a11L71l96k11O97l25l02P16m10k80O09m53l67M29K98n53N0M33o2J62J1p99
8103d93M81L27l54OJ01j9j50M28j17l35M03n3q40Q31J08k88L11j85k11M3q3o6
8125a55L60K75m76o68P33p8p2J52o0j14L28o66M21K38J5p80P31J33m04K07k32
8146a12J58L14N19j439M02L61l42k9N03q05L59Qn2J95L94o72k52M67K35l94L97
$$ y = [65, 271, -140, 225, 98, -226, 260, 180, -81, 348, 177, -248, 230, 52, -7, 87, 305, -266, -81, 175, 330, -37, 66, 93, -419, 122, 197, -351, 3, 40, -197, 278, 180, -315, -429, 228, -76, -2, 355, -177, 140, 525, -212, -131, 517, 277, -137, 67, 66, -85, 341, 122, -324, 50, 56, -467, -216, -22, -335, -47, 362, -46, 65, 92, -379, -337, 526, -10, -220, 76, 2, -37, 403, 183, -287, -95, 55, 59, 460, 251, -206, 165, 118, -118, 206, 306, -425, -111, 260, -136, -347, 350, 25, -277, 439, 29, -251, 358, -95, -462, -33, 265, -288, -238, 195, 133, 295, 306, -493, -12, 315, -39, -33, 68, 49, -101, 327, 210, -125, 278, 225, -615, 216, 324, 36, 347, 162, -49, -6, -89, -155, 205, 480, 4, -664, 69, -9, -81, 71, 11, -103, 225, -441, -20, 218, 233, -547, 184, 317, -87, 120, -112, 46, 360, 879, -560, -158, 203, -139, -168, 335, -470, -111, -103, -155, 40, 434, -238, -490, -23, 212, -182, 215]
8167B15j32k30J82K28l22J05P3l27N3N76n39j1K48m11J1O25m5l99Q8j54p4M63
8189B23K3n26
$$ y = [215, 83, -147, 35, 263, -59, 46, 119, -208, -155, 421, -118, -129, 119, -292, -281, 344, 299, -100, -12, -166, -240, 223, 246, -280]
8191b80
$$ Imaginary data points
##PAGE= N=2
##DATA TABLE= (X++(I..I)), XYDATA
0@%%%%%%%Qj6J6j6J6k2L0l2M0m8N1o0P3q8J02j17J37j57J75j99K30k61K91l27
31a74L69m11M57n11N68o32P02p76Q60r55J057j167J293j434J591j769J974k211
49a169K485k813L213l708M338n173O339q078J0933j6402L0392j23963k70245M13188
63C9337K67852l10998k40263K53730J84172k37802j78286K78629K12759l03270
73c4140k72039K85535K86931k12570k39036J44042J52248j07554q6294J23366
83D0489P8199j54099j19165J64221J52208j36041j31332R6169M9680p8378L7531
94e18R6107p9234j32879N1647J53470M472j45907l5815J22298M958j12657O2437
106a1621J35127j11903j68190J02947J84429m2700j62324j9057J19869L7524q8069
$$ y = [0, 0, 0, 0, 0, 0, 0, 0, 8, -8, 8, -8, 8, -14, 16, -16, 24, -24, 27, -33, 40, -48, 54, -63, 74, -83, 92, -107, 123, -138, 153, -174, 195, -216, 241, -270, 298, -334, 368, -408, 452, -503, 554, -613, 680, -754, 837, -932, 1042, -1169, 1316, -1497, 1716, -1992, 2346, -2827, 3512, -4566, 6367, -10035, 20357, -103606, -373851, 39337, 307189, -3809, -244072, 9658, 193830, -43972, -222258, 56371, 269130, -34140, -306179, -20644, 266287, 53717, -185319, -41277, 110971, 3417, -82877, 40489, 118688, -35411, -154576, 9645, 161853, 25812, -105520, -9351, 40329, -38049, -518, 95589, 16355, -116524, -64877, 88593, 93065, -52842, -88657, 33641, 38599, -74058, -11621, 123506, 11603, -156587, -53640, 130789, 88089, -74235, -93292, 26577, 64101, -23968]
117b3968j42R5634m9515j25420O5348J40666l3692j12498k1433M5412N3981J9910
129E4283l8891m3052r965J5868M5261J7782m5754j5574J5970m0790Q230J21426
141H4794J112j70504m1115J58557Q1424j05082r2194O6620P6286p9049n5729J43870
153F8990O0045k09378r0020K26861J24610j84903j33726J22397J12000r3934q5261
164h2319J22969P8586j86771j05543K30895J41591k23021j56228J69688J32469
174A22316j21686r1455J15722P0883j55075q9681K05426J35016k21984j66379
184a96897J93909J56562j43996j09233J17731O6229j27817o2257J61000J01070
194A56301j82254j48491J69804J59014j33080j18812J02324N5183j00733k0042
$$ y = [-23968, -24110, 71524, 22009, -103411, -38063, 102603, 68911, -43587, -65020, -19608, 34373, 54283, 15392, -27660, -37625, -21757, 23504, 41286, -4468, -20042, -4072, -44862, -36632, 84794, 85906, -84598, -125713, 32844, 114268, 9186, -83008, -16388, 59898, -19151, -74880, 68990, 129035, -80343, -170363, 56498, 181108, -3795, -137521, -15124, 96876, 2942, -82319, 40650, 119236, -67535, -173078, 57817, 199408, -23613, -179841, -10153, 122316, 630, -90825, 24897, 95780, -59295, -148976, 56450, 191466, -30518, -196897, -2988, 153574, 9578, -99655, 18076, 84305, -43512, -105769, 55231, 156301, -25953, -174444, -4640, 154374, 21294, -97518, 4806, 59989, -40744, -60786]
204f0786J19811L2883j38773q0656J33637J14207j08347r8403Q5654M0462q8049
215d8360J6844J12152l0644j33314k530J32421N3526j06926p2377Q3370M5735
226D9897q4454N188J12922l5021j42859J8754J45775K9783j13963p3427O8311
237a9094P8956m7346m8413O0025J3617r3839r055J06357L7614p7213p5099J5848
249e7642R1217L7653p1351n1199L5194K5019j1130P740J5554k532l2061m4401
261e7939L9788J07918k0755j43221j6330J28217M6186q2195n2072M7885M1551
272C9033n6984l6753J00189N0443j42599q3309J44841J07203j05255j05373N3186
283c5378Q1179k8649n9067M6663O0161q5604q3141J09527J06012r5169j00785
$$ y = [-60786, 59025, 91908, -46865, -127521, 6116, 120323, 11976, -86427, -773, 39689, -48360, -31516, 80636, 49992, -83322, -85852, 46569, 100095, -6831, -79208, 4162, 49897, -34557, -29369, 83553, 48532, -94327, -75573, 70202, 99985, -13978, -87405, -19094, 59862, 12516, -35897, 24128, 37745, -56094, -65149, 41208, 78822, 1609, -73490, -57642, 33575, 71228, -123, -51322, -16128, 8891, -2239, 5501, 21055, 18523, -13538, -57939, -18151, 89767, 69012, -74209, -90539, 37678, 83864, 1669, -50403, -2518, 39033, -17951, -54704, 45485, 95928, -46671, -129980, 14861, 122064, 16809, -88564, -35378, 45801, 17152, -41915, 4748, 64909, -20695, -103836, 5691, 111703, 16534, -84251]
294h4251N8172O7334k8021k4714L1478Q139o4148k5403R8821N8423j11662p3627
306h9459R8036N2141p8515q851P5926k3178r9699J4378J28169K6972j44271p0262
318a18613J37556Q1082j20576n2101J13268J2451j24489J483J42033K8109j46399
329d6196p8044J31297J13777j03762j05682Q7100O6855r1443l0718J06491K7888
340G7563j11349n8881R1567R6045n6732j06648K8358P8721k9470l5929N1533P811
352C2589p2830j4026O8090M0234l5164n9740k60N2141J1006k1829J2590o639m7899
365d1737J3446O6094L465m6134k2808O371K7762K3608j3895j9591m138j3865Q507
378a2915M5452K596m5594j8319R615K0986L3968j0474n6423n639M1560R661r023
$$ y = [-84251, -26079, 41255, 13234, -11480, 19998, 28137, -36011, -61414, 37407, 95830, -15832, -89459, 8577, 60718, -17797, -26648, 49278, 26100, -73599, -59221, 68948, 95920, -48351, -118613, 18943, 100025, -20551, -72652, 40616, 53067, -71422, -69939, 72094, 100203, -46196, -124240, 7057, 120834, 17072, -88610, -1510, 65345, -26098, -56816, 49675, 77563, -33786, -92667, -1100, 94945, 38213, -68435, -40077, 38644, 9174, -26755, 24778, 32589, -40241, -54267, 13823, 54057, 18893, -40847, -41107, 11034, 22040, 211, 12801, 6162, -41737, -28291, 37803, 41268, -4866, -27674, -21303, 6459, 30067, 16172, -3419, -7557, -21422, -12915, 32537, 35133, -10461, -28780, -19165, 1821, 35789, 25315, -31108, -36747, 4813, 14474, 5451]
391E451K316r571j7006n331J6859M5817K556q0121k7459Q5653L9771n9775k7066
404b7906L0836M235k3004P286M3289Q718p3715m1541Q8164O5561p6316o1454M9037
417f810L0573l1749k30L5352n452n6377k0503P2084N5458p1950o8453N6047M7754
430C5744m2094p986M4746j9019o0001J2091P6168K3234p7420n5424O8490N9683
442E8212n7502l2915O0038j313p5317J2798R0048Q018q9469m6252P3091P0729
454G0166n5794o6746N0681L9038o4281j6085Q0740J6534q1981m0506O0956O7283
466F0005l0582p5158J2264O0272j8035l4369M0699K1166n4598k5417M4079M1012
478D1338j2093m8835j7469M1375K2199k2803l50Q945l0032q804M0920J6211k3124
$$ y = [5451, 7767, -1804, -18810, -24141, -7282, 38535, 41091, -39030, -66489, 19164, 58935, -840, -27906, 2930, 7165, -15839, -8553, 34736, 43454, -30261, -71802, 16362, 81923, 5607, -55847, -6810, 23763, -7986, -8216, 27136, 21684, -34693, -55196, 16888, 72346, 396, -68057, -12010, 35744, -6350, -14336, 30410, 11391, -48610, -36519, 39649, 62883, -14537, -69961, -1471, 58212, 710, -32205, 27833, 26520, -48797, -35999, 54049, 62067, -27402, -73654, -563, 70166, 14372, -52374, -1693, 37345, -26936, -43021, 37719, 54253, -27728, -68234, -7278, 60005, 29423, -45735, -33471, 26801, 8766, -25603, 15096, 36262, -18336, -43753, 326, 41338, 29245, -19590, -37059, 4316, 26515, 3712, 3362, 12307, -17725, -26529, 14391, 30602, 7478]
491G478k2201j0031J6152K8379m306j9327k392j2001l161L8651J6964l9372k4929
504c0096J3522J9972J7320o013k7241j363J3065n589J3457K5772k4949m2530J1520
517b3153L9965J8249k0345m1116j003M3687N341k8837J0298J2381l4536j3048
529c2117M1482K9758k4286n0169p460N8346K9739n0831k6478L5683L381k7709
541b0661J9023L2416j6810m2697p614M7627L8572m0005m9907K7668L5088k0227
553B473o031K3611j3011l1376O074L3173J9131k5593m1327J3280L9924q627j8988
566g287J5792p680l0904J5977L9877l088l2463j9303J6336L2649o281k6346J2109
579f12R774l1461M414N0257p64m9164j5605L0753L1413q461l5529Q39K7451j3566
$$ y = [7478, -14723, -24754, -8602, 19777, 15471, -3856, -6248, -18249, -21410, 17241, 34205, -5167, -30096, -16574, 3398, 20718, 14705, -12536, -13899, -834, -6423, 7034, 32806, 7857, -34673, -23153, 16812, 35061, 14716, -26400, -27403, 16284, 21625, -7212, 3086, 15467, -19069, -32117, 9365, 39123, 14837, -35332, -42792, 15554, 45293, -5538, -32016, 3667, 7048, -20661, -1638, 30778, 13968, -28729, -36343, 11284, 49856, 9851, -40056, -12388, 22700, 2473, -3558, 20053, 7042, -24334, -18260, 14913, 34044, 8451, -32876, -19596, 20328, 11701, -7287, 8505, 825, -30079, -14102, 25775, 22687, -9776, -29079, -12743, 19906, 13625, -12721, -612, 9162, -22299, -17885, 32372, 31608, -17556, -33161, -2408, 29005, 20544, -14985, -14146, 13305, -261]
593b61j7634L5936J5823m7504k4970L4748L4026p864l6895j5474L0413J6851k1999
606d804J085K0432k3240k5794K7914L1569r483k8953j7489J9205L3543q561k4150
619h726N743J559j3012J8283K3889j7281k5466j725J3966K1859J464k7427q415
632a5289J3458l68O270J7930j7745l1092J0723K6064N489q080j8639p614J8706
645a87O868q175J0728k119l0703K343L7863P961k3605j7584J397K2077J3457k0039
659B82o966J5206j2125j5158K8321K0191k6284k4700N849K3012J6248j8240k5419
672a9783J3824J4231j6100M257K2278j4317k7125P234K1113J2039r014k6561o09
685a8533K6592J086j2538J0523k961k1319P617K4023J443j1944j3233n769J9466
$$ y = [-261, -17895, 18041, 33864, -13640, -38610, -3862, 30164, 22300, -14595, -30069, 344, 17195, -4804, -3719, 16713, -6527, -32321, -4407, 27162, 17679, -11274, -28763, -9558, 23985, 15424, -8726, -2983, -1424, -14436, 3847, 27736, 10455, -15011, -16736, -2770, 19089, 20553, -6874, -15289, -1831, -2199, 4071, 22001, 4256, -26836, -16113, 9951, 15440, 7360, -11279, -18893, -187, 6681, -1494, 9234, 7115, -23588, -21245, 16618, 24579, 974, -16610, -15213, 6864, 20321, 282, -6684, 8522, -3603, -18761, 9560, 29751, 3467, -21233, -15384, 7628, 23876, 5636, -19783, -5959, 8272, -7828, -3571, 18707, 4390, -22735, -15501, 5612, 17651, 8637, -17924, -18533, 8059, 9145, -3393, 7130, 4169, -17150, -9533, 14490, 15933, 3989, -9244, -15013, 4453]
698D453J3679j4383n180K721j3983M760K8012l168k6432n201Q506J0594Q788j1039
712B127j2305O664k468l511K3028N769l3176j1712K5073J4341l126j2339j2639
725a4274R351J3027q439L046J3725j9978k0701K4018K3216j0275j7544r608P520
738f916K0867k333j7459N361K487j6658R325K4166r515k1144k365P382J5320O268
752A4786j9702r719J3486k32k069J5516m428k2075L099J4876M060K883q776j4349
766a2644Q528J2125l684K692K35j9280Q7K3625J342j2119l069n509J742J3447
780G518j215p579K235r138p254K2233J1147k1558r694O782M938Q090R24j3471
794f042L40O019p030P816J6871j4481j9643J0343J2888K251p36j2437p418J4389
$$ y = [4453, 18132, 3749, -1431, 1290, -12693, -7933, 20079, 16911, -9521, -14722, -6216, 4378, 13166, 2127, -10178, -3514, -5982, -9493, 13535, 19304, -13872, -25584, -511, 13830, 10704, -1635, -14274, -4923, 8104, -335, 2711, 16436, -3542, -24243, -225, 22991, 12716, -4828, -14436, -6916, 13951, 11618, -5841, -480, 2007, -14651, -5326, 18840, 9325, -11819, -14184, -6802, 8518, 14786, -4916, -14635, -1149, -1381, -3450, 12066, 7638, -14437, -11338, 3538, 7598, 10481, 1705, -12644, -4116, 8009, 4325, 7017, 7252, -12028, -11941, 11684, 13026, 907, -2162, -7671, -5929, 7518, 6303, -1276, 959, -8179, -15433, 6800, 17947, -3611, -13305, -6523, -1585, 6505, 7429, -6042, -5702, 317, -6713, 1103, 17974, 3493, -16150, -5807, 7081, 9332, 8596, -3841, -11259, 3130]
808C130M203p678P540j385j8731M260J7898p30o160o542r577J0129J5983r391
822B949q992M878n619j555J6622M96j3596j123k34J910J4348m20j6955J136O936
837G81j565Q328M339j7107m923J2731J706Q46K947j2147n055J1580J454j880N313
852G348j0608j2409J4974J1126q501m088k541n111J0178P372r169j90J651j0295
866a0263N285J7884o006j3506J584J515N320J0135q733j0830Q073J231m083J0664
880H270J331j5753j071Q472R77N363k476j5529K498J3750l739k637L952r586l961
895a0139J2551J656m182K160q187m872J5228N180j1393j87O29m814R949O790j0439
910g0k638L104n104O806J0159j1060p701O778o82J641Q050p381j1042O853L777
$$ y = [3130, 7333, -345, 7195, 5810, -12921, -8661, 9237, 8507, 2347, -4195, -13772, -3643, 12340, 2949, -6043, -1165, -6784, -8339, 8283, 8779, -4817, -5940, -6174, -4264, 10084, 9664, -7291, -6155, 781, -784, 7544, 11883, -5224, -10147, 2584, 4290, 5136, 8083, -4064, -9119, 2461, 3915, 2035, 7348, -3260, -15669, -695, 10431, 1930, -2158, -4699, -9810, 368, 7740, -1429, -1619, 32, -10263, -4978, 12906, 6900, -6606, -5022, -3507, 1813, 11948, 3215, -7615, 458, 1689, -2394, 8270, 9601, -6152, -7223, 1249, 2226, 7589, 5113, -10416, -7918, 5832, 2093, -544, 3408, -6178, -10139, 2412, 4068, -114, 2046, -6141, -11013, 4215, 9395, -1998, -2185, -1556, -6370, 3579, 10369, -70, -2708, 396, -4708, 2098, 12257, 1197, -6504, 274, -408, 1233, 9283, 1902, -9140, -2287, 1490]
925A490k138O514m416j1979O756Q402n693K103J378j0697J536J1323k348j295
939I36P50q919J459J4571l847q593M950j147m774R290K874p889N28k001l352J1840
955F676L951j5269j513Q710l402L06N755p413l230M606k443L126Q405j0760j0009
970a2504J2602M925o844K854j205o214O124M186m056M058o24j1809O468J2837
984A0798p937o183N243l304j04P853l722m418L885n837j183J3287l099j3955N335
999c341N724n571L659L080p831M36L098l157O581L743j3890l54J3707k908o500
1014c524O114j523m408N153p6r20N799p042q198J2875N929j2832k92P189n484
1029a240k67M609l762R53J077r259M942J2358r829r387J0733J753o715M334R96
$$ y = [1490, -648, 5866, 1450, -10529, -3773, 4629, -1064, 1039, 2417, -8280, -6744, 4579, 2231, 936, 1686, -7233, -5774, 8797, 4950, -3643, 1307, 160, -4614, 4676, 7550, -339, 189, -1812, -5164, 6676, 10627, -4642, -6155, 2555, -847, -541, 5214, -2199, -5429, -823, -3266, -140, 8265, -2495, -12504, 98, 5023, -1821, 1033, -172, -6386, -262, 3924, -132, 3926, 3302, -8507, -2039, 10798, 2861, -3322, 1921, -1383, -1487, 6366, 2644, -1774, 2111, -3726, -4909, 8378, 5279, -8676, -3341, 2383, -3188, 471, 3551, -4280, -3844, -746, -3903, 2678, 6421, -7469, -7823, 5884, 2976, -3524, 2590, 1067, -3341, 1812, 1736, 816, 6615, -427, -8625, 4250, 10179, -2653, -2945, 4244, -1240, -1507, 3102, -660, 293, 1370, -7889, -2947, 9411, -418, -9805, 928, 2681, -4034, 300, 1296]
1044A296m327L126j964k421J0567q43j4065N728J0894p765k507O743l841k243
1058a622M358l020K448M377j0685k835J4132k087j1449O276L285o752K435K886
1072A747l836L298k562p040J0014O445j4132j349J2135l952n278O354p83k422
1086a361K666l894J992R487p781r967J2225N206j1500J335O334m268o83J229k986
1101a966O016L95j2240M118J2566r415p907R952R89o158K386M74n51M305o351
1116c387l538J2598l78j4100O729R765q654k937O614j631K71Q52n702N636O434
1131H572j1912k640J4098l185j1668O663M941n959L53l80j142O737m512r072J0460
1146A354N874j4069J88J2240m263n992L595K14K009J892q107K265J1883q484r253
$$ y = [1296, -3031, 95, -1869, -4290, 6277, 5434, -8631, -2903, 7991, 226, -2281, 4462, 621, -1622, 2736, -284, 2164, 6541, -4144, -6979, 7153, 5066, -6383, -107, 3178, -3574, -1139, 1747, -2089, 1209, -1353, -8393, 1621, 8066, -6066, -7415, 4720, 768, -4510, 1844, 1061, -1361, 1305, -2589, -597, 8890, 1109, -8858, 3367, 8573, -2927, -1592, 4742, 474, -209, 1020, -1966, 4050, 4445, -7795, -3677, 8889, -526, -8433, 1519, 2508, -3650, -1264, -790, -1341, 2964, -3387, -6925, 5673, 5295, -8805, -2076, 7689, -965, -3902, 2712, 1081, 1352, 2204, -3498, 2138, 8572, -3340, -5980, 8118, 4933, -6735, -72, 4869, -1090, -737, -1117, -2259, 4478, -34, -9106, 1354, 7228, -6841, -6653, 5587, 1324, -4668, -1073, -859, 1150, 3042, -5065, -2800, 9083, 599, -8654]
1161h654J3206L761j1867R06O314j492N83k737m025Q742R26j2631M637J1872j0337
1176g96p677J0265K132n494J86j995K100N810p664m100J2686j738j3751P736R882
1191G582p433l879L306K22L622j136p074O484O597j2474j530J4730l588j1950
1205f521N048N625k049j57m462O9Q001n654q739J1925M730j5118l74J2290j862
1220B752n724M51l40M047J514q527L720J0833j0060q673J3998M580j1405k98M356
1235A224k93K823l421l585Q828j342j2604P824J1726j1187p476P928K067j934
1249E78K46m066J607N183p948j477J2776l667j3505O675Q564m591j303m4k531
1264c503N382J77o123O900M184j2745n95J4500k291q663J962N96J179M080n690
$$ y = [-8654, 4552, 8313, -3554, -2648, 3666, 2174, 2757, 20, -4005, 4737, 5663, -6968, -2331, 9541, -796, -8473, 1792, 3924, -1570, -1384, -3379, -1279, 4531, -3133, -7233, 5453, 3715, -10036, -2300, 7582, 149, -3730, -424, -202, 3420, 2284, -4790, 1694, 8291, -4183, -5713, 9017, 5429, -6521, -1473, 4152, 2103, 1946, -2516, -2447, 5554, -100, -8839, 3086, 7816, -7302, -7676, 4614, 2752, -2972, -2521, -2861, 1186, 2700, -5827, -2107, 8726, -1334, -10007, 3991, 8571, -2834, -3132, 1224, 931, 3754, 333, -3252, 5576, 4234, -8370, -546, 11180, -7, -7483, 445, 2512, 578, 824, -3242, -1635, 3548, -4400, -5877, 6899, 3232, -10273, -3598, 4966, 375, -928, -972, -3503, 1879, 2056, -4067, 2833, 7017, -5728, -6323, 8177, 5886, -2777, -815, -219, 960, 5040, -650]
1279f50j656P703o097p461J1904N540j3730l201P953J383j16j975m878N466K509
1294B694r519M776J1922j0902j0747J1626P399n844k655j711K563N670n752l547
1308d027J1407j945j5558P306J4761q151r075L430K493K269j077o243N412M351
1322E353j2586r48J7331k851j5997L422R384j780j300k179J34M642m348n831J3150
1337E596M482j7607j453J5785m87p638J378L91M95P36l891M540P307j2953q403
1352a1722J6447O206j3604j959N322j843P92P43j427L735l710r675R947J2479
1366A1731j2078r657Q836L296k283K587k402j837K715l730R15J1327m322j4626
1380i528O037J0586l417k498l05m400L170M067m477L447K285j1957p06J4339q72
$$ y = [-650, -2306, 5397, -700, -8161, 3743, 9283, -4447, -7648, 305, 1688, 1572, -403, -5281, 185, 2694, -6825, -2049, 9873, -1029, -11776, -150, 7249, 1405, -1250, -2961, -398, 5272, -480, -4027, 7380, 5435, -10123, -2817, 11944, 3793, -5282, -1852, 641, 2910, 1833, -4410, 1002, 5353, -7233, -8181, 9150, 6299, -9698, -6276, 3108, 1328, 28, -2151, -2017, 2625, -1723, -7554, 5596, 10078, -7529, -8982, 6803, 6316, -1322, 56, 447, 942, 1678, -2213, 2327, 9634, -3319, -11722, 4725, 10931, -2673, -4632, 690, -1153, -361, 382, -1045, 2690, -1020, -10695, -748, 11731, -347, -10004, -1168, 2128, -155, 2432, 30, -1807, 908, -2822, -1907, 9420, 5098, -9528, -3491, 7095, 3678, 1180, 875, -3525, -355, 3712, -765, 2682, 4967, -6990, -7696, 6643, 5771]
1395E771r697R88j68K07O082k456l975M435l437o001J1997O258j4178l297Q426
1410I55R76J94Q67m833J702K457o294M740J1108j1318j1906J1553Q064o526k767
1425a028j28r02L475k980j477J0016l456j6630O601J7040o548j0652K945L022
1439g02P96R13k987L557L026j2032j324J8998J66j7475L78R501j57k47j15k607
1455c11J699k748l828J1519N282j7667n066J4640K428o663J347j716l144L087
1469a141M46K779M066j0996q090J5286P803j2138k624N072l224R04N778p69j454
1484A698l460o915R893J2369j1824j1122R617L495m483L726R16n461n16j318K496
1499h89J0567n050j6169N532J2493m471l917K795l849j375M130q61L908K006j1971
$$ y = [5771, -3926, -2938, -3106, -2899, 3183, 727, -3248, 1187, -2250, -8251, 3746, 10004, -4174, -7471, 955, 1931, 2125, 2992, -1841, -139, 2318, -3976, 764, 11872, 554, -11352, 201, 8265, 1739, -1028, -1156, -2058, 1417, -1563, -3040, 6976, 3520, -13110, -6509, 10531, 3983, -6669, -3724, -702, 94, 1007, -1980, 1577, 4603, -7429, -8753, 10245, 10411, -7064, -6686, 2815, 2658, 2411, 2296, -311, 1388, -1360, -5188, 6331, 11613, -6054, -11120, 3520, 5948, -715, 632, -1084, -4228, -1141, -695, 2084, 6150, -4846, -12936, 2350, 10153, -1985, -4609, 463, -2761, -1857, 3921, 3152, 1698, -1762, -8677, 1216, 13585, 1761, -9361, 256, 3751, -732, 2994, 3910, -1551, -2067, -3385, -889, 9678, 4628, -11541, -6009, 6484, 2013, -1904, 891, -2958, -4333, -203, -1064, 2844, 4850, -7121]
1514g121k737J5568J910r770p8J574j846M821K050l818J693k762o753R874Q839
1529A1444j1290o548O060M56N23M324m565l850J988k316L308R539p802j2573P776
1544c526Q414m766N55L28n675J032L838M68N605k967j4106M527J6882m022j0222
1559c635K577R81j823M512J033l26r66r236p30J7332J490j8066j016R179k47k61
1575G98J944l532j532j666j750J0400N961j5857p575J3819N006o103N05o99m174
1590d455L122K881J634L595p653r692J1379R609q872l662L728m215L47P310k99
1605D757m130l335m786O743J0802q495r262O541J573m779N789M404p872l882J118
1620d814M276Q414l329j3534L496J0478l497k041N297m272o174M391M300L310
$$ y = [-7121, -9858, 5710, 7620, -2150, -2228, -654, -2500, 2321, 4371, 553, 2246, -516, -7269, 2605, 11444, 154, -6394, -334, 122, 645, 4969, 404, -3446, -1458, -3774, -466, 9073, 1271, -11302, -3526, 4888, 122, 677, 1005, -4670, -3638, 200, 668, 6273, 3306, -10800, -6273, 10609, 6587, -3635, -1058, -77, -1900, 2612, 3645, 3319, 2353, -6883, -7613, 9719, 11209, -6857, -7873, 1306, 1059, 798, 2742, -790, -2322, -3988, -5738, 4662, 10623, -5234, -12809, 1010, 6016, -87, 418, -281, -4455, -1333, 1548, 3182, 6777, -876, -10568, 811, 10420, 1548, -2114, 1614, -2601, -2254, 5056, 4757, 627, -2708, -7494, -751, 10051, 1556, -7706, -1165, 408, -4371, 1418, 5822, -2050, -5932, -4814, -538, 7876, 4547, -8987, -5491, 4987, 1490, -551, 4746, 474, -5700, -1309, 2991, 6301]
1634F301k20j1158m012J3848M046r246o38R23m375M074M871k359j048l785o800
1649i578R188J1009q813r478L851K217J958N185m613n255K169q27K460R059l672
1664D860j2984L031Q678l94J229j688p751P29P067N58J496j775j0513Q15J3006
1679F364r48p490J933k392l651P454M146l381l408n988N45J3405J859j3997q43
1694f392P951k741j00N999j345n774k130Q62R962N014j4066p744J2743M401o822
1709a82J783J594n928p95K935L888M024p351j1600Q348J1354n987n062K624l374
1724c729j250P611J010k812k180n763K618J1756j475r740J515J142j931P588L757
1739H117q673m785L247K508O365k08j0971p27O804j359Q91N806p277q880N454
$$ y = [6301, 6081, -5077, -9089, 4759, 8805, -441, -1079, -156, -4531, -457, 4414, 2055, 1007, -2778, -9578, -390, 10619, 1806, -7672, -3821, -1604, 354, 5539, 926, -4329, -2160, -2987, -527, 8532, 4860, -8124, -5093, 3585, 3191, 4420, 2732, -5019, -4290, 2777, 3335, 4831, 3056, -7457, -6642, 6364, 5416, -2074, -141, -2533, -6184, 1270, 5416, 2035, -1373, -7361, -6816, 6589, 8448, -5549, -6392, 1559, -1182, -1282, 4717, 3372, -2402, -4532, -3670, 6292, 11306, -2760, -10504, 2239, 6640, -182, 1601, 3195, -2733, -3528, -593, 3295, 7319, -32, -11632, -3284, 8070, 2083, -2979, -355, -3729, -4979, 2632, 3642, 830, -1350, -7113, -4495, 7261, 5786, -3954, -2439, -1297, -3228, 4360, 8117, -556, -5341, -2094, 414, 6779, 6571, -4400, -5127, 1677, 318, 1209, 7015, -262, -9142, -3688]
1754c688P667R62j794r046l201J0989M002p094P42J162p082K455R240l34m203
1769G77m786m077Q985J0155q831q064M530J626r84N957n98o171j081k45K097R279
1785H569l011j3144J343Q888m75q3J15o521q65N397P81J533J193q888l065J0822
1801B589K167m183O02l650m164P778N996m924k678k237k149P998M889p890j939
1816a795K558m476K315R501l478r125m78K206O048M484q546p583P128K897l554
1831a898M576J804r416k454O329N270K360o437j0502N854J2386l767n363K558
1845A300l204k848O819L665k206l004o747Q53J3085J481j1215k598L159q44N269
1860B965K876p215l242J723k02O076L926r046o006N970K557J481L845o793p706
$$ y = [-3688, 3979, 4941, 3147, -5899, -9100, 1889, 5891, -1203, -461, 701, -6381, -3926, 5314, 4980, 777, -4009, -8086, 899, 11054, 2223, -5841, -1311, 315, -669, 5288, 4690, -1481, -2562, -2807, -710, 8569, 5558, -7586, -6243, 2645, 2170, 2087, 2202, -4319, -5184, 213, 994, 2527, 3720, -5168, -8233, 2589, 4756, 573, 1175, -2475, -6639, 1139, 7135, 2211, -467, -2704, -4853, 3145, 8034, 144, -1795, 763, -3713, -1398, 8103, 4625, -4500, -4978, -2772, 3276, 7760, -786, -8369, -1241, 1656, -1898, 2678, 4482, -4934, -7388, -1059, 4211, 6571, 134, -10368, -4514, 7872, 4105, -1258, 1300, -1904, -4752, 2067, 5732, 3526, 522, -6225, -5372, 7713, 9194, -2021, -4619, -1460, -2304, 2965, 5841, -1374, -4616, -2893, -3095, 2981, 6907, -2139, -8145, -2175, 382, 1863, 5708, -1085, -8791]
1875h791O518O189p85l09m015n199O185N124l036Q66k72q639J839J1166k81o876
1891c16l002j546N211O384m817n440L891j894l660Q168L971p978n064J442L959
1906f91P420k114j1487J583P238j791L51M396m847n709L417M046L452J123r678
1921c291n417J0222N272m472j268k448l949M964N753k849j446k568n499N099R178
1936G281m264o304o08j031M006Q577m735q579J353K782J874M896j960p881J428
1951c165K661P56N994k53j1413j634R355L079r00l419o632K174P434j455k354
1966B28L180n522n348P745O382l962m693m159Q49R736J703q800j043L041k412
1981c075K208O104l241n081m24J89N734N991p698p530N612L594l84K200k388o093
$$ y = [-8791, -2273, 3916, 3131, 2822, -1193, -6392, -207, 4917, 1881, 2747, 2475, -6164, -4325, 6841, 6560, -316, -3318, -4864, 347, 6731, 1914, -3526, 365, -1529, -5189, 2979, 6950, -1028, -6092, -4650, -691, 6729, 4615, -6872, -5289, 1949, 158, 509, 4905, 58, -5651, -2234, 1812, 5264, 6387, -3291, -8708, 1514, 6786, 2314, 1046, -1402, -5351, -387, 5366, 2517, 1071, -1497, -6996, -1897, 7281, 3017, -3287, -3895, -4926, -920, 7657, 2922, -5657, -4304, -1522, 352, 5248, 3288, -4593, -3165, -504, 252, 6246, 5993, -5420, -7054, 2301, 5380, 4480, 1061, -5571, -3397, 4037, 2582, 228, 3408, -2114, -7462, 283, 6665, 2703, -1990, -6149, -5300, 4436, 6139, -2661, -3704, -663, -3075, -867, 5237, 1996, -3085, -3509, -3320, 2414, 8405, 707, -6823, -1211, 2383, 1999, 4199, 1811, -4282]
1997d282K049L526N5L311k070q901J608P797M33j353j958o620J392R412j037m198
2013h36k77k782l30O910J694m471p06l141q63R182M267r721m214L030K637M154
2029D533O81o855j690L214o68K701N571o341q548L482O470K140p98p455m374Q278
2045C41M191m313K25m92n635J810P261J65k334l534m876N387R661l849p354J227
2061b119L26J409N737j564n835Q76l74k72P217P43r499j714M413K111L010j185
2077C280q163j83O487k21m83J981m633l718M566K808M48R59o425m676Q450O002
2093F479m582k867j108j624M642L879l967p14K08n072L566Q898k791p997q85J540
2109b395M682M619n840o636L659K240j597M532K78p571j502L990L241L332k854
$$ y = [-4282, -2233, 1293, 1348, 4659, 2589, -6312, -4704, 3093, 3526, 2173, 215, -6405, -5013, 4399, 3362, -836, -1113, -3895, -4225, 2685, 4379, -92, -798, -3939, -4802, 4380, 8647, -1074, -5288, -2258, 379, 4533, 5214, -1641, -3331, -117, -785, 1916, 7487, 1146, -7402, -3920, 2550, 4690, 3892, -3563, -7937, 341, 4532, 219, 444, -48, -5683, -3873, 3388, 3553, 1219, -2315, -7191, -1804, 7857, 4008, -3346, -2119, -1793, -384, 5353, 3789, -2046, -1170, -1544, -1816, 5401, 6144, -3355, -5069, -656, 1455, 4465, 3280, -4883, -5066, 1421, 1200, 717, 2698, -1935, -5653, -1087, 1721, 2169, 3128, -3297, -7973, 477, 6479, 1897, -970, -2078, -3702, 940, 4819, 852, 138, 346, -4726, -1160, 7738, 4947, -3050, -3935, -2395, 2287, 6906, 1066, -5570, -1911, 329, -1268, 3264, 3542, -4029, -5531, -1541, 1700, 5032, 2178]
2124B178q915M84R663N34k957p11l844l89O587J168j890k78m806k406Q780M371
2140G569o096l800r80O86O472K442p869k189L005j059K472M436m389n286J392
2155c194J604L110M315o406p204N344N239j190J14j887m629L692L515j314K128
2170C237r78p361J257Q315N85l751k344k964K532P154k700n196K335j444k689
2185d012N988K576m893k477p23L06P273J862r276k506N484O53J164K042m592k886
2201d017K864O63K667L840n935p004N728N466p94r25m084l642N704M354l465p72
2217F48j86n155J822P543j110m133j933l031M083P805l293p582J079J837R56M287
2233C637r94n705L62J182K12N783J028r020j923O212K081J297j614o542M76O452
$$ y = [2178, -6737, -6253, 3410, 3944, 987, 276, -3568, -3957, 2630, 3798, 1908, 1630, -3176, -5582, 3198, 7569, 1473, -2327, -3307, -2621, 3851, 6293, -1576, -3765, -760, -1819, 653, 5089, 700, -4586, -3194, -1590, 1520, 5835, -571, -7775, -2431, 2808, 1618, 1732, -155, -4784, -1092, 2423, 1109, 3237, 2259, -5102, -3845, 4470, 5055, 1304, -1040, -4004, -1472, 5682, 2982, -2214, 121, -1323, -4012, 1976, 4552, -341, -2818, -3541, -3235, 4038, 5900, -3376, -5882, -398, 255, 1419, 3461, -1131, -4017, -1153, -490, 2177, 6017, 82, -6922, -1194, 4272, 3478, 2553, -1531, -5173, 531, 4885, 1420, 648, 462, -4693, -2871, 4672, 3562, -571, -2504, -5535, -1452, 6353, 3060, -4522, -3443, -1606, -650, 3637, 2643, -3062, -2700, -1518, -1306, 4477, 5505, -3515, -5438, 774, 2855, 4152, 2538, -4004, -3528, 2924]
2249B924n3k144J843l492l924M803L901j523j374m409k655P833M099o580k425
2264c176J781r53K305L270k613k054J24k671L004P537l648p810J701L744J416
2279A957K488l420m830K781K592j604L202O89o849j353N436J763K14j347o968
2294e249R11P434J7l762L95k720j415N550J783k645k97l004k064P011M225n930
2310B40l500N83J104N093J688o387k241L687o58J217M246l313n789J305L053K529
2326B857K252n930n933N495N270k938o72q55l540J826M104o04N44j679n915J954
2342c764Q600p12n950m89R9J681M475j258m385J570o70j578N401K358o119k686
2358c427K323J313L492Jo471j357N141j12l43J995l548l130L059J828N80J627
$$ y = [2924, 2871, 727, 2570, -922, -4846, -43, 3858, 2335, 961, -3448, -6103, 1730, 5829, -751, -3176, -1395, -2348, -43, 3227, 614, -1440, -1316, -3987, -983, 6554, 2906, -4904, -3203, 541, 1957, 4445, 1025, -3805, -1024, 1568, -36, 3166, 3855, -2994, -4347, 1089, 2852, 3066, 1719, -5249, -4338, 3096, 3113, -649, -254, -2974, -4389, 1161, 2944, 299, 2, -3002, -5066, 1945, 6170, 240, -3260, -2677, -1573, 3520, 5208, -1179, -3420, 267, -391, 826, 5072, 1759, -4030, -2725, 328, 2857, 5109, -821, -6754, -1259, 4011, 1073, 401, -454, -3994, -2168, 1936, 1332, 1876, 197, -5718, -3764, 4836, 4124, -1826, -2315, -2216, -535, 3940, 2682, -1703, -133, -803, -2381, 3020, 5378, -741, -3427, -1104, 209, 3701, 3702, -2769, -4126, 1015, 903, 560, 2555, -993, -4123, -1064, 764, 1344, 2971]
2374B971m425m328M512N061k062j750j564k321M433L296l079r02R74l574J046
2389a712O116p80m245j374j297L449O009l562o588K023K777q71J778O99m453o63
2405b694J162O25M420O7q239j361P171J575j568o02l649o8M655N86j269J496m000
2422a693l231N871M461l568k554j090r60N333K584n051k274J696j374K035M084
2437D269l500l871K022o66J524M145k818o351K738L029Q44J000k290m493L383
2452a035K949j707J195Q54m958m49N366P51r85j516m061J361O477q16m839J797
2468C84q38k005L663J638k414j122j536j509O091K308o202k660L289N39J304J880
2484B810m003j653K461o18J294M226m025n279L417L532J4P07l090l733L721L775
$$ y = [2971, -1454, -5782, -1270, 3791, 1729, -21, -1585, -3906, 527, 3823, 744, -158, 816, -2758, -1712, 4404, 3624, -621, -1995, -3292, 157, 6166, 2604, -3984, -1961, 816, -55, 1723, 2422, -2031, -2694, -1532, -907, 3513, 3580, -4659, -6020, 1151, 2726, 1158, 556, -3093, -3161, 1494, 2080, 811, 2307, -1693, -4924, 947, 5408, 1840, -714, -1804, -2764, 2569, 5153, 102, -2172, -476, -1850, 185, 4269, 769, -3102, -1080, -1746, -222, 3923, 1105, -5246, -2508, 521, 1365, 2365, 75, -4418, -1035, 1914, 207, 1402, 2256, -2702, -3151, 2215, 2966, 1981, 465, -3596, -2235, 4242, 3426, -1413, 384, -454, -2459, 1204, 2842, 428, -694, -2230, -3739, 2352, 4660, -1542, -4202, -913, -374, 930, 2810, -1193, -2846, -385, -1003, 291, 4517, 492, -4787, -1370, 2162, 2176, 2883, -207, -3940, -219, 3556]
2500C556k392J72o35l950J322N255q10j957o25l645J458O209j548m613M4Q4N68
2517a507M469q31m836R40J337j410L503K018n440j299K454J458K109L09n941q15
2533c482O039j97j880J440j688k795K472J885k85Q09l835l615N397M063m305k068
2549b045J170j105J358K731k180p26L60k740J691N647k045n047J139J272N39L326
2565C345j106n176K132K036j450K988k86m799J14L152l25J166M38m733j366N356
2581A486O70j656P4l046o50M498M49k930J646j188l516M112L883l306k119l19
2597a912m39L958K645m868k029L464j043q1L655j718l663R95P24J434L162l489
2613G95n040L425L122j796K32K2l764J337K920j355P32J35m557N99N592j0l170
$$ y = [3556, 1164, 1336, 701, -3249, -1927, 3328, 2518, 561, -64, -3709, -2251, 3958, 2410, -2203, -2159, -2075, -1507, 2962, 2131, -2705, -1765, -428, -1838, 1665, 3683, -1757, -3056, -602, 856, 2965, 3274, -2667, -3482, 2557, 2360, 480, 1920, 232, -2563, -91, 1794, 1509, 2318, -1517, -5132, 265, 4328, 23, -2045, -875, -1980, -622, 2109, -71, -797, -437, -3177, -1486, 4161, 2116, -2931, -1792, -520, 19, 3345, 2239, -2937, -805, 1231, -219, 2769, 2483, -2316, -2202, 950, 625, 1791, 2229, -2504, -3870, 1486, 2156, 500, 574, -2472, -3122, 1376, 1825, -1105, 541, -647, -4163, -51, 3832, 526, -1593, -1912, -2351, 1607, 4252, -616, -2645, 819, -224, -305, 3350, 1632, -2031, -1036, -312, 1122, 4284, 795, -4245, -820, 2302, 506, 738, 760, -3004, -1667, 1253, -102, 630, 765, -3792, -3193, 2399, 2389, -781]
2630g81J35j330K90M343n90l359Q90L65j796L852J235l937m00R55p17K526K179
2647C860m958j760K917J12M60J795l363j929K703N06q28K395j612m140K425L168
2663A751p41p0j653l195L312L493k585j001J665k529N0L978l97j760m60k144J458
2680h28M849j561n123J929J402j417K205M46l420J39O79n28L138O05m878j016
2696c379L669J28q2Q07l190p29L485M73j498J514j937k422M104J709k511M37m44
2713A34k873L268K998k955j361N65q83J493K483k773j512J896j719m26M298j240
2729A393m454J067J735K36K083j760l796K620J930j692Q77J516l368o76L179M73
2745A363k65J71l392O1M588o28k448J368q03j740K634J384k248J88o79k457L719
$$ y = [-781, -646, -1976, -1686, 2657, 2067, -1292, -402, -37, -1833, 2019, 3254, -683, -1083, -128, -845, 1681, 3860, -1098, -2858, 59, 171, 631, 2426, -937, -2866, -163, 343, -485, 1910, 298, -3842, -1417, 1751, 1010, 940, -713, -3908, -596, 2897, 312, -689, 976, -1553, -1503, 2475, 2078, 318, -142, -2286, -828, 4021, 2460, -2663, -734, 668, -749, 1456, 1902, -1518, -1379, -700, -1228, 1910, 2515, -2363, -3379, 290, 418, 336, 1143, -2047, -2776, 709, 1182, -316, 1198, -739, -3161, 943, 2652, 141, 578, 134, -2739, 529, 3527, 572, -789, -224, -1107, 386, 2869, 96, -1416, 480, -1239, -1665, 2633, 1393, -3061, -1994, -259, -23, 2060, 300, -3496, -876, 1054, -638, 239, 1755, -1613, -2289, 890, 1363, 1098, 1269, -2123, -2062, 2526, 1898, -550, 818, 15, -1725, 909, 2293, 45, 233, -446, -2903, 816]
2762H16K254l824j139J401r72J406K248l040j570K541r16j60L544k010l109K117
2778d13J204n43J592j039l565K002K949j576R0J78l135J585K985j583p92J141
2794A080k679p91M537k80k804K49q16J06L478o72l614J756N18k073K068K153l103
2811h87j115J454J38J682J350m000r13L880p52j057K086j355k436K261Q60q66
2827C30J360j519k929K717K478k731J81M97k256J000K807j706j283J009j689K48
2843a486L170r55k234J265m91p79L722n53l674J290J441j265K066J47l142R19
2859e59J719j697J409K009l888j474L581j42r44Q07j949j068L217j15k027J513
2875C92k12k996K794K222k371o12Q3j755K857K658l553q89K056j076j85K741j342
$$ y = [816, 3070, -754, -1893, -492, -1464, -58, 2190, -850, -2420, 121, -795, -955, 2589, 579, -2530, -413, 791, 248, 1840, 801, -2764, -762, 2187, 611, 701, 879, -2256, -671, 2314, 731, -61, 1080, -1599, -2390, 2147, 1867, -937, -688, -1504, -1398, 2080, 1408, -2206, -450, 68, -2005, 63, 2216, -887, -2002, -548, -410, 1272, 2622, -1378, -2291, 1589, 837, -220, 1866, 511, -1925, 336, 1196, 330, 1690, 171, -2758, -41, 2437, -294, -113, 384, -1872, -872, 1935, 229, -1054, -45, -1734, -1486, 1684, 729, -1505, -240, -731, -1510, 2212, 1659, -2015, -725, 716, -549, 1517, 1664, -1478, -559, 1160, -537, 872, 2881, -1007, -2481, 1100, 958, 14, 821, -1128, -2196, 1021, 906, -1121, 392, 180, -2816, -22, 2200, -171, -783, -700, -2455, 402, 3060, -493, -1382, 674, -402, -587, 2154, 812]
2892H12k065J401j44j22K778j304l541K089J256j414J374m0k959O99K318j440
2908c02K48J150l131l25L386o79j315J622k121r75L514K67k821J549O6j517K138
2925G54J334l214J172P44k119J674K636k985j362J734m27M36J219j958j329K526
2941H35q80r18K572j018l335K024J573j268R60m42k549J868K410k588N37J153
2957I34k044o7L021q42j437J173j536m39L748j257k363J252M68j673K390P33l326
2974a265J000R57j552J033J715l242l62K310j089K2J787k298j146K768J13j669
2990i18J725r91j849K670O61k192J454M88k842J725K651k617n30J444j872R48
3006d5K240k125r98J703q86j218K928p38k494J008M36l22J462m7l014J837R26
$$ y = [812, -1253, 148, 4, -118, 2660, 1356, -2185, -96, 1160, -254, 1120, 1080, -1879, -1180, 1138, -302, -54, 1096, -2035, -2360, 1026, 347, -968, 654, -1467, -2442, 1072, 1339, -1482, 67, 133, -1384, 754, 2088, -1126, 46, 790, -1329, 345, 2981, -4, -1366, 368, -59, 377, 1596, -362, -1691, 835, -45, -963, 1609, 591, -2744, -720, 853, -415, 545, 103, -2446, -578, 1832, -756, -219, 934, -1110, -1177, 1844, 1002, -435, 738, -798, -1237, 2511, 1254, -1109, 143, 611, -1062, 1328, 2061, -1265, -265, 692, -860, 173, 1888, -1354, -1716, 594, -495, -473, 1314, -984, -2130, 638, 751, -918, 807, -184, -2033, 637, 1298, -894, 560, 1048, -1794, -69, 2582, -35, -565, 879, -993, -45, 2195, 70, -928, 775, -111, -1329, 1599, 861, -1633, -625, -189, -511, 951, 904, -2110, -273, 653]
3023F53j685Q25J303k330l40K283o91j05J539k203n83L066o27j829J802o88j772
3040a382K307P71k262Q70R8j831J702J199k373K23J229j508O07K280k519p84J396
3057B3l48n63J880q14j976K044K21j590K124M4k851J661J643j693L31J042k008
3074h30P36J752j957K43J722j933j126K776o07j459J004o01j086K671n12k326
3090a533J385M31k259J721J544k226N9J461j697Q99J932k450m30K161j031n59
3106e92K041j242j557K229K3j416J635m60j839J366J127j798R78M79k391R26K012
3123A521j973n79J596j489j46K391j249j466K001o66j226K294k26j967R39N46
3139C01j228J549N96j859O60R13j279M69J677k139m98K081p49m42J250j616j111
$$ y = [653, -1032, -207, 1096, -1234, -1574, 709, 18, -87, 1452, -751, -1334, 1732, 1105, -724, 1078, 390, -1382, 925, 1696, -566, 304, 402, -1429, 273, 1472, -901, -678, 551, -957, -350, 1930, -589, -1373, 23, -325, -888, 992, 178, -1798, 246, 467, -1123, 1001, 1045, -1806, -145, 1498, -195, 136, 1178, -830, -94, 1658, -299, -56, 1666, -267, -1393, 1383, 776, -683, 321, -280, -1366, 1305, 793, -1533, -148, 283, -1976, -255, 1289, -937, -878, 583, -1114, -215, 1717, -733, -1163, 998, -33, -592, 1449, 207, -1350, 879, 902, -514, 1121, 661, -1178, 188, 1315, -483, 495, 974, -1417, -491, 1521, -452, -1031, 565, -924, -1070, 1321, 72, -1394, 607, -59, -1285, 1009, 783, -1184, -245, 301, -927, 622, 1218, -641, 19, 932, -347, 122, 1799, -340, -838, 1243, 494, 52, 1302, -314, -1425]
3156a425K291m33j555J755k87k039J710O33j792J116O67k189J543J301k264RJ583
3173F24j110K4J906j150j157J720l15j444K003n31j350J229L28j531J348N40k324
3190a190Q06J697j834J57J431k043j6K077j827m09K105j122j566K528Kk014J129
3207h9L74j472J680K40j458R97N37j708N27K300k095m48J464j049j13J856j674
3224a31p98J840q62j203K094o11k074J939M69j685J372J51j997J001J311j672
3240h56J50J729j892k01K127j179o08J732p85j290J960k15j504J822k9j710J341
3257E92Q08k329J262P39j996J061Q81j966L46J344j490k61K242j465j323K183
3273F28q31j004J776l70j515J626k2j083R80M89j734R31J402j998P20J050j679
$$ y = [-1425, 866, 433, -1122, 633, 346, -1693, 17, 650, -1142, -26, 641, -1548, -5, 1296, -968, -959, 624, -486, -462, 1444, 294, -863, 857, 542, -902, 1101, 570, -780, 449, 777, -754, 594, 1134, -1190, -384, 1313, -521, -364, 1067, -976, -992, 1085, -742, -1151, 954, -168, -1734, 794, 796, -1218, -89, 285, -1187, 493, 733, -725, 272, 809, -899, -372, 1928, -167, -615, 849, -200, -313, 1543, -131, -929, 911, 49, -1154, 940, 329, -1745, 194, 663, -1022, 350, 501, -1496, -495, 816, -856, -706, 1023, -869, -1070, 1057, -122, -730, 1002, 217, -1073, 887, 672, -832, 990, 961, -749, 592, 1400, -929, 333, 1072, -924, 137, 1018, -948, -602, 742, -748, -1009, 1233, -232, -1555, 628, -203, -1207, 569, 199, -1316, 310, 288, -795, 185, 674, -1060, -129, 1273, -725, -5, 1045, -634]
3290f34M20J459j522k31J336q32q73J521j66j334J479k10j437J479k3j770J095
3307b43J072j731O53P97j660O0J722r94n28J878r90q89J912j168r86J804l50j251
3325h92J334K98j369R48P88j792J210O22k125Q08J146j681J51J660j484o78J914
3342H58q81q95J603j072p73J556o3j622J455M75j432R31O13j634Q13J128j407
3359c47o7J586j271n08J886j015r79J962r69r91J653m49j308J146K29j612R87
3376f7O84k131J482P24j518M85J097k026L02J544j015l79J749p90j102J881n08
3393D12j171J592k82j227J606k74j335Q78O72j474N39J047j412J1J174j209k82
3410g35J268p28r32J967j144p04J674m92j081J018K33j259J141J3r52O32O36j119
$$ y = [-634, -214, 1245, -277, -508, 828, -4, -877, 644, 478, -856, 623, 413, -1024, 455, 432, -1338, -243, 829, -902, -249, 548, -1112, -1052, 670, -324, -852, 1026, 36, -853, 1059, -109, -1095, 709, 359, -892, 442, 740, -629, 319, 1107, -685, 525, 1147, -978, -170, 976, -705, -554, 1106, -378, -1056, 858, -23, -918, 685, -387, -1160, 396, 333, -1289, 166, 641, -791, 140, 753, -881, -68, 1060, -347, -414, 1172, -99, -607, 1279, 264, -715, 1247, 278, -713, 940, 491, -817, 329, 558, -1054, -67, 617, -1514, -32, 692, -826, -341, 756, -1270, -968, 576, -439, -818, 931, 141, -961, 920, 412, -759, 833, 551, -676, 930, 656, -679, 199, 871, -603, -64, 983, -429, -418, 756, -453, -735, 533, -195, -1127, 840, -304, -1008, 666, 174, -907, 111, 344, -915, 226, 239, -713, -81, 555, -564]
3428e64O29R67j361L4J245r23lJ061j070q28J559n94r09J513k37j502J488mj231
3447g30P64O38j718Q14J036j582K45J266j487K27J562j359n05J503r27l82J396
3464G61m21o51J014l04j119J406L41j751J076O14j360P02O18j760M82J080j141
3481d13lO26n38o22J648o69r36J140l28q88J215N9j557J230M44j529J389J54j035
3500f13N03R70j485L32J580j285k53J046q34r7J324r86j259J416nr98J180o0j283
3519h07N04R61j490Q73Q01j722J14J265j037J72R81j183n38J712n38o64J165m06
3537A63j169J813L78j367M39M27j197R56N51j262K06O46j066N59J221j193j190
3554a085J646p27o02R91n56p96J456n0j323J050N0j463J207Q78j376O94M75j174
$$ y = [-564, 65, 1032, -329, -295, 950, 27, 24, 1085, 15, -813, 746, 152, -757, 756, 519, -983, 505, 501, -730, 34, 672, -1046, -232, 804, -778, -533, 733, -754, -527, 1035, -324, -829, 674, -253, -635, 761, 340, -311, 703, 399, -720, 686, 1027, -724, 352, 966, -394, 308, 926, -834, -352, 728, -413, -416, 210, -328, -950, 698, 29, -907, 233, -95, -983, 232, 291, -1266, -36, 408, -1121, 268, 422, -613, -110, 860, -625, -293, 1287, 2, -251, 795, -39, -136, 1188, 202, -1057, 359, 354, -644, 536, 476, -807, -303, 658, -832, 41, 842, -880, -766, 499, -538, -366, 615, -568, -1106, 606, 68, -596, 569, 163, -1006, 807, 1185, -182, 257, 684, -513, 443, 994, -268, -62, 584, -482, 77, 1298, 105, -1085, 561, -166, -768, 223, -333, -1129, 327, 277, -1046, 4, 54, -1409, -202, 676, -700, -6, 469, -705]
3572g05Q93Q50j278R6Q39r32k90J634p50p94J224n93q21J368l38j069P93J92j091
3591g72J079L26j648P19J132j690N29P78j066m30J616q30k89J186p33n55J204
3608E56m12l34R05l51j193J154P77j569O54M43j400M63J497j015n20R86j341J09
3626e91J337r29m10Q40m63l39J255m46j261P57L73p85J068K05j993Q92J286j120
3644c24M01O83j270q9J533p17p30J450j043r11J890k08p74O63m01q71Q22Q46j581
3663f31O90J77r55O30P45r83n23R48p78K38J223r57n47J129l96n45J575q94p77
3682f31P98L10p08O74K92j484Q21R77j048M08L42r91l40J554j276p5O84j054q0
3701h27J350l08p37R05m91q33J044M32j279R47J83j282J171Q31j259j73R83r00
$$ y = [-705, 188, 1038, -240, -144, 695, -237, -527, 1107, 357, -437, 787, 194, -627, 741, 403, -666, 127, 319, -772, 307, 633, -1015, -296, 836, -854, -325, 453, -613, -1043, 573, -257, -546, 640, -93, -648, 556, 144, -190, 715, 364, -829, 325, 1102, -467, 187, 630, -770, -307, 1190, 175, -345, 641, -700, -591, 746, -183, -593, 247, -216, -555, 700, 254, -1007, -250, 123, -662, 406, 611, -1382, -490, 796, -324, 77, 760, -510, -599, 934, 217, -513, 937, -106, -1017, 873, 665, -109, 554, 153, -718, 104, 950, -631, 59, 236, -719, -89, 656, -327, -850, 98, -680, -442, 781, -176, -723, 406, 10, -535, 1040, 146, -631, 167, 477, -231, 443, 735, -749, 72, 1049, 1, 409, 751, -240, -580, 974, -302, -377, 307, -747, -827, 523, 215, -522, 383, -108, -941, 103, 535, -744, 203, 386, -896, 275, 1106, -153, -326, 657, -243]
3719b43K13J191j386n58J201k46l65R45j95j379Q78L58q00P84J60j693Q84J032
3737G81j143J47L99j220L64J267r34l03P32m62l98J828q76r85Q28J49n86J163
3755G51l2j601P14O81n01M67K43j181K73Q55o39j7O67q54m49J177l87o32P00l87
3775a52r21J397Q4j146P56k2q50O90Q42j002K33M68p95PJ236o91p58J231q14j76
3795c83J470p11q99R53n14n36J228k48j046M06O92p19P07R3j340N23N95l79l11
3814d19R48j248k16J411m28j61M13p48p57J624N21j513P59q0m56P51N39j381L29
3833a12M67o61L62J205j282n73R86o77j12J188r25q32J237n9o81Q11k62r60P16
3852a64O27j051O88K09j150Q19J150j085m90J185j009j37J051o37m64J004o47
$$ y = [-243, -30, 1161, -225, -783, 418, 172, -193, 752, 557, -822, 56, 414, -386, 398, 558, -1135, -251, 781, -362, -215, 184, -1036, -672, 595, -339, -642, 90, -372, -770, 1058, 182, -803, 25, 174, -412, 751, 719, -882, -168, 513, 12, 479, 722, -459, -186, 669, 30, 13, 680, -174, -623, 554, 167, -465, 235, -152, -1073, 324, 408, -738, 18, -4, -854, -164, 678, -324, -91, 377, -418, -411, 825, 134, -624, 607, -207, -383, 1087, 376, -523, 430, -84, -620, 608, 360, -686, -280, 412, -307, 400, 493, -847, -324, 271, -108, -419, 529, -719, -935, 476, 48, -113, 300, -448, -1205, 419, 940, -573, 186, 106, -350, 401, 940, -441, -112, 355, -306, 56, 1261, -21, -594, 392, -285, -397, 791, -134, -966, 271, 212, -469, 342, 80, -880, -164, 463, -588, 100, 309, -841, -22, 1128, 43, -447, 738, -271, -408, 643, 6, -458, 546, -101]
3869a01j97J237j41j278O21Nm14L99L85r18K9Q12j042P02N06j251m07J259l61
3888a55l03J047o12q63R64O1m13P64m06o28P07N32n04kJ28r94R15O61o76n5J5
3909A83p36R9J200l45j058Q35l52MR74m61j333Q72j14k93P51q2j347Q53J067j132
3929d15O28M20q49l76J344p48J8O13j049l67J461j03p36P48l75r72J323L63j133
3948b05J22J23p27R57M02j086m8M44o18K27J107p87m98J023l32o32J293n16q48
3967e99P16P7l90Q91j1j272O18R47j174L72L67j085K5R54l22n05Q79o36o23J208
3987D37n35j78L02m20m42J142j74m70L14k5r30P79J002j379J02O69m31J96J093
4006A052j348l72Q95k24J88N82o31q91R95j0j91N78o42q66P35Q47n21k64k2o25
$$ y = [-101, -298, 939, 798, -480, 141, 146, -268, 131, 516, -402, -373, 439, -603, 99, 605, -646, -1053, 206, -155, -458, 589, -23, -886, 78, 139, -274, 490, 84, -544, 163, 695, 191, 189, 317, -677, 238, 899, 223, 168, 183, -553, -454, 746, 401, -657, 178, -174, -170, 804, 343, -990, -118, -232, -525, 226, 144, -1203, -350, 717, -415, 213, 633, -216, -592, 752, 4, 22, 635, -414, -781, 680, 577, -159, 589, 214, -758, 565, 928, -205, -83, 40, -687, 270, 672, -414, -462, -18, -636, -409, 698, -89, -587, 436, 104, -528, 765, 249, -599, 117, 194, -196, 695, 684, -588, 30, 977, -197, 175, 542, -543, -518, 436, 114, -391, 488, -148, -771, 437, -98, -276, 26, -394, -836, 306, 132, -338, -24, -49, -979, -200, 802, -577, -475, 194, -237, -41, 1052, -296, -668, 227, 3, 191, 773, 142, -749, 246, 236, 45, 623, -19, -885, -150, 697, 176, -88, -110, -735]
4026g35J87J094l50q23P63q26K40P93o9p98O38l47j53J073K8j523N44P69r60R37
4046D82L85j024m87J330n68J51L16p15n90R52m5j86L20k52n65P24K42o64K21K12
4066B39j146O77P42o84K71r4o60L33J024q81j81R11n17l79J003j80r81P89j59
4085A27l16N63J47j056M41J85l50O20k34n98L8O79k95K60L21p79o48J112k81j41
4105b05N10p41k51J084L27j145P31k59p73Q51Q44j095m8L98p92J000M83o84o22
4124c87L97k22Q9Q45p32m73P41l33l76P95p3q41J69Q08m94J61J85j077O01R34
4144G17r43j64Q75j056Q6Q71J47n82N74p71k74J137lr21N44l26l78J136o8q29
4164b28lM14o75N74L82p16m11N75k08J30P69q15n24J119l87n34Q59k90n09O21
$$ y = [-735, -548, 546, 196, -627, 136, -690, -450, 343, 274, -524, 114, -233, -386, 687, 715, -808, -264, 505, -455, 482, 867, -157, -644, 686, 118, 269, 585, -130, -720, 232, 187, 1, 321, 69, -496, 228, 470, -194, 27, 239, -907, -230, 512, -172, 99, 5, -655, -322, 702, -179, -360, 551, 34, -345, 658, 478, -503, 286, 127, -189, 374, 521, -535, -94, 91, -259, 361, 127, -471, -433, 246, -49, 211, 532, -247, -895, 217, -64, -205, 305, -436, -687, 397, 724, -421, 310, 51, -722, 129, 973, -122, -170, 228, -564, 436, 919, 235, -387, 10, -212, -123, 722, -10, -483, 258, -75, -451, 344, 271, -570, -401, 407, -87, 74, 259, -818, -217, 717, -226, -390, 485, -571, -485, 386, 533, -49, 525, -246, -520, 617, 614, -307, 237, -89, -467, 669, 601, -228, -231, 183, -492, 82, 464, -252, -663, -88, -296, -166, 603, -212, -736, 383, -4, -538, 321, 31, -478, 143]
4184A43J08k43M02p4j407J038O81n30j86P05q12m6Q11l23o09L23k25m24J071p6
4204C27q51J53K06l88Q18K46j194K23O85o01O89J37q65j9N65j72K04M84r91m29
4224g73J271N6m53L12l78l82P52N4l38j33R2p35O48J090j329j54L07n13K64O30
4244B88n01l45P23l10k9L89r4n20N01p9n17J125j77j094N49Q12r08L15J17m76
4264b31J53M80r4l03M64r31q6Q52p9n61N95m56m32R44K74r47K08M34p89L62R26
4285G83r94m62O85j95K13P55q61n33J041l95l09P16o32k71M13J72o7N47m84p01
4305e79L14M53l48J23J61p84O16M51m08k92O04m09n13J149l79l67J96k97o5J165
4325G91l10r53L86K59l83M1Q11p35j65K81n4J9R53r47l86N69J49l26M33m24j40
$$ y = [143, 251, 8, 410, 336, -1071, -33, 648, 118, -68, 637, -175, -221, 590, 267, -342, -19, -244, -668, 403, 327, -524, -371, -165, -553, 265, 511, -683, -460, 225, -376, 313, 450, -415, -434, 131, -41, 163, 647, -344, -773, 498, 554, 101, 413, 35, -347, 405, 459, 121, -12, 80, -655, -7, 1083, -246, -400, -93, -606, -342, 288, -213, -558, 165, -145, -174, 215, 121, -399, 102, 23, -494, 631, 454, -640, -91, 721, -187, 128, 245, -231, -78, 402, 308, 5, 469, -462, -548, 304, 225, -336, 259, -197, -629, 315, 589, -358, -150, 284, -505, -143, 783, -211, -673, 12, -183, 30, 785, -76, -609, 432, 37, -272, 444, -188, -459, -46, 126, 59, 606, 122, -579, -265, 188, -160, -37, 124, -660, -44, 407, -1, -293, 311, -98, -611, 538, 159, -208, -12, -309, -374, 791, 481, -472, -86, 173, -210, -169, 642, -93, -258, 23, -31, -12, 941, -6, -392, 177, 326, 0, 433, 9, -131]
4346a31J35k6k91O48j13o31K15O02k69K0j02m34M4P66k27m41N33n11J03N22k83
4367A29l07L32k8n65P70j80k56L3M23o22N78O6o57J20K67m19J70M84n56l34O87
4388A35k73o5O15n85n01J168k04p13L49K78n55O12M04j093N13M5n09L79J010q25
4408A85n48M42j95r5Q15o36l30N54j00m7K73k4n29M5M65n41L17j09n68K05J109
4429F88p67k01N82p46M11M75j57m15M39k45q6L75p2l97K95J66o31M65K44p17L43
4450D9Q6j97J82M29n09m31M60l8r5K45p27K63M65k00k12K53O3l24L19K37m08J70
4472H0K50p39M54L05j75j14J12m56L50M05k86k37N26r20L9R40j45o59N0J86p7
4493a11M09o0k94k37M56k96J66J19n28K4N85l09J09M39j074l0R81q7l79K92o00
$$ y = [-131, 4, -22, -313, 335, 222, -409, -194, 408, 139, 159, 57, -377, -333, 433, 206, -235, 298, -213, -110, 412, 129, -178, 154, 126, -439, 331, 151, -105, -72, 351, -271, 307, 373, -284, -164, 103, -316, -146, 338, -218, -552, 135, -138, -203, 412, -173, -674, 494, 290, -423, -74, 204, -351, 261, 665, -428, 85, 130, -379, 0, 1010, 185, -363, 79, -116, -211, 604, -32, -362, 192, 92, 45, 318, 294, -235, -190, 275, -266, 51, -58, -626, -421, 688, -79, -280, 302, -444, -33, 442, 285, -130, 309, 64, -22, 353, 281, -116, 179, 345, -286, 179, 423, -294, 49, 135, -62, 120, 549, 40, -391, 69, 31, -64, 181, -546, -283, 182, -18, -230, 23, 86, -238, 81, 318, -90, 80, 330, -409, 45, 350, 175, 61, 173, -283, 67, 472, 186, -51, 475, -445, -406, 534, 389, -270, -220, -34, -111, 298, 238, -56, -293, 163, -133, 33, 152, -376, -352, 233, -76, 33, 472, -602, -632, 349, 262, -117, 175, -425]
4514d25J67L02L21n09L11j52n09N47L39o05K13j45l13J36Q26p48k27Q59q89M3
4534d58P53j93m01N19l72j2O09k16o40K67L07k56j16J99Q5o8L09m98K36K94m11
4555f3k58N66l22J5L78j53m99O39r7n52M71qn46M50Q9p7k22L10n21J91L95m50
4577b64j4K02K04k90P11l08m47K29K01j42L8K04p31O33j48l95M57M5l30M02J5
4598B72l19j19L78n83m6N18r6K9P9k47k19M62N7n20J20J57l12N60J81l08j04J73
4620A13k35K49J78n52M10L6m63Q7N18j21n27O87Ro28P94l16n51N6N49o97N45k20
4642g9k61K43N34o42J44J84l48Q9M78j55m68N89n45m7N71J47m96K95j36k08K87
4663A76N48q81J89J92l42M5N01p29p0K28K44l39M68j64p27Q27o7o57R44n04p9
$$ y = [-425, -258, 44, 365, -144, 167, 15, -494, 53, 392, -213, 0, -145, -458, -322, 504, -244, -471, 388, -501, -458, 295, 102, -299, 220, -152, -164, 445, 229, -411, -144, 163, -93, -209, -10, 75, 7, 316, -182, 54, 348, -63, -321, 245, -77, -62, 316, 163, -336, 303, 206, -346, 125, 117, -429, 21, 110, 33, -189, 121, -400, -209, 186, -264, -278, -76, 128, -162, 549, 241, -206, 23, 224, 82, 120, 324, -407, 226, 78, -317, 140, 185, -145, 257, 272, -47, -166, 212, -371, -417, 101, 5, 34, 113, -134, -353, 109, 166, -354, -234, -77, -389, 171, 352, 44, -60, 113, -122, 127, 305, -247, 163, 199, -264, -177, 341, 220, -307, 380, 389, -239, 555, 239, -312, -256, 293, -404, 141, -79, -340, -97, 437, -205, -61, 123, -225, -136, 342, 187, -281, 308, -237, -284, 287, 434, -62, 233, 97, -111, 176, 724, -157, 32, 224, -118, -73, 428, -301, -371, -143, 101, -238, 230, 66, -661, 166, 99, -558, 386, -118, -197]
4684a97J76M06m46o0K79m31L26J81n64J8O95p77J66N80P1o52M50P9m97O66j66
4705C03n61L36n8l00L04o9l31J81J95j10j58N06m49J16K96j42j16N10m12m42L85
4726a6L05o85O64l45m63O02K42m03K02J64m56L00j8l71J17N04k99n5L94l60j42
4747a19K09k11o6M95l13k3P7q4rL77r3n87K62K74j95j22J66j39J88m5Mk41N54
4770C59m35k63N98Pn68J12K33k59R8J70l97M00j20l49L57J28k22J23K26o89M26
4791f5Q9L6j40N2J66k73K49N3n97O26j23NL18m92l05J72Q4p0K39K89l42q6M20
4814C05l08p4O6m9j23M60j77l54N90m86k43O04o0m67K11L87l92NJ85M0n47O50
4836B23k10k13M46l92l7L18o9Lm6k45o5K32J35R4J17L2o79N35j05m98N42j6k25
$$ y = [-197, -21, 385, -61, -121, 158, -273, 53, 234, -330, -312, 383, -394, -228, 352, 423, -229, 221, 300, -197, 469, 303, -258, 78, 20, -280, 24, -45, -376, -195, 0, -110, -268, 238, -211, -95, 201, 59, -57, 453, 41, -401, -16, 289, -396, 268, -77, -540, 62, 304, -99, 103, 267, -189, 111, 93, -278, -161, 343, 44, -11, 383, 23, -119, 90, -121, -187, 308, -5, -28, 49, -35, -44, 333, 240, -347, -85, 189, -6, -128, 38, -101, 87, 42, 46, -195, 359, -76, -339, 259, 266, -302, -190, 43, -216, -118, 52, -345, 55, -65, -414, -57, 71, -151, -28, 198, -491, -65, 24, 60, -80, -28, 138, -135, 114, 167, -430, 196, 73, 78, 396, -96, -401, -229, -145, -215, 24, 313, -29, -115, 305, -3, -77, -11, -60, -183, 277, 100, -254, 336, -150, -393, 211, 151, -316, -105, 282, -110, -105, 80, 120, -427, 223, 13, -200, 246, -146, -183, 135, 66, 69, 23, -222, -287, -55, 80, 174, 291, 323, -356, 179, 74, -424, 118, 102, -123]
4859a23J88L69k80j63L76o93J97L88k75j96K15M9J99j61J60k21l28L22k00O74
4879D97l56Rj70K37k45J86J17l8l39J80k56N4mR5l64O24j56k02J05l3j36M1L78
4902B24k48M30k16k65L5N13n57Q0k88K95j63L59k00k28K03j04J09J92k89mM20
$$ y = [-123, 65, 434, 154, -9, 367, -326, -129, 259, -16, -212, 3, 52, 251, 90, 250, 29, -299, 23, -177, 497, 141, 150, -20, 217, -28, 158, 275, 237, -102, 78, -178, -124, -128, -33, -397, 227, 71, -131, -26, -59, -195, -154, 224, -24, 406, 190, -75, -40, 473, -84, -4, -292, 3, -160, 199, -1, -229, -26, -130, -21, 171, -118, -122, 298]
$$ [...]
8191c09
##END NTUPLES=NMR FID
##END=
