##TITLE=1H_CA-8578-5-2
 CDCl3, 8 sc, 
 9.4.2019
##JCAMPDX= 6.0         $$ Bruker NMR JCAMP-DX V2.0
##DATA TYPE= NMR FID
##DATA CLASS= NTUPLES
##ORIGIN= UXNMR, Bruker Analytische Messtechnik GmbH
##OWNER= root
$$ XWIN-NMR		Version 3.5
$$ Tue Apr  9 15:22:45 2019 Russian Standard Time (UT+4h)  she@DPX200
##.OBSERVE FREQUENCY= 200.1315
##.OBSERVE NUCLEUS= ^1H
##.DELAY= (6, 6)
##.ACQUISITION MODE= SIMULTANEOUS
##.ACQUISITION SCHEME= undefined
##.AVERAGES= 8
##.DIGITISER RES= 18
##SPECTROMETER/DATA SYSTEM= spect
##.PULSE SEQUENCE= zg30
##.SOLVENT NAME= DMSO
##.SHIFT REFERENCE= (INTERNAL, DMSO, 0, 15.7039)
##AUDIT TRAIL= $$ (NUMBER, WHEN, WHO, WHERE, WHAT)
$$ ##TITLE= Audit trail, XWIN-NMR		Version 3.5
$$ ##JCAMPDX= 5.01
$$ ##ORIGIN= Bruker BioSpin GmbH
$$ ##OWNER= she
$$ F:/spectra/data/she/nmr/H-F/1/audita.txt
$$ ##AUDIT TRAIL=  $$ (NUMBER, WHEN, WHO, WHERE, WHAT)
(   1,<2019-04-09 15:21:31.35 +0400>,<she>,<DPX200>,
      <created by zg, POWCHK disabled, PULCHK disabled
       configuration hash MD5:
       00 E9 B6 7A A2 85 ED C7 34 08 36 98 17 FE 4E 26
       data hash MD5: 16K
       41 47 49 D3 90 BE DD 08 EF F9 EF FE DA 81 24 B4>)
$$ ##END=
$$ 
$$ hash MD5
$$ 0A 6D EB 93 C9 11 3F 1E AC 78 D7 00 EF 61 2D D1
##$RELAX= 
##$RELAX= 
##$RELAX= 
##$RELAX= 
##$RELAX= 
##$RELAX= 
$$ Bruker specific parameters
$$ --------------------------
##$DU= <F:/spectra>
##$EXPNO= 1
##$NAME= <H-F>
##$PROCNO= 1
##$TYPE= <nmr>
##$USER= <she>
##$AMP= (0..31)
100 100 100 100 100 100 100 100 100 100 100 100 100 100 100 100 100 100 
100 100 100 100 100 100 100 100 100 100 100 100 100 100 
##$AQSEQ= 0
##$AQ_mod= 1
##$AUNM= <au_zg>
##$AUTOPOS= <>
##$BF1= 200.13
##$BF2= 200.13
##$BF3= 200.13
##$BF4= 200.13
##$BF5= 200.13
##$BF6= 200.13
##$BF7= 200.13
##$BF8= 200.13
##$BYTORDA= 1
##$CFDGTYP= 0
##$CFRGTYP= 5
##$CHEMSTR= <none>
##$CNST= (0..31)
1 1 145 1 1 1 1 1 1 1 1 1 1 1 1 1 1 1 1 1 1 1 1 1 1 1 1 1 1 1 1 1 
##$CPDPRG= <>
##$CPDPRG1= <>
##$CPDPRG2= <>
##$CPDPRG3= <>
##$CPDPRG4= <mlev>
##$CPDPRG5= <mlev>
##$CPDPRG6= <mlev>
##$CPDPRG7= <mlev>
##$CPDPRG8= <mlev>
##$CPDPRGB= <>
##$CPDPRGT= <>
##$D= (0..31)
0 1.2 0 0 0 0 0 0 0 0 0 0.03 0 0 0 0 0 0 0 0 0 0 0 0 0 0 0 0 0 0 0 0 
##$DATE= 1554808890
##$DBL= (0..7)
120 120 120 120 120 120 120 120 
##$DBP= (0..7)
150 150 150 150 150 150 150 150 
##$DBP07= 0
##$DBPNAM0= <>
##$DBPNAM1= <>
##$DBPNAM2= <>
##$DBPNAM3= <>
##$DBPNAM4= <>
##$DBPNAM5= <>
##$DBPNAM6= <>
##$DBPNAM7= <>
##$DBPOAL= (0..7)
0.5 0.5 0.5 0.5 0.5 0.5 0.5 0.5 
##$DBPOFFS= (0..7)
0 0 0 0 0 0 0 0 
##$DE= 6
##$DECBNUC= <off>
##$DECIM= 24
##$DECNUC= <off>
##$DECSTAT= 4
##$DIGMOD= 1
##$DIGTYP= 9
##$DL= (0..7)
0 120 120 120 120 120 120 120 
##$DP= (0..7)
150 150 150 150 150 150 150 150 
##$DP07= 0
##$DPNAME0= <>
##$DPNAME1= <>
##$DPNAME2= <>
##$DPNAME3= <>
##$DPNAME4= <>
##$DPNAME5= <>
##$DPNAME6= <>
##$DPNAME7= <>
##$DPOAL= (0..7)
0.5 0.5 0.5 0.5 0.5 0.5 0.5 0.5 
##$DPOFFS= (0..7)
0 0 0 0 0 0 0 0 
##$DQDMODE= 0
##$DR= 18
##$DS= 0
##$DSLIST= <SSSSSSSSSSSSSSS>
##$DSPFIRM= 0
$$ [...]
##$SUBNAM2= <"">
##$SUBNAM3= <"">
##$SUBNAM4= <"">
##$SUBNAM5= <"">
##$SUBNAM6= <"">
##$SUBNAM7= <"">
##$SUBNAM8= <"">
##$SUBNAM9= <"">
##$SW= 24.9337058887773
##$SWIBOX= (0..15)
0 0 2 0 0 0 0 0 0 0 0 0 0 0 0 0 
##$SW_h= 4990.01996007984
##$TD= 16384
##$TD0= 1
##$TE= 0
##$TE2= 300
##$TE3= 300
##$TEG= 300
##$TL= (0..7)
0 120 120 120 120 120 120 120 
##$TP= (0..7)
150 150 150 150 150 150 150 150 
##$TP07= 0
##$TPNAME0= <>
##$TPNAME1= <>
##$TPNAME2= <>
##$TPNAME3= <>
##$TPNAME4= <>
##$TPNAME5= <>
##$TPNAME6= <>
##$TPNAME7= <>
##$TPOAL= (0..7)
0.5 0.5 0.5 0.5 0.5 0.5 0.5 0.5 
##$TPOFFS= (0..7)
0 0 0 0 0 0 0 0 
##$TUNHIN= 0
##$TUNHOUT= 0
##$TUNXOUT= 0
##$USERA1= <user>
##$USERA2= <user>
##$USERA3= <user>
##$USERA4= <user>
##$USERA5= <user>
##$V9= 5
##$VALIST= <valist>
##$VCLIST= <CCCCCCCCCCCCCCC>
##$VD= 0
##$VDLIST= <DDDDDDDDDDDDDDD>
##$VPLIST= <PPPPPPPPPPPPPPP>
##$VTLIST= <TTTTTTTTTTTTTTT>
##$WBST= 1024
##$WBSW= 4
##$XGAIN= (0..3)
0 0 0 0 
##$XL= 0
##$YL= 0
##$YMAX_a= 606181
##$YMIN_a= -714413
##$ZGOPTNS= <>
##$ZL1= 120
##$ZL2= 120
##$ZL3= 120
##$ZL4= 120
##$ABSF1= 10
##$ABSF2= 0
##$ABSG= 5
##$ABSL= 3
##$ALPHA= 0
##$AQORDER= 0
##$ASSFAC= 0
##$ASSFACI= 0
##$ASSFACX= 0
##$ASSWID= 0
##$AUNMP= <proc_1d>
##$AZFE= 0.1
##$AZFW= 0.1
##$BCFW= 1
##$BC_mod= 2
##$BYTORDP= 1
##$COROFFS= 0
##$CY= 11.3945322036743
##$DATMOD= 1
##$DC= 2
##$DFILT= <>
##$DTYPP= 0
##$F1P= 18.9103706918063
##$F2P= -1.10871071338519
##$FCOR= 0.5
##$FTSIZE= 0
##$FT_mod= 4
##$GAMMA= 1
##$GB= 0.15
##$INTBC= 1
##$INTSCL= 1
##$ISEN= 128
##$LB= 0.24
##$LEV0= 0
##$LPBIN= 0
##$MAXI= 10000
##$MC2= 0
##$MEAN= 0
##$ME_mod= 0
##$MI= 1.114404
##$NCOEF= 0
##$NC_proc= 0
##$NLEV= 6
##$NOISF1= 3.799351
##$NOISF2= 2.8
##$NSP= 1
##$NTH_PI= 0
##$NZP= 0
##$OFFSET= 15.70392
##$PC= 1
##$PHC0= -8852.897
##$PHC1= 13.40026
##$PH_mod= 1
##$PKNL= yes
##$PPARMOD= 0
##$PSCAL= 0
##$PSIGN= 0
##$REVERSE= no
##$SF= 200.130013532006
##$SI= 16384
##$SIGF1= 3
##$SIGF2= 2
##$SINO= 400
##$SIOLD= 16384
##$SREGLST= <1H.CDCl3>
##$SSB= 0
##$STSI= 0
##$STSR= 0
##$SW_p= 3612.71676300578
##$SYMM= 0
##$S_DEV= 0
##$TDeff= 0
##$TDoff= 0
##$TI= <>
##$TILT= no
##$TM1= 0
##$TM2= 0
##$TOPLEV= 0
##$USERP1= <user>
##$USERP2= <user>
##$USERP3= <user>
##$USERP4= <user>
##$USERP5= <user>
##$WDW= 1
##$XDIM= 8192
##$YMAX_p= 0
##$YMIN_p= 0
$$ End of Bruker specific parameters
$$ ---------------------------------
##NTUPLES= NMR FID
##VAR_NAME=  TIME,          FID/REAL,        FID/IMAG
##SYMBOL=    X,             R,               I
##VAR_TYPE=  INDEPENDENT,   DEPENDENT,       DEPENDENT
##VAR_FORM=  AFFN,          ASDF,            ASDF
##VAR_DIM=   8192,          8192,            8192
##UNITS=     SECONDS,       ARBITRARY UNITS, ARBITRARY UNITS
##FACTOR=    0.0002004,     1,               1
##FIRST=     0,             0,               0
##LAST=      1.6414764,     0,               0
##MIN=       0,             -714413,         0
##MAX=       1.6414764,     606181,          0
$$ Real data points
##PAGE= N=1
##DATA TABLE= (X++(R..R)), XYDATA
0 0 0 0 0 -8 8 -8 8 -16 24 -24 32 -43 56 -64 80 -98 120 -136 162 -194 226 -264 306 -355 408 -466 532
27 532 -607 687 -775 875 -984 1101 -1233 1379 -1535 1708 -1897 2105 -2334 2584 -2861 3169
43 3169 -3507 3885 -4311 4790 -5330 5953 -6679 7528 -8545 9791 -11358 13387 -16145
56 -16145 20130 -26414 37829 -65175 262721 -10969 -696534 -52898 554673 241115 -441800
67 -441800 -233672 373007 328921 -328088 -382045 260232 507409 -104398 -481774 -37415
77 -37415 412943 125304 -271583 -121064 207414 89639 -200963 -106730 229413 176725 -209334
88 -209334 -254875 142238 264518 -86347 -243574 60667 206044 -86570 -252503 52150
98 52150 300241 19516 -364216 -184111 309594 282444 -249324 -369917 126344 346850
108 346850 -87178 -367521 9340 356369 38641 -411041 -202351 351227 311276 -292819
118 -292819 -441273 122985 417776 -39403 -394601 -45315 318932 44922 -334892 -126724
128 -126724 301192 188882 -290972 -314765 167869 326383 -87099 -307157 18772 228851
138 228851 -45632 -224185 49614 244742 -25846 -296269 -83786 266682 166338 -204111
148 -204111 -198193 146280 175358 -144399 -161107 182570 215034 -169075 -285329 94121 336301
159 336301 45523 -288582 -125270 234876 169831 -176606 -149350 204107 198788 -189893 -247457
170 -247457 161690 338578 -14581 -309523 -82472 272771 179837 -175531 -169668 170175
180 170175 202846 -143191 -213454 151879 301819 -40996 -292983 -40890 285170 163718
190 163718 -180366 -176560 138051 194226 -94628 -170977 119412 221018 -74924 -231125 34415
201 34415 253428 66526 -191301 -105062 141965 121371 -101988 -98544 122626 109926 -145774
212 -145774 -145275 150531 200211 -99935 -222804 27432 199765 16684 -175986 -39276 167986
223 167986 40029 -215282 -99233 230028 166866 -219877 -259838 115305 261985 -36236
233 -36236 -249017 -46997 187689 51768 -202071 -104281 191059 139473 -207821 -243323 108365
244 108365 250016 -29496 -240244 -75662 141182 74960 -112125 -87954 83806 68306
254 68306 -128865 -138753 85838 151094 -53264 -165632 -25501 91452 22685 -56247 -9136
265 -9136 40834 -31113 -105114 -6918 136321 52665 -151750 -115390 107974 120007 -79955
276 -79955 -107680 73312 109575 -77945 -151838 50572 209528 27308 -227764 -111966 205061
287 205061 181068 -134645 -183875 92955 183771 -47696 -164416 37604 198239 29032
297 29032 -193047 -77781 199843 164458 -125833 -167929 84152 167954 -23961 -108680 39094
308 39094 115463 -13363 -102799 18263 150425 55030 -121956 -74505 114056 105829 -62656
319 -62656 -64353 77351 65092 -74694 -58050 104447 128110 -47284 -149782 -2585 167859
330 167859 76799 -122637 -83574 104279 82434 -94331 -74864 113099 121766 -82349 -165275
341 -165275 17862 185472 66808 -153830 -116847 99716 111199 -76530 -96730 73573
351 73573 93377 -83597 -137061 36210 153083 20627 -154869 -94188 96775 93966 -75638
362 -75638 -89434 56646 55220 -96079 -94083 73292 107235 -55903 -148129 -25681 111498
373 111498 45265 -101128 -69864 66774 36470 -102650 -64418 93586 68623 -105209 -125853
384 -125853 36066 114311 -220 -112631 -48114 71255 33563 -81191 -42485 78553 33144
395 33144 -106525 -76255 77047 89524 -44652 -102303 -8425 77852 25925 -63157 -26539
406 -26539 62242 16130 -86847 -31581 102056 68330 -80559 -94458 37087 101431 17163
417 17163 -70178 -25460 63900 30285 -62769 -17790 101995 60755 -89431 -84292 69237 118793
429 118793 4224 -83438 -24988 67436 46144 -34185 -10772 76044 38617 -76983 -47877
440 -47877 92557 99849 -30291 -78685 5060 67446 27175 -23031 8732 54365 3165 -67677
452 -67677 -2251 110331 59456 -80831 -69857 55972 77194 -13631 -44798 20640 53322
463 53322 -14651 -67565 12613 108548 34586 -107581 -72986 80875 92135 -35924 -78450
474 -78450 6775 56631 -606 -57141 -7506 68578 22943 -87856 -64875 68094 80719 -42859
486 -42859 -89294 -5320 50727 7993 -39972 -20960 19967 -900 -55990 -30948 52713 38887
498 38887 -63964 -74406 20824 50078 -16784 -46961 -7539 12527 -23622 -46932 1479 54969
510 54969 3745 -91846 -60117 63054 67124 -46999 -76526 5913 38217 -20560 -48454 7675
522 7675 50493 -7324 -87963 -43655 76830 71764 -54891 -87786 10664 56214 -3021 -35377
534 -35377 4850 27567 -12896 -49936 -7329 65611 44823 -51699 -63309 26505 57830 -592
546 -592 -21295 14567 13868 -22735 -17330 33856 55958 6212 -55477 -29011 54751 57056 -18582
559 -18582 -29265 29120 28689 -22179 -10951 48704 51505 -14113 -54260 -5309 71483 55177 -34191
572 -34191 -45455 33138 51215 -9504 -17043 37543 39814 -18673 -37732 14725 62341 30973
584 30973 -40797 -39636 34894 51555 -9555 -21812 26966 22415 -28218 -19104 38271 44603 -13030
597 -13030 -51203 -13185 48572 35188 -30759 -31507 26698 19495 -37996 -18781 47621 31936 -45736
610 -45736 -59119 9093 58487 18634 -51768 -44518 22146 26090 -31280 -26488 30465 15151 -53038
623 -53038 -48570 22305 47800 -2612 -55458 -41484 14723 24865 -19555 -27424 9109 -2362
635 -2362 -47863 -26676 34787 29326 -30591 -52128 -15849 21534 13809 -21370 -24944 4783 -4236
648 -4236 -39682 -14136 42560 21166 -49075 -49442 12574 38215 4733 -32259 -23220 11907 9341
661 9341 -25586 -12904 36523 19688 -45441 -38525 30889 45785 -4007 -34791 -13343 19980
673 19980 20314 -7311 -7985 21918 13383 -27927 -13615 41505 35020 -19348 -26509 11935 28039
686 28039 12609 -297 3859 14503 5138 -13210 8884 45854 19796 -34301 -19052 37110
698 37110 37986 -1230 -10251 9191 17598 6912 -3112 13657 35884 10673 -34669 -14931 44826
711 44826 41791 -10654 -22598 6289 18954 11441 5183 7759 13086 707 -21383 -4700 37879
724 37879 28208 -22434 -27035 10385 19119 3021 1464 4985 -2572 -12422 -12729 6136 28336 8587
738 8587 -36258 -27565 19753 20830 -13597 -14124 4109 -3930 -19837 -12335 9277 17766 -6354 -39833
752 -39833 -24443 23307 20751 -25111 -29634 1797 964 -19232 -11355 5570 2296 -16572 -29642
765 -29642 -13347 18627 12289 -27946 -32021 1713 5841 -15416 -10443 3059 -7968 -20888 -12548
778 -12548 2561 10302 -1106 -25202 -21610 9621 11832 -14898 -13226 5240 -4339 -17220 -1975
791 -1975 14005 6478 -9282 -19146 -8547 18536 18588 -12606 -18216 7725 10130 -6482 1643 16053
805 16053 5584 -9614 -7874 4965 20539 18882 -7589 -16404 10047 21468 4577 3899 14748
818 14748 3203 -8822 4910 19209 16717 8088 -3671 -5669 13841 23666 7681 1878 13068
831 13068 4996 -7337 9841 26306 11842 -4839 -3092 4616 15669 19702 4707 -4276 8411
844 8411 9963 -2873 5827 20861 6929 -11516 -3109 9326 11206 10670 1189 -9037 514 11003
858 11003 1151 -2057 8461 948 -12864 -2611 10248 2896 -3520 -3793 -8633 -5034 6573 637
872 637 -10382 -3973 -2356 -11757 -5178 7536 -3034 -15410 -8224 -3973 -5954 -1241 -3968 -15416
886 -15416 -11075 -886 -7946 -9550 1198 -4831 -19180 -11320 610 -3508 -7179 -8328 -15826 -12131
900 -12131 2163 -1657 -12789 -6630 -3157 -13625 -10187 3559 -1026 -10365 -7973 -9389 -9455 3087
914 3087 4576 -10948 -10628 -423 -3305 -5042 4726 1936 -9917 -5926 764 -1378 3278 7286 -5255
929 -5255 -8950 5069 6792 -1375 4091 7174 -3704 -3715 7785 7525 4453 6959 367 -3740 9689
944 9689 14544 1085 314 10568 5352 -534 8836 12363 5459 5622 5684 2022 10459 16634 3081
959 3081 -2250 11715 12447 766 5649 14070 6179 2540 8153 7458 7405 10965 2977 -3066 9774
974 9774 14525 -763 -1502 11282 6198 -2683 5065 9161 2921 2260 1120 -2912 5371 11172 -3155
989 -3155 -8120 6682 6170 -7102 -1915 7461 -686 -7294 -2777 -1394 492 3368 -7050 -13216 1093
1004 1093 5959 -10106 -10730 3270 -1587 -13851 -8098 -604 -3099 -4997 -8878 -13087 -2787 3497
1018 3497 -11471 -16069 576 -5 -16507 -12366 1724 -3373 -12056 -10005 -7077 -2918 -596 -10438
1032 -10438 -15124 290 3462 -15425 -14847 4878 1658 -14396 -10422 303 -112 -3338 -8205 -9376
1046 -9376 1950 6227 -10563 -13300 6613 7596 -11441 -8819 7412 4231 -5290 -3921 250 5000
1060 5000 7015 -4556 -8717 9121 13877 -5741 -6915 12450 10988 -4126 -1487 9258 9278 5290
1074 5290 -717 -2153 11377 17041 -785 -6413 14412 16821 -2473 -1839 14449 12714 1604 970
1088 970 5259 12232 14175 873 -4327 13128 18411 -1735 -4210 15546 14228 -3513 -1361 10466
1102 10466 11862 6622 -764 -1941 11020 15676 -2773 -7762 11807 13140 -7124 -5616 11668
1115 11668 9083 -4021 -4908 91 6864 7894 -4828 -10685 4955 9931 -9138 -10115 8817 5858
1129 5858 -12735 -9443 4009 3908 -2675 -9679 -10805 1060 6122 -10747 -15039 4310 3520 -16995
1143 -16995 -13987 5497 2996 -12271 -14371 -7538 -476 828 -11534 -16428 77 3255 -16412
1156 -16412 -15473 6890 3483 -18062 -16555 -446 3027 -3970 -12401 -12881 -481 3988 -11869 -13676
1170 -13676 7221 5315 -18533 -15519 8165 8586 -8606 -12806 -4716 3597 4844 -6791 -9473 6930
1184 6930 7980 -14033 -11193 15284 13591 -11606 -12245 5581 11589 4842 -3897 -4291 8257 10981
1198 10981 -5965 -6160 18089 16923 -11089 -11236 14771 19301 3426 -4025 1485 9957 11713 935
1212 935 -1150 15888 15644 -9142 -8283 20986 22285 -1932 -7111 7679 13040 8506 2427 2326 11694
1227 11694 11135 -6709 -4942 21980 21173 -9236 -12402 12300 17523 2422 -2644 2648 7526 5644
1241 5644 -5037 -3465 16211 14963 -14307 -16515 13509 18202 -5094 -11264 1240 4420 -263
1254 -263 -4393 -2153 6732 4066 -15617 -15153 12475 14591 -13532 -18740 1736 4964 -7027 -6919
1268 -6919 -817 -918 -6660 -14513 -8899 10558 7231 -21368 -22771 5224 8501 -12204 -12845 -2
1282 -2 -2906 -12654 -12286 -2160 7743 -633 -23782 -21029 9292 12967 -14515 -18764 1352 461 -12712
1297 -12712 -8169 4104 3990 -7713 -19162 -11451 12936 13155 -15076 -19227 4572 6680 -9817
1310 -9817 -4101 10569 2223 -13030 -11125 3559 16037 7912 -15130 -14221 12620 14468 -8318
1323 -8318 -4666 15086 6002 -13812 -5236 16035 18677 1637 -14795 -7101 19479 20823 -5718
1336 -5718 -8333 14252 12042 -8577 -788 21142 16195 -4522 -9902 3529 21211 18682 -4528
1349 -4528 -9344 11968 15312 -3341 1984 20310 9047 -12067 -4244 16420 19521 5913 -8624
1362 -8624 -5793 13116 14857 -3547 -1205 15909 5019 -16345 -2478 22940 15382 -8657 -15166
1375 -15166 -1435 14897 12534 -6574 -10010 7412 4622 -14485 -3972 19737 8388 -18900
1387 -18900 -17465 3257 13201 5871 -10414 -14909 -1711 3438 -8173 -4465 10231 -1780 -24606
1400 -24606 -13848 10872 8891 -7899 -14323 -11594 -3696 611 -5391 -4305 2948 -8950 -26030
1413 -26030 -7777 18802 5819 -22064 -19051 -1435 2997 -2120 -6944 -6164 -741 -7125 -19505
1426 -19505 -4538 19268 4839 -26193 -19615 7893 10652 -2647 -8641 -6798 -2423 -906 -5126
1439 -5126 -36 12104 897 -21317 -10653 16865 13261 -7268 -7892 11 539 1373 5069 6281
1453 6281 5831 -3964 -14008 2495 26153 12013 -16248 -9195 12817 10994 916 3851 8502
1466 8502 4964 -3532 -5888 9767 27315 10921 -20254 -10757 22053 21777 417 -1910 6080 4484
1480 4484 1357 4147 11645 17286 4595 -16339 -6231 24062 22730 -4131 -7617 4411 3928 2041
1494 2041 10164 12016 3551 -6551 -10362 3416 23082 13636 -13988 -12636 8396 7443 -3010 5331
1508 5331 9846 -3700 -14318 -7176 9314 18692 3368 -22967 -16809 12650 13642 -7586 -8381 2425
1522 2425 -4755 -12879 -3504 7905 7117 -6263 -21785 -14968 10389 13394 -10309 -17133 -4154 -4500
1536 -4500 -8602 1260 5596 -7311 -16527 -12403 -2351 7522 2663 -15187 -16124 -1039 -715 -8819
1550 -8819 723 6147 -12535 -22555 -5510 11997 8540 -7747 -21094 -13021 8640 9219 -8848
1563 -8848 -8068 3931 -5531 -16092 440 16447 5862 -12158 -17261 -5584 14194 15619 -5034
1576 -5034 -13855 -736 2735 -2168 8101 14625 -2249 -14573 -4111 9226 13913 9851 -2766
1589 -2766 -8928 913 7224 5495 11991 14123 -6718 -17707 6250 25537 14450 -3923 -7513
1602 -7513 -60 10414 12274 3593 5536 11778 -1947 -13883 7455 29676 13482 -12050 -11440
1615 -11440 5087 16815 15558 1295 -5960 3440 5549 -1836 6170 18625 5315 -14241 -6625
1628 -6625 10001 13104 7990 -962 -9290 -4291 6328 6801 5840 5134 -8105 -16550 1753 18526
1642 18526 5533 -11020 -7917 -2339 -766 2256 2361 227 -1567 -10397 -16240 2704 20513 1889
1656 1889 -24637 -17528 3776 8173 1495 -6234 -11568 -7644 -3868 -6574 -968 9440 -2639 -24057
1670 -24057 -16540 6365 9524 -702 -9299 -16137 -13275 1419 6877 104 -5612 -12017 -16728 -3767
1684 -3767 12397 4168 -11354 -10408 -6281 -7335 843 9824 3123 -10018 -15286 -10335 6389 18978
1698 18978 2754 -20428 -13520 6610 7172 1031 2575 -437 -7155 -6150 -22 8580 14635 3239
1712 3239 -16983 -11496 12918 17865 4305 -2477 -4309 -4917 5088 14268 8873 1466 -1616 -4841
1726 -4841 1219 15545 14124 -476 -2559 1897 -270 6619 18557 11115 -7466 -9263 3481 15205
1740 15205 18393 5193 -11434 -4983 13108 11126 1565 6608 7788 -4272 -7047 5773 15376
1753 15376 14287 518 -15635 -8551 16046 20276 363 -8291 -2925 -1311 2253 10497 8363 -1998
1767 -1998 -6747 -7582 -3376 10105 13887 -2858 -13616 -8035 -1732 4070 12249 3820 -16596 -17357
1781 -17357 -317 9566 7201 -2287 -13957 -13718 -118 3260 -2327 1613 942 -15520 -19895 309
1795 309 14424 5854 -11345 -21533 -14096 6822 12428 -4860 -14414 -6776 -6191 -8471 1014 7144
1809 7144 -2335 -12290 -13858 -8252 4969 12378 -2695 -18404 -12616 -4 4214 6015 904 -13253
1823 -13253 -14370 1005 7604 2248 -104 -4199 -9758 -4463 4185 5623 5447 1935 -12009 -14146
1837 -14146 7773 20754 5006 -11657 -10494 -286 10708 13066 1321 -5674 628 1910 -2527
1850 -2527 7433 17598 5213 -11154 -7914 5362 15452 17180 2665 -13135 -5517 11463 14286
1863 14286 9348 5480 -3809 -7401 5572 14531 10120 5695 2287 -6297 -4567 10667 17998 10037
1877 10037 -1249 -11041 -8390 12732 24447 6212 -11694 -7163 3358 6748 9049 7055 -378
1890 -378 -3556 -4568 -4467 7577 19485 4775 -17908 -13412 5640 13073 9120 -2300 -13286 -9421
1904 -9421 4285 6698 1455 1467 -3673 -12986 -7624 5772 6809 194 -5340 -13264 -13060 3326 12352
1919 12352 344 -12325 -14343 -9093 3368 10320 -1842 -16057 -10179 -1311 -3116 -1124 3573
1932 3573 -3221 -12566 -12437 -5859 4401 10766 -2892 -22773 -16308 6151 11135 -151 -8438 -12020
1946 -12020 -9254 913 5117 -370 -1464 -3534 -12975 -10353 6858 12677 877 -9986 -13234 -7109
1960 -7109 9055 16696 1073 -13743 -9907 -289 6432 10843 5566 -6726 -6969 -399 1866 6548
1974 6548 13752 4614 -12021 -9995 5309 15494 14908 1513 -14097 -8707 12304 17261 5525
1987 5525 -207 -387 -3115 988 9972 11446 8142 2180 -7542 -6866 12022 21955 7257 -7465 -7285
2002 -7285 1055 11675 16861 5598 -7407 -3614 4633 5073 7636 10245 1445 -6802 -3252 3189
2016 3189 9047 13514 3658 -13318 -10401 8429 14982 6462 -3362 -9968 -6469 6680 10292 347
2030 347 -3262 -1552 -5709 -6634 4991 10151 1415 -8429 -13004 -8361 8041 15227 -1885 -17888
2044 -17888 -11824 966 4834 4378 -1740 -10980 -10262 -3593 -2265 1083 6266 -3135 -17957 -13858 1906
2059 1906 8629 4490 -6953 -19353 -14245 5115 10504 -1100 -9385 -10826 -9867 -2038 5908 2582
2073 2582 -4304 -6097 -11031 -11032 3941 13701 1369 -14005 -15048 -5645 8417 13432 -686 -16297
2087 -16297 -9457 3544 4045 2530 3448 -1662 -7858 -5377 719 7270 12219 1915 -14633 -10884
2101 -10884 9279 16016 5803 -3479 -7927 -4163 7864 12318 3983 -839 515 -2341 -956 9614
2115 9614 12787 3563 -2861 -4205 -1356 10515 18437 5908 -9650 -6217 6036 12508 12391 3378
2129 3378 -6886 -2696 8001 7651 4262 8452 4754 -6405 -5534 7160 14020 11265 -442 -13072
2143 -13072 -6092 14061 17283 1849 -6628 -3971 -1343 4295 9675 5426 -1515 -4061 -6503 -3876
2157 -3876 8989 14022 64 -11968 -9712 -1729 7770 12351 429 -15344 -11580 2652 6650
2170 6650 3895 -643 -8220 -9995 -3187 682 1211 4769 -598 -15728 -15629 2887 12244 3062 -9934
2185 -9934 -16153 -10132 5207 8033 -4568 -10055 -5090 -6138 -7285 1297 5979 -2176 -10483 -11761
2199 -11761 -6918 4920 10159 -3372 -15871 -10454 -181 3879 5027 -716 -12084 -10529 1187
2212 1187 4628 647 -269 -2929 -8567 -5053 3095 5676 5101 -706 -12179 -10377 8412 16003 1561
2227 1561 -10203 -7557 351 7382 8960 1066 -3360 492 -545 -2819 7308 14987 3519 -9939
2241 -9939 -6389 4815 13345 13538 367 -10845 -3304 9240 10328 7021 4868 -2572 -5438 3440
2255 3440 10523 8325 6150 1697 -5922 -3714 9536 14869 8364 -1131 -8959 -5370 11227 18384
2269 18384 3833 -7787 -2844 2918 4155 6558 6713 1706 -2301 -4812 -3948 7874 16606 2913
2283 2913 -14280 -9231 5971 10337 6138 -2111 -8968 -5928 3165 4334 1201 2543 -2589 -10088
2297 -10088 -5649 5119 5421 399 -4296 -10249 -9067 3416 9194 -373 -9452 -10659 -6507 2986
2311 2986 7434 -2478 -12151 -6450 -1002 -4131 -1574 3372 -1606 -10389 -11053 -5030 4756 8727 -4310
2326 -4310 -18613 -10758 5717 5705 -2831 -5909 -7608 -7601 -2078 1937 1316 474 -4257 -12788 -7461 7319
2342 7319 8849 -1669 -7749 -8621 -5447 5237 10889 835 -8827 -7188 -1437 3663 8529 3989
2356 3989 -5742 -4770 545 231 4117 10872 3733 -9473 -8244 4329 12383 10680 -404 -10636
2370 -10636 -4325 10261 9717 1286 2261 2713 -2545 -1697 7237 10903 7147 215 -6758 -2597 11893
2385 11893 14871 2124 -4377 -1461 1693 6277 11141 5778 -3335 -2376 2723 4515 7737 7587 -338
2400 -338 -3400 386 2525 5174 10087 4325 -9061 -7606 7210 11561 4512 -3014 -6524 -2426 6042
2415 6042 5977 -856 48 1466 -5672 -6678 4654 9632 478 -8060 -9051 -3401 7181 7883 -4062
2430 -4062 -10442 -5024 -657 -169 3474 1429 -7783 -9528 -3470 -133 1359 2535 -4828 -11987 -7509
2445 -7509 108 2906 2894 -3137 -13508 -11818 3135 7418 -2023 -7702 -7393 -6322 -2187 1583 -315
2460 -315 -1570 -2874 -9660 -10140 4015 10200 -1483 -12230 -8818 -1327 4185 4891 -2340 -8108 -3821
2475 -3821 -527 -1631 2161 5928 -2161 -8574 -3444 3143 4910 5084 193 -7651 -4482 5006 6971
2490 6971 3992 801 -4911 -4685 5577 9921 1940 -1835 938 51 38 5344 7731 3809 -168 -3326
2506 -3326 -1785 8986 14053 2100 -7691 -1019 7604 7175 5456 3122 -593 146 3399 3262 5570
2521 5570 8961 2091 -6630 -895 9165 8748 4019 491 -4319 -2314 7017 9277 2904 -722 -2363
2536 -2363 -3280 3116 9086 3377 -2348 -732 -1355 -2939 4099 8641 1226 -6302 -6388 -1686 5344 8514
2552 8514 -1094 -10309 -4744 3017 1128 -630 1720 -2386 -7462 -4462 -164 2234 3508 -3145 -11662
2567 -11662 -7003 4129 3863 -3083 -4603 -6225 -7564 -784 3176 -1418 -5193 -5261 -6567 -4540 2519
2582 2519 989 -5032 -5800 -4686 -5536 -367 5362 -1275 -9942 -7264 -1236 1320 1872 -2311 -8756 -4952
2598 -4952 1582 -417 -2931 1852 -42 -7221 -5210 2384 4126 1573 -2453 -7693 -3981 6498 6021
2613 6021 -2384 -2975 -498 -2266 796 6103 3686 -1629 -1732 -830 97 5732 6878 -280 -3693 125
2629 125 1859 4323 8353 3855 -5015 -2546 5834 7055 5001 3311 -1153 -1436 4314 5641 3415
2644 3415 5413 4186 -3622 -2719 7630 9803 3511 -372 -1998 99 6733 8416 1388 -611 2283
2659 2283 336 123 6146 6973 197 -2113 -50 847 4597 6608 634 -4943 -1298 2213 1849 3985
2675 3985 2580 -4701 -4656 2610 2982 -170 727 -671 -4653 -2145 1703 559 -21 -540 -6348 -6589 2564
2692 2564 4854 -3116 -5825 -3422 -2679 -732 1301 -2665 -5125 -2819 -2851 -5123 -258 2440 -4313 -8380
2708 -8380 -3896 -1253 -711 614 -3020 -7966 -4810 443 -406 -1665 -1376 -5453 -7200 -458 2138 -2045
2724 -2045 -2655 -1945 -5614 -4632 2036 2371 -1598 -2660 -4741 -4864 2304 5433 -2017 -5846 -1381 100
2740 100 -500 2012 2454 -1781 -2093 -447 -738 2811 6438 128 -5657 -621 4188 2815 2961 2419 -2011
2757 -2011 -1645 3732 4243 2367 3753 1774 -2260 1865 6677 4219 1447 2622 293 -792 4984
2772 4984 7268 2479 557 1679 1034 3612 7373 2857 -1475 2069 3840 1381 3183 6017 1727
2787 1727 -1530 1623 2731 3136 5225 1974 -3520 -87 5466 3066 333 2042 -2 -2260 1915
2802 1915 3317 412 595 642 -3030 -1569 3987 2375 -2346 -1776 -1236 -2784 259 3582 -1496 -5159
2818 -5159 -2054 -1100 -1269 1677 101 -5147 -3735 -583 -2211 -1936 900 -2284 -6908 -3896 -79 -1181
2834 -1181 -1356 -1888 -6203 -5250 619 -274 -3614 -1847 -2110 -6085 -3338 878 -1457 -3687 -2295 -4110
2850 -4110 -4813 367 1022 -3546 -3962 -1775 -3040 -1891 1761 -563 -5133 -2165 -232 -2057 -70 1540
2866 1540 -2387 -3650 202 221 -924 2145 1362 -3757 -1718 3580 1802 -672 1283 -180 -1232 2549
2882 2549 3497 -33 819 3101 -33 -240 4429 3876 -115 1106 2419 548 3096 5362 1440 -232
2898 -232 3184 3331 1570 4298 4283 -206 985 4675 2676 1927 4251 2338 -746 2400 4581 1955
2914 1955 2636 3499 -156 -218 4605 4604 526 1280 1925 -924 1155 4195 1186 -424 1882 403 -1451
2931 -1451 2403 3423 -954 -1619 853 -310 -574 2736 372 -3381 -1012 759 -1529 -703 1628 -1968
2947 -1968 -3585 150 -117 -2419 -82 -198 -3999 -3255 806 -1399 -3258 -1065 -2137 -4405 -1359 -152
2963 -152 -3326 -3328 -846 -3199 -4048 -498 -1231 -4425 -2477 -1333 -4011 -2769 -14 -2822 -4273 -830
2979 -830 -1391 -3571 -1306 -259 -3902 -3275 186 -2184 -3368 -679 -692 -3430 -1104 732 -2217 -1458
2995 -1458 709 -1811 -2410 1486 771 -2538 -418 1548 -1177 -264 2192 -54 -1235 2100 1329 -673
3011 -673 1816 2935 -622 -189 3386 1041 327 2694 2441 -466 2194 3647 820 1200 3946 1571
3027 1571 466 3907 3429 43 2691 3997 750 845 4455 2368 931 3665 2953 612 3140 4350
3043 4350 711 1055 4201 2044 -47 2807 2547 322 1867 3264 -56 686 2982 843 -533 2665
3059 2665 2015 -1286 448 2723 -611 -626 2121 -442 -1923 746 731 -1582 58 657 -2927 -1662
3075 -1662 1722 -737 -3131 -338 -450 -3593 -1657 529 -2404 -2690 -650 -2953 -3365 531 -245 -4111
3091 -4111 -2510 -443 -3456 -3108 -273 -2149 -4353 -1985 -1828 -3519 -1224 -645 -4097 -3776 -8 -1733
3107 -1733 -3519 -967 -1450 -4312 -2243 -138 -2221 -2335 -496 -2447 -3390 487 318 -2917 -1154 742
3123 742 -2551 -2211 1376 46 -2356 -633 -324 -1140 1107 1737 -1752 -1430 2314 762 -1244 2075
3139 2075 2301 -1106 -216 2360 1176 1160 2956 67 -949 3129 3598 339 1689 3208 365 643
3155 643 4354 2915 989 2427 1779 228 2962 4562 1193 736 3282 1426 767 4465 4368 -233
3171 -233 440 2982 2243 2363 3899 979 -890 2315 2872 391 2319 4006 -810 -1371 2810 2955 1124
3188 1124 1551 160 -1793 1160 2922 290 -653 1771 -977 -2754 1405 2279 -1505 -1576 -264 -2130
3204 -2130 -1018 1916 -477 -3313 -1272 -1009 -2571 -68 1490 -3083 -4701 -572 -308 -1703 -897 -1653
3220 -1653 -4075 -2408 -545 -2634 -2063 -76 -3501 -6109 -1161 1344 -2291 -2862 -2142 -3938 -2380 718
3236 718 -1300 -3846 -1572 -2112 -4550 -854 1984 -1987 -4144 -1615 -1551 -1690 867 256 -3104 -2615 -301
3253 -301 -1331 50 1920 -1633 -4208 -11 2132 132 110 1072 -1333 -2025 1675 1736 825 1807 -510
3270 -510 -3145 1023 5251 1743 -1088 1119 1123 288 3032 3554 766 1167 1426 -283 1809 5907 2818
3287 2818 -1921 427 3339 2350 3403 4136 824 -476 2620 3174 2248 3931 2005 -1844 521 4688
3303 4688 2849 1116 2750 627 -1320 2118 4786 2407 838 453 -1551 1242 5374 2132 -1816
3318 -1816 118 1584 -675 766 3248 729 -1626 -991 -783 109 3506 1287 -4088 -3308 933 360
3334 360 -476 1001 -1268 -4039 -1307 853 -509 -203 -788 -4193 -3701 587 486 -1949 -1570 -2415 -5236
3351 -5236 -2049 2475 99 -3587 -3444 -3354 -2664 1191 -72 -4258 -3496 -1302 -2679 -2508 1562 -232
3367 -232 -4693 -4070 -1749 -194 1224 270 -4994 -4924 257 638 -1805 -420 -591 -4208 -2818 1217 990
3384 990 -94 -205 -2583 -3135 1562 3786 131 -1225 -590 -2100 -749 4386 3043 -1944 -1914 799
3400 799 883 2770 3501 38 -826 1129 574 669 4626 4272 -1970 -2810 2618 4540 3761 2695 -474 -1494
3418 -1494 2885 4493 1501 2292 3029 -547 -1327 3817 5520 2060 1034 -27 -1042 2871 5828 3111
3434 3111 -514 291 229 799 4770 4750 -837 -2228 1166 1766 1524 3550 1785 -1911 -1001 273 1215
3451 1215 3401 2779 -3320 -4591 1213 4036 815 -858 -1498 -3057 -538 1969 768 -164 299 -2878
3467 -2878 -4740 695 3898 -551 -4000 -3380 -3072 -903 2487 64 -4377 -3635 -2088 -1906 338 1650
3483 1650 -2839 -5467 -2046 -1328 -1891 649 -278 -4681 -5535 -1742 786 845 -2 -4822 -6638 -435 3193
3500 3193 -839 -2811 -2004 -3141 -3466 -78 1364 -225 -1193 -3446 -4841 263 5251 926 -4388 -3277
3516 -3277 -876 694 2626 2033 -2300 -3088 -11 248 1114 3442 704 -3106 -1556 1622 1824 3086
3532 3086 2646 -2350 -3587 1715 5191 3453 1312 -754 -1855 1931 5741 2919 159 1842 681
3547 681 -1305 2005 5927 3683 -117 -1105 -919 3089 7320 3438 -2420 -1043 3222 2802 3124 3952
3563 3952 1116 -1579 221 2124 2567 4356 2602 -2755 -2342 2541 3750 3158 1923 -1623 -3649 1176
3579 1176 5158 2160 -1040 -970 -1932 -580 2542 2454 -745 -812 -1218 -3702 -44 4897 2273 -4292 -5025
3596 -5025 -1891 1117 3123 498 -4748 -4556 1 -436 -871 1199 -318 -4696 -4328 -916 686 1013
3612 1013 -680 -5408 -6406 -230 2778 -244 -2237 -3540 -4920 -1955 2327 493 -3052 -2765 -2878 -3558
3628 -3558 -215 1837 -465 -3593 -3408 -3810 -825 4496 1638 -5143 -5508 -411 1739 1318 422 -2903
3644 -2903 -3063 -209 301 -208 2289 1590 -3236 -4484 1057 4165 2650 228 -2617 -3284 2216 5384
3660 5384 1645 -1256 -524 -958 174 3863 3816 245 -173 280 -859 2354 5992 3565 -1603 -1765 297
3677 297 2843 6036 3929 -2683 -2857 3114 4601 2688 2514 1459 -908 -270 2115 2733 4121 3637
3693 3637 -2099 -3829 2833 7042 3447 -664 -1275 -1509 1940 5052 2409 -817 -297 -420 -1304 2094
3709 2094 4583 1044 -2055 -1870 -1210 1117 5079 2397 -3777 -4563 -165 2045 2963 1021 -3415 -4154
3725 -4154 212 1447 -621 -5 503 -3392 -4744 -786 1910 1556 -1003 -5066 -5930 128 4432 186
3741 186 -4760 -3598 -2155 -1618 781 289 -2425 -3163 -2930 -3718 -835 2945 -5 -5347 -5156 -1784 309
3758 309 2338 474 -5407 -5651 -158 1872 -82 -584 -2258 -3618 -1502 662 95 363 543 -3280
3774 -3280 -5519 505 4996 2295 -2264 -4040 -3297 1594 5005 1330 -3240 -1446 611 -375 1524
3789 1524 3486 1301 -1764 -1418 -404 2321 6075 3396 -3172 -3168 1586 4418 3808 2215 -1643 -2276
3805 -2276 2264 4142 2797 2075 1785 -874 -1146 2691 4623 3231 1824 -1475 -3155 2535 7566 3512
3821 3512 -2013 -1729 786 2596 4498 2618 -988 90 1306 -126 1035 4607 2847 -2414 -2778
3836 -2778 47 2871 4704 2229 -3853 -4060 2162 3802 1204 10 -1315 -2590 -714 1822 873
3851 873 182 -210 -2739 -4246 304 3975 957 -2595 -3803 -4077 606 4621 424 -5303 -3949 -1197
3867 -1197 -569 -27 727 -1453 -3378 -2581 -2391 -906 3024 786 -6188 -6218 -1008 2299 976 -1328 -4989
3884 -4989 -5041 217 2251 -863 -1789 -1503 -3483 -3656 206 1939 235 -1674 -3768 -4856 228 4882
3900 4882 1305 -4207 -3783 -1451 1276 3316 976 -2851 -2588 143 60 378 2874 1542 -2649 -2947
3916 -2947 -335 2644 4583 2346 -3716 -4454 2445 5121 2178 -4 -1118 -1155 968 3586 2266 1038
3932 1038 2086 -693 -2109 2303 6069 3141 -74 -1735 -944 3050 6597 2503 -2775 -1708 2058
3947 2058 2580 3135 2909 -27 -813 1268 1339 1866 4314 3021 -2693 -3202 2009 4533 3741 691 -2968
3964 -2968 -2860 2922 5144 1113 -1018 -351 -1122 -848 2061 2400 676 -582 -2899 -3601 1199 5260
3980 5260 1627 -4220 -4195 -966 1505 2960 615 -4184 -3528 -326 -148 -218 1099 -178 -3991 -3775 -1231
3997 -1231 687 1931 29 -5477 -6260 39 3461 300 -2529 -4129 -3976 -452 1998 -730 -2316
4012 -2316 -1320 -2378 -3855 -620 2737 200 -3033 -4258 -3769 643 4166 595 -5102 -4389 -389 1039
4028 1039 899 83 -2117 -3080 -698 57 25 2081 941 -3531 -3768 651 3233 2546 114 -3334 -3538
4045 -3538 2284 4894 1171 -1867 -811 -416 337 2651 2896 897 132 -998 -1880 1911 5977 3238
4061 3238 -2543 -2437 935 3335 5305 2212 -2545 -1779 2626 3097 1838 2851 1553 -1117 -195 2306
4077 2306 2852 4242 2580 -2397 -3300 2431 6082 2916 -443 -1733 -1341 2406 4696 1701 -1122 278
4093 278 4 -1130 1751 4137 1612 -1448 -2250 -1340 1916 5179 1807 -4244 -3770 889 2279 1789
4109 1789 643 -2386 -3093 165 595 -403 1142 645 -3387 -4131 237 2206 1091 -1094 -4565 -4807
4125 -4807 553 3762 -258 -3969 -2843 -1794 -1059 551 128 -2255 -2483 -2281 -3339 -431 2883 246
4141 246 -4513 -4729 -1755 791 2344 -87 -5188 -4172 288 1131 -592 -344 -1357 -3462 -1714 226
4157 226 382 1204 664 -3586 -4325 882 3779 1317 -2176 -3288 -2051 1342 4099 810 -2572 -1220
4173 -1220 143 -492 1328 2894 1109 -1330 -1664 -862 1952 5045 2197 -3108 -2760 1871 3647 2900
4189 2900 1335 -961 -1864 1572 3039 1523 2169 1856 -1238 -1373 2376 4287 3064 1051 -1686 -2291
4205 -2291 2801 5978 2415 -1621 -480 520 1850 3700 2581 -313 228 829 -345 1121 4343
4220 4343 2536 -2112 -2178 406 2385 3867 1524 -3123 -2546 1876 2746 721 222 -580 -1992 -397
4236 -397 1188 971 638 610 -2618 -3713 1167 3445 658 -2420 -2983 -2629 511 3303 161 -3698 -2470
4253 -2470 -792 -552 4 815 -1463 -2692 -2432 -2244 -290 2420 330 -4886 -4769 -62 1453 870 -1071
4270 -1071 -4142 -3980 48 946 -749 -826 -701 -2996 -3451 124 1333 17 -1178 -3270 -3847 574 3791
4287 3791 133 -3146 -2361 -1177 132 2107 859 -2469 -1850 129 -483 -45 2638 945 -2329 -2345
4303 -2345 39 1779 3213 1540 -2883 -2873 2102 3344 1163 -99 -81 -1023 864 2560 1584 1173 1514
4320 1514 -729 -1883 2066 4914 1945 -648 -724 -186 2705 4644 2052 -1569 -521 1529 1314 2474
4336 2474 2904 336 -652 649 1207 1686 3633 2027 -1797 -1870 1783 2866 2643 1386 -1880 -2040 2175
4353 2175 3511 1121 -349 510 -727 -1213 1502 2058 867 -136 -1543 -2398 973 4226 977 -2957
4369 -2957 -2100 -366 425 1608 766 -2814 -2295 -153 -660 -58 1386 -124 -3263 -2562 -416 213 1067
4386 1067 -131 -3628 -3803 398 1774 -519 -1379 -2554 -2916 -856 1301 -486 -1881 -1195 -1966 -3262
4402 -3262 -534 1651 -496 -2537 -2940 -2603 96 2502 -338 -3604 -2413 13 -259 -123 399 -1344
4418 -1344 -2422 -762 -135 -138 1331 312 -2922 -2546 1042 1961 874 -235 -1788 -2508 1071 2584 330
4435 330 -468 -127 -634 70 2069 1941 366 -47 -302 -1075 1503 4486 1736 -1674 -969 640 2128
4452 2128 3328 1632 -1252 -141 1984 1643 1095 2302 1318 -1326 30 1671 1960 2841 1790 -1407
4468 -1407 -1323 2758 3465 1151 410 -175 -662 1277 3345 1227 -219 522 96 -452 1533 2700 902
4485 902 -530 -604 -704 772 3511 1087 -2441 -1777 1063 1119 1079 650 -1419 -1711 180 304 -346 1209
4503 1209 280 -2645 -2284 547 1298 276 -619 -2428 -2667 428 1674 -1143 -2015 -1245 -1866 -1747 551
4520 551 184 -1735 -2096 -1710 -1715 -281 1471 -775 -2949 -2105 -920 -622 908 -172 -3332 -2733 203
4537 203 510 -798 -237 -748 -2410 -1528 281 -247 485 -71 -2620 -2864 745 1825 -14 -1527 -1182
4554 -1182 -1733 238 2068 149 -1127 -118 -657 -931 1101 2045 -97 -1306 -457 -24 907 2605 1378
4571 1378 -1703 -1027 1354 1237 1727 1563 -410 -989 1247 2212 836 1249 1706 -497 -393 1892 2098
4588 2098 1795 1598 -333 -979 1856 3683 1037 -234 538 540 661 2185 1883 421 215 614 187 1288
4606 1288 2747 772 -1046 -100 1033 1184 1766 1442 -1522 -800 1490 1420 262 817 -191 -1432 140
4623 140 1588 366 84 719 -1323 -1723 711 1934 -164 -936 -1315 -1548 63 1756 -272 -2040 -589
4640 -589 -460 -1157 -288 763 -833 -2158 -1034 -1043 -501 961 -808 -2987 -2267 -61 -315 -458 -382 -1777
4658 -1777 -2707 -776 229 -1025 -635 -539 -2116 -1885 242 120 -878 -614 -1380 -2332 -510 1493 -224
4675 -224 -2125 -954 -1237 -561 1073 401 -1610 -824 250 -792 -143 1136 64 -1911 -922 143 479
4692 479 807 1019 -1327 -917 1461 1372 -7 1111 597 -972 354 1780 897 170 932 43 -40 1872
4710 1872 2135 528 416 833 -50 1061 2616 1350 -775 709 1093 721 1209 1900 156 -75 1089
4727 1089 583 687 2184 1564 -892 -182 1776 1791 961 1130 -147 -152 1370 1235 131 699 817 -416
4745 -416 -592 1382 1413 -66 20 -436 -720 277 1586 169 -932 -119 -199 -623 1102 412 -1650 -1032 96
4764 96 -481 -607 690 -515 -1865 -708 -193 -484 123 -122 -2035 -2183 74 269 -1505 -630 -645 -1808
4782 -1808 -920 109 -894 -943 -300 -1566 -2309 -23 405 -1468 -1330 -747 -1254 -863 172 -447 -1811 -1064
4800 -1064 -379 -1392 -386 245 -1622 -1723 -44 -121 -1076 314 319 -1470 -1171 274 15 -45 276 -804
4818 -804 -1303 625 1382 -405 29 510 -8 -539 1230 930 -444 678 319 -418 426 2018 113 -459
4836 -459 595 703 267 1466 1772 -224 11 1324 838 484 1653 1094 -215 1196 1657 218 1136
4853 1136 1707 277 -329 1687 1520 418 774 842 -83 818 1709 553 233 1412 536 -210 745 1467
4871 1467 201 65 456 -220 434 1240 702 -650 475 680 -405 -19 1266 -28 -879 170 187 -433
4889 -433 195 -9 -1407 -584 469 -378 -575 58 -727 -1563 -136 590 -519 -916 -422 -1018 -1372 -50
4907 -50 -450 -1355 -358 -374 -1565 -525 324 -1042 -1514 -670 -599 -1366 -38 -435 -1823 -1228 106 -1162 -1216
4926 -1216 34 -585 -1445 -666 -122 -747 -741 -182 -1035 -1077 280 -10 -1073 -48 -337 -1332 -608 779 34
4945 34 -743 122 247 -731 10 692 -536 -214 696 -174 -302 1242 694 -508 437 1136 140 461 1260
4964 1260 481 -12 1065 974 -118 1383 1286 77 266 1456 807 348 818 994 150 793 1261 126
4982 126 362 1483 641 162 1715 928 189 655 1127 130 412 1455 828 201 1175 618 83 453 1225
5001 1225 18 203 1257 325 -298 455 561 -288 321 773 -299 -170 547 -481 -679 275 107 -1031
5019 -1031 -132 460 -622 -823 119 -479 -988 339 -273 -1370 -349 -105 -891 -613 153 -690 -1309 -395
5037 -395 -294 -1161 -778 -44 -1135 -835 -193 -1059 -1421 -589 -457 -1856 -975 -80 -1075 -1076 -187 -930 -1194 -202
5057 -202 -622 -1145 -596 -90 -1198 -1032 311 -444 -1008 -136 -151 -860 -184 49 -527 -561 253 -281 -409 500
5077 500 249 -1035 -26 633 -276 4 844 63 -661 653 610 29 356 757 -79 192 1168 666 -174
5096 -174 623 830 274 487 1331 365 589 989 515 56 1523 1193 -141 548 1220 299 638 1762 744
5115 744 125 1201 1132 587 1112 1451 316 -100 1324 473 73 636 701 -416 533 984 225 -232 462
5134 462 -67 -508 533 762 -174 -100 514 -413 -350 705 73 -512 107 103 -721 239 396 -901 -1169 24
5154 24 -239 -1177 23 -192 -1045 -408 140 -720 -573 62 -915 -1648 -276 -332 -1007 -413 -457 -1488 -971 255
5174 255 -661 -1193 -526 -873 -1301 -654 -217 -820 -1002 -366 -901 -1059 -73 -9 -1475 -1031 -238 -672 -531 48
5194 48 -533 -1182 -150 361 -931 -343 256 -975 -839 154 151 -127 468 106 -924 143 965 -123 1
5213 1 100 54 -263 887 925 -239 480 675 257 406 1322 611 79 515 858 299 1140 1516 422 -525 784
5234 784 1110 464 1097 980 -106 581 1149 773 787 1112 708 -368 1093 1172 516 978 640 -353 423 1793
5254 1793 986 -55 413 311 -8 439 1382 544 -211 562 77 -177 953 743 -729 -659 328 235 298 629
5274 629 -185 -1020 -72 301 -278 -300 252 -570 -780 560 -9 -433 -52 -496 -1315 -280 381 -593 -1060 -876
5294 -876 -1007 -813 258 314 -1118 -913 -429 -543 -748 65 -275 -1264 -940 -899 -986 100 379 -1524 -1652 -179
5314 -179 41 -546 11 -222 -1576 -624 283 -414 -562 -121 -643 -1232 -185 519 -537 -253 -508 -1035 -601
5333 -601 1030 436 -1186 -134 -171 -270 512 897 -299 -463 482 310 -153 767 1009 -781 -643 395 728
5352 728 705 1175 45 -835 562 1316 700 506 758 -293 49 1297 1142 421 697 682 -427 621 1912
5371 1912 1122 -74 518 486 111 1525 1371 0 -59 813 601 600 1199 310 -403 256 643 586 807 1240
5391 1240 -121 -1228 227 1125 471 594 -86 -719 -97 935 174 -225 422 -285 -689 -99 1116 -23
5409 -23 -244 -532 -1095 -471 638 411 -1262 -600 -345 -615 -166 339 -791 -1577 -541 -554 -517 -34 -114 -1187
5429 -1187 -1149 -525 -343 -139 26 -911 -2052 -537 306 -217 -689 -713 -1052 -888 227 81 -1029 -570 -574 -1853
5449 -1853 -591 893 202 -953 -1007 -655 -428 621 547 -1076 -628 -393 -434 -38 636 -33 -1013 -321 242
5468 242 31 623 846 -465 -860 285 941 554 439 -194 -598 299 1674 452 -36 583 256 -493 1060
5487 1060 1412 556 275 290 -342 575 2012 1611 -341 -544 462 924 1056 1310 44 -35 1039 799 418
5506 418 1012 756 -329 -179 322 651 973 1073 -285 -859 491 1663 840 178 -67 -300 206 1176 864
5525 864 -176 -49 89 -625 -180 1387 603 -435 -308 -462 -454 873 622 -1098 -1375 -48 -49 -172 298
5544 298 -426 -1040 -732 -202 -356 55 204 -1103 -1463 -423 770 1 -499 -1115 -1576 -623 574 -65 -1113
5563 -1113 -693 -612 -1187 -593 314 -737 -713 -628 -1225 -868 665 377 -1361 -1472 -574 -98 464 188 -1276
5582 -1276 -1393 -398 320 -344 168 303 -854 -923 -38 177 625 373 -683 -1478 25 1253 452 -184 -521
5601 -521 -517 -45 1297 949 -30 -33 603 -497 313 1311 629 -441 -444 14 482 1626 1651 -152 -777 604
5621 604 1272 757 510 287 -176 788 921 688 696 1067 62 -624 482 1639 956 565 223 -224 115 1685
5641 1685 899 -259 268 284 103 727 1050 238 -20 87 -119 29 1378 861 -1032 -804 174 288 688
5660 688 809 -915 -845 250 880 -276 101 276 -764 -767 448 15 113 151 -1181 -1384 -249 1095 284
5679 284 -762 -1136 -829 -421 564 -164 -1038 -1167 -433 -746 -600 646 210 -1196 -1220 -863 -259 414 546
5698 546 -1302 -2104 -712 261 24 -298 -953 -1620 -400 181 -286 -600 39 -988 -1530 -655 462 310
5716 310 28 -836 -1430 -261 1347 573 -834 -541 87 -506 243 521 10 -166 -142 -335 -56 1054 1141
5735 1141 -661 -1087 20 608 1259 661 -410 -753 643 1362 811 368 589 -98 -70 518 793 773 998
5754 998 87 -772 400 1538 969 -120 -256 -328 530 1541 841 -226 -106 609 410 605 991 669 -144
5773 -144 -12 172 377 1340 1365 -1107 -1147 342 1037 390 333 -421 -625 264 398 372 -45 471 -451 -886 -84
5794 -84 773 550 -171 -692 -1485 -74 1228 569 -763 -1079 -395 -57 204 505 -674 -676 -298 -500 -358 531
5814 531 66 -778 -1247 -880 336 355 258 -1636 -1932 -229 680 -523 -476 -419 -976 -843 -43 49 -86 -63 -426
5835 -426 -1272 -473 752 333 -865 -1176 -953 -194 785 322 -1300 -886 -6 -139 61 370 -55 -640 -368
5854 -368 -241 -186 731 1064 -609 -1443 233 1100 386 18 -642 -561 652 1327 223 -87 365 -91 -180 227
5874 227 979 876 225 13 -544 296 1791 1048 -157 -781 520 816 971 863 65 -420 674 734 -155
5893 -155 1144 1176 42 -626 304 865 1112 821 -833 -1093 316 1352 833 -170 137 -83 -202 707
5911 707 658 148 117 -58 -1074 -196 1538 743 -516 -1010 -288 333 1049 738 -1004 -681 258 375 -127
5930 -127 377 -170 -722 -595 -309 -151 470 548 -955 -1732 -285 425 266 0 -1240 -1458 -229 636 -227
5949 -227 -1110 -545 -865 -735 -358 225 -60 -139 -745 -1747 -130 901 357 -1167 -1560 -209 13 253 137
5968 137 -783 -993 -254 62 -326 97 140 -625 -963 -325 200 722 409 -496 -1215 227 815 826 -340 -559
5988 -559 -761 -267 923 484 -375 142 155 -115 -116 1186 977 -397 -236 -441 520 1529 1123 -653 -952
6007 -952 307 806 408 707 -34 255 -18 441 266 725 814 -66 -852 380 1198 900 436 -334 -586 399
6027 399 1412 769 -94 12 271 178 414 930 205 69 238 -714 -73 1249 927 -604 -910 -249 410
6046 410 684 697 -693 -972 255 430 -188 32 538 -481 -619 250 311 286 370 -644 -1367 -367 1088
6065 1088 -94 -838 -884 -734 -197 433 -7 -893 -304 -149 -906 -406 603 -249 -1087 -1058 -741 -364 701
6084 701 379 -1335 -1417 -135 499 -362 -91 -649 -794 -386 241 -406 -95 112 -603 -1499 -704 422 128
6103 128 -41 -697 -1094 -133 747 185 -717 -613 52 -460 334 289 -96 76 125 -626 49 717 460 -546
6123 -546 -594 198 330 704 602 -468 -557 634 827 -18 115 550 -175 -62 34 404 526 1156 -235 -650
6143 -650 621 1294 1108 71 -161 -18 427 1098 529 -57 313 454 529 354 1196 398 -156 -48 -165 461
6163 461 719 929 -193 -592 379 1055 616 67 -244 -544 305 596 310 190 462 -4 -373 152 793 302
6183 302 104 -452 -974 -9 1192 -152 -989 -884 -423 58 234 -108 -493 -405 -71 -561 -546 157 225 -780
6203 -780 -968 -293 83 219 -191 -799 -1341 28 686 -462 -251 -450 -683 -539 152 -438 -413 107 -341 -1053
6223 -1053 -24 623 192 -640 -645 -368 -88 662 63 -932 -591 -187 -467 7 198 74 -518 -414 -367 -304 586
6244 586 470 -775 -854 198 510 303 267 -331 -637 164 803 289 79 486 -429 -553 214 833 305 249
6264 249 -70 -583 47 1546 443 -348 -134 335 702 888 835 -230 -232 286 311 424 658 731 -8 -677 73
6285 73 765 799 448 -274 -800 422 930 426 -107 199 107 216 636 318 155 328 375 -634 23 819 359
6306 359 -303 -456 125 232 674 414 -737 -688 394 137 -198 173 88 -524 -424 -266 -107 357 409 -564
6326 -564 -1100 -304 307 -143 -409 -485 -725 -179 480 -150 -664 -223 -544 -851 -324 -120 87 -672 -643 -747 -209
6347 -209 690 58 -1109 -705 -70 -231 18 68 -868 -862 181 -215 -185 190 31 -584 -527 161 255 73 388
6368 388 -616 -1041 129 894 230 -424 -424 -88 100 227 562 -420 317 -168 -331 162 816 208 -465 -209
6388 -209 -1 201 1036 442 -502 -317 534 305 332 418 419 62 195 316 344 598 872 -39 -272 355 970 648
6410 648 442 476 -166 381 857 414 241 297 193 43 426 574 333 112 153 -314 -51 731 692 -225 -303 213
6432 213 148 569 345 -244 -352 178 223 -116 -152 428 -260 -359 106 82 189 338 -557 -952 30 675 -30 -432
6454 -432 -536 -362 -497 64 47 -700 -251 61 -392 -1 287 13 -848 -612 -451 16 409 -211 -719 -940
6474 -940 -89 -192 -158 39 -573 -659 -322 -137 -555 -75 -56 -600 -830 -220 156 -58 -75 -435 -519 -31 404 -106
6496 -106 -450 -82 -173 -104 225 52 -306 -31 -155 -393 29 631 137 -194 -303 35 374 419 415 74 -101 421
6518 421 455 134 208 -82 -95 -325 308 336 203 447 81 -421 284 958 282 -48 19 279 39 913 391 -49
6540 -49 221 283 -16 312 830 363 -500 189 380 232 725 478 -305 -179 751 451 398 385 293 -172 190 407
6562 407 -27 127 426 -186 32 266 744 -2 74 -145 -320 -102 601 89 -214 47 -370 -192 61 50 -607
6583 -607 -490 -105 -269 -438 250 -171 -749 -498 -243 -177 -115 86 -470 -636 -74 -14 19 -12 -65 -538 -366 -86
6605 -86 42 -425 -366 -386 -692 -203 337 -563 -377 -303 -289 -328 276 -63 -642 -88 105 -199 -475 264 83 -341
6627 -341 -58 -131 -387 188 -104 -549 -522 2 120 176 -9 -196 -301 -172 449 72 53 -87 -161 -62 339 593
6649 593 266 62 234 172 13 691 198 2 -142 276 326 324 383 145 -302 118 443 202 271 479 -322 -69
6671 -69 472 550 369 736 -11 -377 159 196 100 245 320 -10 154 548 219 -195 40 317 -430 212 313 48
6693 48 -43 -85 68 -91 356 98 -557 -242 52 -115 193 571 -2 -455 9 20 -282 -117 22 -117 -221
6714 -221 99 -194 -343 -23 5 -245 -299 218 -489 -249 23 -47 -301 -162 -22 -467 -333 -467 -437 -355 146 -119
6736 -119 -445 -463 -283 -426 -318 -68 -414 -275 -155 -291 -397 370 -60 -528 -487 -42 27 -41 282 -582 -487 -35
6758 -35 118 -340 99 -187 -513 179 80 117 -61 70 -169 -266 -291 401 -11 -314 -111 -81 190 469 45 -248
6780 -248 -50 152 47 -10 214 209 -217 396 468 31 158 507 47 34 403 389 33 209 164 -202 44 502
6802 502 14 53 356 111 -169 -74 662 -277 148 326 231 -2 -1 83 -30 292 123 -83 116 411 -156 143
6824 143 474 293 142 263 158 -120 46 -76 -397 -45 307 -85 -169 257 106 -37 34 189 -223 273 -53
6845 -53 -118 -188 -327 83 -433 -125 140 145 -92 -97 -203 -375 91 173 -372 -140 -329 -99 -169 -45 -487 -426 -401 13
6869 13 -233 -194 179 -222 -443 -284 -16 -281 101 230 -199 -30 99 -374 -363 -53 -264 -71 59 -206 -54
6890 -54 -234 51 -291 -172 336 -89 -602 -117 144 -269 225 -167 -74 -55 -4 -220 -49 409 342 191 -51 407
6912 407 29 163 198 163 103 299 286 -112 10 223 21 147 494 282 -384 304 155 250 112 179 504 110
6934 110 389 293 196 202 206 222 -128 192 247 16 207 93 -99 -70 295 38 313 12 -55 -104 -136 -121 -239 -53
6958 -53 221 -83 197 131 64 -383 -129 181 -326 19 323 23 -70 378 -46 150 15 -362 -401 17 -93 -245
6980 -245 -78 -25 -71 -456 32 -3 -144 -200 181 -443 -328 64 -256 -56 127 20 -354 -109 -127 -187 -296 -62
7002 -62 -265 -100 -191 -226 -536 -213 187 -144 -290 50 -495 -290 -76 44 -459 49 296 -319 -239 202 -32
7023 -32 -164 85 50 20 169 107 -36 208 278 35 -219 369 282 -185 78 312 -106 50 269 281 -118 339
7045 339 -7 -118 243 415 -31 113 410 139 -93 262 490 58 142 244 173 97 123 385 -303 431 397 -226
7067 -226 129 66 -43 303 224 -97 42 266 232 214 280 73 -79 129 -29 -150 7 263 141 -285 6 67
7089 67 113 -85 -157 -112 -58 -45 -76 -181 8 54 -61 -28 -169 -121 -395 -172 58 -146 -400 -1 -248 9 95 30
7113 30 -115 55 56 -239 -19 157 -158 -411 -409 -355 -346 312 25 -659 -217 -44 84 -218 -242 -357 -661 83 87 -228
7137 -228 -17 -93 -201 -240 161 56 -113 -82 -282 -73 -199 280 -312 -222 -208 -389 -306 -47 -104 -380 -223 288
7159 288 -194 -254 202 113 -17 -213 239 42 53 314 1 -303 382 21 101 -63 187 -140 -93 181 165 130
7181 130 147 -126 -26 120 183 148 137 400 -99 -25 444 342 -6 436 402 127 233 490 171 -199 142 215
7203 215 -154 -80 514 48 -147 55 98 383 82 45 -150 191 106 34 -278 300 -74 -181 -23 -144 177 74
7225 74 -17 -206 84 -42 -40 247 289 53 -293 52 86 -356 58 116 55 -22 73 -91 139 -63 -287 -238 11 -222
7249 -222 -316 -408 136 -243 9 -309 -135 -397 -158 -195 -60 -388 -35 -54 -407 -257 211 -324 96 -57 -58 -310
7271 -310 -359 29 -390 -308 -132 -161 247 107 -138 -12 -188 -97 29 14 85 39 84 -64 58 -31 264 -127 -381
7294 -381 -151 366 153 -14 -87 -90 -164 -120 -56 599 317 156 -351 -312 218 57 26 209 -21 173 221 57 139
7317 139 92 335 -86 368 393 136 99 127 -57 -229 99 448 -99 -121 150 221 270 335 210 -103 -54 126 -9
7340 -9 133 15 -106 7 142 155 141 176 -27 132 -12 176 290 -78 -291 7 245 41 120 26 -497 0
7362 0 -273 -116 -124 32 -87 -164 -344 -336 -105 -44 -126 -297 -258 -53 186 -409 -156 -430 -145 364 -62 44 -94
7385 -94 10 -63 -230 5 -100 -259 60 -96 -185 -57 392 -376 -149 -130 -158 -29 174 -342 -166 -366 -77 -245
7407 -245 -359 27 -205 -558 244 -15 -189 36 -145 -568 -118 55 136 -279 96 111 -150 7 166 -85 -165
7428 -165 301 -225 7 374 381 26 -33 78 0 243 284 158 65 145 109 -150 126 -14 18 -255 -25 -292 126
7451 126 328 38 -410 134 370 -26 194 31 -449 4 329 -38 181 -57 132 -105 113 275 105 149
7471 149 -43 44 -219 -83 479 -121 -203 96 -200 21 15 -63 130 86 446 209 590 85 341 -64 -89 140
7493 140 68 73 212 -389 -81 108 10 33 -129 -56 -314 -41 45 230 -104 -173 -275 -204 56 79 -160 -112 -99 -328
7517 -328 -351 115 142 -232 -427 -29 -104 -226 -119 -346 -125 -77 -121 298 298 -159 -376 -143 211 -134 -184 -460 -212
7540 -212 -264 24 -111 -293 -153 -75 -127 -160 238 202 -88 297 -155 -67 70 236 140 53 -274 70 179 180 18
7563 18 -128 -11 115 -104 -329 169 -103 -165 -107 374 100 -177 252 9 59 55 69 224 -70 209 -24 -45 99
7586 99 -53 179 188 -252 55 324 301 156 -23 0 234 5 109 -108 -193 115 -82 234 155 60 -120 17 275
7609 275 221 303 535 224 -184 -17 153 145 98 -44 -433 -285 39 -100 -3 -267 135 -91 29 388 29 -159
7631 -159 24 -141 -299 346 319 -402 -250 -135 302 -31 -52 19 -134 -47 -121 -166 -5 83 -91 -445 -100 -25 -111
7654 -111 127 43 -122 -240 -73 272 -251 -286 149 -250 -148 -157 -122 181 11 93 134 66 -14 -76 100 -221 -73
7677 -73 349 349 -206 -138 54 287 -19 -92 -18 -13 -171 86 253 105 121 107 -71 -45 43 119 81 24 44 -225 274
7702 274 222 300 -225 3 -203 -40 59 150 -31 175 439 183 352 480 106 -79 62 329 73 226 282 55
7724 55 235 498 156 -16 -91 -45 199 75 50 -124 180 -266 27 -216 119 88 -74 50 58 -112 217 301 71
7747 71 -17 238 200 -393 142 -14 -39 38 -207 -193 -120 -12 -298 -354 -270 -177 -267 -148 -18 94 36 228 64 -249
7771 -249 -173 -262 -374 -124 124 -307 33 -65 246 -126 -37 54 -72 -186 -19 44 134 6 -235 -50 -24 -126 -145
7794 -145 216 47 242 -202 -80 69 -14 29 -248 20 -477 148 79 -115 -28 -187 -59 -165 62 -229 73
7815 73 -282 56 -97 28 -19 134 -475 -8 -113 -361 528 235 -27 -37 75 -143 326 209 -48 214 137
7836 137 -148 138 265 -32 -4 -253 23 404 -110 -59 -55 187 268 262 -128 283 182 114 212 72 29 4 166 -72
7860 -72 -165 236 66 102 73 71 -38 6 -94 -47 -113 29 87 152 106 58 7 -177 -253 -5 25 192 -147 -40 -149
7885 -149 -59 310 119 -63 -118 -178 -216 127 -52 -154 -40 -215 -125 -115 214 65 -230 -284 -186 -65 47 -16 -225
7908 -225 -269 169 -360 347 127 -79 -67 -4 13 -139 -4 291 -289 121 76 22 -131 48 -275 -230 427 140
7930 140 -77 155 184 -164 287 -109 -180 27 -126 -232 38 181 2 15 96 -186 126 -105 8 481 -7
7951 -7 -78 80 159 7 80 261 66 -83 59 290 122 -55 140 40 98 135 186 -54 291 0 -147 216 -265
7974 -265 118 -334 -47 322 318 287 209 133 21 -19 -65 128 123 -296 -443 -47 130 -148 36 24 -84 138 -124
7997 -124 148 330 43 -285 -162 -16 110 242 -273 0 -554 14 -45 37 128 111 -138 -263 79 -162 -27
8018 -27 -24 -128 -90 122 290 226 -239 -198 -163 -40 101 98 -231 -46 60 -105 -53 -145 -7 -329 -376 42 195 163
8042 163 -15 -386 -278 -19 61 -158 -308 214 -139 130 -260 -229 -34 158 -5 -110 28 4 92 203 -111
8063 -111 -638 -46 -35 100 234 -266 48 -288 -256 -184 -217 -369 316 -192 -281 144 124 -222 -71 -172 -287 48
8085 48 -61 -182 -308 54 337 58 14 75 -130 174 259 90 50 25 174 88 -7 243 109 -69 168 -158 -201
8108 -201 478 42 9 12 47 134 132 -345 188 90 13 264 269 392 240 15 112 -21 221 -137 -285 -162 -93 -132 163
8133 163 -241 -60 76 335 -258 -95 87 256 -123 -71 78 -64 240 166 147 -113 -215 35 15 54 -77 -134
8155 -134 145 272 -156 63 287 -145 -35 -366 242 -215 48 -237 -129 -139 151 -18 -47 86 -3 117 -101
8176 -101 -62 -74 -94 -366 -234 15 261 403 -114 -221 -126 6 154 -108 -202
8191b02
$$ Imaginary data points
##PAGE= N=2
##DATA TABLE= (X++(I..I)), XYDATA
0 0 0 0 0 5 -8 0 -8 8 -8 8 -16 23 -24 24 -35 41 -46 56 -70 79 -90 107 -123 141 -159 184 -210 238 -264
29 -264 304 -339 378 -424 477 -530 586 -653 727 -805 889 -986 1094 -1209 1337 -1486 1651
46 1651 -1833 2048 -2298 2591 -2936 3361 -3897 4580 -5502 6816 -8819 12228 -19134 38533
60 38533 -199660 -714413 -7543 606181 158881 -512929 -245640 384548 269958 -365676
70 -365676 -359924 287875 439980 -204749 -521152 11645 442310 74957 -355415 -149542
80 -149542 214028 86197 -211876 -106351 201589 120160 -242587 -237321 163258 251169 -126113
91 -126113 -273664 51663 204383 -87976 -237290 63008 261426 -38709 -352521 -111773
101 -111773 334775 228887 -293862 -344218 177127 355047 -110625 -362675 42123 352354
111 352354 2976 -391073 -119439 386396 256985 -330882 -385568 210493 442662 -71370
121 -71370 -406547 -5920 356893 49572 -318260 -75577 325716 160316 -295763 -246655
131 -246655 244816 341735 -112855 -312239 55550 278220 -14850 -206781 63389 242156
141 242156 -34106 -261614 -11047 304357 145403 -223557 -176428 184340 204662 -122632
151 -122632 -147507 178359 195407 -170626 -236696 154953 333269 -11186 -307422 -80802
161 -80802 273915 166903 -187031 -147870 197345 178728 -190946 -210154 194754 306755 -86525
172 -86525 -328226 -33052 300848 143246 -217869 -176346 169426 185845 -153271 -202213 154572
183 154572 258563 -104775 -306659 -2362 292252 102969 -240375 -183824 147964 181448
193 181448 -117850 -186407 100332 185443 -111048 -237079 49121 237446 5257 -238939
203 -238939 -104242 152629 105840 -128561 -122163 95210 87215 -147984 -136285 141209 160732
214 160732 -144387 -230331 50524 201884 -14087 -199399 -43833 154123 25132 -200900
224 -200900 -75521 215936 120068 -243752 -227820 163474 259963 -82176 -267754 -19025
234 -19025 208226 44554 -197375 -81681 190297 112609 -210344 -196058 162708 253826 -70083
245 -70083 -253500 -29324 192450 83134 -119855 -80706 93808 75952 -104101 -96185 118833
256 118833 154977 -66455 -157927 18459 140141 39173 -61017 -10142 49077 -6216 -60274
267 -60274 28366 134035 38032 -139007 -76191 144554 135258 -78856 -102613 84752 115507
278 115507 -65180 -114492 81910 193714 -5041 -213237 -59109 233691 163932 -159974
288 -159974 -177162 121159 194940 -57798 -161402 53635 188634 1126 -189682 -44563
298 -44563 208244 130367 -160308 -167222 109058 177123 -45490 -133707 32329 111520 -24821
309 -24821 -104533 20034 127805 15362 -142079 -70118 117203 91912 -89823 -91412 62244
320 62244 57823 -79617 -61513 87684 84402 -89154 -150440 15463 155213 34342 -156846
331 -156846 -95231 100592 74642 -105659 -84433 94845 84052 -114527 -156128 43418 170123
342 170123 14102 -186623 -109836 114788 108242 -94816 -114186 61608 80059 -92356 -123252
353 -123252 55481 138710 -18930 -168354 -69982 119502 92140 -90471 -101220 54259 61972
364 61972 -82965 -76319 84092 96219 -72514 -134819 12688 131469 37815 -107397 -62667
375 -62667 79287 52268 -82850 -46487 101028 66246 -101152 -94732 78384 129537 -11439
386 -11439 -110743 -22490 96453 49792 -66503 -30459 85631 42984 -86454 -44140 105298
397 105298 94934 -52588 -89299 27048 102112 31157 -58542 -18711 69458 30076 -63453
408 -63453 -10259 108276 59197 -85756 -74086 71375 112284 2242 -77624 -15945 73573
419 73573 38479 -51176 -12274 90885 43482 -93108 -65916 90508 112395 -27202 -99339
430 -99339 -13683 79734 44551 -42157 -24246 55198 23016 -77659 -40140 90398 75822 -65031
442 -65031 -95487 14082 73649 13864 -43862 -13229 31195 -9510 -64325 -4366 87215 23800
454 23800 -107062 -75241 61874 70048 -39025 -68280 6600 37839 -26426 -66038 8218 80088
466 80088 -789 -122874 -65654 87876 76978 -67954 -97879 8899 57394 -11565 -63779
477 -63779 -11772 51705 3718 -89892 -52526 73164 66857 -65543 -97196 9288 63629 2555
489 2555 -50801 -23064 20440 2684 -41677 -17248 51945 30520 -65319 -62556 40403 62613
501 62613 -19457 -51447 -71 26140 -8219 -25791 16102 51875 478 -73837 -28638 84131
513 84131 70509 -52053 -71681 28159 61910 -6016 -34612 20941 53659 -3503 -62883 -8113
525 -8113 95122 68456 -60392 -76027 39598 82952 5460 -35166 11075 36781 -1715 -27768
537 -27768 15674 69941 35430 -52891 -48254 48897 73593 -1524 -31267 13443 22533 -11192
549 -11192 -4211 39579 43878 -9629 -52429 -12058 63752 52450 -30237 -40096 26025 32168 -20143
562 -20143 -13025 40373 32143 -33153 -53494 6412 66779 32940 -54268 -53736 31886 48981 -20161
575 -20161 -34523 20387 22585 -33612 -42309 14403 46805 3191 -59497 -42900 32709 42716
587 42716 -26355 -43626 9014 12686 -35375 -26489 27683 22668 -36510 -58327 -8611 43583 18433
600 18433 -48256 -44713 17906 16492 -39007 -25047 35188 14610 -58052 -54435 21568 53682 -1804
613 -1804 -64781 -42990 28948 30741 -30809 -32150 23906 12668 -49037 -35565 36426 46005 -17764
626 -17764 -58549 -25503 32343 33621 -16984 -28749 10400 9524 -28860 -9239 45294 29721 -34371
639 -34371 -41840 8640 40615 19951 -17766 -18229 13978 13590 -15719 2824 48793 22161 -43212
652 -43212 -30176 39245 52964 4125 -29408 -9540 27772 24532 -8532 -1682 39389 23309
664 23309 -35009 -20830 49285 53000 -9439 -34102 1578 35883 26818 -4128 -6428 20756 17019
677 17019 -17413 -4837 43874 31719 -25639 -25958 21710 34114 8152 -8046 -756 9811 4275
690 4275 -8798 6562 32964 6785 -40641 -18193 39537 32081 -17499 -24156 3927 12626 -697
703 -697 -9465 2144 16189 -6018 -39994 -15444 38771 26684 -32404 -38259 2918 16273 -744
716 -744 -10552 -8150 -4823 -12111 -24100 -8055 24822 9835 -39542 -37238 8799 17191 -9578 -15913
730 -15913 -8435 -12662 -17635 -11823 3202 13599 -7951 -42423 -27033 21532 19150 -23266 -25261
743 -25261 407 -3052 -18629 -8319 10169 9183 -14593 -35562 -14201 28658 19994 -28683 -30634
756 -30634 8469 11954 -11947 -6486 11515 4538 -13782 -17121 1928 25189 13924 -23927 -23284
769 -23284 15601 21663 -5681 -4747 11828 3361 -8608 3146 17443 16282 2838 -13889 -5991
782 -5991 23451 23719 -5576 -6828 15639 10766 -3847 9840 23720 10867 -5733 -6291 7900
795 7900 27333 22157 -8440 -12355 17352 21961 715 4111 19247 7895 -7015 446 15081
808 15081 21636 13775 -8525 -13089 14114 25651 3562 -4114 9003 2620 -8504 5843 19152
821 19152 9176 -3494 -8837 -5282 11140 17797 -1269 -11273 1756 363 -11206 2832 16595
834 16595 -892 -18858 -10348 2689 7764 5984 -8809 -17044 -3326 3261 -9728 -6245 7545
847 7545 -5966 -22899 -10620 5422 1619 -4940 -11599 -17423 -7581 3877 -5945 -13848 -3973 -6303
861 -6303 -18664 -8710 5228 -4387 -14625 -11029 -10276 -7405 1598 -3386 -15711 -9591 -2214 -9995
875 -9995 -6778 4522 -4953 -17830 -7704 955 -2695 -2330 -2859 -11765 -6935 4795 -744 -6257 2890
890 2890 21 -12361 -4247 10174 3540 -4435 -2372 -4299 -1554 11111 8134 -5342 -547 7615
904 7615 -897 473 13110 8174 -3733 329 5341 4663 12495 13404 -1427 -2663 11213 10790 4195
919 4195 11184 9859 -1874 2150 12652 9737 8441 11543 1929 -1754 12229 15338 4017 5396
933 5396 10847 1650 446 13013 12462 4477 5386 3157 -489 9819 14709 443 -3528 8674 6332
948 6332 -1909 5703 10282 575 -929 2358 110 3783 8733 -3272 -9609 4525 7348 -5801
962 -5801 -4095 5876 -1346 -7602 -436 478 -2914 -1235 -5763 -11292 -247 5222 -9704 -12391 1476
977 1476 -947 -12460 -5504 727 -6936 -9905 -7018 -8849 -4290 824 -10940 -16716 -1566 797
991 797 -13422 -10526 965 -6480 -14493 -7300 -3081 -4963 -3619 -9896 -14478 -1969 4352 -10949
1005 -10949 -13762 1373 -723 -13692 -7458 3043 -1647 -6226 -6153 -7320 331 6200 -6780 -11993
1019 -11993 3627 6573 -10048 -6907 9044 4517 -6839 -2863 3653 4611 5087 -2098 -5705 7224
1033 7224 11920 -5200 -6292 13581 11782 -5551 -1891 12008 9834 3440 1442 2008 10471 13711
1047 13711 -455 -4743 15112 17114 -3156 -2263 16439 13111 52 2410 9234 11063 9742 1702
1061 1702 -1801 13206 18065 -1303 -4665 14972 14727 -3547 -187 12507 9925 2606 -186 572
1075 572 10216 14378 -2166 -8850 10553 14825 -5792 -6831 10641 8346 -5091 -4991 2624 6350
1089 6350 4954 -5219 -9890 5216 10663 -9034 -13441 6651 6622 -12529 -10580 4265 3073 -5975
1103 -5975 -10141 -8246 1246 4882 -11471 -17143 1771 5142 -14821 -14834 4368 1332 -13980 -12754
1117 -12754 -3884 25 -2193 -12712 -15936 -1291 4551 -13661 -15989 2971 1853 -17281 -13584
1130 -13584 3110 1142 -8530 -12436 -9657 384 4632 -10146 -15239 3130 5638 -14618 -11954
1143 -11954 8656 5239 -12138 -11376 -143 5406 3041 -6665 -9972 4874 9674 -8097 -8942 12545
1157 12545 10021 -12158 -8712 10931 12042 529 -4822 -1907 8624 12416 -1527 -5021 13696
1170 13696 13643 -9057 -5972 18701 17252 -3892 -5705 7021 13500 10904 1038 -1537 12245 14469
1184 14469 -4489 -3277 21198 18297 -8480 -7547 14477 18077 5900 -2152 784 10909 12777
1197 12777 -1633 -3209 17384 16215 -10695 -10191 17758 19774 -2095 -8318 1710 9306 8396 -1358
1211 -1358 -4389 9157 10050 -11325 -10858 16610 16322 -11727 -15565 4489 9590 193 -5773 -4993 2293
1226 2293 2012 -11444 -9638 12530 10261 -19538 -21066 7646 11362 -9153 -14014 -4593 250 -3146
1240 -3146 -10816 -9259 5775 3874 -21528 -21611 8924 12309 -15296 -20946 -3180 1786 -6198 -9596
1254 -9596 -6639 -848 -2813 -17173 -15078 9460 9917 -18636 -22276 2890 7405 -8460 -9351 -1260
1268 -1260 -1627 -6864 -10250 -4208 9848 5411 -19410 -18371 11567 14610 -10181 -12379 4267 3193
1282 3193 -7153 -3982 5931 10510 617 -15915 -9489 18727 19882 -9877 -14307 9967 11837 -3497
1296 -3497 -69 12356 8770 -3258 -7745 2500 21541 17336 -9549 -12437 14281 18486 -1524
1309 -1524 585 15322 7414 -7095 -670 14806 19682 7623 -11017 -6502 19213 20666 -4255
1322 -4255 -4689 16264 9385 -10249 -111 20779 16698 -3208 -12929 -469 21705 18914 -8691
1335 -8691 -12170 12471 12928 -8693 -2950 17843 9659 -12408 -11859 5552 17550 8833 -13010 -15088
1349 -15088 7738 12276 -7637 -7134 10253 1226 -18826 -8246 13209 9849 -8224 -17961 -9579
1362 -9579 7626 8069 -11014 -12482 4699 -1759 -20760 -7191 16327 4182 -21729 -20977 -1813
1375 -1813 10227 3008 -15693 -17628 873 1801 -15992 -8850 12474 477 -25957 -18589 6997
1388 6997 11251 -2934 -16936 -16838 -1032 5759 -6535 -7759 5545 -3420 -22373 -9108 15970
1401 15970 9333 -12195 -14964 -5094 3019 5149 -582 -3670 1863 -4137 -15161 728 24117 7276
1415 7276 -21371 -13037 10905 12938 2056 -2680 -1016 4331 1512 -5965 5259 23109 7370
1428 7370 -21003 -9515 21716 20160 -668 -5754 843 6455 8130 4472 5721 13356 4632 -12612
1442 -12612 -439 25761 18236 -6965 -6128 8004 8649 6772 8365 7505 4484 -1468 -5281 8936
1456 8936 25894 9459 -17733 -7815 18456 14673 -1845 339 6552 1723 -3826 -1832 10074
1469 10074 19307 1937 -23950 -9976 23388 18885 -9611 -11870 2117 2356 -1920 1005 5318
1482 5318 5028 -5864 -19476 -6906 19725 13406 -16662 -19175 327 2924 -2770 1388 1512 -8702
1496 -8702 -14503 -10899 2049 13854 1190 -24496 -19190 6370 6170 -9202 -5368 724 -10960
1509 -10960 -18052 -5541 8311 8678 -8595 -27332 -15618 13755 12120 -13942 -16207 -424 -3228
1522 -3228 -11335 -2098 7430 1220 -11801 -18582 -7775 14069 13073 -13026 -18967 -74 4433 -3291
1536 -3291 2502 6170 -6766 -12808 -3432 7757 10839 2881 -11932 -10394 7594 9738 -1557 2455
1550 2455 8396 -6314 -13042 6825 21246 9401 -7933 -12866 -4 19228 16185 -4643 -5282
1563 -5282 9180 4569 -5426 8982 21640 6985 -11133 -7691 8596 21929 16663 -5395 -11927
1576 -11927 6113 13364 5633 9018 13258 -1878 -11688 3542 17717 14677 4417 -5263 -7284
1589 -7284 5257 12836 7254 6028 6473 -8281 -14002 10171 26049 6607 -13793 -10628 2493
1602 2493 10489 8787 -1292 -3581 2828 -4350 -12824 5772 22529 2115 -23638 -15022 7558
1615 7558 13943 4807 -9891 -14297 -2488 3289 -4233 -1870 7328 -4520 -21585 -9705 9514
1628 9514 7278 -5027 -11778 -14309 -6583 4407 2694 -4064 -6165 -12814 -16240 1038 14494 -2385
1642 -2385 -20371 -12252 -537 -275 -801 -1777 -6331 -7821 -9852 -10746 4141 15996 -4224 -27961
1656 -27961 -13801 11781 11414 -2597 -10282 -10575 -4136 2583 280 649 6563 -3203 -19412 -7775
1670 -7775 16088 14173 -3505 -10332 -8983 -1434 11174 13104 812 -5881 -5266 -4317 7246 18704
1684 18704 7097 -10245 -6353 4796 5300 8612 13449 4110 -8472 -6572 4769 16473 19943
1697 19943 2373 -17394 -5320 18749 16201 2680 2232 2648 -2205 1429 9177 12953 11649 792
1711 792 -13125 -3808 20925 20681 -43 -7747 -1981 1892 9212 14104 5400 -4371 -3860 -1013 4153
1726 4153 13868 9395 -6555 -8339 1793 2806 4718 11220 2428 -14270 -10973 6487 13147 7929
1740 7929 -5717 -17276 -7181 11490 8067 -6567 -4253 81 -8969 -10245 4033 10013 1283
1753 1283 -11906 -19141 -8023 13749 12470 -11931 -19795 -6736 -730 -591 3730 -599 -11825 -13221
1767 -13221 -7560 -1959 6079 5103 -12112 -20107 -7762 2983 3721 4295 -4668 -20383 -15782 5393
1781 5393 11687 1268 -9648 -15730 -10091 4534 7231 -2555 -3706 -2072 -12268 -12758 7847 17509
1795 17509 1496 -15855 -16065 -2156 14910 14598 -6184 -14764 -1962 4252 585 5586 9531 -1519
1809 -1519 -9879 -4546 4515 12736 13290 -2095 -14560 -2978 13117 12398 6905 1029 -7952 -5217
1823 -5217 11451 16090 5361 -622 -326 -1302 3738 12477 10116 4486 1096 -5700 -3661 15584 23390
1838 23390 2506 -13697 -4939 9619 15409 11766 -878 -7290 1858 7504 2977 7540 13500 554
1852 554 -13638 -4760 11681 15383 8676 -5484 -15225 -3318 14636 12542 638 -4693 -7525 -6828
1866 -6828 5533 12650 2786 -5956 -6072 -7860 -4191 8687 11232 -2503 -12967 -13727 -5724 10992
1880 10992 15637 -5906 -22458 -11092 4667 4858 1128 -2595 -9057 -10356 -6338 -3390 3685 8994
1894 8994 -6298 -24463 -14397 8806 11430 -1732 -12446 -16625 -8607 5734 6129 -4637 -7086
1907 -7086 -7554 -12120 -5652 7240 5000 -6427 -10446 -11027 -6649 6994 11540 -4015 -16116 -10320
1921 -10320 -59 8234 9375 -4039 -16190 -6320 6438 3995 720 3088 -1975 -9264 -4501 5007
1935 5007 10503 9334 -3459 -17446 -5806 17427 17212 -1018 -8608 -4898 1237 9919 11550 2834
1949 2834 -1302 249 -3172 334 14928 16207 -56 -9524 -4406 5627 16599 17381 -164 -13138
1963 -13138 -2687 11409 13643 10880 3500 -6347 -3997 6870 9147 8254 10124 1451 -11288 -4749
1977 -4749 12971 17818 8128 -5070 -13477 -3934 16320 16726 -724 -7861 -2703 -1040 2395 9588
1991 9588 7287 -1081 -5209 -8054 -4292 11522 16166 -3211 -17342 -9068 3405 10014 8154 -4747
2005 -4747 -15226 -7135 4515 3165 234 168 -6711 -12415 -5225 3038 4526 2509 -6633 -18300 -10798
2020 -10798 8620 10625 -4288 -13996 -13050 -5647 5586 6213 -6559 -11340 -5668 -5548 -5981 2831 5583
2035 5583 -5834 -14386 -11475 -3036 8700 9691 -8676 -21613 -8714 7497 7137 318 -6048 -11544
2049 -11544 -7655 2334 3657 1726 3186 -4645 -14911 -6541 10739 11996 1297 -9076 -13738 -3987
2063 -3987 14431 14759 -2476 -10686 -4968 413 6350 11217 4452 -4244 -3989 -2305 290 11662 16034
2078 16034 646 -12703 -6357 7789 16135 13770 -1696 -13251 -2123 13557 11621 3886 3788
2091 3788 708 -3444 1460 9211 11279 9581 198 -11719 -3877 16738 18313 1788 -7252 -4743
2105 -4743 2247 12003 12794 1190 -4760 -391 1487 2149 9139 9202 -1697 -7166 -3286 2238 9705
2120 9705 12256 -1854 -14980 -6093 9014 10654 3861 -5040 -10886 -4171 7351 5398 -2046 -643
2134 -643 -2119 -9879 -6529 6430 9158 37 -10915 -15600 -5308 12362 10853 -9131 -16475 -7163
2148 -7163 -459 1854 3844 -1981 -9804 -9303 -5976 -2786 5582 6188 -8714 -18456 -9114 2792 6858
2163 6858 4467 -7715 -18799 -10132 6615 7519 -1340 -7110 -10223 -8838 211 4310 665 -565
2177 -565 -4482 -13542 -9789 8749 13935 -1427 -13656 -12352 -1375 10962 9643 -5127 -10527 -1810
2191 -1810 1542 -279 5120 8033 -1820 -8110 -4418 3459 10879 10873 -3046 -12894 -2236 10487 10846
2206 10846 5716 -435 -7043 -2857 9813 11803 3226 537 -193 -2171 2453 10208 9653 4011 -910
2221 -910 -6040 -1527 15012 17928 2 -10992 -2174 8565 12258 9025 -97 -4306 1579 3942
2235 3942 2169 7905 12271 -144 -11229 -3102 10325 13182 6960 -5388 -11909 -939 12008
2248 12008 9237 367 -2510 -5581 -5406 4045 9766 3358 -2693 -4544 -7623 -3251 8391 9591 -1828
2263 -1828 -10636 -10958 -3805 9510 11431 -5655 -16474 -6676 3296 2025 522 -826 -6257 -8202
2277 -8202 -6339 -3244 4706 7866 -6045 -19939 -9556 7542 7699 -2543 -10020 -12186 -5702 3510
2291 3510 2480 -3977 -4653 -5959 -10219 -4277 5852 3335 -5444 -8340 -8902 -5380 5250 8032 -4620
2306 -4620 -12691 -8159 -200 6016 6322 -4199 -12371 -4181 4419 1055 -35 3252 -1406 -8147 -4657
2321 -4657 3749 9160 7232 -5226 -14581 -2793 14232 10124 -2778 -5377 -1994 435 5182 7617
2335 7617 4178 873 -1668 -4602 1129 13451 11732 -2343 -6923 -1546 4771 11537 12035 555
2349 555 -7978 -1676 7291 9685 8824 3042 -4994 -2222 5970 6247 5865 8812 2115 -8446 -3661 10510
2365 10510 14038 6464 -4492 -9285 -82 13041 10446 -2211 -2979 1331 -1441 -384 7042 7985
2379 7985 327 -5298 -7278 -768 10804 10076 -4786 -10994 -2872 3046 3910 5188 -1086 -8891 -6109
2394 -6109 1850 2441 1748 226 -6111 -8383 -1969 1634 1033 1478 -3709 -13065 -8793 5948 7570 -3924
2410 -3924 -10882 -9308 -3265 3722 2137 -6405 -6568 -2528 -6374 -6708 3438 5751 -5843 -12687 -8167
2425 -8167 -153 6272 3716 -8725 -13245 -3561 2722 1149 454 -1408 -8722 -8518 242 3769 1536
2440 1536 -146 -5036 -9221 -2481 6233 5535 1066 -3934 -9598 -5028 9186 10880 -2545 -7992 -2932
2455 -2932 950 3930 6004 2380 -827 -1116 -3130 -1823 9383 12781 -914 -10402 -2167 8342
2469 8342 9727 6317 -845 -4964 1195 6722 4705 5127 6956 -196 -5365 2330 9663 7481 4093
2484 4093 -38 -4370 309 9992 9397 2296 -986 -2592 -253 8329 10898 817 -4088 1368 3053
2499 3053 1900 5012 6020 438 -2778 -2180 1244 7715 9833 -2731 -10995 -1117 8734 5407 109
2514 109 -1632 -4188 -2015 2282 2084 970 2222 -3288 -9278 -2411 7639 4155 -3890 -6436 -6482 -3157
2530 -3157 4676 4474 -4395 -8062 -6195 -3899 656 4255 -2277 -8956 -5846 -2676 -3168 959 3125
2545 3125 -4950 -11477 -7259 -234 3729 2487 -6351 -13374 -5169 4417 959 -3978 -2411 -4342 -7813
2560 -7813 -3292 2006 1495 -555 -4975 -10348 -4220 7084 4643 -5073 -6087 -3704 -2896 2272 5193
2575 5193 -773 -5209 -2949 -1181 712 4943 3357 -3925 -3919 667 1083 3288 6671 753 -7191 -2187
2591 -2187 5864 6573 3477 -187 -4032 430 7363 4454 6 3445 2988 -2123 -198 7688 7629 2113
2607 2113 -1277 -2388 2179 10478 8417 -1846 -2319 3078 3299 3911 7703 4182 -1777 -656 2656
2622 2656 3738 6665 5993 -1368 -3830 2390 5177 4289 5323 1101 -5616 -1938 7343 6586 1115 -1222
2638 -1222 -2797 -1952 3420 4726 49 331 43 -5037 -3355 6239 6802 -2755 -6484 -4088 -1039 3713
2654 3713 3711 -4287 -6512 -1585 -1012 -2527 1540 2064 -5725 -7428 -2330 -218 697 1177 -4795 -9293 -3876
2671 -3876 1543 -422 -1315 -2699 -7360 -6850 985 1853 -3754 -4003 -3422 -5362 -3158 1198 -997 -3667
2687 -3667 -3452 -6168 -5090 2502 4306 -4824 -8021 -2302 -171 -23 605 -2544 -5326 -1799 -37 -1942
2703 -1942 898 3285 -3201 -6468 -302 3836 1713 1007 -1430 -4456 -1016 5281 3311 -348 189
2718 189 -1463 -2445 4403 6215 733 -875 1301 161 741 6344 5615 -104 -1096 441 1236 6642
2734 6642 8155 213 -3741 2142 5989 3368 4406 4179 -47 85 3251 3433 4494 6438 515 -4215
2750 -4215 1741 7497 4414 1719 2063 -407 -223 5102 5271 1388 1470 799 -1887 1351 6333 2624
2766 2624 -1642 -61 295 -990 3381 4923 -1125 -3511 -101 -34 1078 3273 -692 -5521 -1321 1891
2782 1891 -1192 -1458 1639 -2238 -5297 -1270 785 -391 -495 -2421 -6659 -3077 2569 -328 -4862
2797 -4862 -3209 -2687 -4241 -1144 838 -2972 -4319 -2633 -4237 -3444 1390 -399 -6070 -5037 -1896
2812 -1896 -3276 -1349 981 -3555 -7061 -2610 242 -1323 -634 -1169 -5468 -4248 607 -634 -2173
2827 -2173 130 -2072 -5676 -1858 2747 610 -1123 -1092 -3166 -2350 3293 2532 -2100 -1333 510 -1838
2843 -1838 -234 4222 1718 -1903 272 482 -46 3908 4536 -597 -1698 2300 2364 2032 4580 2726
2859 2726 -2004 919 4353 2417 2264 4318 1204 -344 3672 4213 1710 3075 3463 -971 877 6230
2875 6230 4082 615 2164 2423 682 4223 5113 1016 564 3444 1194 454 4676 4248 -1097 -130
2891 -130 2812 1273 1994 3868 206 -2115 2136 2832 -88 1082 1765 -2383 -1737 2324 1114 -1499
2907 -1499 553 -180 -3175 -706 2129 -862 -2177 -327 -2668 -3401 1139 1132 -3921 -3349 -961 -3183
2923 -3183 -2374 396 -1957 -4888 -1791 -1627 -3758 -1047 445 -4511 -5224 -1547 -1761 -3275 -889 -1870
2939 -1870 -5850 -3042 78 -2540 -2978 -743 -3130 -4995 -1316 45 -3248 -1864 -996 -4061 -3485 833
2955 833 -607 -3587 -767 -673 -2892 -748 1002 -1858 -2532 822 -643 -2141 1034 1255 -2053 -756
2971 -756 1564 -438 -323 2938 733 -1635 1895 2456 -363 1256 2966 239 198 3612 2106 -278
2987 -278 2460 3245 189 2024 4500 1321 841 3220 2155 306 3910 3858 121 1664 4414 1724
3003 1724 1408 4423 2556 345 3374 3386 650 2403 4020 743 43 3652 2697 161 2540 2690
3019 2690 -264 1318 3470 834 401 2657 1257 -768 1975 2362 -1100 295 2154 -783 -1275 1802
3035 1802 751 -1665 346 923 -1928 -610 1410 -2009 -2312 975 -858 -3474 -813 205 -2898
3050 -2898 -2090 63 -2356 -3112 -333 -1739 -3630 -964 -871 -4381 -2955 -134 -2830 -3696 -925 -2245
3066 -2245 -4421 -1690 -500 -3597 -2399 -940 -3509 -3392 237 -1563 -4765 -1351 -1100 -3386 -2458 500
3082 500 -1952 -2966 -809 -1334 -2669 516 431 -3522 -1830 953 -1204 -2195 710 144 -2672 172
3098 172 1121 -1612 283 2023 -1173 -1672 2283 1816 -1362 881 2057 -919 695 3451 1064 122
3114 122 2424 1333 -97 3014 3601 -236 1074 3506 1179 528 4056 3166 -147 1608 3321 1915
3130 1915 3067 4199 424 465 4282 3400 480 2664 3736 219 812 4066 2351 1361 2582 791
3146 791 -511 3308 4147 -136 209 2634 -29 -215 3368 2264 -1330 80 1269 -334 940 2728
3162 2728 -603 -2000 1113 440 -1544 1266 1226 -3150 -2797 874 288 -1160 234 -1816 -3565 -272
3178 -272 662 -2065 -1515 425 -3414 -4558 8 402 -2737 -2742 -2511 -4069 -1608 790 -2758 -4000 -1256
3195 -1256 -2106 -4157 -673 498 -3431 -4184 -1723 -2042 -2548 -132 -1895 -4731 -2417 -515 -2467 -997
3211 -997 678 -3386 -4621 188 1281 -1682 -1389 -1038 -3144 -1572 811 -682 -1363 574 -1310 -3369
3227 -3369 1064 3679 -491 -2465 -137 -278 107 2615 1130 -1511 607 1224 -688 1803 4671 731
3243 731 -2128 1574 2775 1498 2876 2756 -974 -50 3403 2562 2225 3764 1131 -1420 2688 5589
3259 5589 2333 1026 2431 743 146 3652 4141 1720 1872 1322 -758 2555 6195 2184 -1921 987
3275 987 2192 1204 2469 3211 72 -768 1273 251 1571 3965 1311 -3194 -707 3158 1347 665
3291 665 1390 -1384 -2603 1138 2233 -99 78 -597 -3746 -968 2846 620 -2574 -798 -1317 -3503
3307 -3503 -117 1870 -1225 -3183 -2361 -2921 -1061 2482 -1007 -5394 -3293 -92 -1599 -1971 274 -1837
3323 -1837 -4415 -3067 -1405 -1325 613 -1307 -6149 -4694 870 429 -2660 -1386 -2549 -4452 -1314 1268
3339 1268 -1088 -2170 -1862 -3710 -2906 1847 1109 -2564 -2309 -1420 -3026 -565 3476 667 -3430 -2576
3355 -2576 -390 637 2590 1327 -3374 -2038 1836 376 205 3162 1877 -2983 -1873 2655 3173
3370 3173 2785 1042 -2144 -1582 3804 4459 544 742 1689 -663 804 4864 3916 712 907 304 168
3387 168 4075 5473 1266 -747 1348 1081 2124 5662 3734 -1510 -944 2959 3405 3062 3315 383
3403 383 -1077 1776 2511 1525 3421 3302 -2866 -3049 3716 5109 1884 -236 -1713 -1593 2104 3810
3419 3810 -67 -1156 911 -1512 -2410 2485 3540 -1201 -2927 -1726 -1430 1348 3491 -662 -4385
3434 -4385 -2341 -526 -569 1681 806 -4297 -5101 -492 525 -1094 -43 -1543 -4395 -3163 -344 -132
3450 -132 -51 -893 -5632 -6195 288 2995 -1918 -4338 -3245 -2906 -1223 1039 -568 -2925 -2211 -3448 -4173
3467 -4173 321 3503 -1926 -5907 -3344 -1250 129 2046 -517 -4745 -3253 316 605 469 940 -2579
3483 -2579 -4323 -188 2000 581 757 685 -3149 -2985 2110 3800 1702 -20 -2664 -2667 2788 5813 1008
3500 1008 -2329 305 722 490 3036 4098 1248 -222 -623 -208 3596 6942 1995 -3514 -871 3461
3516 3461 3771 3601 2614 -911 -1153 2744 3484 2783 3590 1234 -2285 339 4407 3861 2343 1641 -1682
3533 -1682 -2200 3486 6156 2267 -922 -1415 -648 2357 5425 1553 -2223 161 926 -1250 1488 4072
3549 4072 1275 -2934 -2612 -221 2514 4642 165 -5610 -3102 2446 1620 -31 76 -2080 -3748 -833
3565 -833 1090 308 377 -1226 -5113 -4036 1555 2340 -1059 -2845 -4267 -4662 136 3161 -840 -4892
3581 -4892 -3864 -2324 -1306 922 8 -3448 -3515 -2353 -3178 -650 3154 -545 -6535 -5230 -303 1782
3597 1782 1264 -1862 -5802 -4204 1039 1362 -1504 -632 -812 -4249 -3131 1480 1664 98 -1245 -4444
3613 -4444 -3519 2587 4594 -266 -2696 -2112 -1527 1180 4194 1771 -2416 -1400 444 348 2028 3908
3629 3908 527 -2179 -753 613 2940 5674 2391 -4013 -2553 3687 5204 2373 540 -997 -895
3644 -895 2498 3834 1974 2554 2513 -1621 -1683 4387 6557 2652 -469 -1774 -422 4469 6675 1600
3660 1600 -2006 192 1180 1901 4120 3546 -373 -775 624 984 2307 4803 1531 -3398 -2637 1574
3676 1574 3526 3756 888 -4589 -3190 3081 4212 -70 -1130 -1091 -2338 -1322 1551 1325 758 -671
3692 -671 -4489 -4489 1998 5075 -517 -5198 -4021 -1652 968 2615 -1020 -4679 -3307 -1216 -1574 148
3708 148 1653 -2076 -5344 -3393 -1158 453 1868 -958 -6667 -5399 542 2258 204 -2042 -4919
3723 -4919 -4661 481 1921 -1245 -2096 -978 -3356 -3918 667 2533 55 -2995 -4576 -3470 2406 4967
3739 4967 -957 -5336 -2453 892 885 1717 933 -2302 -2162 -268 -158 1172 3684 800 -4334 -2640 2558
3756 2558 3812 3175 517 -3801 -2474 3788 5136 1320 -233 -361 -1242 1349 4135 2636 864 1405
3772 1405 -1113 -1772 3729 7032 2660 -2529 -2151 750 4690 6148 1454 -3248 -383 3296 2154
3787 2154 2731 3647 1261 -1827 -212 1858 3658 4827 1669 -3728 -2620 3855 5320 2026 -469
3802 -469 -2686 -2073 2645 4523 1100 -816 -97 -1471 -1451 2308 3213 376 -1564 -3053 -2790 1889 5423
3819 5423 289 -5628 -3378 579 1785 1717 -403 -3798 -2664 155 -733 -848 1659 -528 -5469 -4364
3835 -4364 409 1925 1171 -2013 -6190 -4647 1469 2971 -1464 -3537 -3289 -2854 -1294 1468 -155 -2298
3851 -2298 -1950 -3127 -3762 916 3171 -1176 -5088 -4422 -1903 1483 3645 -1239 -6155 -3391 1314 1282
3867 1282 214 -146 -1947 -3014 -1243 239 784 2634 127 -4935 -4179 3174 5078 1130 -1857 -3455
3883 -3455 -1820 3381 4947 107 -1830 -113 -256 -293 2986 4027 858 -924 -1458 -314 3757 6544
3899 6544 1582 -3665 -1881 2535 4160 4283 1703 -2336 -1226 3126 3098 1713 2750 1971 -1662 -905
3915 -905 2916 4695 3689 689 -3139 -2081 4716 6358 1416 -2104 -1114 52 2179 4055 1663
3930 1663 -267 483 -723 -1365 2455 5177 1038 -3360 -2329 0 2972 4282 -71 -5001 -2913
3945 -2913 2467 2442 406 -353 -2177 -2761 -388 1003 155 849 -234 -4848 -4539 1745 3486 -379 -3700
3962 -3700 -5289 -3491 2103 3577 -1663 -4539 -2327 -1534 -1876 545 624 -2205 -3258 -3142 -2511 998
3978 998 3596 -1369 -6375 -4450 282 1808 1187 -1737 -5480 -3815 989 799 -661 -468 -1416 -3838
3994 -3838 -2637 960 1674 1267 -1209 -4806 -4048 2668 5107 -144 -3760 -2892 -933 1789 3474 419
4010 419 -2119 -637 -166 -1100 1955 4129 900 -2821 -1687 372 3542 4741 642 -4302 -1540 3827
4026 3827 4256 1579 789 -592 -1135 2227 3119 1776 2449 1811 -2277 -1575 3982 5515 2274 -777 -2063
4043 -2063 -550 4866 6118 926 -2192 5 1772 2107 3261 2772 -364 -472 -261 415 3035 5187
4059 5187 1086 -3974 -2425 2486 3977 3048 -280 -3856 -2075 2995 3197 280 46 -494 -2405 -1156
4075 -1156 1993 1918 997 -886 -4205 -3489 2265 4722 -483 -4275 -3253 -1413 1380 2821 -972 -4102
4091 -4102 -2259 -913 -1424 76 1992 -1170 -4262 -3310 -1353 1210 2500 -1049 -6250 -4634 1175
4106 1175 2322 -376 -2301 -3713 -3415 81 848 -995 -1117 -621 -3697 -3663 1169 2667 -32 -2926
4122 -2926 -4018 -2888 1857 3848 -1023 -4758 -2047 10 695 1419 472 -2070 -1781 -327 -784 1286
4138 1286 3612 470 -4248 -2302 2065 3455 2866 17 -3525 -2077 3575 3609 618 -222 -309 -980 846
4155 846 3229 2528 1135 489 -1625 -1591 3692 5970 1460 -2057 -1607 1037 4073 5011 1163 -2154 -146
4172 -146 2371 1781 2166 3306 760 -1404 -49 1621 3181 4248 1328 -3562 -1788 3519 4262 1383
4188 1383 -155 -1714 -1161 2119 3263 744 149 767 -1715 -1345 2223 3311 507 -1850 -2745 -1848
4204 -1848 2332 4375 -596 -4345 -2194 564 1059 1448 -35 -2871 -2394 -485 -841 -412 1564 -318
4220 -318 -4521 -3117 776 1564 646 -1437 -4839 -3485 1542 1851 -1628 -2703 -1854 -2550 -1259 659
4236 659 -474 -1424 -1719 -3083 -3613 929 2869 -1525 -4368 -2972 -1519 1179 2446 -1008 -4667 -2487
4252 -2487 784 -46 -180 358 -1610 -2845 -837 11 796 2001 -587 -4060 -2848 2399 3288 743
4268 743 -1746 -2659 -1340 2223 3052 -174 -767 369 -966 -850 2816 3518 499 -915 -1331 -155 3021
4285 3021 4867 558 -2787 -593 1898 2614 2937 1435 -1186 -478 1897 1949 1466 3240 1486 -1433
4301 -1433 -642 2568 3287 2864 807 -2543 -1034 3809 4536 1002 -953 -101 115 1503 2913 1036
4317 1036 120 793 -229 -987 2416 4268 461 -2358 -1068 439 2483 3703 -77 -3401 -1110 1723
4333 1723 1360 404 593 -1590 -2672 -96 1064 146 826 -223 -3490 -2571 1268 2320 -204 -1948
4349 -1948 -3297 -2452 1019 2166 -1687 -2721 -1610 -1468 -1698 609 852 -1425 -2317 -2398 -2387 707 2083
4366 2083 -1294 -5261 -2841 -5 449 262 -1009 -3423 -2708 315 -147 -727 297 -1111 -3611 -1918
4382 -1918 829 875 25 -954 -3434 -2657 1430 2588 -774 -2011 -1700 -1089 750 1935 -103 -1671 -36
4399 -36 -285 -747 1217 2504 200 -1927 -1315 261 2102 3338 355 -2873 -624 2681 2062 1031
4415 1031 1261 4 -611 1298 2051 1608 1832 1115 -1443 -526 3419 3003 675 394 -280 -269 2656 4307
4433 4307 919 -1323 559 914 987 2510 2117 -215 -205 428 323 1933 3574 892 -2605 -923 1860
4450 1860 2302 2049 218 -2110 -671 2210 1663 -316 645 65 -1853 -775 1818 1296 311 -679 -2546
4467 -2546 -2016 2015 2529 -1028 -2383 -1201 -1410 385 1658 -26 -2592 -1669 -880 -1283 300 1048 -1569
4484 -1569 -2801 -1596 -1097 12 1177 -722 -4004 -2649 797 766 -618 -1192 -2427 -2224 -253 202
4500 202 -1404 -665 -671 -3148 -2533 944 1173 -1259 -2187 -2212 -1953 662 1904 -1074 -2709 -846 -278 -724
4518 -724 960 532 -1354 -1784 -312 -229 414 1405 -260 -2783 -778 1248 1074 1533 262 -2123 -1042
4535 -1042 2160 2056 58 262 62 -856 369 2210 1274 663 731 -607 -926 2690 3250 51 -1126
4552 -1126 437 994 1971 2980 1017 -567 331 1494 666 2151 2671 346 -1358 703 1590 1567 2470
4569 2470 1111 -1480 -148 2150 2179 983 641 -193 -815 1685 2348 192 200 591 -636 -684 1621 1545
4587 1545 5 -448 -783 -870 1420 2320 -445 -2237 -457 60 27 841 502 -1356 -1130 -313 -721 -392
4605 -392 1220 -620 -2996 -1150 780 286 -495 -758 -2515 -2131 480 473 -1079 -1128 -1244 -2259 -990 367
4623 367 -792 -2142 -1098 -1778 -2430 304 1147 -1322 -2492 -1544 -1020 24 1074 -628 -2731 -1321
4639 -1321 172 -900 -407 603 -1420 -2009 -736 55 129 753 -91 -2714 -1187 1379 792 -609 79
4656 79 -729 -1189 505 1615 405 -219 229 -849 -86 1683 1189 -370 -66 312 -280 1178 2866 700
4674 700 -1054 418 1228 873 1844 1241 -274 281 1549 1155 1033 2092 960 -860 14 2205 1872
4691 1872 1366 1073 -430 25 2472 2197 240 531 930 190 625 2428 971 -39 464 110 -195 1991
4709 1991 1748 -189 -615 396 301 578 2016 292 -1682 -388 999 399 214 441 -754 -1120 444
4726 444 627 -334 732 54 -2166 -1328 1457 617 -836 -976 -1281 -1708 430 729 -986 -1411 -582 -1471
4744 -1471 -1491 531 381 -1516 -1835 -850 -1120 -342 241 -1247 -2689 -1116 -816 -996 -298 -214 -2151 -2000
4762 -2000 -31 -407 -657 99 -578 -1957 -791 96 -571 -684 -346 -1827 -1525 551 519 -1179 -895 -421
4780 -421 -756 25 1085 -2 -960 -68 -388 -925 907 1445 -702 -732 549 565 85 1340 637 -911
4798 -911 201 1046 484 694 1303 64 -402 1425 1262 -14 1105 1242 -149 383 1774 1680 532 1318
4816 1318 573 -190 1336 2310 394 149 1555 916 174 1726 1714 384 320 1187 232 1231 2062 265
4834 265 -488 894 1598 648 1018 1132 -546 -352 1088 431 67 1079 508 -1000 218 882 -388 -403
4852 -403 696 -644 -1247 655 564 -767 -288 -474 -952 57 427 -417 -1310 -397 -298 -986 -461 657 -1042
4871 -1042 -1600 -273 -822 -877 -80 -795 -2019 -932 -46 -1357 -1234 -385 -1045 -1813 -635 -314 -1527 -720
4889 -720 -493 -1596 -1230 192 -296 -1456 -675 -675 -1558 -591 388 -1044 -1585 -123 -576 -1129 186 -400 -1315
4908 -1315 -519 216 -869 -724 821 143 -1166 -40 416 -420 3 784 -603 -147 1068 562 -319 761
4926 761 586 -412 335 1466 518 -142 773 212 88 1071 1238 -500 727 1017 398 554 1834 1090 200
4945 200 1117 1301 58 956 1356 553 430 1506 691 444 1440 1123 -146 328 1528 452 263 1482
4963 1482 520 165 1072 1010 -327 457 1042 -53 84 1205 647 -447 586 809 -351 307 1008 -331
4981 -331 -364 740 42 -667 180 -60 -645 -260 419 -630 -907 -50 -311 -1136 -39 -408 -672 -504 309
5000 309 -1030 -899 47 -522 -1327 -639 -188 -1087 -1186 -43 -1536 -803 -244 -1216 -1592 -356 -174 -1871 -1109
5019 -1109 -94 -1000 -1074 -382 -915 -1174 -482 -131 -1259 -576 45 -614 -992 68 -499 -1307 -428 80 -922
5038 -922 -334 315 -737 -813 270 -142 -742 316 693 -516 3 766 67 -462 544 -35 -412 449 712
5057 712 -61 314 1058 64 23 1334 759 49 586 1105 201 614 1348 242 99 1269 878 419 1437
5076 1437 1038 -201 470 1475 534 146 1127 1020 199 991 1198 335 589 1083 495 389 1273 736 -114
5095 -114 704 932 325 478 1097 200 -139 877 352 -154 942 731 -504 -468 471 112 -262 556 128
5114 128 -965 -364 545 -482 -197 459 -607 -1038 220 132 -710 -208 -286 -1047 -395 566 -563 -1394 -518
5133 -518 -772 -1229 -172 -356 -1452 -894 -137 -970 -1178 27 -821 -1559 -722 -291 -826 -374 24 -1183 -1625
5152 -1625 -506 -164 -1046 -482 -402 -1302 -893 340 -572 -675 -145 -519 -1143 -155 555 -657 -688 57 -500
5171 -500 -694 515 298 -782 -76 533 -163 267 1007 -197 -477 625 365 -11 1027 723 -706 -181
5189 -181 1092 460 254 1117 357 -290 833 1377 405 617 982 246 -21 1262 1059 690 668 891 82
5208 82 639 1943 901 36 626 662 391 1462 1308 -271 281 849 540 343 1292 639 -419 240 944
5227 944 382 414 1220 -318 -802 769 976 95 302 309 -664 -303 789 -7 -228 420 -203 -974 16 620
5247 620 -276 -581 -76 -952 -237 625 -28 -1344 -947 -193 -553 -501 429 -473 -1242 -592 -352 -919 -150 158
5267 158 -1404 -1344 -106 -263 -927 -188 -915 -1551 -331 246 -917 -1059 -402 -767 -1308 102 163 -927 -251
5286 -251 -590 -1669 -549 734 -90 -962 -614 -646 -407 204 -35 -1211 -940 147 117 -122 731 -16 -1003
5305 -1003 -425 398 94 308 540 -532 -592 1011 1215 343 219 76 -449 343 1255 699 -150 452 580
5324 580 -214 839 1627 284 -41 558 307 899 1562 897 -307 -16 1007 944 1109 1244 203 -310 701
5343 701 865 476 1265 1302 -72 -417 1143 1170 781 1079 -164 -665 817 1754 651 -323 350 209 -247
5362 -247 1094 829 33 272 14 -742 195 1235 394 -945 -585 40 59 545 487 -1377 -1133 374 -280
5381 -280 -449 243 -325 -1171 -760 4 -171 50 -100 -1065 -1629 -29 413 -762 -1240 -977 -1452 -831 551
5400 551 -453 -1190 -779 -702 -982 -296 657 -763 -1145 -917 -802 -426 621 18 -1780 -1303 -341 -300 -258 177
5420 177 -830 -1373 -247 150 -379 433 -62 -954 -1067 300 729 292 162 -523 -1067 105 1410 -1
5438 -1 -645 -6 -492 -425 838 751 -252 -70 238 -610 208 1491 394 -459 -343 463 951 1395 1204 -477
5458 -477 -564 1119 960 466 787 682 55 474 1294 739 853 1059 -428 -366 1057 1705 687 292 172
5477 172 -129 431 1768 836 -323 87 590 160 562 966 194 -528 443 -203 279 1496 832 -769 -760
5496 -760 385 749 901 288 -528 -916 312 525 218 90 68 -1022 -1216 97 463 -258 -225 -988 -1278
5515 -1278 -145 788 -193 -1103 -828 -790 -614 192 222 -926 -798 -565 -618 -657 475 -206 -1512 -1226 -609 -204
5535 -204 297 -306 -1865 -1848 51 168 -634 -214 -776 -1083 -806 -174 -363 -509 89 -966 -1241 -69 713
5554 713 78 -896 -1045 -783 0 773 -114 -1047 -362 -34 -291 292 384 -38 -563 -83 60 151 1103 1214 -770
5575 -770 -549 675 894 865 707 -370 -720 998 1440 269 305 525 124 -176 839 1242 761 918 -50
5594 -50 -401 791 2080 580 -489 302 257 848 1547 863 -89 21 531 183 350 1342 1011 -534 -191
5613 -191 535 840 1904 647 -746 -843 891 1330 481 -66 -386 -252 159 642 353 -218 182 -745 -1472
5632 -1472 175 1432 57 -510 -677 -1057 61 1083 234 -1291 -886 -70 -496 -17 132 -685 -769 -609
5650 -609 -615 -126 618 -1 -1726 -1262 -259 168 -106 -366 -1349 -1583 -116 546 -486 -817 -561 -1030 -969 -388
5670 -388 197 -366 -698 -1001 -1121 -183 1422 -39 -1495 -862 -520 -57 379 28 -1010 -1165 170 -444
5688 -444 -130 684 88 -837 -452 211 433 719 165 -1079 -1059 547 1622 467 285 -281 -332 286 1105
5707 1105 482 -23 362 196 -576 466 1664 797 39 161 -354 686 2023 871 -912 -380 762
5724 762 609 841 1019 494 -308 715 468 498 1231 1006 -622 -568 720 1346 954 325 -585 -469 912
5743 912 1522 460 25 94 -84 -316 660 682 177 271 -132 -469 292 1483 433 -826 -1034 -121 402 751
5763 751 319 -869 -687 419 -68 -451 216 99 -956 -842 -93 46 203 397 -1528 -1489 14 631 -582
5782 -582 -814 -1037 -1186 -247 350 -280 -980 -726 -562 -1045 -132 475 -104 -906 -1307 -972 89 720 -60 -1789
5802 -1789 -1729 -74 -23 24 230 -1022 -1191 76 -325 -86 429 262 -927 -1141 -16 854 439 -98 -1146
5821 -1146 -1270 584 1184 -310 -778 -147 -229 -223 530 423 -43 -54 28 -459 476 1231 665 -1089 -497 225
5841 225 741 1504 791 -690 -370 906 852 426 841 392 -12 179 632 762 1009 953 -656 -1017 906
5860 906 1708 834 190 -282 -431 649 1358 703 -269 267 344 -226 564 1226 407 -247 -251 188 637 1433 784
5881 784 -931 -764 837 616 732 120 -409 -691 129 248 -50 272 162 -1211 -1244 71 713 224 -268
5900 -268 -948 -1189 256 1203 32 -1346 -558 -258 140 321 -4 -923 -516 -776 -929 -369 734 37 -1534
5919 -1534 -1345 -538 -64 293 -162 -1454 -1320 291 142 -723 -288 -622 -884 -565 -211 17 -88 99 -1018
5938 -1018 -1408 221 763 -230 -426 -890 -898 172 1010 -289 -946 -34 335 -331 199 466 -61 -451 -448 -325
5958 -325 399 1189 687 -1073 -604 752 1138 716 62 -206 -311 1040 733 155 321 139 -239 -566 638
5977 638 1201 831 417 -478 -539 807 1832 684 -694 -171 456 635 1046 806 9 -222 503 -216 434
5996 434 1279 693 -324 -528 75 975 1154 846 -952 -906 1103 866 113 138 -161 -203 187 431 170 445
6016 445 411 -636 -986 700 1013 114 -693 -770 -725 127 955 22 -913 -452 399 -332 -251 611 -121 -581 -386
6037 -386 -781 -366 663 283 -1125 -1418 187 307 -60 -190 -1434 -1344 327 605 -652 -737 -46 -747 -711
6056 -711 -123 155 -22 -937 -903 -1314 104 983 -282 -1168 -748 -433 -26 328 -260 -613 -466 -105 -237 -339
6076 -339 658 -13 -935 -635 130 333 663 557 -1170 -524 688 1224 226 -106 -285 -322 307 810 262 277
6096 277 401 -361 -425 286 1409 592 -429 -336 -98 864 1573 160 -522 -57 677 443 439 469 341 120 505
6117 505 342 210 1314 907 -140 -318 661 895 559 273 -461 -318 860 872 -193 81 301 155 -362
6136 -362 289 821 226 -122 -264 -645 546 1140 337 -693 -408 202 257 594 181 -477 -574 185 -76 -207
6156 -207 44 101 -947 -725 -105 101 491 -377 -1287 -1110 364 960 -288 -922 -837 -641 12 345 -192 -447
6176 -447 -534 -335 -899 126 266 -506 -971 -1151 -727 85 816 -371 -1578 -1173 83 163 -181 -256 -870 -669
6196 -669 -206 -227 -220 217 174 -986 -1013 360 249 -55 -204 -882 -991 345 826 -118 -824 -179 121 -306 421
6217 421 98 36 -68 -96 -369 545 1163 256 -979 -208 280 295 741 413 -414 -131 517 471 287 769 365
6238 365 -173 267 536 743 720 806 -463 -454 933 989 392 66 -369 129 885 1003 169 -233 639 437 -149
6259 -149 549 937 427 -459 28 -384 341 1029 107 -655 -580 678 739 350 252 -357 -283 189 192 -172 545 -61
6281 -61 -793 -613 365 305 46 58 -712 -932 112 806 -250 -729 -471 -204 -223 139 153 -643 -588 -232 -760
6302 -760 -39 683 148 -1087 -428 -197 -279 289 -186 -1042 -753 -134 26 -91 12 -89 -864 -133 10 -112
6322 -112 -35 -37 -859 -1155 -2 578 -64 -565 -555 -490 343 304 -174 -815 68 -115 -67 -22 286 -180 -209 -251 14
6345 14 220 802 176 -1102 -382 339 575 197 311 -200 -329 -4 466 284 702 289 -284 9 687 779
6365 779 185 -21 -374 23 866 899 229 -97 -175 413 437 744 584 -28 247 219 19 198 828 548 -597
6386 -597 -98 596 677 823 466 -606 -11 619 681 -35 198 3 -63 242 587 108 -53 101 -482 -706 331
6407 331 242 48 -146 -245 -365 179 813 36 -438 -304 -131 -227 98 378 -167 -177 -92 -451 -392 541 -77 -1131
6429 -1131 -662 -126 194 -189 -351 -889 -717 -154 367 -176 -250 -188 -480 -539 455 374 -242 -311 -571 -842 194
6450 194 708 -132 -826 35 -431 -378 348 218 -395 -442 -270 -559 -174 352 -67 -724 -452 12 -13 407 21
6471 21 -581 -341 268 564 -56 271 -337 -192 90 428 -12 -276 281 -32 -360 190 533 161 -126 -100 -459
6492 -459 545 784 170 -344 116 455 284 490 373 312 224 323 75 296 805 540 -436 48 449 271 431
6513 431 624 170 -617 669 675 334 -19 450 60 -31 624 434 129 173 124 -9 328 1029 -43 -484 -76
6534 -76 42 344 362 3 -560 -256 336 -120 -342 480 -86 -341 -418 13 18 400 283 -674 -538 235 177 -144
6556 -144 -307 -296 -534 -111 37 53 -221 -514 -625 -515 -180 331 -223 -269 -364 -578 -142 258 -146 -421 -616
6577 -616 -234 -145 -1 101 -373 -234 -237 7 -570 -99 120 -638 -278 204 -43 67 -162 -511 -242 191 202
6598 202 30 -222 -198 -209 108 36 68 -414 -133 127 -208 260 780 37 -399 -155 114 23 320 459 -206 -216
6620 -216 397 384 368 560 289 14 401 378 83 522 360 106 63 766 623 253 302 168 4 399 594 262
6642 262 208 379 195 -161 4 451 -32 -132 -34 188 355 708 200 -251 -221 117 288 295 268 -222 -230 199 78
6665 78 -184 -47 -211 -630 -262 360 303 -4 88 -158 -370 -27 246 -324 -279 269 -128 -98 44 -176 -395 -179
6687 -179 -502 -666 4 218 -96 -657 61 -22 -158 -444 -218 -631 -547 235 -152 -501 -24 -89 -333 -126 -100
6708 -100 -164 -117 -43 -145 -380 173 -29 -126 -69 -28 10 48 -20 -432 0 13 -379 -115 212 250 -70 -74 -58 81 -143
6733 -143 482 -155 -1 -36 301 14 283 461 -226 -457 365 397 137 282 325 -204 -141 365 65 142 395 207
6755 207 24 334 304 -86 15 49 419 146 265 288 -42 229 306 19 -27 560 295 -311 317 137 258 543
6777 543 240 -39 -36 544 42 3 336 121 -183 252 168 -229 -33 74 -235 -80 335 245 -78 52 182 -271
6799 -271 -15 577 162 -213 -180 17 -513 -5 193 -145 13 -101 -304 -554 86 -57 -348 -271 -240 -205 -321
6820 -321 -14 -234 -417 -48 12 -540 -401 -8 -558 -406 26 58 -218 -21 -61 -291 -344 30 -177 -166 -45 -366
6842 -366 -290 -149 -165 -393 -413 -133 -481 -256 27 -56 -462 -244 -206 353 48 -207 -360 -145 7 -8 -3 -176 -8
6865 -8 -98 34 70 -47 106 386 -338 -179 400 336 -151 245 220 142 129 231 364 228 182 398 -50 225 303
6888 303 -17 -142 379 315 46 236 312 316 38 418 133 -38 207 60 -108 577 249 -105 273 117 -77
6909 -77 30 236 36 -58 -96 275 102 51 32 101 -163 -284 108 -185 -44 97 -39 8 309 -108 288 257 -150
6932 -150 -133 -144 -89 -99 -167 138 -502 16 -22 -219 -335 106 -412 -582 152 230 305 -161 40 -154 -76 380 78
6955 78 -152 -315 -189 -66 -177 -22 -296 -554 -91 119 -36 -166 116 -181 -539 124 -148 -356 -310 -60 -202
6976 -202 -170 -175 -185 16 110 -359 -544 70 -155 -513 -303 206 -210 -185 137 -114 -118 180 -63 -373 20 241 -166
6999 -166 -179 164 17 65 267 417 305 111 220 -13 -249 352 322 66 114 -19 -93 121 273 97 73 313
7021 313 383 -125 261 -244 79 149 290 147 108 247 301 11 103 387 -53 -131 256 187 142 360 144 -11 152
7044 152 253 -170 -313 90 177 -115 272 129 261 265 217 -204 -215 101 -9 -365 197 -172 -358 -70 46 -88
7066 -88 -18 193 -63 154 -168 151 -329 -253 -472 -152 -465 227 -122 -311 -164 -169 -568 38 32 -630 -89 52
7088 52 116 -261 -77 -152 -428 4 -278 -80 47 57 -153 -254 -7 -344 -179 -195 -219 -337 -331 -69 -274 193 -340
7111 -340 299 -257 -288 -62 -336 62 74 -1 -200 173 105 -237 -142 133 -51 -59 67 -19 113 152 -129 -267 -136
7134 -136 239 426 235 168 332 -45 371 -86 -229 -15 42 -82 -91 295 331 -76 162 126 115 75 211 155 -51
7157 -51 149 -166 97 545 153 -36 190 124 282 175 310 57 -31 96 265 293 -35 212 -73 91 52 150
7179 150 17 -69 74 -330 0 195 26 43 187 -136 10 279 29 11 -23 60 -25 134 -120 7 -208 157
7201 157 142 -170 -122 2 -336 -181 -44 56 -104 338 -322 -246 -191 157 53 -273 321 -91 -177 -312 -224 -178
7223 -178 -132 -122 -296 -315 -11 -69 -165 -70 -351 -201 -46 142 -377 -436 -85 -222 87 78 -42 -405 -39 156 -343
7246 -343 82 235 83 -197 -22 121 132 225 1 -223 162 306 239 -168 99 -22 70 -117 148 113 84 315
7268 315 -415 -101 46 185 153 -260 2 136 64 281 152 -206 73 132 81 166 56 -24 35 185 1 69 209
7291 209 173 84 107 176 166 166 258 -163 221 206 436 -30 -61 -9 37 63 -103 422 0 54 265 251 157 173 46 -277
7317 -277 296 -131 5 130 163 -274 -130 -58 232 30 7 -79 -380 -270 176 -166 -224 -197 -184 297 -43 94
7339 94 -362 46 -306 -76 -264 31 -4 -481 -255 -144 -170 274 124 -233 -122 44 3 -248 -2 -165 -520
7360 -520 -200 -210 -96 -248 -59 79 -54 -52 -51 48 58 66 -442 -408 36 -161 -183 84 -111 15 254 301 -34 -334
7384 -334 57 227 46 92 335 -184 -118 -116 52 215 280 33 -82 -18 177 14 -181 165 -163 -29 121 138
7406 138 -8 330 -76 -164 -66 50 3 381 207 123 -25 180 53 -110 351 416 226 225 -96 194 -28 -287
7428 -287 130 58 89 151 -116 -257 -24 251 89 107 157 -50 223 -106 -37 175 353 -119 65 -67 97 37
7450 37 142 -99 -282 151 40 202 -58 -145 -307 46 -212 168 -297 -165 123 7 -182 56 305 -247 -129
7471 -129 -202 -288 -176 -81 -61 -582 420 53 -64 130 48 -217 -361 50 -154 175 -111 -280 -303 -395 131 85
7493 85 -267 -127 -400 -39 -281 142 21 -315 -251 -241 -120 -78 -59 -34 -57 147 107 434 -82 21 -18 -154 -114
7516 -114 125 308 -46 -339 -50 164 -184 103 91 115 -133 264 322 376 92 -38 80 257 418 473 -24 -13
7538 -13 172 -465 183 42 -40 -81 -45 226 -155 -42 254 -66 59 304 262 651 118 -242 -90 -61 154 38
7560 38 96 274 -456 216 517 228 234 -3 166 -19 185 141 17 -60 -59 -100 -105 4 479 92 -72 252 77 58
7584 58 90 9 -441 32 229 -48 -145 89 -74 -167 -152 342 -140 -167 -67 -585 -32 -93 -397 -21 -210 -277 -229
7607 -229 77 113 -262 -82 178 -394 -165 21 -215 -64 -49 -121 -73 14 298 -162 -331 35 62 6 177 -30
7629 -30 -277 -203 -29 59 -35 45 -89 -366 -94 61 211 38 93 -358 72 20 168 369 -225 172 -28 9 196
7652 196 -308 -30 25 89 -123 405 -17 28 211 45 253 -112 283 235 -338 -127 -4 -40 696 251 145 50
7674 50 -17 140 152 -26 203 -137 -27 148 300 173 177 -217 -62 297 302 101 144 -222 -245 35 71 92 290 32
7698 32 -287 -42 294 350 -129 -124 -225 -15 -21 111 -197 -155 -6 -208 -32 -248 244 -9 -287 17 166 -137
7720 -137 -103 30 50 24 87 -11 -321 -107 61 -96 -162 131 77 -12 -272 -66 -332 -37 178 -69 -15 16 -289
7743 -289 -111 152 74 -94 -202 40 -352 234 -57 41 -241 -285 -235 246 -67 -256 -304 -537 117 143 -95 7
7765 7 -239 -22 81 138 -88 -145 -129 103 115 -107 -58 154 43 258 119 -31 395 -45 -150 -141 163 81 106 -136
7789 -136 -254 209 -77 -14 -90 91 -4 40 -186 121 8 -166 -42 -413 79 545 126 -153 197 50 -308
7810 -308 234 121 400 -63 -206 129 -73 46 257 83 98 -44 -123 7 100 89 -125 96 375 112 51 48
7832 48 -252 178 -263 6 104 202 164 -120 -271 25 125 79 53 -89 -9 236 165 40 9 -30 -30 -162 31 322
7856 322 -158 244 33 -191 -27 -65 7 -201 -96 145 7 104 -168 -185 -144 133 -235 -129 207 146 -73 -246
7878 -246 276 -11 150 82 -303 -3 209 -20 332 -425 -187 -295 94 -270 -324 -92 91 -308 -27 -292 -200
7899 -200 31 -257 -238 -102 -129 354 -68 -162 -266 142 -191 64 50 69 90 -57 297 -9 8 -78 -349 -20 68
7922 68 127 96 185 38 -58 174 374 -67 -736 262 123 2 158 -169 171 87 250 -131 271 247 -148 -55 -146
7945 -146 184 111 128 -29 78 -95 9 5 186 172 -81 44 12 112 111 262 44 -19 -406 149 166 -236 -201 465
7969 465 30 499 1 -30 -118 -211 182 -332 -143 46 90 -126 94 200 129 287 36 -395 -78 34 191 268
7991 268 -214 -145 -183 155 291 16 58 -99 -188 -35 65 238 285 -329 -121 -262 -227 213 -274 -451 3 103
8013 103 -123 -62 242 71 103 -137 100 247 327 178 157 -67 -244 -309 59 138 181 -104 -19 -59 -173 -78 -164 -16
8037 -16 -258 -291 34 133 168 23 -374 218 100 16 -290 129 152 53 142 65 -85 236 173 -88 147 -174 64
8060 64 146 -143 -61 -41 142 231 -213 -135 260 64 165 -208 -166 156 -88 252 118 -215 300 100 -202 -29
8082 -29 216 214 186 -132 -318 323 292 -155 -35 -99 82 351 -23 -74 -16 175 94 89 64 187 70 -109 173 463
8106 463 254 7 -210 210 -236 284 84 41 -156 -141 95 -10 -227 162 95 19 -273 48 206 131 -54 -394
8128 -394 -388 -57 262 125 -335 -244 -190 -84 -174 147 -249 32 12 -189 -314 -87 -27 155 46 -139 -76 94 -220
8151 -220 -89 -121 3 -190 10 -231 -46 -107 -235 -344 13 -227 -260 -29 106 -231 239 -85 104 -219 83
8172 83 97 430 -41 -5 -45 -158 116 -63 89 145 503 -270 108 101 29 -62 -1 -83 212
8191B12
##END NTUPLES=NMR FID
##END=
