##TITLE=1H_CA-8578-3-3
 CDCl3, 8 sc, 
 5.4.2019
##JCAMPDX= 6.0         $$ Bruker NMR JCAMP-DX V2.0
##DATA TYPE= NMR FID
##DATA CLASS= NTUPLES
##ORIGIN= UXNMR, Bruker Analytische Messtechnik GmbH
##OWNER= root
$$ XWIN-NMR		Version 3.5
$$ Fri Apr  5 16:25:56 2019 Russian Standard Time (UT+4h)  she@DPX200
##.OBSERVE FREQUENCY= 200.1315
##.OBSERVE NUCLEUS= ^1H
##.DELAY= (6, 6)
##.ACQUISITION MODE= SIMULTANEOUS
##.ACQUISITION SCHEME= undefined
##.AVERAGES= 8
##.DIGITISER RES= 18
##SPECTROMETER/DATA SYSTEM= spect
##.PULSE SEQUENCE= zg30
##.SOLVENT NAME= D2O
##.SHIFT REFERENCE= (INTERNAL, D2O, 0, 15.7039)
##AUDIT TRAIL= $$ (NUMBER, WHEN, WHO, WHERE, WHAT)
$$ ##TITLE= Audit trail, XWIN-NMR		Version 3.5
$$ ##JCAMPDX= 5.01
$$ ##ORIGIN= Bruker BioSpin GmbH
$$ ##OWNER= she
$$ F:/spectra/data/she/nmr/H-F/1/audita.txt
$$ ##AUDIT TRAIL=  $$ (NUMBER, WHEN, WHO, WHERE, WHAT)
(   1,<2019-04-05 16:24:15.46 +0400>,<she>,<DPX200>,
      <created by zg, POWCHK disabled, PULCHK disabled
       configuration hash MD5:
       00 E9 B6 7A A2 85 ED C7 34 08 36 98 17 FE 4E 26
       data hash MD5: 16K
       1A D9 EE B0 45 73 60 26 58 95 4C 5B 79 FD C4 CD>)
$$ ##END=
$$ 
$$ hash MD5
$$ 86 8A 80 96 82 DB 1A EB 62 50 FE E0 92 9B 73 7E
##$RELAX= 
##$RELAX= 
##$RELAX= 
##$RELAX= 
##$RELAX= 
##$RELAX= 
$$ Bruker specific parameters
$$ --------------------------
##$DU= <F:/spectra>
##$EXPNO= 1
##$NAME= <H-F>
##$PROCNO= 1
##$TYPE= <nmr>
##$USER= <she>
##$AMP= (0..31)
100 100 100 100 100 100 100 100 100 100 100 100 100 100 100 100 100 100 
100 100 100 100 100 100 100 100 100 100 100 100 100 100 
##$AQSEQ= 0
##$AQ_mod= 1
##$AUNM= <au_zg>
##$AUTOPOS= <>
##$BF1= 200.13
##$BF2= 200.13
##$BF3= 200.13
##$BF4= 200.13
##$BF5= 200.13
##$BF6= 200.13
##$BF7= 200.13
##$BF8= 200.13
##$BYTORDA= 1
##$CFDGTYP= 0
##$CFRGTYP= 5
##$CHEMSTR= <none>
##$CNST= (0..31)
1 1 145 1 1 1 1 1 1 1 1 1 1 1 1 1 1 1 1 1 1 1 1 1 1 1 1 1 1 1 1 1 
##$CPDPRG= <>
##$CPDPRG1= <>
##$CPDPRG2= <>
##$CPDPRG3= <>
##$CPDPRG4= <mlev>
##$CPDPRG5= <mlev>
##$CPDPRG6= <mlev>
##$CPDPRG7= <mlev>
##$CPDPRG8= <mlev>
##$CPDPRGB= <>
##$CPDPRGT= <>
##$D= (0..31)
0 1.2 0 0 0 0 0 0 0 0 0 0.03 0 0 0 0 0 0 0 0 0 0 0 0 0 0 0 0 0 0 0 0 
##$DATE= 1554467054
##$DBL= (0..7)
120 120 120 120 120 120 120 120 
##$DBP= (0..7)
150 150 150 150 150 150 150 150 
##$DBP07= 0
##$DBPNAM0= <>
##$DBPNAM1= <>
##$DBPNAM2= <>
##$DBPNAM3= <>
##$DBPNAM4= <>
##$DBPNAM5= <>
##$DBPNAM6= <>
##$DBPNAM7= <>
##$DBPOAL= (0..7)
0.5 0.5 0.5 0.5 0.5 0.5 0.5 0.5 
##$DBPOFFS= (0..7)
0 0 0 0 0 0 0 0 
##$DE= 6
##$DECBNUC= <off>
##$DECIM= 24
##$DECNUC= <off>
##$DECSTAT= 4
##$DIGMOD= 1
##$DIGTYP= 9
##$DL= (0..7)
0 120 120 120 120 120 120 120 
##$DP= (0..7)
150 150 150 150 150 150 150 150 
##$DP07= 0
##$DPNAME0= <>
##$DPNAME1= <>
##$DPNAME2= <>
##$DPNAME3= <>
##$DPNAME4= <>
##$DPNAME5= <>
##$DPNAME6= <>
##$DPNAME7= <>
##$DPOAL= (0..7)
0.5 0.5 0.5 0.5 0.5 0.5 0.5 0.5 
##$DPOFFS= (0..7)
0 0 0 0 0 0 0 0 
##$DQDMODE= 0
##$DR= 18
##$DS= 0
##$DSLIST= <SSSSSSSSSSSSSSS>
##$DSPFIRM= 0
$$ [...]
##$SUBNAM2= <"">
##$SUBNAM3= <"">
##$SUBNAM4= <"">
##$SUBNAM5= <"">
##$SUBNAM6= <"">
##$SUBNAM7= <"">
##$SUBNAM8= <"">
##$SUBNAM9= <"">
##$SW= 24.9337058887773
##$SWIBOX= (0..15)
0 0 2 0 0 0 0 0 0 0 0 0 0 0 0 0 
##$SW_h= 4990.01996007984
##$TD= 16384
##$TD0= 1
##$TE= 0
##$TE2= 300
##$TE3= 300
##$TEG= 300
##$TL= (0..7)
0 120 120 120 120 120 120 120 
##$TP= (0..7)
150 150 150 150 150 150 150 150 
##$TP07= 0
##$TPNAME0= <>
##$TPNAME1= <>
##$TPNAME2= <>
##$TPNAME3= <>
##$TPNAME4= <>
##$TPNAME5= <>
##$TPNAME6= <>
##$TPNAME7= <>
##$TPOAL= (0..7)
0.5 0.5 0.5 0.5 0.5 0.5 0.5 0.5 
##$TPOFFS= (0..7)
0 0 0 0 0 0 0 0 
##$TUNHIN= 0
##$TUNHOUT= 0
##$TUNXOUT= 0
##$USERA1= <user>
##$USERA2= <user>
##$USERA3= <user>
##$USERA4= <user>
##$USERA5= <user>
##$V9= 5
##$VALIST= <valist>
##$VCLIST= <CCCCCCCCCCCCCCC>
##$VD= 0
##$VDLIST= <DDDDDDDDDDDDDDD>
##$VPLIST= <PPPPPPPPPPPPPPP>
##$VTLIST= <TTTTTTTTTTTTTTT>
##$WBST= 1024
##$WBSW= 4
##$XGAIN= (0..3)
0 0 0 0 
##$XL= 0
##$YL= 0
##$YMAX_a= 939795
##$YMIN_a= -1085537
##$ZGOPTNS= <>
##$ZL1= 120
##$ZL2= 120
##$ZL3= 120
##$ZL4= 120
##$ABSF1= 10
##$ABSF2= 0
##$ABSG= 5
##$ABSL= 3
##$ALPHA= 0
##$AQORDER= 0
##$ASSFAC= 0
##$ASSFACI= 0
##$ASSFACX= 0
##$ASSWID= 0
##$AUNMP= <proc_1d>
##$AZFE= 0.1
##$AZFW= 0.1
##$BCFW= 1
##$BC_mod= 2
##$BYTORDP= 1
##$COROFFS= 0
##$CY= 11.3945322036743
##$DATMOD= 1
##$DC= 2
##$DFILT= <>
##$DTYPP= 0
##$F1P= 18.9103706918063
##$F2P= -1.10871071338519
##$FCOR= 0.5
##$FTSIZE= 0
##$FT_mod= 4
##$GAMMA= 1
##$GB= 0.15
##$INTBC= 1
##$INTSCL= 1
##$ISEN= 128
##$LB= 0.24
##$LEV0= 0
##$LPBIN= 0
##$MAXI= 10000
##$MC2= 0
##$MEAN= 0
##$ME_mod= 0
##$MI= 1.114404
##$NCOEF= 0
##$NC_proc= 0
##$NLEV= 6
##$NOISF1= 3.799351
##$NOISF2= 2.8
##$NSP= 1
##$NTH_PI= 0
##$NZP= 0
##$OFFSET= 15.70392
##$PC= 1
##$PHC0= -8851.168
##$PHC1= 15.80028
##$PH_mod= 1
##$PKNL= yes
##$PPARMOD= 0
##$PSCAL= 0
##$PSIGN= 0
##$REVERSE= no
##$SF= 200.130013532006
##$SI= 16384
##$SIGF1= 3
##$SIGF2= 2
##$SINO= 400
##$SIOLD= 16384
##$SREGLST= <1H.CDCl3>
##$SSB= 0
##$STSI= 0
##$STSR= 0
##$SW_p= 3612.71676300578
##$SYMM= 0
##$S_DEV= 0
##$TDeff= 0
##$TDoff= 0
##$TI= <>
##$TILT= no
##$TM1= 0
##$TM2= 0
##$TOPLEV= 0
##$USERP1= <user>
##$USERP2= <user>
##$USERP3= <user>
##$USERP4= <user>
##$USERP5= <user>
##$WDW= 1
##$XDIM= 8192
##$YMAX_p= 0
##$YMIN_p= 0
$$ End of Bruker specific parameters
$$ ---------------------------------
##NTUPLES= NMR FID
##VAR_NAME=  TIME,          FID/REAL,        FID/IMAG
##SYMBOL=    X,             R,               I
##VAR_TYPE=  INDEPENDENT,   DEPENDENT,       DEPENDENT
##VAR_FORM=  AFFN,          ASDF,            ASDF
##VAR_DIM=   8192,          8192,            8192
##UNITS=     SECONDS,       ARBITRARY UNITS, ARBITRARY UNITS
##FACTOR=    0.0002004,     1,               1
##FIRST=     0,             0,               0
##LAST=      1.6414764,     0,               0
##MIN=       0,             -1085537,        0
##MAX=       1.6414764,     939795,          0
$$ Real data points
##PAGE= N=1
##DATA TABLE= (X++(R..R)), XYDATA
0@%%%qK4l2K9l7O4q0Q8j17J57j85K17k73L36l92M62n57O55p57Q81j025J179j348
26g19J541j758J996k256K548k872L220l602M031m501N008n563O179o856P591q403
42d416R309j0306J1408j2649J4049j5623J7418j9505K1942k4825K8327l2683L8255
55B0701m5677N6146p2120R9725j60436N09960l72185j121651R29374R90854m24281
66D10410j088744K76791R57525l9268j022025r9834R86696L94220r23193n92513
76g39935O56743P03990m12209o20217K08149N16647j65529m55673J37794N19733
86C49493p7882n83183o7733N90301J85292n13852k40968M45673K31791m34497
96a15565k67554M64186L95760m40631o00925L03823P70163p9101q35527j45711
$$ y = [0, 0, 0, 0, -8, 16, -16, 13, -24, 40, -40, 48, -69, 88, -97, 120, -153, 183, -209, 253, -304, 351, -406, 475, -550, 629, -719, 822, -936, 1060, -1196, 1352, -1520, 1700, -1902, 2129, -2372, 2636, -2927, 3252, -3604, 3987, -4416, 4893, -5413, 5995, -6654, 7395, -8228, 9190, -10315, 11627, -13198, 15129, -17554, 20701, -24976, 31170, -40950, 58775, -101661, 408299, 36114, -1085537, -156163, 834691, 410410, -678334, -401543, 555982, 516714, -505311, -605145, 381551, 775771, -147422, -739935, -83192, 620798, 208589, -411628, -203479, 313168, 147639, -308034, -170240, 349493, 271611, -311572, -379305, 210996, 396288, -117564, -358532, 87141, 318932, -115565, -383119, 81067, 476827, 36196, -564729, -260906, 509257, 430156, -405371, -551082]
106e51082P94054L10593p09803m18362O35279N30966n63428o95710M24092Q69597
116F26196j92548r71403q8733R41250L29594p97256m53847O37585M90615n26953
126e500n26692M43850O07456l28321p07935J44597P43862O1588o64698j81598
136d13391N36122J90499m50930j51606M50643J70500m75199k87173M28261M29256
146D26982k86704m90194J43068M64084p8501m23782R4495M57466q6859n45401
156c25346k8836N90513K31810n10614m09234L45323M83488j99245m80136J37899
166a64378M93516j13595n62986L3188O38481J50438o20058l65212M81593N08872
176D79859l00386n52574J65244N50581j00123n72796M7653O29985P2854o48256
$$ y = [-551082, 242972, 553565, -156238, -574600, 60679, 591645, 28217, -667493, -243401, 626196, 433648, -537755, -626488, 314762, 644356, -152900, -606747, 30838, 521453, -5500, -532192, -88342, 519114, 190793, -517142, -372545, 371317, 432905, -231793, -413391, 122731, 313230, -137700, -289306, 161337, 331837, -143362, -430535, -2274, 426982, 140278, -349916, -206848, 257236, 178735, -245047, -150552, 306914, 220055, -325346, -354182, 236331, 468141, -42473, -451707, -106384, 377104, 177859, -302277, -164378, 329138, 215543, -347443, -314255, 324226, 474664, -145394, -510606, -29013, 479859, 179473, -373101, -207857, 342724, 242601, -330195, -282542, 347443, 420297, -227959]
186b27959k50883N69255M13339m11554m99688K42237N01614j38283m80390R8212
196a84100M91082n6597n19932l0048N15856J49399m44910k53354L20669K87777
206B75842k19763k73440J84735K65151k01623l05638K08572L80714j55648m35933
216b77031M2854M21057O5213l58269j30932L05707J62460l07119k20380L30270
226C3830L33816l07336m67059J87658N38675r560n05944j46237M08293K31995
236B98131l26888k82487K92925L51925k67594m62403J78157N47929j0005n29961
246b10271j61032M12067K56304k70706k64688J88697K47802j81939k79139J76221
256h6684L46156j09775l72223J0165L19276N9701k19405n0350J59318J529j90570
$$ y = [-227959, -478842, 90413, 503752, 92198, -407490, -165253, 336361, 198078, -282312, -184100, 306982, 250385, -269547, -299595, 216261, 365660, -79250, -332604, -11935, 275842, 56079, -217361, -32626, 232525, 30902, -274736, -66164, 314550, 158902, -277031, -234177, 186880, 252093, -106176, -237108, 68599, 231059, -76060, -296440, 33830, 367646, 60310, -406749, -219091, 319584, 310024, -195920, -342157, 66136, 298131, -28757, -311244, -18319, 333606, 66012, -396391, -218234, 329695, 319690, -210271, -371303, 40764, 297068, 26362, -238326, -49629, 198173, 16234, -262905, -86684, 259472, 149697, -222526, -212361, 106915, 166616, -52789, -103139, 56179, 57708, -132862]
267a32862L230K69090P1311l12914j78182K88635K52295k21911k61060J78716
277d3652K53743j67149k86136J39717L65151m5068m29963j07578M26089K59872
287C65026l43779l45395K32278L60082j38250l42947P4910L41936l039l55904
297a55082r8335L52603K19553k98347l14019J96989L38300r4435k97382L5039
307a15116K44762j3980k22653j161K41050M9641k63767j31757K45603J95952j94665
318C3909k09791J50803J85581j43925j71337J63437K13748j51865k97364O8112
328a58692L53484N4296l46616j54839K91084J89236k44242j87389K38544K11228
338B46094k33772k87647J69035L64531l7522l83852j07072L24488J86946k41286
$$ y = [-132862, -129632, 139458, 210769, -102145, -280327, 8308, 260603, 38692, -222368, -43652, 210091, 42942, -243194, -103477, 261674, 216606, -213357, -320935, 105154, 365026, 21247, -324148, -91870, 268212, 129962, -212985, -138075, 203861, 200822, -155082, -253417, 99186, 318739, 20392, -293627, -96638, 241662, 147227, -150155, -115116, 129646, 115666, -106987, -108148, 132902, 182543, -81224, -212981, 32622, 228574, 33909, -175882, -25079, 160502, 16577, -154760, 8677, 222425, 70560, -226804, -158692, 194792, 249088, -97528, -252367, 38717, 227953, -16289, -203678, 34866, 246094, 12322, -275325, -106290, 258241, 220719, -163133, -270205, 54283, 241229, -57]
348e7j92080J95153J73635j92694j96673J76135K56183j00274k99031k0420K79133
359G9010J15947k13353j45041J60508J22099j60238j15287J79344J54942j62464
369A5467k15462Q9477K47947Q550k28952p5770J88700Q7920j75710q4507J93959
380E1619J03628k07121j57010J79127K17158r7353k38409P379K17607M7624j87895
391f3646n9953J79365N6454j96899p2414K12265J22330j86139j71694J20266J94062
402A33997m4957j81749J39J62373M704j67846P02K04079K5966k28498q7088K04675
414B6497J52164j30546j76470N1962J63181j0517j47202R850J67288k499k06956
425a03248m5742K17000J19453j63158j68674P2289J63885N66j23660j4347J08884
$$ y = [-57, -192137, 3016, 176651, -16043, -212716, -36581, 219602, 119328, -179703, -200123, 79010, 194957, -18396, -163437, -2929, 119170, -41068, -156355, 22989, 177931, 15467, -199995, -110518, 137429, 145979, -82973, -158743, 29957, 117877, -57833, -142340, 51619, 155247, -51874, -208884, -29757, 187401, 90048, -148361, -140982, 76625, 124249, -63646, -123599, 55766, 112220, -84679, -157093, 55172, 177502, -8637, -180331, -60065, 133997, 89040, -92709, -92570, 69803, 74507, -93339, -92637, 111442, 137408, -91090, -178178, 26497, 178661, 48115, -128355, -76393, 86788, 76271, -70931, -61081, 106207, 103708, -103248, -148990, 68010, 187463, 24305, -144369, -72080, 91805, 92371, -31289, -45636, 63248]
436F3248l311j41020l846J82312N3160j80760j14249J21415J35227m6288j06109
447d0221J6149P8414l4861r6957N4528J54516l4367k06416k8618K01387Q6096
458A49650j49457j02842R9662R3548q4190j02424Q9256J48676p6156k12577J7536
469a29318K38877N8430k08705j09899J42810J20002q8454j12349O2549J19570
479I3513n0477j54264J9548J86303L4889j83758q9458J35691J10522p3176r6835
490f7502K8792P1108k0911o8143K7877R7757j8318j33300j7804J40662N5006j12182
502a6958p0821O8765N5988m7899m1545N8713O2669o8743j16250M9971J67652L375
514A04917j77909n9695J39958P9784r2608o8220P4053O5816p6745r7317P1310
$$ y = [63248, 59937, -81083, -84929, 97383, 150543, -30217, -144466, -23051, 112176, 65888, -40221, -24072, 54342, 19481, -77476, -22948, 131568, 97201, -109215, -137833, 63554, 149650, 193, -102649, -2987, 90561, 6371, -96053, -6797, 141879, 65723, -146854, -129318, 109559, 167989, -40716, -150615, -7805, 112197, 23743, -88606, -26057, 93513, 43036, -111228, -91680, 94623, 129512, -54246, -143704, -8013, 102509, 29333, -67502, -38710, 32398, 11487, -56656, -28779, 68978, 50660, -82640, -100444, 40218, 95224, -16958, -87779, -19014, 36974, -10925, -52470, 6243, 68912, 169, -116081, -66110, 101542, 104917, -72992, -132687, 7271, 87055, -5553, -73773, 280, 66096, -10649, -107966, -36656]
525c6656J53412k5388j84658m2063J60647Q4199j02460p6110N8411M7529n2040
536a5177l9861O5237P6365n4051j21920Q687J34454L9295j00234m8086N8147J9610
548B2466m5893Q231O7704O443q6112n8803O9093J07906k0949j15778j4263R2587
560C2632J5936p2093L458P7331n563r6912l1860R5153Q8753n7396j23575P603
572f6533J22352K4823r7226k3936P8083Q199q1581j2834Q8050M4047p6175q4175
584g6906M1446J06757k912r7849j4110P5627K54o8345J7034P9472j4559r5541
596d9632k0318R1002O4771o1344r0528K6219Q7076j5520p6043K7907P9691l9238
608B4043j02814J8912J17265L0919j00308q2095N3561R8763j2878q4842M497O8691
$$ y = [-36656, 116756, 91368, -93290, -135353, 25294, 109493, 7033, -69077, -10666, 36863, -15177, -55038, 10199, 86564, 32513, -89407, -80720, 53734, 93029, -7205, -55291, 2856, 22466, -23427, -15196, 52508, 58951, -27161, -85964, -16871, 91035, 70086, -45692, -59955, 32632, 48568, -23525, -20067, 57264, 51701, -45211, -77071, 18082, 106835, 49439, -74136, -66533, 55819, 80642, -16584, -40520, 37563, 45762, -35819, -48653, 39397, 83444, 7269, -76906, -35460, 71297, 68385, -29464, -43574, 32053, 32307, -36038, -19004, 60468, 45909, -49632, -69950, 21052, 85823, 24479, -66049, -39830, 47246, 31726, -44317, -16410, 63281, 24043, -78771, -59859, 57406, 88325, -11983, -94078, -40517, 58246, 45368, -39474, -34977, 33714]
620C3714k2233p5735K9592R7189k772j02091m8011O7183Q0926j8722p6678p057
632d4695N3965n733m5201L4496O5855l8139r1859M644Q7852L6628n4751n5724
644e2662K1433M8484j5677l8331M0394N3774n7716q6352M2633J04916j217r0721
656c1042l5913N4959M8864k7376m1845K9789M4925m6016o4401M9804Q9401k6834
668D4315r2730q872O9133L4785l3621l6461J4250K7808j8481k8217L6670M4907
680E3486m3155o1990K9525O5632l966m6361j1777K2335J1268j4541o606K7787
692B1637J4955m8583l7131N5416O2260l7160o6819J0015M9384N518k8202p722
704f432K3752P476m0719k3287N7649N4859n0357p6558K2295O7984M615l8839j2564
$$ y = [33714, 11481, -64254, -34662, 62527, 59755, -42336, -90347, -23164, 57762, 39040, -37638, -44695, 9270, 3537, -41664, -7168, 58687, 20548, -71311, -66667, 21185, 57813, 3062, -52662, -31229, 17255, 1578, -36753, 3641, 57415, -301, -86653, -44020, 60896, 59679, -31042, -66955, -11996, 36868, 9492, -32353, -2564, 42361, -3655, -68056, -18252, 71149, 44315, -48415, -57287, 11846, 46631, 13010, -23451, -9201, 18607, 126, -28091, 8579, 53486, 10331, -51659, -22134, 43498, 39532, -6829, -18606, 3729, 14997, 456, -6150, 21637, 36592, -11991, -49122, 6294, 68554, 31394, -35425, -25410, 23974, 29492, 1290, -6432, 17320, 24796, -15923, -39210, 18439, 73298, 22941, -53617, -31322, 36662, 41277, 2438, -10126]
717a0126J3781J880j6695l63L9172K0060n3361m9863M2118O2097j7682m6989J951
730a4020J7830q979p085J9958K3133j4152m8584j4988N5666M3976m3039n0371
742d0655K3311L3519j8428j6724K4798J9222k4465l8369K109N1269K8811m6837
754b439m9556K8435M6551j5203k7883J5865J5418k0394k0353J3296L2923P567
766B4227m0022l3299L1810M5438j7525l5594J1530J8680j4914q950K0637J3065
778A5083j5966k5989k481L4327K4281l0415l3931K2753K9282j8097j5059K2708
790F496Q701k6495j6238J8659L0111L573l4651k5478K8856L4306j8308k4640J6581
803A473J0536k1306o957K5198J6529j1739k5247j1603K3815L0081j2187k8658
$$ y = [-10126, 3655, 5535, -11160, -11523, 27649, 47709, -5652, -55515, -13397, 48700, 31018, -15971, -14020, 3810, -5169, -12254, 7704, 30837, 16685, -31899, -46887, 8779, 52755, 9716, -40655, -17344, 16175, -2253, -18977, 5821, 25043, 578, -37791, -35682, 15587, 44398, -2439, -51995, -23560, 22991, 7788, -20095, -4230, 11188, -9206, -29559, -16263, 16660, 24227, -15795, -49094, -17284, 28154, 10629, -24965, -13435, 5245, -9669, -18619, 2018, 15083, -883, -26872, -29353, 4974, 29255, -1160, -35091, -12338, 16944, -1153, -16212, 6496, 15197, -11298, -27536, -8877, 21234, 24807, -9844, -35322, -6466, 27840, 9532, -15108, 1473, 12009, -9297, -16254, 8944, 25473, 13734, -11513, -23116, 699, 30780, 18593, -10065]
815a0065L960J2250r387K931K3074q44k5660j0320J1043J7959J1860j3670k3942
828a0811L589J6830m469j667J7764l654k8977l422K5480J4594o720j7068j4674
841a3205R512K0389n105j3191J0199M883k1688m451K6435J0194j6474j4397k602
854i501R177J5487l348j6952J775R204r723l148J9086J956k1899m994J1623N081
868C824J486j934j1295k038J0893J45n543P318m51j7669N03J9272J592j1471k261
883g629j904L21J1411K586j2465j412O258q206j724J6072K133j6631m306O551
897h945M065Q925J301j7232o111J5054K850p871O382L773j4001m267J2466N729
911B118R73j446j2375p142J6809J0542j1561m204N641o977l407J3960N799q826
$$ y = [-10065, -6105, 6145, -3242, -311, 22763, 21919, -3741, -14061, -3018, 14941, 26801, 13131, -10811, -7222, 9608, 5139, 3472, 21236, 17582, -11395, -14817, 10663, 25257, 18537, 1469, -13205, -3693, 16696, 11591, -1600, 8599, 13482, -8206, -12657, 13778, 23972, 7498, -6899, -9501, -324, 15163, 11815, -5137, -3362, 5842, -3881, -7029, 12057, 14013, -7886, -12880, -1257, 3824, 5310, 3376, -7919, -9957, 936, 1081, -4462, 2856, 2405, -15264, -14761, 4511, 6103, -5368, -7629, -9533, -9212, 2199, 4785, -7680, -9092, -2834, -11040, -12764, 3308, 5441, -11190, -15496, -8945, -4880, 4045, 5346, -11886, -17997, -2943, -93, -7964, -1582, 2191, -11810, -16077, -3611, 2118, 3091, 1645, -10730, -17872, -1063, 9479, -2082, -6286, -645, -7622, -11029, 2931, 8730, -96]
925i6l109k470l609J1706J0448j1642r249Q598R11o098R482P886j0994p058L624
940a670K147O454O931j1892j1210J2915R157j0383o87R714n393q997M785N522
954G393O46J656p665q102J3100J1723j4166q872J3496K705j2070K064Q692m067
968F533m236j63j065P046O182j2789q595J5861N696j6217j267J3245l797j0615
982d181L277O262J329O9q701o727J3425Q989j6110o347J5411n80j5378M205J3837
997H780l067r252m741M23J1394O622j6058r761J6423N866j6884L85J6832l554
1011C408j5352J50R045N997j727j3136n531J7464P489k0293m006K1589L64k0465
1025a5004P36J6191J419r726o552K450J2688J748j7498k717K3309J411k5522M22
$$ y = [-96, -3205, -5675, -9284, 2422, 12870, 1228, -8021, 577, 1488, -4610, 4872, 12758, 1764, -5294, -1670, 477, 6931, 13862, 1970, -9240, 3675, 12832, 2449, 1762, 11476, 6083, -2914, 1871, 7393, 8039, 9695, 2030, -6072, 7028, 18751, 4585, -4287, 9209, 11914, -156, 1908, 10600, 6533, 2297, 2134, 1069, 8115, 14297, 1508, -7087, 8774, 14470, -1747, -3014, 10231, 6434, -4181, -904, 5358, 6687, 6756, -1945, -8672, 4753, 13742, -2368, -8715, 6696, 6116, -9262, -5057, 8780, 5713, -3539, -8280, -7857, 3537, 10159, -5899, -15660, 763, 6629, -10255, -9870, 6962, 3408, -11944, -11794, -2749, 3248, 1521, -11615, -17146, 318, 7807, -12486, -16492, 5097, 5461, -15004, -14268, 1923, 3342, -6384, -12936, -10486, 2202, 3950, -13548, -16265, 7044, 8455, -17067, -16645]
1039a6645K3855O89j8458l110J0374P821k583j3002j481J9811L350k3545k109
1052a5033K5463M4k2837O66J8891K507j1533q173M686J6253J799k1240m254K4009
1066A1248L555k3890J47K2322j028j8144j379J2823R099n692j7099j044K3406
1079A4324M726k5655l504K5397J419k2669N89J8629K221j2145q817N312J5808
1092A5635q22k1480j156K5013jk5679K087K4420k326k0403j856J3468P799o515
1106H184j5550J161K0546J53k3992K482K4200n268k4132M493K0454n31j4815p721
1120a0336O917J4600j014j9822l22K0762l170k2741P412K2349q284k1187K178
1133a2658J6559O092r188j4948L089J9784l246k2300N681K3918r619k5339Q900
$$ y = [-16645, 7210, 7899, -10559, -13669, -3295, 4526, 1943, -11059, -12540, 7271, 10621, -12924, -15033, 10430, 10474, -12363, -11697, 7194, 9701, -1832, -10005, -5319, 10934, 12733, -8507, -12761, 11248, 14803, -9087, -8940, 13382, 12354, -5790, -7169, 5654, 14753, 9061, -8038, -9082, 14324, 19050, -6605, -10109, 15288, 16707, -5962, -5373, 13256, 15477, 3332, -5485, -173, 15635, 14813, -6667, -7823, 17190, 17189, -8490, -6403, 18017, 15691, -4712, -6568, 6900, 14699, 8184, -7366, -6205, 14341, 14494, -9498, -7016, 17184, 11916, -12216, -7723, 12731, 12200, -2615, -10336, -3419, 11181, 10167, -9655, -9977, 10785, 7615, -15126, -7714, 14635, 6351, -14836, -12658, 3901, 9993, 805, -14143, -11054, 8730, 5484, -16816, -11135, 12783, 3164, -22175, -13275]
1146a3275K3227k198j7779o543R983J3923n435j9219N717K2251r815k5539J2799
1159a1903K7853r978k5739K631J8913O353j0880j2833O391J7295q169k1313J4139
1172g240K6864j6179k9480J1969K8306k310k0846o170J2094J2793p960j6378J1206
1185c331K1476j5365k7268J6953L1760j1133k8525J315K0330P997j0840j2574
1197i205Q711J6915j1991k2422J6821L0143j6259l3075Q447K8760J861j7878p837
1210g009R756J1087q630j4898J3725K2889j8582l0685J6072L2780p607k6080m24
1223g606J5705M325r602o777J1546J2875j8787k3277K1795L1852j7351l3197Q687
1236i812K5161j871j5502k083J1385M817j5152j3343K0339K4557k1145l3492J4872
$$ y = [-13275, 9952, 7754, -10025, -16568, -6585, 7338, 1903, -17316, -11599, 10652, 837, -24702, -11903, 15950, 5972, -19767, -17136, 1777, 8130, -2750, -15583, -9192, 8103, -66, -21379, -7240, 19624, 3445, -26035, -14066, 14240, 11930, -8916, -15086, -2992, 9801, 1841, -14537, -3331, 18145, 2780, -24488, -7535, 24225, 13092, -15433, -14118, 6212, 14209, 3369, -9205, -494, 16421, 4430, -17992, -1171, 28972, 12713, -20362, -11915, 16845, 18706, 828, -7009, 2747, 13834, 5204, -9694, 4031, 26920, 8338, -22347, -6275, 26505, 18898, -7182, -7606, 8099, 12424, 2822, -3955, 7591, 20466, 1679, -21598, 197, 32049, 14698, -18499, -9812, 15349, 13478, -2024, -4107, 7278, 12095, -3057, -16400, 3939, 28496, 7351, -26141, -11269]
1249a1269L1716p745k1563K140J1130j240r260k029J4070J0071k0588k2299K1085
1262e781K9169j5940k7408R944J6827p577r855P604J0311l968j8697o739K5297
1275C187K0846k5363k8985J8518K5907j3106j6857J2503J1278j3039j5420O521
1287a4010K4465Q917k9048k4695K5153K9721j7159k2714J3778J2997j6101j0215
1299a8911J7444J8018q359k6773r062K9393K3355k2526k5158J7110J6485j7465
1311f449q257K3711J0451k3466k0525J1553L0114P333k9555k0227K5090K0758
1323B0531k2186j3230K6124J0500k9603j6518K4643K7356p199l2610j1643K9447
1335E612K2164k3006j9476K2034J3174k6628j1612K8998J8266k0673k6558L428
$$ y = [-11269, 20447, 12702, -8861, -6721, 4409, 3169, -6091, -8120, 5950, 16021, -4567, -26866, -5781, 23388, 7448, -19960, -10016, 6811, -766, -10621, -3017, 7294, 3326, -15371, -22110, 3187, 24033, -1330, -30315, -11797, 14110, 1004, -15853, -3350, 7928, -5111, -20531, -14010, 10455, 19372, -9676, -34371, -9218, 20503, 3344, -19370, -5592, 7405, -8696, -18911, -1467, 16551, 8192, -18581, -27643, 1750, 25105, 2579, -22579, -5469, 11016, -6449, -14706, 9005, 19456, -4010, -24535, -12982, 17132, 24465, -5090, -25317, -227, 20531, -1655, -14885, 11239, 21739, -7864, -24382, 261, 27617, 20418, -12192, -23835, 5612, 27776, 4770, -14706, 7328, 20502, -6126, -17738, 11260, 29526, 8853, -17705, -14277]
1347a4277K8370J3298k2399j8981J7015J2971j9386n066K7889M825l3087j3391
1359b2219K5270K3805q544k6302q102K1792J2779j9508o625K4060J094l4650n495
1372b2645L7490J7124k6074k7589N769K6464R387k0138j1955J7763M818k5911
1384a5497k173L5168Q927l4041k0432J7427K2981K459j6502j1229Q242M797j1332
1397a1205M721K4789n483l6629n108L2994J5190j6602j5352J030O907K164m635
1410g219O880J4688j4095l2801R192M3108M851l7165j4744J9803J4108n587q812
1423g793N146R939j0281k3209J1518L8215j985m2199j0054L0934J5277j2909r774
1436g175L171L687m718o515J1145K0638j0801l4103K834L6061O815k4401p091
$$ y = [-14277, 14093, 27391, 4992, -13989, 3026, 15997, -3389, -8455, 19434, 24259, -8828, -22219, 3051, 26856, 18312, -7990, -16092, 5700, 18479, -1029, -7654, 16406, 17500, -17150, -22645, 14845, 31969, 5895, -21694, -15925, 10539, 19926, -212, -12167, 5596, 10414, -15497, -17670, 17498, 26425, -7616, -28048, -10621, 12360, 14819, -1683, -12912, -4670, 127, -11205, -6484, 18305, 12822, -23807, -28915, 4079, 19269, 2667, -12685, -11655, -4748, -2584, -7219, -339, 14349, 254, -32547, -23355, 19753, 24604, -12561, -27305, -7502, 6606, 1019, -7793, -2647, 7292, -2989, -26198, -14680, 23535, 21550, -20649, -30703, 231, 15508, 2599, -7175, -4004, -317, -5035, -11550, -405, 20233, 9432, -24671, -21837, 14224, 21039, -3362, -10453]
1449a0453J1221l9o458N086J3456L310k0742k1763J9030L8713o673m0897m641
1462b0850K9766O121j5679k00J2609p45j8890j0521K2293L1767j4073m4521k329
1475b5252M0157J2471k3088q940R198q58q777J657J6587J1601j7471l0417O432
1488a6700L7746O612k7659q898J1350k676n486J2932J3797r036k3862j1403K1635
1501a648L1029q417l5149l638K4380J092j3449R775J3298j4369k3649K672K7342
1514I269J9897j8862l6159J415L4937P531k1942l311J1782p826j3576R860J8972
1527A1987K815j8519k0908P058K8611N836k2403p789R600l235m755J6311R882
1540A4491j7270j8699M531J8780J2519r788k0353J518J5436l439q232J5677R665
$$ y = [-10453, 768, 729, -5729, -643, 12813, 16123, -4619, -26382, -7352, 31361, 24688, -16209, -20850, 8916, 15037, -642, -842, 11767, 11022, -7868, -18389, 3904, 35671, 21598, -22923, -25252, 14905, 27376, 4288, -4652, 4546, 3688, -5089, -3432, 13155, 24756, 7285, -23132, -16700, 21046, 27658, -1, -8899, 2451, -225, -5711, 7221, 21018, 11982, -11880, -23283, -1648, 29381, 20964, -14185, -17823, 6557, 7649, -5800, 3975, 17273, 2904, -20745, -18073, 9269, 29166, 10304, -25855, -24440, 10497, 18028, -3914, -7225, 4557, -3269, -16845, -6985, 11987, 14802, -3717, -24625, -17567, 11044, 16880, -5523, -13312, -3712, -6947, -11702, 4609, 14491, -2779, -21478, -16947, 1833, 14352, 4564, -15789, -14271, 1165, -2274, -10506, 5171, 14836]
1553A4836k5292k0514K0773K9481q50k5928j9361J2685K6055j78j9711K145J1855
1566E996j3966j3068K0925K3451j1623k7169q315J6814K3916J621k1573r006P686
1579d311P7O64J8239O350k5837j8284J4936K1664L727j0087j2319k571O663J111
1593B2L104J6364n29l3244j4808L3615K8682j4533k8568m809J4416J2715l576
1606H851p900P876M085k1595j2768K9890K6924k0592l2792K37K2197J4565m213
1619A4765j4761n610O351j188k933J4923R720k1987j9347J3908J9963K2q197p936
1633b307o436K741Q491O720M289q045k3170l567L0556J7006k2688k0742P245J1610
1647A703L60n86J640R47o160j5124L72K9235J4946k9593k8359J3470K6236M110
$$ y = [14836, -10456, -30970, -10197, 19284, 18434, -7494, -26855, -14170, 11885, 11707, -8004, -5859, 5996, -7970, -21038, -113, 23338, 11715, -15454, -23769, -6955, 16961, 18582, -2991, -11997, -4311, -4234, -3570, 14669, 21019, -4818, -23102, -8166, 13498, 17225, 7138, -5181, -7752, -1089, 22, 3126, 19490, 18961, -14283, -29091, 4524, 33206, 18673, -9895, -14704, -288, 12427, 8851, 951, 8827, 12912, -8683, -21451, 8439, 35363, 14771, -18021, -17784, 4413, 18978, 14765, 4, -5606, 745, -443, -3376, 11547, 21267, -720, -20067, -6159, 13804, 13826, 5629, -2307, -8743, -6002, 2489, 9209, 13498, 5453, -17717, -21284, 9272, 26278, 3590, -17152, -9907, 1703, 2063, 1477, 3117, 4064, -2096, -17220, -16848, 12387, 27333, -2260, -30619, -17149, 9087, 13197]
1661A3197j0528r823m500L485L641K054J0015L940k1088j7324J5771K3358p60
1674A1438j1097r901q775L562J8717J1017q165j6289j2676N285K5176J1492j9804
1687b0j5465O432L787k254J1148J1795j0460k0839p535J6357K6721L865l0735
1700g203k0591J8274K1786l809p409J367n226p697L486J1536J0219j435k0307
1713g009j4605J6798K2374k290j3120n775n402J047J6717J0742j0776j5420l835
1726a0554O859J4989O133j2512j0737M852J055l014J3044J2677j6758k3958L956
1739a3968K4202J6020j0333k5918r209K1317J7257j0928r005O310l461j2623M624
1752e715J8981P175j2274k1171p195K1835K3559r059k2937m675N673M406J1092
$$ y = [13197, 2669, -7154, -11654, -8169, -4528, -2474, 7541, 11481, -9607, -26931, -11160, 12198, 11438, 341, -9560, -18335, -14773, 3944, 14961, 6796, -9493, -22169, -16884, 8292, 19784, -20, -15485, -9053, -5266, -7520, 3628, 15423, 4963, -15876, -23411, -7054, 19667, 23532, -7203, -27794, -9520, 12266, 8457, 1048, 2415, -2811, -10508, -7022, 4514, 14733, 13298, -7009, -21614, -4816, 17558, 15268, 2148, -3627, -9029, -7982, 8735, 19477, 8701, -6719, -10554, -3695, 11294, 17427, 4915, -5822, -970, 85, -2929, 10115, 22792, 6034, -17924, -13968, 10234, 26254, 15921, -9997, -19206, 2111, 19368, 8440, -565, 5745, 2284, -10339, -5715, 13266, 20441, 8167, -13004, -20199, 1636, 25195, 16136, -6801, -11476, -5803, -1397, 9695]
1765I695O966j2653j5512m9P911J0651Q548q615j6581m111O400P920J3074L920
1779A7564k2937k2573J2539K8582O725j5521j8716n149J4104J2852l471m247M324
1792D076r683j7394R849K8036N177k1887k1093n4K1705K0119q741k2516l322Q633
1806g095K489N136Q489n691j4723l648O495R448J0657l195j9295q724J1403J3880
1820E626O393l539j8879j2377J6262K0950l738j4127m273K62K330P032M143K72
1834F337j899j3130j0947J6360K7161n146k9290j0787J4882J7842O541j0838j6404
1847i318K73R664J489L056R533n584j9934l878J5612J4357L449j0907k0640m575
1861a7403K0132J7699l122j3492j3836l981J5703J7900m631j4260l849j028k113
$$ y = [9695, 16661, 4008, -11504, -11553, -3642, 7009, 15557, 6942, -9639, -13750, -7350, 570, 13644, 17564, -5373, -27946, -15407, 13175, 19900, 4379, -14337, -19486, -5382, 7470, 3999, -248, 4076, -5607, -23001, -13152, 14884, 20061, -1826, -22919, -22973, -1268, 18851, 10110, -12406, -15728, -7095, -4606, 530, 9019, 3328, -11395, -15043, -8548, 900, 11557, 8362, -10933, -19657, -8254, 5626, 12019, 8480, -10399, -22776, -6514, 14436, 10698, -3429, -7702, -7440, -5110, 1922, 6065, 6337, 4438, -8692, -19639, -3279, 23882, 18736, -10554, -21341, -6459, 11383, 17924, 7086, -9318, -9045, 619, 2108, 5164, 14697, 9113, -10821, -14699, 913, 15270, 18719, 7812, -12828, -17403, 2729, 20428, 17306, 3814, -10022, -14003, 1700, 19600, 14969, 709, -3140, -4168, -6281]
1874f281J0127J4527k157j5951j5697m20K3271K3256j3557l1930m779K0177J2579
1887A3165j340n156q517m591J138K560Q720J2252p161k6166o885K2485J7766l319
1901A4951j4822j5574o92J7894J3379o695j1070n382l085N206J3265J826r065
1914A36n988m003k601J2273J5917o724k1448q186J0140J8292R458j4945k2722
1927b0401L055J9568M824o413j011k276q440q98Q378J0631N070j2005k1964L66
1941b1516K7453J4043j4258j7940n134O678J5211Q069r433j0851j349k77K927
1954f377J3415P429j1753j5282l638Q148J8416J1529j6059k5764k77K1374J4572
1967A5733j303j2948j4076O09J3822N926q37K473o391j6222j674K0340J5120m408
$$ y = [-6281, 3846, 18373, 16216, 265, -15432, -15852, 7419, 30675, 17118, -14812, -19591, 586, 13165, 11825, 6669, -1848, -6439, -5301, -2741, 5979, 18231, 11070, -15096, -21981, 504, 18270, 14951, 129, -15445, -16137, 1757, 15136, 8441, -2629, -8011, -11096, -5890, 7375, 9201, 136, -5852, -9855, -12456, -183, 15734, 9010, -12438, -20624, -10484, 7808, 17266, 2321, -20401, -17346, 2222, 7046, 633, -378, -2654, -11094, -11992, -3614, 7017, 12087, 82, -21882, -21516, 5937, 19980, 5722, -12218, -17352, -10674, 4537, 12606, 3173, -7678, -9027, -9304, -6377, 7038, 14467, 2714, -12568, -16206, -8058, 10358, 21887, 5828, -19936, -20213, 1161, 15733, 14430, 1482, -12594, -11985, 1837, 7763, 6926, 9399, 3008, -13214, -14888, 5452, 20572, 16164]
1981A6164j8601j7013O116K6223J1637j7335j6080Q95N368P146P665j572q333
1994B280n292l963J591J5566J2367j3789k1222j495J4811J5071M396j5920j9990
2007a5589M751J9361N339o629m657n399l952M851P594L976J135r318j6730K481
2021a2786K4422J0500j5481j8350l906J1810J7402K194j6979j0579O391M914P91
2034C43O173K010r861j0140k70Q495J5186M957j9688k0593Q075K2707P818q639
2048F573j4368r531O915J4871K597n367j601o278j0261N752J8411O702j0523j6983
2062a3091r979J1819K5150N440k1851j6949L974J2425J0650K339r972j1065P72
2075a0338L807L183J0905N228j5008j7107L863J7011J4521k175k0636j6720J2866
$$ y = [16164, -2437, -19450, -13334, 12889, 24526, 7191, -8889, -7994, -2626, 4520, 12185, 10613, 2280, -3012, -6975, -5384, 10182, 22549, 8760, -12462, -13957, 854, 15925, 20321, 4401, -15589, -10838, 8523, 13862, 7233, 2576, -2823, -6775, -1924, 5670, 9646, 10781, 1463, -15267, -12786, 11636, 22136, 6655, -11695, -15601, -3791, 13611, 15805, -1174, -11753, -5362, -448, 343, 6516, 8526, -1335, -11475, -11745, -3250, 11936, 16893, -2795, -23388, -15313, 7394, 15212, 6573, -7795, -17326, -10411, 4460, 7057, 1690, 89, -6189, -16450, -10698, 7713, 14415, 3892, -13091, -23070, -11251, 13899, 19339, -2512, -19461, -15487, -3062, 7588, 9927, -45, -11110, -10338, -6531, -3348, 7557, 12785, -2223, -19330, -15467, 1544, 16065, 13890, -6746, -23466, -10600]
2088a0600K2266J038j1291o365k154N66O211N991J395k99r773j3772P279K3798
2102A4290N801j8023j5240M75J3147J5052o35j7011q572P252O681K419M086k828
2116F894j0200l734M523O634R210J574j7226j4650J0782K0448M702j1591j5640
2129h274n356J3664J6525l943j2852j773J036l099M434J1403J843j0175j3164
2142i731m674J5119K1514m315k5068j0367J1880J3612N375l688j2077p828M479
2155e769O830M156N887l303j6278p527J0703J4180N822o508j8377j1581J5128
2168f637K1808k51j5421j1640j148R472J0893m16o897k119l731p978P527J9206
2182A2668K013j9331j5362M533J7954J4156q669k1003l934J3603O661j577Q10
$$ y = [-10600, 11666, 12704, 1413, -4952, -7106, -6540, -329, 5662, 7057, 6758, -3015, -16787, -9508, 14290, 20091, 2068, -13172, -12697, 450, 15502, 14867, -2144, -10716, -3464, 3217, 5636, 9722, 6894, -3306, -7040, -2517, 4117, 13327, 14901, -2325, -16975, -6193, 14255, 18957, 7366, -8274, -13630, 34, 16559, 12616, -236, -2009, -973, -4072, 362, 11765, 13608, 3433, -9731, -14405, 714, 22228, 17913, -7155, -17522, -5642, 7970, 13345, 9657, -2420, -10248, -5769, 1061, 5217, 11104, 7801, -8477, -16004, -5301, 8879, 14701, 8193, -10184, -21765, -6637, 15171, 14920, -501, -12141, -13289, -3817, 7076, 6660, -237, -2356, -6087, -14065, -6538, 12668, 14681, -4650, -20012, -15479, 2475, 16631, 7962, -13041, -16975, -3372, 3289, 1712, 2522]
2195B522k270r276k468O337Q393N505m244j6122o419J3739J4887j124r994j1339
2209a1873l087J2335J5392m606j4111m009M306L777M864K934l429m935m961l370
2223a0773J0498J7928m597k4341q672J6482J6804J457j2442j3029J204J2185L490
2236F194k671L066j264j3711l681J4048J2961p43j2660j4006j68J8781J3248q068
2250A1326j4184n973J601R848J2332k594j3383m501K491J556O920Q621l899j3755
2264c594p822L798J5221J3532q989k4464m366J9627J1772n190q082m400j143K409
2278a691K791L963N741l965j7730n358J9078J5426q061j5393p068L788J3002Q014
2292A2537p257j0339j704J833K768Q360J615r657o649J710K900N877Q081n284
$$ y = [2522, 252, -9024, -11492, -5155, 3238, 8743, 4499, -11623, -18042, -4303, 10584, 9460, -534, -11873, -14960, -2625, 12767, 8161, -5950, -9959, -5653, -1876, 2988, 5922, 2493, -2442, -7403, -10773, -275, 17653, 13056, -11285, -19957, -3475, 13329, 14786, 2344, -10685, -9481, 2704, 6194, 3523, 6589, 5325, -8386, -12067, 1981, 14942, 14199, 1539, -12467, -12635, 6146, 19394, 11326, -2858, -8831, -7230, 2618, 14950, 12356, -1027, -5528, -3037, -1481, 5439, 14060, 10161, -3594, -11416, -7618, 7603, 21135, 12146, -12318, -16684, 2943, 14715, 9525, 1443, -2957, -4100, -1691, 1100, 5063, 10804, 6839, -10891, -16249, 2829, 18255, 10194, -5199, -12267, -8479, 4523, 12537, 5280, -5059, -6763, -4930, -2162, 6198, 7813, -1844, -8493, -6783, -3883, 1994, 10075, 4791]
2306D791j5414m778J1547J2493K397j1532j5686K488J7953M542r831l874K422
2319b482l533k228O619P799O97r738j4230K310K1679R600j5746j5408K616R009
2333c036O870L149n163q553k017K029L884R357L567j2012j1622L382J0134P554
2347G523L016q770j5778n82J6536J1158l852j1081r988K654J3297M809o020j817
2361A105M71q408k876J3606J2121o053j5655q621Q137J8558M995j5781j1565N867
2375d099O878K08L197K022o215p037O9N610R565L462j1884j2282M807J1813M188
2390A0302r91o740j0754O24J3443O863o332p160k942J017N353M619j946k097k053
2405A206p650j270J5420Q790j2551j5189R55J2564R451k714j2409n480P581M503
$$ y = [4791, -10623, -15401, -3854, 8639, 11036, -496, -16182, -13694, 4259, 8801, -1030, -4904, -2482, -6015, -8243, -1624, 6175, 6872, -2866, -17096, -14786, 6893, 16493, 747, -14661, -12045, -3036, 3834, 6983, 1820, -6733, -8750, -6721, -2837, 6520, 10087, -1925, -13547, -10165, -31, 7523, 10539, 1769, -14009, -14591, 1945, 13103, 9251, -1830, -11818, -9164, 4133, 8942, 2922, 1105, 1576, -6832, -9708, 3898, 16019, 9966, -5689, -14310, -6173, 12385, 17380, 1599, -9966, -4099, 2779, 2987, 6184, 8206, 1991, -5046, -4977, 633, 10198, 13660, 1776, -10506, -5699, 6114, 10302, 9311, 2571, -8183, -7559, 5884, 12747, 6415, -745, -3687, -2670, 2683, 7302, 5356, 3259, 1206, -6444, -7714, 7706, 16496, 3945, -11244, -10289, 2275, 11726, 9012, -3397, -8877, -1296, 3207]
2419C207l302L371M399q398j0332L862J0974O326l429j2363q875Q604J3385N16
2433G945o233o082n449J191J1579O526p706p409j720L58M039P666J388o515o957
2448g379m856M253J6187N522j6507j4713O781J3878L371l844o207l570K041J830
2462c213J60O741M592j1214j3303O705J6151L152q088r036l843O878R978m09n462
2477b11k009k930j803O720Q262l759p403j361k45K382Q373L016q560p669M09O939
2493A51R297R88j2897q699R284R940l328l404N27j947k970K204M358N208J7j1358
2509b629r232J0923J5397l758j2395m001K804N008N739o65n547k063j131r04N532
2524C078Q126m213j0497j828M097M308O109Q9j0750p746N733R316L673k732r810
$$ y = [3207, -95, 3276, 7675, -723, -11055, -7193, 3781, 10107, 6678, -5685, -14560, -5956, 7429, 7945, 1712, -4370, -9819, -8628, 2951, 9477, 1771, -5638, -7358, -7000, -2961, 4705, 6093, -422, -7379, -12235, -7982, 8205, 13727, -2780, -17493, -10712, 3166, 6537, 2693, -3514, -7084, -5043, -3213, -3053, 3688, 8280, -2934, -16237, -9532, 6619, 9771, 1683, -7353, -11196, -4318, 5660, 5251, -211, -2220, -5150, -6953, -233, 8029, 4270, -3133, -4494, -4739, -2357, 6016, 9032, 472, -7197, -6788, 151, 9448, 10436, -2461, -11160, -1876, 8064, 4736, 1332, 1859, -88, -3058, -854, 3504, 8712, 8729, -2629, -11861, -938, 14459, 10701, -1694, -5695, -2891, 2117, 7856, 7191, 1644, -419, -1550, -2454, 3078, 11204, 6991, -3506, -5334, -1237, 3071, 9180, 9269, -1481, -9227, -3494, 5822, 9495, 6763, -3047]
2539c047n907P687P527k370j950K116n291p088M890J0093L106o672j0655m123
2553a1684J0884J2323m894j1640p67L221N21K815M045k625n827k863n5O453P812
2568G719l467j1211k254O245L390K979J94p995n959N497P404P82k685m551l697
2583g609L269N711r61j250J835m357o860N512J0976q34r171n437K092P941O041
2598F898n928q225K826M642k385M01N839j191p648k554M556N797M013n164j0020
2613h143J064Q752L172j782n19m764m783N162Q190o79m563k750k590J380O751
2628C898K521l248k333l431l233P265J0452l887j1867k192N635N033K667k978
2642D302n686k0K734j510K270P035k607j0732j936Q116N421J90m660p031l00P611
$$ y = [-3047, -8954, -1267, 6260, 3890, 1940, 4056, -1235, -8323, -3433, 6660, 9766, 3094, -7561, -11684, -800, 11523, 6629, -5011, -5778, -2557, -2036, 779, 4824, 2199, -3628, -6491, -6546, -93, 7719, 4252, -6959, -9213, -2968, 422, 3401, 3595, -4400, -10359, -4862, 2542, 3324, 639, -3912, -7609, -4340, 1371, 410, -840, 995, -3362, -10222, -4710, 6266, 5432, -3739, -9176, -7084, 857, 6898, 970, -7255, -4429, 213, -2172, -1771, 4068, 2877, -4771, -7325, -2769, 3028, 7041, 1877, -8143, -7079, 1673, 4845, 3063, 2544, -2220, -7003, -1841, 6349, 5670, 1107, -1643, -4233, -2853, 3898, 6419, 3171, 838, -2593, -5826, 1439, 11891, 8004, -3863, -6055, -420, 4613, 7280, 4302, -1384, -1404, 1330, -180, 2090, 9125, 6518, -4214, -6150, 1966, 7387, 7577, 2917, -4114, -4414, 3197]
2658C197K835k707q42j392n041K025P422O96m051k055k211j453O042M172l126
2673C511m726k052m94M848P085l821r878M16O633M12n65K09k397k491J069O61
2689a580J788M772l143r164K3R675K906n270l106j613N51M243K132l232r15K16
2705a717l920J038P213P97o242k291J171j9M040M093l949o530L24L032L731L239
2721D010l312q034N93O945J155j628J733j764n373P55M662L300L58m175p589J830
2737f534J0515J784o202l025J607r15K247L875p69k334j420k497P10P034K214
2752F290o650l392K842Q87J957L828k786n728M13L555J336J656l28n018j738M660
2768A784J431j335J989n58n339k37O109J807j901k962l050M66O652J251n645j412
$$ y = [3197, 6032, 3325, 2483, 1091, -3950, -1925, 5497, 6193, 2142, 87, -2124, -3577, 2465, 6637, 3511, -1215, -3267, -3761, 1087, 8172, 4351, -5527, -5111, 1522, 1934, 1369, 1578, -819, -3310, -2241, -1580, 208, 4980, 1837, -7327, -7304, 2371, 5277, 7, -3099, -4712, -4161, 82, 2214, -1018, -1933, -1717, -5637, -4599, 2614, 3411, -2831, -5122, -3951, -3970, 70, 4163, 214, -6316, -5992, -2960, 771, 4010, 698, -7336, -6743, 202, 1357, -271, 1462, -302, -5675, -4920, -258, 3042, 3400, -775, -8364, -6534, 3981, 5765, -437, -3462, -1855, -2770, -523, 3352, 2583, 249, -1171, -3668, -2958, 4076, 6290, -360, -3752, -910, -23, 1934, 5762, 2976, -2752, -2339, 1216, 2552, 4208, 3880, -1138, -2876, 1784, 3215, 1880, 3869, 3311, -2028, -2265, 3844, 5651, 3750, 788, -2262, -1796, 4856, 6107, 462, -950]
2784i50L193j609m35M054M12m260j028N79L30L814J369o202l061L872K647r89
2800A736J470j407m691Q29M770j4j537J4k797j790L766K682k472k86m38m032O21
2817c576O935J011n443k005L83O41L264J570m137k373J922l32j274N029J491o050
2833b944k525K872J916J206J640m474l712L046L202r25N52K67m385j005M939J298
2849I68j889m2n82l314J985M266j302j440L9k126o59N322J595m923j273K413j85
2866a147K44K618j516k488J608K51j612L262K376m802k573L833J944j246R13j028
2882F37k699J724K946j583j027J916k125j807L934J916k971p58J363k142J074
2897C98L828j021l271O63N20q72K548J670l894k300L700L95j222J922L0l573M15
$$ y = [-950, 2243, 634, 199, 4253, 4665, 405, -623, -44, 286, 4100, 5469, -733, -3794, 78, 2725, 1736, 3206, 1799, -2892, -2063, 2707, 2693, 1156, 1170, -1627, -3417, 349, 3031, 559, 273, -165, -4197, -3576, 3359, 4370, -1073, -3078, -2695, -2054, 1210, 2780, -1357, -3730, -1808, -2140, -3414, 1615, 3106, -2944, -5469, -2597, -681, 525, 2165, -2309, -6021, -2975, 227, -698, -146, 121, -4264, -5269, -330, 968, -921, -963, -1545, -4859, -2874, 1392, 90, -1350, -1311, -3437, -4096, 1226, 2821, -2102, -3375, -962, -1147, -903, 1715, 199, -2289, -681, -430, -2042, 1220, 3596, -1206, -3779, 54, 1998, 752, 1665, 637, -2062, -338, 2608, 1025, -2, 1914, -211, -2018, 1916, 3832, 861, 103, 1466, -676, 398, 4226, 3205, -66, 597, 1117, 245, 2793, 4463, 569, -1731, 1969, 2364, 1142, 3064, 3094, -479, -64]
2914f4K415m99O20J306l539k860M067K330k185o59P64k460L37L292n65j954J316
2931A662j100k556K537L029k554k166J310j481j35L428P07l953l30J989j006J74
2947d45K391k220k425J903P58k399J961J838l531j158L233R8j313J074p77k498
2963c510J817K310k432o89K088p67k193K680O91k715P54J741k334O99K397j882
2979a345j715J982N41k233J592J350k933n1K948o13j691J863K86k298Q91K173
2995G47k055K57K014k193j761L015J649k653O9J649j511K42K553j634j704K104
3011G88j62j780K064J661k833q25L178j236r93K651l39k846J315K014k020J76
3027H13J710j654j283K775K25l195J670K471k633m52K014j283n94J659k74k158
$$ y = [-64, 2351, 1852, 2472, 3778, 239, -2621, 1446, 3776, 1591, 932, 1696, -764, -427, 2865, 2300, 346, 1662, 562, -1994, 543, 3572, 1018, -1148, 162, -1319, -1454, 1974, 2681, -1272, -1602, 387, -619, -445, 1946, -274, -2699, -796, -38, -2437, -476, 1362, -2169, -3327, -94, 4, -1309, -235, -1012, -3510, -1693, 617, -1815, -2504, -416, -1183, -3376, -696, -5, -2720, -1966, -225, -2559, -1860, 537, -1345, -3060, -1078, -537, -2770, -1178, 172, -2761, -2812, 136, -477, -2168, -305, -19, -2317, -1426, 747, -1308, -1051, 963, -1230, -2991, 24, 1673, -980, -911, 738, -773, -531, 2022, 388, -1316, 788, 626, -1154, 910, 2571, -262, -1087, 2091, 855, -138, 2513, 2174, -672, 643, 2657, 637, 813, 2523, 869, -414, 2361, 2586, -609, 1061, 3532, 899, 447, 2461, 1178, 584, 2243, 1969, -189]
3043a89J504J573k690L45K434j020k392J864N33j798Q96J290k445K81K124j677
3059F33j074K274j57k839R61K519k597J0K385j564j760J735K12j286J253J34k954
3076b115L79L434j407k116J915m6k271Q80J914j280j82O07k229r1L284k56l445
3093c025J177J786j847O67J441j125j594J771k03j667K022L65k972L06K752p86
3109i32k103L076n78k218J076J627q55J7J209k516m15L470q71k622K008J311l003
3126b319P52K674n25j894M35J03l84K927j42l877M44K978r09r58K373n17k635
3143a474J054K118r55O73N64k727q05L483K5j813J237N6k663R18L650o78j604
3160A059N5l04p93K640M92k833M32J076k020J94L670j34l813k78J842L6J319N32
$$ y = [-189, 1315, 2888, 198, 543, 2977, 1957, -435, 1429, 1962, 164, 1060, 2350, -95, 186, 2310, 633, -441, 1833, 1676, -1163, -202, 2317, -280, -270, 2115, 551, -1209, 526, 738, -548, 705, 839, -2115, -1736, 1698, 291, -1825, 90, 44, -2227, -1347, 567, -713, -895, -288, -2517, -2608, 676, 420, -3025, -1848, -62, -1909, -1242, 199, -926, -2520, -749, -952, -2619, -597, -232, -3204, -2898, -146, -932, -3035, 41, -537, -2755, -1679, -52, -907, -890, 319, -2197, -2612, 858, -13, -2635, -627, 684, -2319, -1567, 1107, 582, -1312, -877, -774, -1158, 1769, 1627, -2250, -1806, 1172, 263, -695, 1678, 1161, -1474, -420, 1698, 743, 1416, 1980, -747, -1552, 1931, 1956, 143, 1380, 1436, -1227, -309, 3341, 2663, 1059, 1114, 810, 17, 2657, 3149, 316, 748, 1824, -196, -2, 3668, 3534, -279, -557, 1285, 1321, 2640, 3172]
3178C172l038j413K725K83j510J921N28l814o82L603L15q33M27k288j560L491
3194A327J522k293n62P13k300k10L858J52l219m27J091p56J602J646k441j624
3210a921J095j21n59L257L0n031n72L556M00o52N94j321j591J943Q33j453J307
3227b06P36m076j024M752J306k965m21m16p65J919K640j926j870J430j612j3L519
3244A008J004m229j055J944J86P21J793j015l348O78J646J86K185J29n030r80
3260d177M865J157k026K65N2k208J044K321L51j10l27l235j027N260K360m244
3276C21j999J527l42R79K197o77k197M17j58o90L718J411l859k694K334J289j61
3293A416J702m37l816m90L481R67K25k14l761j413M397K195l245J5Q65k620r75
$$ y = [3172, 134, -1279, 1446, 1729, 219, 2140, 2668, -1146, -1828, 1775, 2090, 1257, 1684, -604, -2164, 1327, 2849, 556, -6, 707, -1593, -1803, 2055, 2207, -1012, -1439, -348, -1104, 498, 2144, -297, -1921, -826, -947, -1506, 1751, 1781, -3250, -3822, -266, 134, -518, 76, -1245, -2836, -893, -60, -1513, -206, 530, -3546, -4570, 182, 1488, -1477, -1898, -2314, -3079, -1160, 1480, -446, -2316, -886, -2498, -2511, 1008, 2012, -2217, -3272, -1328, -1142, -421, 1372, 357, -2991, -2313, -667, -481, 1704, 1833, -3197, -4177, 688, 1845, -181, 84, 136, -2072, -1028, 1293, 1644, 1534, 1207, -2028, -3055, 2205, 4565, 321, -1678, -151, -493, 486, 2683, 2006, -191, 226, 68, -622, 3096, 4507, 648, -2046, 288, 1577, 1416, 3118, 2681, -1135, -1625, 1856, 2823, 3048, 2834, -927, -2340, 2057, 4252, 1007, 1022, 1887, -733, -1708]
3310a708M053J545j843j920j908j7M989K358m738l171K321Q47o04K234K29l650
3326i83r41J003P22K209J525m143l363K766K992p82J68m00l787q06M364J627j606
3343E65q70k117j302L436K398k014r96L75k505j179M954K552l481l572k34J616
3359b374L758J425m238l243K679J485j136J783J874l813l133K070K649J668L51
3374A805l833l716L563L872n76j725Jk063j253M137K389k526j503k50j397K049
3390a026L527r52k502k48j131l16N051K855m906m866K096L278J537J72k159k647
3406b237J686J531r17K008K167l679m758K534N117R84k246l319j916K542M691
3421D188j007j870k6j602j365L334L326k085k968m34m18J002M361o7m244j513
$$ y = [-1708, 2345, 3890, 2047, 127, -1781, -1798, 3191, 5549, 811, -2360, -39, 808, 204, 2438, 2667, -983, -1924, -921, -199, 2010, 3535, -608, -3971, -1205, 1787, 1005, 1173, 773, -3014, -3820, 544, 2171, 565, -305, -2422, -3724, -288, 2110, 96, -900, -525, -3030, -4209, 745, 3297, -184, -3756, -3990, -2374, 1384, 2809, -1429, -4672, -1993, -508, -1644, 139, 2013, -1800, -4933, -2863, -214, 1454, 1805, -2028, -5744, -2181, 1691, 1115, -610, -609, -2672, -3925, 212, 2601, 75, -1428, -1678, -3075, -1026, 2501, 1549, -953, -1201, -2332, -2648, 2403, 5258, 352, -4514, -2418, 860, 2397, 2569, 410, -2237, -551, 980, 63, 2071, 4238, 559, -4199, -1665, 3452, 4436, 2190, -1129, -3045, -503, 4188, 3181, 1311, 1285, -317, -1682, 1652, 4978, 2893, -75, -509, -927, 75, 4436, 4369, 125, -1388]
3437a388P10R78L386J962n101m499L394L363o96l78p9k335j105J935J043J550
3453B740J140m575m722L826O313p41m279j766m63J556L395r1k930k19o21j618
3469c055K386M817k082m573r37J210J730K970M95n322k626J929K904K057N49m061
3485a609l551K859L538p40n28P31k942k407J896L914J037j167m802l381N209O408
3501D465k139n358m29J443L7K391J136j231k012j267o07K573N134j331o571p79
3517d545L173K221K047N3m859k971K921L803O13q51k224k955J340M024L24p17
3533A397N33l089l449L486O074k21m710k943o27M635M783k632m859N39J754r72
3549c01J610L435j512m087j620J184L195M124k143o719p28M487L180o06n97l184
$$ y = [-1388, -678, 300, 3686, 5648, 547, -3952, -558, 2805, 2109, 1731, 1652, -683, -1788, 147, 1190, 2740, 3880, -695, -5417, -1591, 4722, 3981, -298, -2064, -2527, -971, 2424, 2333, -597, -816, -1437, -3055, -669, 4148, 2066, -2507, -3444, -2234, -504, 2466, 2961, -2361, -4987, -3058, -154, 1903, 2452, -1609, -5160, -2301, 1237, 497, -31, 700, -2242, -4649, -2753, 1161, 2198, 1031, -3771, -7152, -1943, 4465, 2326, -3032, -3461, -2018, -1981, 410, 1546, 315, -1697, -2964, -3571, -998, 4136, 2805, -3766, -4545, -1372, 849, 2896, 2949, -1910, -4881, -1960, 1843, 2456, 1605, -619, -3574, -2234, 1790, 2114, 1397, 1930, -1159, -4608, -1122, 4952, 4731, 21, -2922, -3549, 1086, 5869, 3237, -1622, -1083, 671, -301, 1309, 4744, 3232, -855, -2475, -1291, 1904, 6028, 3885, -2834, -3562, 925, 4105, 3499, 2902, -282]
3565b82l171L147M128q08q52j293k804m17M201J956j038j186l564k173M692N929
3581F465j879o420j903K432K961K293j471m222j46J672j134J504M331j094o936
3596c547j466L863M394J390l255o281j98N693K271j657j449j108k543J539L813
3611A459N54j585j303k960j016M617L866k393l574k118l51M420M909k896o004
3626d375k25L214J074J044L95j932k167R2Q5K710L838j891p425j006O820L719
3642C970j457l674l057O30M237K010k317o12k68k665L46M134K507k498k792j689
3658c195K26N014L459l375n326l35K480K874K341j844n261m1M031K74K23J926
3674C471j854l824q43L608L727J510m073o727M62P847L363m419l074o37O55K275
$$ y = [-282, -3453, -306, 3822, 3014, 2162, 869, -1935, -2352, 1849, 3805, 2767, 1581, -1983, -4156, 536, 6465, 4586, -1834, -3737, -1305, 1656, 3949, 2478, -1744, -1890, -218, -1352, 152, 4483, 3389, -3547, -5013, -1150, 3244, 4634, 1379, -4902, -5100, 593, 2864, 1207, -242, -1350, -3893, -2354, 1459, 2013, 428, -875, -3835, -4851, -234, 3632, 1239, -2335, -4453, -4804, -384, 4525, 1629, -4375, -4600, -1386, -312, 732, 1127, -805, -2972, -2880, -2795, -85, 3753, 1862, -5563, -6569, 251, 3970, 2513, -1161, -4218, -3588, 649, 2659, 342, -270, -538, -3203, -2857, 1277, 3784, 1286, -1506, -3195, -2969, 2045, 5504, 2129, -3197, -3532, -1052, 1822, 4163, 2319, -2942, -2983, 1048, 1322, 1545, 3471, 1617, -2207, -3050, 558, 4285, 5795, 1722, -5005, -4543, 3304, 6667, 2248, -826, -1463, -808, 1467]
3690A467J761n32j063j075l029q1N660L782m764m765o10K507M292K529l945n228
3706c094N31L913J298O44j023l580q63J806J364O33K220k649n231m34N617L848
3722E000j160m782m515J834O817J393m715k089J289p49J68K979J068j849k830
3737b141k273J118N898K951o200n322J711L786K501O89l316m010J338L266R99
3752I95j54J6k571l000J923L207J307K97l146n559J644P473K350m448m210j022
3768d898K592M566N37l859j228J188j761L74M462K393m157m810l79L967N114J016
3784E117o338m688L266M698M99q78j430k956o9K739J695O49N07l053m288K285
3800b245N617J716k445m055l092K196O966J141n528l018J483J978J379J398j243
$$ y = [1467, 3228, 2696, 1633, 558, -2471, -2552, 3108, 6890, 2126, -2639, -3249, -742, 3550, 6079, 2134, -3094, -2563, 1350, 2648, 3292, 2269, -1311, -2174, -368, 996, 1629, 3849, 1200, -4031, -4465, 1152, 5000, 3840, -942, -5457, -3623, 3194, 4587, -128, -2217, -928, -1677, -1509, 1470, 2538, 689, -2141, -4414, -3296, 2602, 5553, -647, -5969, -4258, -472, 2029, 2718, -598, -4608, -3270, -4, 995, 841, 857, -1714, -4714, -2791, 416, 1723, 2020, -1126, -6685, -5041, 2432, 4782, 334, -3876, -4898, -2306, 2260, 2797, -1062, -2290, -1102, -2863, -2489, 1973, 4366, 209, -4601, -4980, -1013, 4101, 5117, -1221, -5909, -2643, 2055, 2554, 1676, 246, -2710, -2779, -40, 1655, 2304, 2811, -242, -4530, -2245, 3372, 5088, 2643, -1412, -4504, -2308, 4658, 5799, 271, -2747, -1264, 714, 2093, 3491, 2248]
3815B248k006o19j063M11N554J912n630o235K793N746K035j243n098k805L620
3830c80L938j030j349O65k044k404K360L123N99j133l348l859L233O262P00n255
3846G8l379M32K598M117Q9m776k355J926J076p4K710M93l968k781L82L333M755
3863D656k96p293m257M680N920o8l061l221j109K556K512M35j034J36k892l004
3879e340L152N689O6m544l752j175M535O105j193o619k156K719J920J739P97k753
3895h10j989K64N71P96L558J176o121l718L109N239K430k583n575k447N398M591
3911C889j838k695o25n32m16K078K316kj153l384k495M505O400j510o243k633
3927d338J924L940K859j364m904q62K924Q66N42J516q29l262j349J777K865K700
$$ y = [2248, 242, -377, -1440, -1029, 4525, 6437, 807, -5428, -2635, 3111, 5146, 3903, -1195, -4000, -380, 3558, 2528, 1179, 1844, -200, -2604, -244, 2879, 3478, 2345, -1003, -4862, -1629, 4633, 5333, 78, -3301, -2869, -271, 3846, 3935, -841, -3196, -1270, -194, -268, 2442, 2935, -1033, -3814, -3432, -99, 4656, 4360, -2933, -7190, -2510, 3410, 3342, 281, -2940, -4049, -1493, 1019, 1454, 420, 556, -2336, -5340, -2188, 3501, 3567, -977, -4729, -5904, -1369, 4736, 3543, -3076, -5232, -2513, -593, 1146, 1943, -810, -2799, -2535, -1964, -1168, 2390, 3566, -2555, -6273, -3164, 2075, 4505, 1922, -3653, -6100, -702, 3889, 2051, -644, -1269, -1801, -2217, -139, 2177, 2175, 1022, -2362, -4857, -352, 6048, 4538, -1705, -4338, -2414, 1526, 4385, 3021, -1883, -2745, 179, 1045, 1587, 3103, 2274, -988, -2337, -560, 2305, 5005]
3943E005j194o216l124N803N661q73m239l159k20L692L191j660k496M66j217j662
3959b242K841M234r05m041l221k00N144N476k942p113j139L758L159P76j258l420
3975a093j344J899Q93J133J882q52n285j900M076M186R61l480n238j128N763M473
3991D946k688l861j212K96J505K269M25j611m10k444j698M024N384k276o349k167
4007e867L029M483K674l161n870L55L851J537p36M70j069l048J77J819K205J784
4023B633j933n465j444O224M381j834m677k741R87M580L026l034l014P07J89m05
4039a820K529K170j617l226k017P40M907M093l763o730j39N365K922n38k298l437
4055b859k05L563P60l09J314r86m503j94M405L722p20l668m731M59O636L559m030
$$ y = [5005, 3811, -2405, -5529, 274, 5935, 5062, 823, -2336, -2556, 1136, 4327, 2667, 171, 637, -580, -2242, 599, 4833, 3928, -113, -3334, -3534, 1610, 7086, 4144, -2969, -4108, -350, 2809, 3585, 2327, -1093, -2437, -538, 355, 1488, 3370, 2518, -2767, -4667, -591, 3595, 4556, 1076, -4162, -5290, 473, 4946, 2258, -1603, -2815, -2519, -1014, 1255, 1680, 69, -341, -2785, -4483, -459, 4925, 2649, -3700, -5867, -2838, 1645, 4319, 1158, -4712, -4357, -506, 1031, 295, 765, -304, -3352, -3175, -1356, 849, 2633, 700, -4765, -6209, 15, 4396, 2562, -2115, -4856, -3869, 711, 3737, 703, -2311, -1604, -1415, -1820, 709, 2879, 1262, -1964, -3981, -3241, 1666, 5759, 1996, -4734, -4873, 492, 3414, 2876, 578, -2859, -3064, 499, 1259, 950, 2264, 1278, -3225, -3419, 986, 4708, 3988, 320, -4411, -3952, 2684, 6243, 2213]
4072B213m312j07J627K231K130j342k260l08q47p41L736L955k885o013o88L389
4088b22M120J624m168n544J353M804J928j855q12j253j662J276K016R04N72j825
4104A256m856O4N634L449l324m227k219K058M823J835l827l256J063J065Q3J890
4120A511J046k407k237j024J146M034K695m388o233J268N324K807j573l071l148
4135d250J035M040N17j801K74m47l118R35L875J356j205l325l545J870O113K376
4151D700n013m480J090K458K700J123k594l084R78Q02j75K445K291l286m382K08
4167d219M374L332K73m748n020K708N873P63k859j453j165K0K304J669n15J9j849
4184d93l127J030N506J975l875l684q46K425N290L61m530k953J808J817P78N90
$$ y = [2213, -2099, -2206, -579, 1652, 3782, 2440, 180, -128, -975, -1716, 2020, 5975, 3090, -2923, -3611, -222, 3898, 5522, 1354, -4190, -2837, 1967, 3895, 2040, 1228, -25, -1687, -411, 1605, 2509, 3081, 1256, -3600, -3536, 2098, 5547, 2223, -2004, -4223, -2165, 2658, 4493, 666, -2590, -1527, -462, -379, 1511, 2557, 150, -2087, -3111, -1965, 2069, 4764, 376, -5857, -4589, 735, 3542, 1969, -1102, -4250, -3215, 825, 1342, -459, -185, -632, -3750, -2815, 1060, 2416, 1211, -2114, -5659, -3789, 2324, 4700, -313, -4793, -3703, -1245, 1455, 2578, -16, -3100, -2122, -1320, -1495, 950, 3241, -45, -4427, -4219, 155, 3487, 3760, -988, -6008, -3300, 2573, 3336, 477, -976, -2141, -2121, 183, 1852, 1337, 1356, -493, -3620, -2590, 2916, 4891, 1016, -2668, -3514, -1089, 4201, 4562, 32, -2921, -1113, 704, 1482, 2072]
4200B072J17k519o37M65P75L050J355m027m872K035N026J764j738l701k403K809
4216d29L787k09k720K09m60j371P97L221O16j989k557k340K308N531J010n805
4232d01l297J989K834J845J58l264k521J609J482r4J383R50l573k403J892K476
4248A065K267k77m611l735L302N514m43l421k004m26J727K239L71j830q5n17k671
4265c535J569M624M47m139l272M00K943M459p20n127k238K580K148L34O03j117
4281d1k457l08J617R11J570L39l489l215K833M080N85j935l240j787L219M532
4297C214j312l218m45K98j96J721J638p68j313j497j536K083N259o35n208k110
4313d025K526L039J645j408l429q37K597J276p49R94P5k979j244K663K342M05
$$ y = [2072, 2189, -330, -967, -502, 273, 3323, 4678, 651, -4221, -2186, 2840, 4604, 2866, -835, -3238, -429, 3358, 3149, 429, 638, 178, -1193, -396, 2825, 3441, 1452, -1105, -3445, -1137, 4394, 5404, -401, -3698, -1709, 1125, 2970, 3128, -136, -2657, -1048, 434, 340, 1723, 2673, -900, -3303, -1411, 1065, 3332, 3055, -1556, -5291, -1989, 3525, 3082, -339, -2343, -2769, -1042, 1197, 1568, -262, -347, -864, -3535, -1966, 2658, 3105, -1034, -4306, -3906, -963, 3496, 2776, -2351, -4589, -2009, 139, 473, 1076, -41, -2498, -2806, -1189, -278, 1292, 1631, -1858, -5073, -2240, 1840, 2425, 490, -2750, -4537, -1318, 3214, 1902, -1316, -1761, -1463, -1659, 62, 1700, 932, -381, -1878, -3414, -1331, 3928, 3293, -1915, -4025, -1499, 1540, 3185, 1777, -1652, -2489, 108, 1384, 635, 1629, 1704, -1275, -2519, 144, 2486, 2891]
4329B891r86l727j503L638M207j062l363j373m00K437K810p12k861m41O42r12
4345g15J253L306q14l935j613O64L286L604j907n545j139M170K493p82j054j663
4361c91j098J017J641K29N59k51l488j488L483L661j259k736k108o72L474L142
4377C715j716l800K51M81N17J826L05j953j346N72n25J288L346j078m416j207
4393c740K544K633J072j737m049n17L745J704j951j56K06j970m09K210J449k16
4409H18j027l021r44M207L151k648l328J86M14J910K567j518k903k75J493k24
4425a142J335J321j732k327K03J152J715K349j810m286n66M223K310j196j860
4440c11j842l30L010J231j202L1L61k646r01L683K487j754k542j956M76M535K105
$$ y = [2891, 1905, -1822, -3325, 313, 4520, 3458, 95, -1278, -1678, 759, 3569, 2857, -4, -445, 197, -715, 538, 3844, 3030, -905, -2518, -1854, 1432, 5036, 3129, -2416, -3555, 615, 3108, 2326, 1272, -391, -1489, -472, 1169, 1398, 1957, 1706, -1782, -3270, 213, 3874, 2615, -121, -2229, -2901, 573, 3715, 1999, -1801, -1550, -1069, -552, 1274, 1579, -374, -1720, -1148, -1673, -385, 2961, 1883, -2533, -3740, -1196, 1437, 2509, 772, -3277, -3794, -49, 1655, -296, -452, -246, -2216, -2625, -415, 1034, 818, -209, -3230, -4174, 33, 3184, 536, -2792, -2606, -2192, -282, 2285, 767, -2136, -2411, -918, -1142, 193, 1514, -218, -2545, -2342, -1190, 525, 2874, 1064, -3222, -3788, 435, 2745, 1549, -311, -2153, -2483, 527, 1758, 556, 587, 948, -1698, -2599, 1084, 3571, 1817, -725, -2681, -2205, 2330, 4435]
4457D435l270l197O87J466O47J163L83k366j438J098N40J408J726j701l809N55
4473a673K658J667M01j498l770K84M000J101j956q68m77o17J086J347K08n13n54
4490H26k264p92L983K436l088l035l2J556K379P83j994k746J165J338o26J056
4506I45J046k277k215J167K103M73N78j545l582R45L299O82j039j344j771J22
4522b413K779J693k266r30J63q26J16K395O41j767j395r18O36L263J961m038l015
4539c921J613K352L19P05j090k093J36R96K80Q43J447k262k957J099L635K97n10
4556H89j494k381N63L467P13j862n84j032o4J736J838q75j499K22q76j62K653
4573A252J420k806j946N10J367J957J195k921k381J781J776k30J2O03j619j115
$$ y = [4435, 1165, -2032, -1345, 121, 768, 1931, 2314, -52, -1490, -392, 148, 1556, 3282, 1581, -2228, -1673, 985, 2652, 3053, 1555, -2215, -1931, 2069, 3170, 1214, 346, -131, -748, 338, 1685, 1893, 1380, 826, -1438, -2230, 1753, 4189, 1101, -1934, -1966, -410, 1969, 2752, 758, -1988, -823, 515, -111, 945, 1991, -286, -2501, -1334, 769, 1242, 1820, 275, -3307, -2362, 937, 1619, 580, -764, -2535, -2413, 366, 2059, -207, -1137, -974, -1800, -1684, 711, 1352, -415, -1810, -2728, -2092, 1171, 3132, -906, -3921, -2308, 44, 363, 1068, -22, -2115, -1979, -983, -703, 140, 1587, -675, -3632, -2533, 1102, 1399, 889, -605, -2986, -2423, 1044, 1757, -105, -689, -1721, -1785, -49, 1789, 914, -585, -363, -1239, -1401, 1252, 2672, -134, -2080, -1570, -203, 1754, 2949, 28, -2353, -572, 1204, 974, 986, 1589, -30, -1145]
4589a145J084P85R27P32k351k179J508L646m95j771p36j003P81K096Q89k099q92
4606b23P04p81O68J783%k599j5M01k8K048J255l054j922J307J805N13k7j593j890
4625a648J299J806o49k68J019j661j711J386K223m8q96j764j592K076K864p14
4641A722k499l45M77n35J850P71j324j403R9O3L30K178Ll069m37J179J75J381
4659F16O18k347j965J568J779J4k0n79j386K00J414J11k67N45r74k366J605K617
4677A183m26j772o61k03J147J808l89j890P2P53o49K24J985p14k178L8J143J08
4695d21J782P9k957p41K260Q11m68O92j412j416J449K022r09o78L06p00p91J914
4713H22O13n48l54q03j058J363K738p40k830L59N84M23P54N98j731q89J159l40
$$ y = [-1145, -61, 724, 1651, 2383, 32, -2147, -639, 3007, 2512, 741, 5, -998, -217, 1879, 2768, 669, -223, 481, -300, 368, 2151, 2151, -448, -463, -62, -90, 1958, 3213, 159, -1763, -456, 1349, 1862, 1835, 242, -1648, -349, 1457, 808, 540, 1559, -102, -1813, -427, 1796, 1748, 852, -912, -2504, -428, 2436, 1722, -777, -1122, -645, -1180, 670, 1441, 117, -1286, -1187, -1124, -794, 1384, 1387, -1682, -2119, -940, -765, 616, 1234, -1113, -3078, -1510, 269, 283, 263, -316, -1702, -1502, -88, 23, -244, 301, -673, -3039, -1434, 1183, 757, -1015, -1676, -1879, -732, 1076, 687, -1203, -1131, -378, -1027, -803, 1182, 468, -1710, -1672, -529, -421, 1361, 1440, -1517, -2258, 2, 813, 345, 1037, -375, -1791, -342, 1680, 771, 93, 399, -301, -1092, 822, 1435, 887, 533, -270, -1328, 35, 2773, 2033, -797, -438, 146, 569, 1323, 1921, 190, -699, 460, 120]
4731A20K63K070p70k513J41J494O24L33m9j864j046J823J035n13j19j41j781L19
4749e74K625k17j401P1m96q73J293J532j008r26n17q35J099K254m08k865l4J596
4767C16r5PJ177j201j246N09M09k21J390j38k678j16K291K01p27J82o08j146Q15
4786h79J573r03k30M41j491k86K069J94j589K80J82q87N88J865j037j498J02L87
4804a119M17J084R4k078NJ510j63q74J195j33j378%J355k12N57K31j890m13J968
4823A56R04j425o8K34q88L56J638l39j234Q11m44m19J248J106j802n96J186m32
4841hk41J502k16j691R0J124j23pP80j277k37J158L27j126J004L95j976m3J643
4860A078M18q83K06m85o07J212O22j263J83P12r00l25J157M19j106j08K89o40
$$ y = [120, 383, 2453, 1683, -830, -689, 805, 1429, 1762, 1713, -151, -1197, 626, 1661, 1148, 1029, 888, -893, -574, 2051, 1834, 433, 504, 8, -865, 428, 1960, 952, 26, -491, -1326, -227, 2027, 1619, -1246, -1280, 316, 221, 228, 1405, 204, -1042, -533, -124, -345, 1045, 907, -1771, -1887, 404, 605, -122, 60, -548, -1694, -879, 694, -209, -439, 2, -1489, -1775, 294, 488, -1101, -821, -639, -1526, -938, 927, -110, -1608, -1506, -1119, -702, 382, 476, -1602, -1597, -87, -250, -1124, 71, -62, -1440, -1440, -85, -297, 260, 491, -1399, -1812, 156, 1060, -365, -433, -199, -1087, -731, 907, 568, -666, 145, -299, -718, 530, 1636, -166, -762, 424, -8, -249, 1253, 1037, -654, -564, 560, 437, 430, 1210, -67, -304, 854, 1181, 55, 1059, 1454, -522, -565, 1078, 1496, 613, 819, 334, -273, 939, 1561, 298, 481, 1193, 293, -32, 1125, 1544, 438, 330, 619, -21]
4878b1M35J220j545o30J341j11n12M27O87j413j62J089L4q70P06n22p75P19P27
4897H24j057L23K56j056l47J656q5j226J00N63n71N25M50n54o89P13k18r45J026
4916c12J120j530n62J177m75k90J189p84j172J008P25o06l17J026j027n55J171
4933b14R1j096N35O06j262L05J158o24l50O86n09q77J631K18r67m57R71k34m73
4952h62Q86j19p56Q35m8q42M18J230j298p15J371K73q34O65J88q66M59P44n05
4971B24m65J169n86r08J074L27q83Q2J108p63l67R51R4j186L54M35n76N77Q16
4990A477j217m18J405l55q02N93M72q18L5O18k96l28P36m22r22J083O60j500L8
5009C9J106r82p6J043o08l25M35j76q34P58P92j125j94Q34j82q31N48L58j101
$$ y = [-21, 414, 1634, 89, -541, 800, 689, 177, 604, 1291, -122, -284, 805, 839, -31, 675, 153, -622, 97, 824, -233, 90, 346, -710, -1057, 599, 514, -712, -612, -49, -620, -95, 355, -199, -888, -175, -393, -1338, -312, 808, -722, -1284, -107, -582, -872, 317, -467, -1639, -631, 94, -512, -829, 197, -830, -1385, -214, -123, -1219, -684, -78, -1340, -1035, 123, -501, -851, -165, -674, -1551, 80, 298, -669, -1126, -155, -389, -862, 24, -95, -851, -16, -64, -906, -488, 742, -556, -1271, 100, 373, -461, 204, 392, -474, -15, 729, 224, -241, 928, 342, -566, 508, 835, -48, 34, 1142, 379, 12, 963, 1057, -129, 225, 660, 84, 661, 1477, 260, -158, 1247, 892, 90, 683, 1155, 337, 372, 990, 694, 366, 1102, 680, -242, 841, 1501, 1, 39, 1145, 163, 87, 1130, 522, 197, 632, 456, -378, 380, 1172, 47, -147, 687, 505, -326, 222, 580, -521]
5028e21M28R04j083K3N04l28q91R67N33j320K70J011j164j39P56j47p42N66K45
5047a28q92O26P28j345k79J295J49j452R25K14q40L67O36n49l98P27m73m53P52
5066c90N76j073J10Q55q31j70R59k25j160R20L00p80R03J95r64k63J469p57l25
5085f51P41j17p35J65O82j63J52L90q28r94J760P59j191k23O15n30m3R82q8j119
5105d36P98K62j050R05O19p36p32R10j23k39Q87l05j113L75R04m34k15Q22o53
5124D46q00J148L39j001M55L71j101o3J538n69l13K04m83l9M96P99r40o44Q54
5143F97l96k61N72M61j217J48L69n78L90Q87n87j429R26O76p85L19P1q37j36J369
5163F59n56o01O58k91p31P11R02q80m55R43j197l25J579P0j231l25N47l48J70
$$ y = [-521, -93, 811, -272, -249, 255, -73, -964, 3, 536, -784, -514, 497, -667, -806, -50, -197, -939, -373, -128, -1020, -394, 334, -1011, -1290, 5, 154, -1298, -373, -159, -999, -632, 4, -545, -943, -216, -689, -1142, -390, 186, -887, -777, 78, -753, -923, 36, -189, -1349, -429, -129, -909, -6, 189, -775, -1038, 431, -326, -651, 90, -27, -762, -597, 85, -78, 74, 464, -364, -1358, 402, 1161, -30, -253, 362, -168, -211, 771, 683, -436, 362, 624, -426, 479, 1098, 362, -370, 540, 417, 178, 1065, 760, -353, 22, 926, 492, 277, 1099, 446, -354, 794, 1133, 132, 587, 958, -143, -206, 1332, 763, 450, 654, 171, 132, 628, 1427, 487, -157, 697, 301, 40, 612, 1073, -144, 4, 373, -205, 185, 1072, 485, -944, -18, 658, -127, 192, 263, -574, -710, 659, 103, -498, 160, -131, -862, -151, 751, -129, -584, 359, -838, -1163, 416, 486, -745, -1070, -523, -871, -701]
5182g01J143p62j126Q34K90o67O05P42j431j05P96m5j05M86m37j532Q58J326m12
5201b43j25R1m49n21J099M87j081J95L76p65L55J235m57r24K90j71j83J125R25
5220A259j785o39Q50K85k04P77l1j081k5J110l85J84Q63j378r42J385L41J32j22
5239E94j72r62J45J640k64j014M28m7o73Q53J162j119o10O04o43N3J716j24j495
5258G2l50Q88J06L85O52j524j088J012P34m91O21J24j199k51J049K01j15J62j005
5277a7j164Q37K054r37q16L85q80K45J449k37j095J91o5o74O17J340n57j500J75
5296f49k81O19J392l98j828m65J403N98n88O96n93j473P43O48m01L79N56j549
5314a191n83J282J071o26o7p86j088R67J739m22j630O06k63m65J180R37j286k41
$$ y = [-701, 442, -320, -1446, -612, -322, -989, -384, 358, -1073, -1178, -382, -427, -532, -46, -483, -2015, -1157, 169, -243, -368, -277, -726, -1247, -148, 339, -742, -547, -171, -936, -581, 654, 197, -727, -437, -608, -791, 334, 1259, -526, -1165, -315, -30, -234, 543, 512, -569, -594, 516, 131, 315, 1178, -200, -1142, 243, 584, 716, 594, 422, -540, -395, 1245, 981, -33, 395, 348, -325, 528, 1690, 571, -39, 565, -78, -25, 1691, 1567, 72, -278, 610, 716, 1101, 1753, 229, -859, 153, 887, 396, 1017, 1141, -58, -309, 740, 941, 826, 988, -17, -1181, -344, 1710, 773, -43, 342, -538, -293, 1156, 919, -176, 15, -50, -724, -107, 1233, 676, -824, -649, -930, -311, 1081, 683, -1145, -1610, -207, 391, -197, 499, -94, -1567, -824, -176, -577, -198, 358, -1191, -1774, -492, 579, -47, -114, -900, -1988, -1021, 718, 296, -1334, -728, -991, -1456, -276, 661, -625, -866]
5332h66K71n48N35J570n15k051J31P79M11O82L19j582j003J647N03m11M11Q5j425
5351a057k2J422J56l6J61j295r93K040J158q88j303J82l97Q55J265k58j395J07
5369b98O78m92O37J328j010j448K84M13L50J137o8k256l39J959K97J51l33j032
5387d2r60J185J069m42j10L27j335q72K063P38n57o39r11m25J442J889j306j884
5405g70O30M26Q6P40N6j495m34N88k4N55J172r73j732k55J529O98N78p32k050
5424a407J18J432P44o72p0l60r18L36J284j35l02m3j411o98K320J350j472j322
5442a226l90J11J599O77j024j512Q82P68q89R49O91q72j396K76N74J064N51q35
5460bk047N0K219N6j14r2j506l83J902R97j300o6M1q42q3J676L74r39m09r23j37
$$ y = [-866, -595, -1143, -608, 962, 447, -1604, -1473, -694, -283, 399, 718, -864, -1867, -220, 283, -128, 283, 368, -1057, -1079, 343, 499, 463, 624, -671, -1664, 376, 1534, 646, -657, -475, -872, -17, 1248, 990, -405, -298, 380, -112, 525, 1853, 843, -605, -321, 92, 442, 1579, 1511, -745, -1084, 875, 1172, 1323, 990, -42, -1002, 183, 1252, 810, 700, 1027, -308, -1180, 883, 1621, 1064, 425, -486, -911, 531, 2420, 1114, -770, -140, 286, 372, 1112, 1168, -327, -761, -173, -197, 358, 1530, 557, -1175, -1430, 99, 797, 1375, 643, -1407, -1289, 143, 887, 215, 145, -215, -1133, -797, 487, 352, 50, 7, -1404, -2102, 218, 1568, 96, -1226, -1616, -1505, 94, 771, -253, -1765, -883, -115, -1004, -55, 636, -236, -1632, -1356, -782, 282, 833, -2, -2049, -1999, 220, 276, 162, 70, -1436, -1819, 83, 1080, -220, -286, -245, -1087, -1170, 506, 880, -59, -468, -1391, -1528]
5481a528K067J597j961j786L88J185M22Q79o10j550J57Q17j38O91J138q86k405
5498a523O97J459O00J1p95j975M64K303P84j320k65o24m33J110J049n22l06N5
5516G69j465L13K105J296j964j888P6Q47J297P28j673j253O27Q97P6J88M28j179
5534B25j022O84J09J172O86j412k485R61K595K51j196j034p79L24K289j97j140
5551C1j35N0o97J13J393K77j122p59m82K52K039P50j938k097J075J480L27L02
5569H59j281j143M32J169m35M57N11j227j553P63J533M82n2j510j924J463K943
5586A487l74k015n07M35j09J141L51p92m5j29o09K46K163K82k341j417M00J364
5604d69J725L60k402j457J623J606m61n4l26r40l27J295l3P69P42j905k276J418
$$ y = [-1528, 539, 2136, 175, -1611, -1223, -38, 384, 1263, 653, -897, -740, 77, -61, 630, 1768, 882, -1523, -826, 633, 1233, 1244, 449, -1526, -1062, 1241, 2025, 705, 440, -184, -617, 493, 1542, 1020, 714, 769, -696, -383, 1722, 3018, 1054, -834, -758, 89, 1386, 2114, 441, -812, -185, 712, 788, 976, 1404, 225, -797, -113, -4, 1168, 1854, 442, -2043, -1082, 1513, 1764, 568, -466, -1245, -921, 1368, 1171, 31, -104, -54, -751, -638, 755, 1032, -90, -849, -1331, -1079, 960, 1710, -228, -2325, -1250, 230, 557, 859, -422, -1565, -1133, 36, -399, 58, 569, -658, -2211, -1448, 85, 567, 515, -995, -2919, -1456, 1487, 1113, -902, -1409, -974, -1083, 58, 409, -383, -428, -557, -1166, -920, 1243, 1525, -816, -2233, -1833, -469, 1256, 1616, -786, -2243, -620, 986, 525, 471, 145, -795, -1122, 173, 140, 909, 1651, -254, -2530, -1112]
5622a112L116m3j720j331l75J445K194l61k042q8P00n29O30J080l95j155n57n8
5640f01Q01J864M16k789j617J830J561M36n62j466j266J508J209m26m44M41o67
5657B28q44O12J285L30m17j855j058J572L011n41k581p68N08O93J230j02j753
5674d50M8L31m33M50J655l39k171q19R11J187J487n03k848j059K266J651p62o81
5692g9r07n50O28J322J83m83L26j265j593J550K427m90j676j247n28K003K247
5709A868o26l143lJ307q8N10N63k48j516J90j25Q23J834j91l109j264K066K197
5727A045K25j080j805r86K461J450r99p43K69q14l67J105J190k60p02j367q63
5744b241K270K511q96l072l85J139J533J122r63k118n3J822m13K15J267p33j633
$$ y = [-1112, 2004, 1961, 241, -1090, -1465, -20, 2174, 1813, -229, -317, 383, -146, 484, 1564, 1169, 14, -543, -601, 200, 2064, 2480, -309, -1926, -96, 1465, 1901, 1339, -127, -1393, 115, 1324, 898, 454, 895, 228, -616, -4, 1281, 1611, 1194, -661, -1719, -147, 2864, 2323, -258, -1026, -518, 175, 1405, 1303, -450, -402, -71, -504, -54, 1601, 1262, -909, -1728, -817, 370, 1857, 1354, -1494, -2553, -287, 1364, 602, -79, -986, -1536, -908, 414, 597, 114, 440, -825, -2418, -868, 1559, 1069, -607, -1854, -2382, -379, 1868, 1242, -1901, -1904, -597, -685, -175, 388, 140, -1376, -1186, -1311, -488, 1346, 1155, -1954, -3218, -1152, 1045, 1270, 190, -1615, -2601, -140, 1310, 311, -432, -163, -977, -1344, -239, 951, 691, -11, -1378, -2241, 29, 2540, 1644, -1428, -1813, -674, 859, 1981, 1018, -1100, -1153, 669, 256, 471, 1738, 1005, -628]
5761f28l93Q09J131J617j029l017p45L293J898j324j627l24l89J127J139m68n37
5778E33L89j336r01K035J643n25k173p31j1K032K035j593l332P26J938M96l0m8
5796A147r30p05J33L40N32J396j37l458n97K436J803p9j752k028J28K664J477
5813B370j995j184O95m92k00J414J96o65m16j106o09K557K063j981k463m26J760
5830d82J125N89j132k071M82J743n29k78Q34n27j499p1J257Q31J069j174k860
5847b693K73L158J050j640j855j10N27J505R75j203j192P16m65m46J507J372j206
5864B73j607m11M50K444J231k338k785J464J959M46k44n85j213j64J435j65K6
5881B16J299q27k671j06L238R36o62j886j479Q70K843J034k476j005M40L03J85
$$ y = [-628, -1021, -212, 919, 2536, 1507, -1510, -2255, 1038, 2936, 1612, -15, -339, -728, 399, 1538, 1070, 533, 922, -414, -1315, 720, 2363, 1838, -335, -1066, -1077, 955, 2990, 1397, -1935, -1209, 729, 1225, 1195, 1147, 217, -488, -355, -15, 517, 1913, 1776, -1682, -2279, 157, 1960, 1881, 129, -1899, -1771, 893, 2370, 375, -809, -114, -606, -806, 608, 804, 139, -277, -1383, -1992, 565, 2628, 647, -1816, -2242, -482, 643, 1232, 100, -1971, -1489, 254, -275, -553, 281, -246, -1745, -1816, -559, 272, 1341, 167, -2693, -2420, 738, 1788, 148, -1707, -1817, -1290, 215, 1190, -13, -1205, -489, -954, -1400, 107, 1479, 273, -1334, -1745, -1295, 1149, 2380, 42, -2743, -1279, 680, 1126, 882, 297, -916, -1080, 355, 190, 216, 1515, 688, -1983, -2089, 1149, 2085, 1423, -463, -1942, -1072, 1771, 2805, 329, -676, -236, 67, 252]
5898B52Q45N2o01m19p05l09K335J560j994k920O00K059J152n6j785j507J348J537
5916A444j08q19K84n86j088N59J382M8P66j480k608N80L157J199k196j503n5P27
5934b97K104M3j998q67J065j31p11J579O76j222j648k28Q28K265O88k759k138
5951b751J242K630m9j000p68r19J009R67O9l24L70q87j918J025K047N79j258j585
5969a521j070R28L364j22k659j210J056R28M50J44o85p61K51R1n78K182Q00k358
5987g70j937J345J528J237J1k425j821J979K268n68j326P09r17n81J140P05R0
6004F67N22j382k145J030L246P6k259j476M26J101J815J85k361l02J037J99J34
6021E13O42J2j426n35M96L64J814K33k491j916J838K323jj089j156p45J497J545
$$ y = [252, 1097, 1149, 548, 129, -576, -885, 1450, 3010, 1016, -1904, -1304, 755, 1907, 1851, 66, -1441, -93, 1444, 1336, 517, 801, 215, -873, -314, 1068, 1116, 1882, 402, -2206, -1626, 1531, 2730, 534, -969, -1024, -297, 1807, 1850, -148, -1015, 50, -81, -792, 787, 1463, 241, -1407, -1635, -807, 1458, 2146, -613, -2751, -1509, 1121, 1072, 72, -696, -1615, -606, 361, 430, 106, 476, -411, -2329, -1304, 743, 1322, 64, -1521, -2591, -1663, 1701, 1579, -1080, -2290, -1234, -306, 144, 288, -397, -1158, -907, -816, -1394, 788, 1588, -770, -2707, -1362, 166, 1403, 1414, -1011, -2832, -853, 1415, 847, -479, 230, -687, -1268, -128, 577, 667, 1189, -193, -2338, -1308, 1938, 2014, -245, -1721, -1295, -194, 1621, 1806, -555, -857, 180, 379, 513, 1155, 1167, -259, -794, -298, 66, 1880, 2113, -378, -2294, -456, 1867, 1866, 777, -379, -1124, 373, 1918]
6039A918j183n23M89m56j153Q90J829L8j436q27j023J813K586o80l418m00J568
6056C2Q45M00k07j297n76J238n09R7Q48M02j572j534J129J843P23j220k071j124
6074b553K336K386j316j431m33K21K71Q04K08n42O53j126j470J034K718m41k514
6091a195q50P19J541J291o99k406n02J813N40o20N73l24j054k03Q05N55J090l64
6109G10k282j235K272J945o26j446r96j94J797J120j061r20L78K06j083J093J213
6126H91k78r63j133j40J350K567j007k828l11J686J673l76p71j242j65J369Q8
6143D10l25O01K60j761m86J509R56N81j183j826k85K616J707j650j835j88J018
6160A19N31P82k61j108L00k59q43J033K450j417k179l72Q61J681J310j450k737
$$ y = [1918, 735, 212, 701, 245, -908, -18, 1811, 1849, 413, -414, -1437, 376, 2962, 2282, -1136, -1536, 32, 877, 1277, 1070, -227, -803, 435, -74, 23, 871, 1273, -299, -1833, -704, 1139, 1862, 642, -1429, -2553, -217, 2169, 853, -578, -1011, -790, -519, 285, 493, -49, 604, -522, -1992, -958, 1760, 1319, -1195, -2045, -1326, 215, 1506, 807, -1599, -2101, -288, 252, -368, 205, -119, -1173, -1376, -571, -16, 1074, 710, -1572, -2807, -535, 1410, 784, -662, -1658, -1852, -55, 1065, 4, -916, -538, -332, -1415, -322, 891, 613, -350, -1483, -1623, -273, 2294, 1287, -1541, -1852, -166, 1507, 1131, 360, -882, -1047, 322, 410, 85, 686, 946, -815, -1301, 208, 1164, 1745, 562, -1264, -1549, 1067, 2774, 1124, -711, -899, 119, 650, 1432, 1171, 63, 363, 104, -739, 294, 2744, 1327, -852, -1224, -363, 1318, 2628, 1178, -1559]
6177a559K02K665K1o44J87m31j007L60O81J52O68k88k064p32K250J665j202j381
6195d57q22J12J854J092j573j713J175K13j66O83J67n55m58n59J7J123K167j879
6213D21k360L70J587R74j2j007j860N24J989k10j147N61J48j400j83J419P31l2
6231E13p74j963O9K843J052j864j479K17N42J030O56r48j052N86j5l01J052J011
6249A175j360j318j30J209J356L67j421k126O22K733K07j187o44j0k24P89L66
6266D04k27L70n78j278N7K351R33j239j370q78N88K101Q47k079r98J112L77N7
6284E50N21j76p20p95K7L30J221J348j432k230N32K172P39n14j437j423P16K305
6302A734l33j419K56j5r10O28J065K35m74p51j082M56K065J095k496j390O78R21
$$ y = [-1559, -1357, 1308, 1329, 685, 872, 441, -566, -206, 475, 627, 1295, 1007, -1057, -1789, 461, 2126, 924, -457, -1279, -1167, 687, 1779, 206, -1507, -332, -119, -285, 398, 565, 10, -448, -1007, -990, 133, 2300, 421, -1939, -1569, 18, 992, 980, -27, -1887, -1363, 626, 416, -731, -170, -22, -1422, -1605, -186, 545, 513, -261, -2224, -2155, 688, 1740, -124, -1603, -1386, -844, 186, 842, -106, -1158, -572, -587, -888, 164, 1175, -185, -1503, -1633, -424, 932, 1299, -122, -2248, -1626, 1107, 1314, 127, -517, -527, -751, 38, 404, 177, 547, -31, -1309, -1252, 1099, 2032, 793, -577, -1455, -867, 1234, 2081, 2, -996, 116, 493, 550, 1071, 895, 175, -620, -593, -263, 958, 2306, 874, -1356, -824, 1348, 2087, 1573, 136, -1287, -571, 1734, 1401, -18, 238, 223, -687, -59, 1006, 1241, 767, 16, -1066, -610, 1455, 2550, 54, -1336, -658, 263]
6320B63J071n6j340o58N71N61m41L28Q14p83j467N15R71O52J31j601j614J135
6338i48K195q2j416o31o6Q8J357K50p95k67j80j068O02J684L66j261j297j69J002
6357f36J782J24k149j521J498J329k92q9k80q39k6P62k11J022Q04j768j952J314
6375a128J782M09o28j283o86Q55J747n81j073J2J38n83Q83P44l68l96k95j029
6393a480R86J861J46k009j009O90R28J270k12j650n00J306L91n01J90O12q26q64
6411f71J034J78N59K02j562j238J618J849p11j187l07j97N88J030j45r36k70P62
6429E96q47L97J727m99j297o20K16P14J153L3k177p46J673Q52k81j84p41n42N49
6448b4N15p2L41M72j305j071J028J617l14p51j300n33J423J483o19j728K46K51
$$ y = [263, 1334, 1278, -62, -720, -149, 412, -29, 299, 1113, 330, -1137, -622, 349, 1001, 1132, -469, -2083, -948, 1247, 1165, -251, -882, -948, -860, 497, 747, -48, -315, -495, -1563, -961, 723, 1089, -172, -1469, -1638, -636, 1146, 1270, -879, -2400, -902, 427, 135, 46, -234, -1073, -1099, -337, -548, 474, 1278, -490, -2442, -1128, 654, 1063, 435, -848, -1534, -679, 1068, 487, -586, -574, -436, -1019, -136, 608, 240, -156, -451, -1480, -494, 1367, 1513, -496, -1505, -815, 113, 1383, 1171, -479, -979, 327, 718, 217, 407, 1019, 193, -671, 363, 541, 1100, 1302, -260, -1498, 120, 1969, 1258, 71, -236, -433, 155, 1185, 1040, 104, -166, 596, -251, 146, 1873, 1374, 77, -543, -327, 387, 1540, 1573, -604, -1350, 323, 1175, 894, 710, -31, -573, -24, 491, 419, 760, 1232, -73, -1144, -116, 1501, 1187, 436, -864, -1397, 26, 1509, 890, -838, -592, -341]
6466c41r3O83L88o95m08R1m30L64J687k58j923n09R12N00P39k73j585j97J375
6485B7M70r02L04j81p94K58O65L05o9K57j201p10J279J601p38j322k17j2K75J269
6505E64l44j222L51L67j93K60P93n88o37m2J55M80J231n72j721l87J487O55j64
6524D73k65o52o10Q16O86n02K06J56p52k69Q89R15n73n98m69l39J439J382j341
6543E92j423O52L38L26L84j39o58k30M58j76J49J002j80j477k25J127L56L07l91
6562G92j273J7J378O06n80m72L01j261J67J129k6j4N2j081l79J035J412j301p85
6581b83O3j71P20O34n73j226M46P76o28K71N55m59o45P1J77p4J345p89j282l2
6601a104J677O4n38j62p75k01J139L95j018j67M71l20l96J162M04j194J89k62
$$ y = [-341, -434, 249, 637, -58, -466, -375, -805, -441, 1246, 988, -935, -1444, -532, -32, 707, 434, -1151, -1348, 27, 497, -405, -101, -282, -1076, -818, -153, 152, 83, 340, -861, -1571, -292, 1309, 571, -751, -968, -980, -705, 564, 220, -1002, -651, -284, -477, -217, 576, -12, -649, -691, -536, -56, 1175, 603, -1118, -1505, -18, 637, 473, 208, -444, -1054, -238, 448, -54, 152, 308, -444, -713, 176, 1091, 518, -80, -549, -888, 551, 1933, 592, -831, -179, 159, 485, 869, 730, 72, -158, 300, 124, 273, 1275, 1095, -382, -607, 520, 876, 1183, 792, -481, -464, 914, 1520, 940, 468, 769, -492, -325, 804, 778, 764, 816, -265, -644, 391, 1803, 502, -283, -220, -391, 329, 963, 390, -836, -390, 386, -242, 29, 584, 125, -520, -449, -272, -346, 999, 210, -1072, -1104, 573, 637, 99, -63, -838, -1039, 100, 495, -523, -690, -219, -539, -935, 227, 631, -563, -374, -636]
6619f36o41J609L88j065j012O50P32j36K50l23p93M84L97m61K46P86n30j333N80
6638h08P86J64m4R8j129j22J394K48n10m22j15m71J017N60p52M9j80l43P7Q27
6658C24P07r58m80K78jM64O16j012o43M82R74m29k04M65l40o59N60M32j34M40
6678H82l24r23J82R60J01l78j64l95k53J472K1r61j28J86j87r6Q15p0n66L87m54
6699A07k41R60P74j472p75P64L08K5J78l92q80Q16M02p9m53M79k96j064Q49O75
6719F85l83m54J18p85N69P11J31q41k38K18l50P87N28j073j23K29j38q8Q66J64
6739E33j127q4O5J78K59N60q79o02N40O27l3l05o7n39j5P31jk7J75k68p72K20
6761h31J326m61p80J36j51P4J100j53j221M24N26l64J79K78l70k45K90j17J39
$$ y = [-636, -1277, 332, 720, -345, -1357, -707, 25, -111, 139, -184, -977, -493, -96, -557, -311, 475, -55, -1388, -808, -22, 142, 98, 196, -933, -1055, 339, 587, 77, -345, -460, -931, 86, 646, -106, -57, -237, -580, -503, 324, 1031, 73, -407, -129, -130, 334, 950, -62, -705, -223, 751, 322, 118, 583, 243, -416, 144, 576, 442, 882, 558, -365, -183, 777, 878, 500, 336, -59, -312, 1160, 1181, 220, 92, 278, 91, -5, 810, 740, 174, 561, 107, -134, 826, 1600, 128, -647, 117, 425, 450, 628, 236, -644, 172, 574, 495, 42, 521, 225, -839, 10, 685, 302, -152, -34, -819, -250, 461, 592, -249, -487, -269, -619, 168, 696, -377, -500, -271, -409, -497, 369, 533, -594, -678, -613, -435, -176, 384, -495, -1097, -557, 70, 37, -268, -335, -874, -889, -158, -159, -186, -11, -279, -1051, -831, 495, 34, -746, -610, -761, -687, 413, 260, -961, -537, -11, -375, -196, 82, -288, -533, -243, -360, -221]
6780b21P19J44r98k60Q37J39l29J99n11p45J043Q33p01o7M1j96j33M50P34p47
6800B31J31po88M23Q64m08m47j4J59j29N03K74r05R6N03j78k49O35j23p90m8O88
6822E21K7j73L55o24n02Q94K58m02N48m13l01l02P65n27k25P97m81n73N75O88
6842I05o44l29K34m07K85O99j22j147N07K11m02J65L39j65o26L76k25RL61N24
6862E48j315j65J034o2k71K17j95q51R67K98o21k11Q66o92o2M36J15l67J6K95
6882b0o91K3Q73k65o40M32Mj80N28k86k94q8P96k56n89P69m4q03M09N30l38l55
6904d85N33m48m42J106m62m25M74j8k27J81L55k21o29Q48j60l51N49M58o78J67
6924A25J32k27l35J146m43o38J98O98p59M44L8k37K6J49K09l04oN38r33M05N18
$$ y = [-221, 498, 642, -356, -616, 221, 360, 31, 230, -281, -1026, 17, 850, 149, 82, 123, -73, -206, 244, 978, 231, 362, 355, -333, 90, 954, 546, 99, 85, 244, 115, 618, 892, -13, 83, 586, 408, 159, 794, 671, -119, -167, 521, 548, 375, 730, 106, -396, 498, 756, 354, 902, 489, 188, -114, 651, 124, -101, 696, 215, -358, 217, 905, 261, -68, 166, -241, 44, 743, 621, -526, -19, 192, -210, -45, 294, 129, -497, -121, -346, -337, 24, 548, -767, -932, 102, 40, -231, -14, -209, -1060, -93, 205, -416, -627, 239, -453, -515, -79, 36, -331, -315, -20, -711, -688, 185, -80, -720, -288, -284, -464, 64, -222, -516, -604, 192, -64, -653, 116, 72, -731, -322, 208, -130, -485, 48, -400, -842, 264, -198, -623, -149, -167, -394, -213, 142, -79, -708, 140, -20, -371, 178, 636, -42, 125, 257, 30, -305, 841, 398, -240, -42, 656, -103, 341, 379, 142, 168, 317, 526, 222, 216, 754, -179, 226, 744]
6945G44l18k63L24n78%P59J56n91q0L45l35Q3M25O9r07Q13k4n38J95M69o01j82
6967c5M75J06o15N91k06n07N87J20o29OO43l49l29K07M19r86M65K14j97l11M57
6988A26J0p12L36J93l08J1M54n10j55O55k08p80P28L0j41k62O41n08o72Q43K23
7009fo86P02J1n35o2K56Q9j27N06n49k47P70Lp05N21K25n90j49N12l14m68M51
7031c92N56o90J53O67m90m7J29q2k70N36o1n54L06P26m46m50Q37k54p16M21O92
7052E71j042P84K15n14k37N05J03l52L56l48n1K36L05m31lL16j27m18M35O47o12
7073C38j6M4j57j32M12J36r13N11L72n78L88K66l60k02N24n05K09j00K10m37K45
7094B55K51l57m38N09k06j09P58j59p37J13M99o26J61L60n9l16JM66n17J73N33
$$ y = [744, 426, 163, 487, -91, -91, 668, 824, 233, 153, 498, 163, 246, 671, 740, -167, 646, 622, 84, 279, 748, 147, -35, 440, 546, -69, 522, 316, -191, 396, 516, -113, -107, 536, 187, -142, 65, 484, -502, -37, 177, -20, -331, 126, 136, -576, -240, -47, -355, -344, 110, -400, -555, 100, -108, -888, -160, -130, -271, -533, 108, -400, -1072, -229, -6, -692, 10, 21, -514, -576, -320, -231, -358, 148, -401, -648, 122, 125, -580, -59, 166, -424, -573, -61, -375, -843, -392, 164, -526, -373, 294, -196, -243, -114, -196, -466, 70, 9, -545, -239, 487, 41, -409, 428, 174, -542, -121, 571, -471, 313, 528, 14, -223, 282, 385, 33, 389, 41, -10, 226, 531, 100, 97, 413, 286, -132, 303, 950, 338, 322, 366, 209, 77, 489, 625, -288, 223, 595, 17, 405, 671, 311, 109, 633, 128, 337, 237, 447, 10, 255, 506, 149, -289, 220, 14, -95, 663, 504, -233, -120, 379, -247, -86, 274, 215, -101, -100, 366, -151, 22, 555]
7115E55n06l38L70j98k45P80m06p91L29Q86n72l97Q69n68l83L09J21j20K36J15
7135D6o92l6R69j96n75M2o9l14L41P46n75j13K17k40l3N18J83q66P6O41n91L27
7157a94Q14o18n58K76K42l29L67j8n76K05N26j06k96L88l77m32J59P43l15J34
7177C5L03o77j32Q80M30r97J23L95m39O8Q16k50o83M96l2l12L16L46m78n71P56
7198C93k2k9P19m10j165N39O76k82O3r2k89mM3M86j97J73J8j002J42J009k34l10
7220B25J05k49l41O06N97p32k65M00k27k0M71L3n84l51O14o07N19O01r73n94M16
7241c56N85l25O89m32p53J56R49k96o00O56l70n99N64L75j43l06K51r91J90R71
7261B15rp65M4K32l06L86M69p90k71Q42k85j27N20J65r87J52K21q5J49Q21o68
$$ y = [555, 49, -289, 81, -117, -362, 418, 12, -779, -450, 436, -136, -533, 336, -232, -615, -306, -185, -305, -69, 46, -646, -682, 287, 91, -484, -442, -511, -825, -484, 262, -313, -426, -209, -449, -482, 36, 219, -647, -571, 70, -521, -194, 620, 2, -556, -280, -38, -367, 0, -18, -594, -389, 137, 31, -265, 123, -254, -686, -527, 216, -99, 35, 338, -339, -471, 409, 839, -158, -35, 360, -79, -11, 805, 555, -128, 368, 336, 24, 340, 686, 208, -363, 393, 371, 342, 1061, 651, -514, 25, 701, 419, 482, 390, 101, 97, 140, 626, 429, 602, 620, -382, -240, 769, 535, 225, 330, 81, -260, 346, 943, 211, -54, 346, 119, 99, 570, 603, 19, -332, 282, -325, 194, 795, -178, -772, -356, 229, -96, 593, 161, -592, -436, 513, 217, -383, 273, -97, -696, -132, 243, 100, -206, 45, -946, -756, 215, 206, -559, -515, -283, -589, -203, 266, -524, -795, 47, -238, -365, 155, 320, -667, -515, -294, -379, -230, 591, -77]
7282g7j037N66J143n57o2j33l10k02P76J83p32ML33n39R8J203K2r40j83q6J76
7303c54R01M69j346k38P80k28o6O37m76p42O58K82l96M83L78r80j28P22M85j71
7323F70k00j40q38L85R79j77o33N63n61k09N08M98k15l19q5n16O2R19J55r89J41
7344bL38r3jP43j136l48J036l72l28R18n4j062K89M08k5nM76o14j007O72O08j57
7366B84l28Q7j43k9P18k92o05L23p7q27O27R66m45o42R2m82N45Q80l44j088k52
7387a032Q61L38n22O74r07l15N72L91k51L50M4j427K42Q42O33n21j81o89j95O70
7407d23P98l34n30J12L4m96N86N03m94nl24k74K72R13J55j574K35P71j8N70j11
7428C66r22n44J216K55n17M98kr48r5J146r5k9K22q49q29J635O43r83j72j12j04
$$ y = [-77, -1114, -548, 595, 38, -24, -157, -467, -669, 107, 290, -442, -438, -105, -644, -546, 657, 679, -261, -444, -530, -354, 547, 1016, -330, -568, 212, -16, -82, 555, 79, -663, -5, 277, -119, 364, 742, -238, -366, 356, 841, 670, 470, 330, -508, -123, 856, 679, 46, 609, 48, -161, 347, 845, 630, 311, 226, -290, -228, 691, 846, -143, -2, 336, 243, 242, 985, -151, -499, 537, 165, -163, 755, 701, -361, -72, 336, 311, 306, 782, 168, -839, -167, 441, 284, -44, 43, -100, -129, 589, 297, -308, 15, -62, -889, -262, 704, 259, -383, -291, -773, -228, 652, 308, -780, -1032, -171, 167, -355, 319, -588, -903, -331, 60, -191, 159, 203, -1224, -982, -140, 493, -28, -209, -898, -1093, -423, 375, 41, -489, -377, -343, -839, -253, 250, -244, -249, -573, -847, -575, 338, 493, -1081, -846, -75, -93, 477, 366, -556, -1100, 116, 371, -146, 352, 350, -598, -693, 453, 358, 329, 551, -298, -1127, 508, 1151, 168, -4, -116, -220]
7449b20Q26L32k25q41J2N32o95M80P24m13p42N3K58o3J379q12j025m21J408M29
7469I76n60m7m08l08Q21L83q19N15k15m82l66R03J46J7l42q24k0J224P49j029
7489C14o15K37K38k05P02O4j114K15L65n79O13R54p25j186K00N74o3M70n54j018
7509a113L60J199L1p31K08R6p50L94M61k75n3M39j064m19J314P08r16o34j67k2
7529i34Q07J102j142r32L09M46Q4L03N27q51n94L25L36J22R57q98j069M23J040
7548C61L3m94q5p82M9J554m95l54R8M2l87j84J070P4n29K0o05m1J314P80j445
7569fn04K77J30N43R9k51q90L70M99l14M4R70o72j101Q90M86K35J06o38j122P30
7590a19J582m60q46l51L38k25N91N27n77l6j15r20J60J564K07r98p39K54L1R75
$$ y = [-220, 606, 938, 713, -128, -116, 416, -279, 201, 925, 512, -230, -177, 81, 18, 1397, 585, -440, -861, 547, 976, 416, 369, -39, -347, 474, 857, 38, 553, 338, -144, -510, 393, 539, 556, 214, -610, -630, 594, 1343, 314, -301, -64, 174, -31, 671, 735, -379, -164, 201, -378, 235, 1189, 464, -722, -522, 52, -11, 459, -95, -1113, -753, 446, 477, -254, -46, 50, -700, -306, 155, -120, -173, 266, -798, -1217, 97, 805, -111, -745, -912, -934, -127, 975, -167, -1099, -790, -344, -260, 43, 570, -281, -875, -550, -214, -92, 865, -33, -1102, -679, 361, 394, -100, -185, -967, -918, 636, 141, -213, -115, -73, -460, -644, 426, 500, -29, -9, -614, -655, 659, 1439, -6, -510, -233, -103, 440, 539, 288, -602, -232, 267, -47, -3, 967, 295, -806, 84, 570, 805, 911, 273, -849, -119, 1463, 1003, 157, -194, 144, -81, 510, 1037, 460, 424, 309, -611, -451, 1113, 1320, 322, -417, -163, -132, 843]
7610H43M41j242q21M30P16k68K72K50m37p97O23O3K94P26p80j765Q77J469m1m64
7630C89m97o77L51J048J76j142M5J12l56M55N88l46l60j95o05L72J489N6j575
7649f72r01J285L05M6L06p21o32N66M32m64L32O49r48n93L22Q37L21l15r07r10
7669a662R75J692n59r30k29J42j23O10P81q47k09J37n58K53J245k05r92m58J44
7688g93P64P99m5j533m66J245O58q4k87n96j15K31M16n7L68N15j300r39R12J464
7708A157j75q64o67j25O43J351p55p44L2L12j76p5R22l30j75l82J7k81J543J02
7728A330j670n79J167O25K1j49j287O6R85K08m84rK57n00q79J121M74J79k02j108
7748d34l82R56J197n86j108r5K29K64P15m61m85j66M81l97LJ184K8j601j96K78
$$ y = [843, 1284, 42, -779, -349, 367, 99, 371, 621, 184, -613, 10, 73, 367, 1093, 313, -1452, -575, 894, 853, 389, -108, -785, -434, 614, 790, -352, -307, -195, -551, -96, 492, 146, -214, -409, -1014, -642, 847, 903, -672, -1573, -288, 17, 63, 369, -352, -984, -418, 14, -450, -118, 531, -417, -1010, -688, 149, 470, 155, -752, -1662, -687, 1005, 446, -484, -713, -571, -694, -84, 697, -150, -359, -222, -780, -527, 718, 513, -479, -937, -793, -29, 770, 725, -808, -1274, -29, 629, 545, 258, -338, -453, -222, 194, 137, 505, 1020, -280, -1219, -307, 1157, 982, 118, -549, -674, -31, 1320, 565, -179, -147, 165, -11, -86, 836, 506, 331, -51, -34, -315, 1228, 1330, -340, -919, 248, 873, 894, 745, -542, -476, 509, 717, 233, 224, 481, -19, -898, 223, 697, 876, 674, -434, -816, 140, 1337, 751, -357, -452, -223, 41, 756, 295, -190, -356, 125, -272, -269, 915, 943, -658, -854, -576]
7768e76O14P69n67j264o57J690N02m54l81n5j95J83O77m43j73N37q94o73J184
7787a76J188p06n12j086L39J012J169r29j108OO09o8J12J03j74o4k33LL65R50
7807H00k26j576o03J615N01j2l97j132J4J341M80j105RM71n56k44Q29N01o2m35
7827B13q23M9M11J422o74j224q4M36R29L03n43p11J36M67m16K64Q51k84j085J62
7847b01M83N15L17n80r78m00J777K90r29j43l64N9P79M34q48l12M47m12o42J285
7867E77Q76q92p69k93j1J292R03j502q38N01N31N47l69k32k36n11L54l3K76J011
7887A182o79j478j3J182P64l96o70r08N53J014L04j149m36M87p1j32O32L17k91
7906B12l87o05k89J091J342r77j637J51Q44O37Ln29q78N96P01o64j07O59k92o92
$$ y = [-576, 38, 807, 240, -1024, -1681, 9, 511, 57, -324, -379, -574, -391, 286, -157, -330, 207, -687, -1360, -176, 1012, 306, -206, -1292, -953, 59, 1228, 299, -809, -803, -194, -262, -150, -47, -221, -285, -518, -515, -150, 800, 574, -1002, -1605, 10, 511, 499, 102, -1030, -1016, 325, 805, -300, -291, 180, -376, -620, 209, 710, 648, 213, -610, -561, -150, 1272, 598, -626, -710, -274, 655, 958, 415, -296, -160, 307, -109, 155, 1006, 722, -363, -201, 282, 797, 1114, 534, -444, -844, 933, 1223, 294, 151, -213, -154, 625, 1059, 211, -101, 346, -66, -708, 577, 1453, 561, -208, -501, -512, 780, 1683, 181, -657, -156, 375, 922, 553, 321, 85, -426, -72, -105, 171, 1182, 503, -975, -988, 194, 958, 562, -108, -1016, -463, 551, 855, -294, -730, -243, -314, -446, 186, 503, 212, -175, -780, -1069, 22, 1364, 387, -1250, -1099, -255, 382, 385, -144, -1022, -426, 275, -389, -496, 163, -129, -821]
7926h21j31M30N73O77p77j597K78J959Q1p61o31J61l92J477j1o91J04M35p91m76
7946i04J172N93o93o51l76M91J056M83j408j039R04J182k66m73K1p51M23O42j16
7965B90j47O83n40r06K2J545R8m08q30p20N63J614k41j219M6L30R6PN53l69l24
7986A43R2m53j32J422N80j125j452L89Q33Q18j9j006q69Q07N73l34j34M09n40
8005Bj68J44J40L55N05l55j896P56J681q5j241n96Q1O16Q87n03p51K24J99q2n79
8026f66Q89M06o99l88j93N88R86M3j607r55J160R94n65j31k00m52N08L61k34m
8046a59N44n78o71J17J072J16l99p96l12Q32J206n52j509K5N59M87J8Q1j13p67
8066g99M24j43k06J112J75r17q53P03P80L63k12j162n82J403Q23n28p39K31k19
$$ y = [-821, -952, -522, 51, 728, -49, -1646, -1368, 591, 672, -89, -720, -559, -951, 526, 515, -176, -72, 363, -428, -904, 268, 861, 168, -483, -859, -368, 688, 1171, -237, -1276, -372, 810, 544, 71, 92, -659, -236, 406, 290, 143, 826, 286, -620, -598, 947, 1045, 637, -193, -913, -350, 1264, 1023, -196, -150, 180, 276, 283, 836, 467, 143, 235, -218, -350, 1072, 1652, 527, -925, -536, 297, 1115, 1096, 90, -779, 28, 601, 267, 133, 542, 2, -166, -22, 118, 473, 978, 623, -1273, -517, 1164, 1079, -162, -758, -677, -61, 826, 323, -428, -204, -5, -87, -666, 223, 629, -70, -458, -651, -63, 923, 966, -641, -1596, -436, 558, -7, -138, -338, -790, -282, 79, -155, -159, 385, -193, -864, -747, 325, 441, 42, -754, -1066, -234, 972, 420, -1089, -1064, -505, -18, 0, 81, -32, -799, -375, -518, -724, 388, 563, -354, -1207, -504, 276, 639, 427, -735, -1317, 86, 909, 381, -358, -127, -346]
8085c46k6O18R5r9r0m29o23O61J461j92j121o60J02Q83O99l76r53k69J025Q6o01
8106a55N57J36m44n14K24L13R12k03j188o10J072J056j1p57l62n19O80M62m82
8125A67m34O21k34m64L00R72k07p69L18j021O52J511r31j162q4J103J19J31m71
8144A17n62J22L98n8m26R42J06q47j018J150P30j50l69j253n7J539N37r29l21
8163c49j34q0L94M50k06k71M87o42p88J003J047m88j365j99L64O38P32m08j112
8182i27L06O26J89k46K70o87l48L22K37
$$ y = [-346, -372, 246, 341, 242, 152, -277, -900, -239, 1222, 1030, -91, -751, -649, 234, 933, 557, -396, -665, 360, 446, -155, 402, 538, 94, -420, -196, 117, 1029, 826, -362, -972, 100, 1156, 1145, 388, 26, -493, 187, 649, 167, -267, 354, 120, -344, -44, 928, 721, -48, 270, -751, -99, 1412, 481, -681, -765, 338, 457, 588, 117, -445, -323, 75, 17, -409, 533, 639, -208, -1226, -76, 654, 504, 135, -1118, -1175, 364, 901, -28, -349, -483, -563, -169, 281, 75, -196, 291, -351, -1139, -136, 911, 423, -942, -1141, -777, -139, 593, 185, -927, -621, 5, 194, -52, 218, -469, -817, -495, -258]
8191b58
$$ Imaginary data points
##PAGE= N=2
##DATA TABLE= (X++(I..I)), XYDATA
0@%%%Qj6QqK4k4J6l2M8m8N6q0J02j10J26j58J89k11K43k90L33l76M31m94N57o27
29c33P10q02Q97j000J120j253J391j541J713j900K101k325K578k853L154l497
45a840L888m324M817n398O081o883P858r079J0637j2701J5596j9939K7114m1002
59b5175P7175l32420q02980J006001J017194o31785j075590L55921J003820j42093
69D50068r93991j3839J003540K47955r80296n00255P96670O73632n33897o73732
79e24145K90560N69863j77221m70500J51799M80686j20323n55186Q017N99662
89B53212J32396n56583k24720M75100K37918m30774k39241M50135L18723m63844
99d7678m94900L87630O96139j97041q17569l7074Q25385K38025p53553l67662
$$ y = [0, 0, 0, 0, 8, -8, 0, -8, 16, -8, 8, -24, 24, -24, 32, -48, 54, -56, 70, -88, 101, -110, 133, -157, 176, -200, 231, -263, 294, -333, 377, -425, 472, -528, 592, -661, 730, -811, 902, -998, 1103, -1222, 1356, -1497, 1657, -1840, 2048, -2276, 2541, -2857, 3224, -3659, 4199, -4880, 5757, -6944, 8652, -11287, 15827, -25175, 52000, -280420, -1083400, -77399, 939795, 308010, -767580, -411659, 592161, 450068, -543923, -557762, 445778, 693733, -286563, -786818, 9852, 683484, 149587, -524145, -233585, 336278, 159057, -311443, -159644, 321042, 200719, -354467, -346450, 253212, 385608, -170975, -395695, 79405, 317323, -113451, -352692, 97443, 416166, -47678, -542578, -154948, 541191, 344150, -473419, -510493, 314892, 552917, -200636, -568298]
109e68298O70439M69661o03139o06581N06260P87224l18532r33493N4250R74764
119D32555K21369q77543m06755P13928M77953n75790n03274M86023N61600l93679
129A36387o59059K45161P40164l6723p16570j36134O00217J98450m83769j69855
139b81731M41835J49293m65864k18490M65264L62320l64428m72569K08390M84829
149C08849r7975m38299Q1503M29932j00587m99542M3920N80326J25243n66296
159a32926l31291M32522M60379k63394m86566J58593M80132j27543n22408Q4993
169b47509O06400M7492o46209k61754N62055M49051l89713n41926K22783N51988
179C52658j26244n55881P7415O00184J659o49737j59341O20621L37637m97080
$$ y = [-568298, 102141, 571802, -31337, -637918, -131658, 655566, 337034, -596459, -542209, 432555, 653924, -223619, -630374, 83554, 561507, -14283, -517557, -31534, 530066, 136387, -522672, -277511, 462653, 425930, -290640, -426774, 173443, 371893, -111876, -281731, 160104, 309397, -156467, -374957, 90307, 452627, 88199, -384370, -175980, 308849, 210874, -227425, -145922, 284010, 183423, -316119, -272199, 308127, 433370, -132926, -464217, -31695, 428684, 165290, -321276, -162683, 317449, 189906, -332502, -247509, 358891, 406383, -239826, -501580, 60475, 509526, 119813, -422113, -199330, 352658, 226414, -329467, -252052, 348132, 349791, -299946, -459287, 161334, 498971, 1891]
189A891m68953L22828N08360j80701m89076J13370M80517q1536n06942J8959N24390
200B43107Q7311m89731k07809L84444K79480k63098k83448J93129K64773j89539
210A8619k79761K10741L41702j91672m15285J03521M37450J4783l92074j04428
220b56404L26820J47231k99615j84665L20527K70474l28803m02458K59526N15522
230C68155j01142n34809p5770M60439J97474l61708k57916L04953L12419k83317
240B8778m03652K34719N14555r9448n53777q1080M80508K20835l37987k68115
250b64664K19208K54222j78765k55203J85133L13531j50041l67732O0356L55993
260A72038L3569k70354o4451J79147K6131j63739J0660K29771K5797k98608j24581
$$ y = [1891, -467062, -144234, 364126, 183425, -305651, -192281, 288236, 206700, -300242, -281283, 243107, 330418, -159313, -367122, 17322, 296802, 33704, -249744, -56615, 208158, 18619, -261142, -50401, 291301, 99629, -315656, -212135, 225315, 240098, -151976, -256404, 70416, 217647, -81968, -266633, 53894, 324368, -4435, -406893, -147367, 368155, 267013, -267796, -343566, 116873, 314347, -47361, -305277, -324, 312095, 28778, -374874, -140155, 374400, 274952, -278825, -359905, 120603, 341438, 3451, -264664, -45456, 208766, 30001, -225202, -40069, 273462, 123421, -244311, -183955, 172038, 205607, -64747, -129198, 49949, 76080, -87659, -76999, 152772, 178569, -120039, -244620]
271b44620L09187K23249k56075k63347J94892K55184j70565k63125J59371L22603
281B66754j01426m03083k7828M39224J88393l92656l12289K87864L59827j81624
291A23156l51240J04321L38765m2257l49262m4051L58837J59130l33282k73955
301c09838K50629L36325j42194l23284N8263K68921k2423k28832Q429K27141J8990
312A42127k55477q9945K60465J68996k22446k10479J69764K00057j43147j73649
322a53734J52503J84128j66111k55152J18156L32089q475l58556j10799L20856
332E4905J79942k62505j89256K36875J92267k40851k44794K10621L30093j09154
342A58143l84827l8854L62190J57793k81246j96703K11333J81483j91506j78328
$$ y = [-244620, 64567, 287816, 31741, -231606, -36714, 218470, 47905, -215220, -55849, 266754, 165328, -237755, -265583, 173641, 362034, -30622, -342911, -55047, 304780, 123156, -228084, -123763, 215002, 172745, -176517, -220568, 138269, 297399, -35883, -309838, -59209, 277116, 134922, -188362, -130099, 138822, 116399, -112433, -104004, 123137, 142127, -113350, -203295, 57170, 226166, 3720, -206759, -36995, 163062, 19915, -153734, -1231, 182897, 16786, -238366, -120210, 211879, 203404, -155152, -265951, 54905, 234847, -27658, -216914, 19961, 212228, -28623, -273417, -62796, 267297, 158143, -226684, -265538, 96652, 254445, -26801, -223504, -12171, 169312, -22194, -200522]
352b00522J90412K24288j45851k83598M1601K97452P5631k48080j39830J81850
362f647J36410j54342j12214J71053J30264j78036j85254J32852K37824l9436
372A32474k44086m8982K08480Q7237j76950q4421J83062R0092k02859j26400K00377
383A8024J89948j42605k34108N0155K32285K6429k01496n7488J80189N8320j85344
394f5691n9900K08556R4917k04967j49008J56218J87809q0259j91467J6793J70782
405H3783O357j60519K20J84348O631k19649n4115K23701J22412j71889j70368
416a49088Q8406J72725k5326j52586O992J52122j0058j87715j6407K18836Q1969
427A79870j97589j50153J19098J72567k9569j44889j4920J09525M896j20304M939
$$ y = [-200522, -10110, 214178, 68327, -215271, -173670, 123782, 199413, -48667, -188497, -6647, 129763, -24579, -136793, 34260, 164524, -13512, -198766, -65914, 171910, 132474, -111612, -160594, 47886, 135123, -41827, -126248, 56814, 146906, -55953, -182353, 18024, 207972, 65367, -168741, -118586, 113699, 140128, -61368, -118856, 61333, 119653, -65691, -125591, 82965, 177882, -27085, -176093, -19875, 167934, 87675, -103792, -86999, 83783, 90140, -70379, -70159, 114189, 120820, -98829, -152944, 70757, 193169, 21280, -149088, -60682, 112043, 86717, -65869, -58877, 93245, 83187, -104528, -120935, 97901, 179870, -17719, -167872, -48774, 123793, 94224, -50665, -65585, 43940, 48836, -71468, -66529]
438f6529J63257K3936j89135q6279J56787J31711q1800j25298K3425Q8039k1941
449A6173q1682M7065J22515n1305j85154N915K11599O1239j78888j00058J21273
460a1308R8665q8079r4633Q6363J21010q8209j82025N1995K32813K0505k30414
471h3317q9419J77258J19779j12507j16155P1936J12682n6723j34708L8382J72562
482I9770O062j91049o4170J64179J05596j03678j07490M7617Q3662k0506o4813
493d4820K4506Q0169k5929j17267K202J42044L8091j29761o6722R0082O6808n3199
505F204m5889N1145M7585o6103q6682O4598J44825k6450j79308l3364J63465P5280
517A15306j13665p5256Q0163O3264p4065p6162P8354J24929n3267j74734q819
$$ y = [-66529, 96728, 120664, -68471, -154750, 2037, 133748, 51948, -73350, -49925, 38114, 16173, -65509, -18444, 104071, 52766, -132388, -126473, 85126, 146365, -32523, -132581, -11308, 87357, -722, -95355, -8992, 112018, 23809, -158216, -106221, 126592, 147097, -83317, -172736, 4522, 124301, 11794, -104361, -32425, 80257, 23534, -111174, -72792, 99770, 105832, -85217, -149387, 14792, 120388, 16710, -90780, -43163, 40499, 19993, -44820, -20314, 59855, 33926, -83341, -81139, 60905, 98996, -30765, -97487, -7405, 59403, 6204, -39685, 11460, 59045, -7058, -93740, -29142, 115683, 89233, -90075, -123439, 40026, 115306, 1641, -73615, 6548, 69812, -4253, -80415, -2061, 122868, 69601, -105133, -113952]
528a13952J79788O9313j32809q5281P6419O2029n0672l8232N9056N3530o4274
539A4915j01392L4715J34476J7864j21667m9769P7227L6429m7047k197N4093o982
551D0665q0361l0079Q2479Q7138m6558j18048o89J05800J9321q0555p134P1154
563D3133r243q7642q704J00490O0131q0155j10960L1846J26987J1711j11568k8030
575f2004Q4056J5635p7792o892Q5854K5679q5250o5467O1382R8698k1378j06117
587e3596j0402Q6354R558o9602R613P1511j9684q8676N19R6607M3283p8322q1866
600h4703M1525R1786j7340q0435J9422P5114l5999r0082L3592J13469L721j13607
612d3537n8894P8792R5917k9921r4412M429P5450j2043o8815K9182Q6681k0713
$$ y = [-113952, 65836, 135149, 2340, -82941, -6522, 55507, 4835, -33397, 25659, 79189, 14915, -86477, -51762, 82714, 100578, -21089, -70858, 6369, 42798, -4249, -6446, 47647, 40665, -39696, -69775, 12704, 99842, 53284, -64764, -65453, 40347, 59668, -20887, -28021, 43133, 33890, -53752, -62456, 38034, 98165, 18010, -92950, -61104, 65883, 77594, -33974, -62004, 22052, 37687, -40105, -46997, 38857, 64536, -20714, -86181, -24799, 73899, 52521, -53596, -63998, 22356, 31914, -37688, -28075, 43436, 23752, -64924, -64405, 32202, 75485, -2837, -84703, -43178, 48608, 31268, -49167, -29745, 45369, 9370, -80712, -47120, 66349, 70070, -43537, -102431, -23639, 72278, 42357, -52055, -47626, 27824, 15781, -53034, -23852, 62829, 42116]
624D2116j03576k2429Q9544O9392m1924q2583J549O5408N338m5213K0887N2212
636E0721m0470q0871K5146R4964J7696p3563m9690L6650N4817j3544m1397K6609
648G068M2686n2143o9544N4576R9433k3186j01942j9282P3948M6290l7705m5902
660b5703K5585M0921l7993n2779N1115P7865m0779r5011R334Q3981K4346n1093
672I789l7869K0293L2560j3783k6239K7679L4874m2448n4215L8228O6379j7147
684C8101n8124n955L2770J3052j6034q638J9228Q695l9146k4883N4480N0844m8964
697A5426o8495K2727N9591k18l8072q739K3386O333l0802j2882N0683L8490n8191
710g63o8671L7558P5225o977n5529j2064K3659Q313j1521J218K6777P725m8974
$$ y = [42116, -61460, -83889, 5655, 75047, 33123, -49460, -47911, 17497, 22835, -22378, -1491, 50721, 10251, -70620, -45474, 49490, 67186, -6377, -56067, -19417, 35400, 21856, -19541, 7068, 49754, -2389, -71933, -17357, 82076, 58890, -43052, -62334, 11614, 57904, 20199, -25703, -118, 40803, 2810, -49969, 1146, 79011, 38232, -56779, -47445, 36536, 60882, 9789, -28080, -7787, 24773, 10990, -15249, 12430, 47304, 4856, -49359, -11131, 55248, 38101, -20023, -25978, 6792, 19844, 3810, -4828, 14400, 23095, -16051, -40934, 13546, 64390, 15426, -53069, -30342, 29249, 29031, -9041, -17780, 5606, 11939, -18863, -31745, 18938, 57428, -763, -69434, -31876, 43349, 36372, -19157, -31221, -7562, 751, -10770, -9552, 17225, 24950, -24024]
723b4024l6115N0568N9703l0365n7764O872L1940l515q906J5498J2653k0415l6706
736d0576J078N5628L1155n1284n0360L2166M3691j8595k3059K1264J5211k6578
748a0259k8327J5680M6863J4137n1251m1994L8944N1628j9912l7592J4014J9987
760A1918j8643j5579J8974K6671m204l7516k0530L7821M2318k4004m2147J2953
$$ y = [-24024, -60139, -9571, 50132, 19767, -37997, -31125, 815, -2700, -11606, 3892, 16545, -3870, -40576, -39498, 16130, 47285, -3999, -54359, -22193, 21498, 2903, -20156, 1108, 16319, -10259, -38586, -22906, 23957, 38094, -13157, -55151, -16207, 35421, 15509, -22083, -8069, 11918, -6725, -22304, -3330, 23341, 19137, -18379, -38909, -1088, 41230, 17226, -24921, -11968]
$$ [...]
8191F58
##END NTUPLES=NMR FID
##END=
