##TITLE=1H_CA-8578-3-2
 CDCl3, 8 sc, 
 5.4.2019
##JCAMPDX= 6.0         $$ Bruker NMR JCAMP-DX V2.0
##DATA TYPE= NMR FID
##DATA CLASS= NTUPLES
##ORIGIN= UXNMR, Bruker Analytische Messtechnik GmbH
##OWNER= root
$$ XWIN-NMR		Version 3.5
$$ Fri Apr  5 16:21:57 2019 Russian Standard Time (UT+4h)  she@DPX200
##.OBSERVE FREQUENCY= 200.1315
##.OBSERVE NUCLEUS= ^1H
##.DELAY= (6, 6)
##.ACQUISITION MODE= SIMULTANEOUS
##.ACQUISITION SCHEME= undefined
##.AVERAGES= 8
##.DIGITISER RES= 18
##SPECTROMETER/DATA SYSTEM= spect
##.PULSE SEQUENCE= zg30
##.SOLVENT NAME= D2O
##.SHIFT REFERENCE= (INTERNAL, D2O, 0, 15.7039)
##AUDIT TRAIL= $$ (NUMBER, WHEN, WHO, WHERE, WHAT)
$$ ##TITLE= Audit trail, XWIN-NMR		Version 3.5
$$ ##JCAMPDX= 5.01
$$ ##ORIGIN= Bruker BioSpin GmbH
$$ ##OWNER= she
$$ F:/spectra/data/she/nmr/H-F/1/audita.txt
$$ ##AUDIT TRAIL=  $$ (NUMBER, WHEN, WHO, WHERE, WHAT)
(   1,<2019-04-05 16:20:23.07 +0400>,<she>,<DPX200>,
      <created by zg, POWCHK disabled, PULCHK disabled
       configuration hash MD5:
       00 E9 B6 7A A2 85 ED C7 34 08 36 98 17 FE 4E 26
       data hash MD5: 16K
       18 F2 04 24 96 11 56 DF 9C 10 79 8B 07 F1 DB 04>)
$$ ##END=
$$ 
$$ hash MD5
$$ 67 79 44 47 66 4E 90 39 CD D5 DE 0F 0B 36 94 64
##$RELAX= 
##$RELAX= 
##$RELAX= 
##$RELAX= 
##$RELAX= 
##$RELAX= 
$$ Bruker specific parameters
$$ --------------------------
##$DU= <F:/spectra>
##$EXPNO= 1
##$NAME= <H-F>
##$PROCNO= 1
##$TYPE= <nmr>
##$USER= <she>
##$AMP= (0..31)
100 100 100 100 100 100 100 100 100 100 100 100 100 100 100 100 100 100 
100 100 100 100 100 100 100 100 100 100 100 100 100 100 
##$AQSEQ= 0
##$AQ_mod= 1
##$AUNM= <au_zg>
##$AUTOPOS= <>
##$BF1= 200.13
##$BF2= 200.13
##$BF3= 200.13
##$BF4= 200.13
##$BF5= 200.13
##$BF6= 200.13
##$BF7= 200.13
##$BF8= 200.13
##$BYTORDA= 1
##$CFDGTYP= 0
##$CFRGTYP= 5
##$CHEMSTR= <none>
##$CNST= (0..31)
1 1 145 1 1 1 1 1 1 1 1 1 1 1 1 1 1 1 1 1 1 1 1 1 1 1 1 1 1 1 1 1 
##$CPDPRG= <>
##$CPDPRG1= <>
##$CPDPRG2= <>
##$CPDPRG3= <>
##$CPDPRG4= <mlev>
##$CPDPRG5= <mlev>
##$CPDPRG6= <mlev>
##$CPDPRG7= <mlev>
##$CPDPRG8= <mlev>
##$CPDPRGB= <>
##$CPDPRGT= <>
##$D= (0..31)
0 1.2 0 0 0 0 0 0 0 0 0 0.03 0 0 0 0 0 0 0 0 0 0 0 0 0 0 0 0 0 0 0 0 
##$DATE= 1554466822
##$DBL= (0..7)
120 120 120 120 120 120 120 120 
##$DBP= (0..7)
150 150 150 150 150 150 150 150 
##$DBP07= 0
##$DBPNAM0= <>
##$DBPNAM1= <>
##$DBPNAM2= <>
##$DBPNAM3= <>
##$DBPNAM4= <>
##$DBPNAM5= <>
##$DBPNAM6= <>
##$DBPNAM7= <>
##$DBPOAL= (0..7)
0.5 0.5 0.5 0.5 0.5 0.5 0.5 0.5 
##$DBPOFFS= (0..7)
0 0 0 0 0 0 0 0 
##$DE= 6
##$DECBNUC= <off>
##$DECIM= 24
##$DECNUC= <off>
##$DECSTAT= 4
##$DIGMOD= 1
##$DIGTYP= 9
##$DL= (0..7)
0 120 120 120 120 120 120 120 
##$DP= (0..7)
150 150 150 150 150 150 150 150 
##$DP07= 0
##$DPNAME0= <>
##$DPNAME1= <>
##$DPNAME2= <>
##$DPNAME3= <>
##$DPNAME4= <>
##$DPNAME5= <>
##$DPNAME6= <>
##$DPNAME7= <>
##$DPOAL= (0..7)
0.5 0.5 0.5 0.5 0.5 0.5 0.5 0.5 
##$DPOFFS= (0..7)
0 0 0 0 0 0 0 0 
##$DQDMODE= 0
##$DR= 18
##$DS= 0
##$DSLIST= <SSSSSSSSSSSSSSS>
##$DSPFIRM= 0
$$ [...]
##$SUBNAM2= <"">
##$SUBNAM3= <"">
##$SUBNAM4= <"">
##$SUBNAM5= <"">
##$SUBNAM6= <"">
##$SUBNAM7= <"">
##$SUBNAM8= <"">
##$SUBNAM9= <"">
##$SW= 24.9337058887773
##$SWIBOX= (0..15)
0 0 2 0 0 0 0 0 0 0 0 0 0 0 0 0 
##$SW_h= 4990.01996007984
##$TD= 16384
##$TD0= 1
##$TE= 0
##$TE2= 300
##$TE3= 300
##$TEG= 300
##$TL= (0..7)
0 120 120 120 120 120 120 120 
##$TP= (0..7)
150 150 150 150 150 150 150 150 
##$TP07= 0
##$TPNAME0= <>
##$TPNAME1= <>
##$TPNAME2= <>
##$TPNAME3= <>
##$TPNAME4= <>
##$TPNAME5= <>
##$TPNAME6= <>
##$TPNAME7= <>
##$TPOAL= (0..7)
0.5 0.5 0.5 0.5 0.5 0.5 0.5 0.5 
##$TPOFFS= (0..7)
0 0 0 0 0 0 0 0 
##$TUNHIN= 0
##$TUNHOUT= 0
##$TUNXOUT= 0
##$USERA1= <user>
##$USERA2= <user>
##$USERA3= <user>
##$USERA4= <user>
##$USERA5= <user>
##$V9= 5
##$VALIST= <valist>
##$VCLIST= <CCCCCCCCCCCCCCC>
##$VD= 0
##$VDLIST= <DDDDDDDDDDDDDDD>
##$VPLIST= <PPPPPPPPPPPPPPP>
##$VTLIST= <TTTTTTTTTTTTTTT>
##$WBST= 1024
##$WBSW= 4
##$XGAIN= (0..3)
0 0 0 0 
##$XL= 0
##$YL= 0
##$YMAX_a= 960123
##$YMIN_a= -1149577
##$ZGOPTNS= <>
##$ZL1= 120
##$ZL2= 120
##$ZL3= 120
##$ZL4= 120
##$ABSF1= 10
##$ABSF2= 0
##$ABSG= 5
##$ABSL= 3
##$ALPHA= 0
##$AQORDER= 0
##$ASSFAC= 0
##$ASSFACI= 0
##$ASSFACX= 0
##$ASSWID= 0
##$AUNMP= <proc_1d>
##$AZFE= 0.1
##$AZFW= 0.1
##$BCFW= 1
##$BC_mod= 2
##$BYTORDP= 1
##$COROFFS= 0
##$CY= 11.3945322036743
##$DATMOD= 1
##$DC= 2
##$DFILT= <>
##$DTYPP= 0
##$F1P= 18.9103706918063
##$F2P= -1.10871071338519
##$FCOR= 0.5
##$FTSIZE= 0
##$FT_mod= 4
##$GAMMA= 1
##$GB= 0.15
##$INTBC= 1
##$INTSCL= 1
##$ISEN= 128
##$LB= 0.24
##$LEV0= 0
##$LPBIN= 0
##$MAXI= 10000
##$MC2= 0
##$MEAN= 0
##$ME_mod= 0
##$MI= 1.114404
##$NCOEF= 0
##$NC_proc= 0
##$NLEV= 6
##$NOISF1= 3.799351
##$NOISF2= 2.8
##$NSP= 1
##$NTH_PI= 0
##$NZP= 0
##$OFFSET= 15.70392
##$PC= 1
##$PHC0= -8852.374
##$PHC1= 17.80028
##$PH_mod= 1
##$PKNL= yes
##$PPARMOD= 0
##$PSCAL= 0
##$PSIGN= 0
##$REVERSE= no
##$SF= 200.130013532006
##$SI= 16384
##$SIGF1= 3
##$SIGF2= 2
##$SINO= 400
##$SIOLD= 16384
##$SREGLST= <1H.CDCl3>
##$SSB= 0
##$STSI= 0
##$STSR= 0
##$SW_p= 3612.71676300578
##$SYMM= 0
##$S_DEV= 0
##$TDeff= 0
##$TDoff= 0
##$TI= <>
##$TILT= no
##$TM1= 0
##$TM2= 0
##$TOPLEV= 0
##$USERP1= <user>
##$USERP2= <user>
##$USERP3= <user>
##$USERP4= <user>
##$USERP5= <user>
##$WDW= 1
##$XDIM= 8192
##$YMAX_p= 0
##$YMIN_p= 0
$$ End of Bruker specific parameters
$$ ---------------------------------
##NTUPLES= NMR FID
##VAR_NAME=  TIME,          FID/REAL,        FID/IMAG
##SYMBOL=    X,             R,               I
##VAR_TYPE=  INDEPENDENT,   DEPENDENT,       DEPENDENT
##VAR_FORM=  AFFN,          ASDF,            ASDF
##VAR_DIM=   8192,          8192,            8192
##UNITS=     SECONDS,       ARBITRARY UNITS, ARBITRARY UNITS
##FACTOR=    0.0002004,     1,               1
##FIRST=     0,             0,               0
##LAST=      1.6414764,     0,               0
##MIN=       0,             -1149577,        0
##MAX=       1.6414764,     960123,          0
$$ Real data points
##PAGE= N=1
##DATA TABLE= (X++(R..R)), XYDATA
0@%%%qK4l2L2m1O5q0R6j28J67k00K35k98L65m24N04o06P07q19R57j112J278j464
26g82J677j912K166k447K765l115L494l913M375m879N429o034O702p436Q238r121
42d793J0101j1181J2379j3725J5239j6946J8897k1158K3801k6934L0733l5458
54a9045M1504m9560O0925p8272J08283j74396N53166l60663j231519Q84457J071003
65H05883l24710j129067J93406R81654M3756j079998k29432J038322O25463q64830
75F0447q30985M61087Q37190j93001o43294N6316N26926o7930n21586q897N90396
86B66669J69935n27483l15200L88814K96061k88562k12318L25012J91647l93628
96i9053l13763L68692M64297k20607n44153N4075N32630M0827n34775j00959N82274
$$ plain form
0 0 0 0 0 -8 16 -16 16 -25 40 -40 56 -72 95 -105 130 -168 197 -227 277 -329 378 -441 516 -596 682 -782
26 -782 895 -1017 1149 -1298 1467 -1648 1846 -2067 2308 -2571 2858 -3176 3526 -3910 4328 -4793
42 -4793 5308 -5873 6506 -7219 8020 -8926 9971 -11187 12614 -14320 16413 -19045
54 -19045 22459 -27101 33824 -44448 63835 -110561 442605 81942 -1149577 -265120 805883
65 805883 481173 -647894 -454488 527166 570922 -509076 -738508 299814 925277 60447
75 60447 -770538 -309451 527739 334738 -308556 -252240 274686 206756 -314830 -323727 266669
86 266669 436604 -90879 -406079 -17265 278796 -9766 -222084 102928 294575 -99053
96 -99053 -412816 -44124 420173 199566 -344587 -290512 242118 282945 -251830 -352789 229485
107B29485K32957n74932m07417M51620N36938k55560n76012O5323N39936M2284
117B84622n32183j36010N51231K87985m78085m14278L15836M42615j38112l72216
127a88595L5640K74420m4741k83463L5120L56125O8767l42350j58485K44812J46152
138A43402j50178l3665J75910m9106l11671m0972L77770K26636k89949l32529
148b84352J60551L18600j22124k86504J94661L73497k23574n51146P7687O45236
158C02532J78725n51184l61338L67345L90746k69539l80058K88379M68933k85507
168A49034o39756J37423P47693J32203o62370l39287M64787L90512l40051l97596
178c57408L13143M74881k86018o24670J46541P27755J05072o48908k93133M67712
$$ plain form
107 229485 462442 -112490 -519907 -68287 468651 213091 -362921 -297598 242338 284622
117 284622 -247561 -383571 167660 455645 -22440 -436718 -120882 321733 183621 -188595
127 -188595 -152955 121465 76724 -206739 -171619 184506 253273 -89077 -247562 -2750 143402
138 143402 -6776 -40441 135469 86363 -225308 -266280 111490 338126 48177 -284352
148 -284352 -123801 194799 72675 -213829 -19168 354329 130755 -420391 -342704 302532
158 302532 481257 -69927 -431265 -63920 326826 57287 -322771 -34392 434541 149034
168 149034 -490722 -353299 394394 526597 -135773 -475060 -10273 380239 40188 -357408
178 -357408 -44265 430616 144598 -480072 -333531 394224 499296 -149612 -442745 24967
188B4967L44428l39360l58834K79760M10979k34256n19001J12254N86383P9039
198C86359n12984j99706L79698K18255k94628k20364K60958K63064k32808l55053
208c07209J41226M08880k1280l73229l2266L24111K6613l28829m8452L61416J42314
219B93295l46518k72651K49877L46933j39677l53024Q7201L59189p5836m21186
229b72397N986M78907J56070m28095l15891K75784L83049j16928l61857L3509
239a61863L32402k0024l73314m5936M07777J93786l20465l07283J40611L07825
249A53516K7774k03244p8167J04325J8928j19440n14J65729O2181j25967j02321
260i7200J5945N1096P4571Q6833l2325j79986j12901J22602K05803K189j96682
$$ plain form
188 24967 369395 30035 -328799 -49039 361940 127684 -391317 -279063 307320 386359
198 386359 -126625 -326331 53367 271622 -23006 -243370 17588 280652 47844 -307209
208 -307209 -165983 242897 221617 -151612 -183878 140233 166846 -161983 -210435 150981 293295
219 293295 -53223 -325874 -75997 270936 131259 -221765 -134564 224625 148789 -272397
229 -272397 -266411 212496 368566 -59529 -375420 -99636 283413 166485 -195372 -161863
239 -161863 170539 150515 -222799 -268735 139042 332828 12363 -294920 -154309 153516
249 153516 181290 -21954 -100121 4204 23132 -96308 -96822 68907 131088 5121 -97200
260 -97200 -81255 -30159 44412 131245 98920 -81066 -193967 -71365 134438 136627 -60055
271f0055p3032J60360O9862j77700o3985K53181J52491k68725k96362J50970L69017
282B16022K7108l24201j44023K37180J68689k01928j74776K15630K34074j92260
292F1515l12199Q4550L27555N4649k47099j20061J59670J08894j45668j04152
302a32346J74908J44020j82677k06508J28463K24060n0946j74144L8794J51378
312A15002n6909k02251K4157K69399O8239k95090j83837K40821K38870j63724
322E4677k23930J44771K39451j30165l10672M6866L71679J00261l60747k50980
332c18789K56349L07979j48797k81289J11444K73760r0478l16618R949L50261
342A53771J33824l04721k63507J77197K89652o9673k34984M8240J97600o6561
$$ plain form
271 -60055 -133087 27273 97135 -80565 -144550 108631 261122 -7603 -303965 -152995 216022
282 216022 243130 -81071 -225094 12086 180775 -21153 -195929 19701 253775 61515
292 61515 -250684 -166134 161421 216070 -31029 -151090 8580 117474 -28194 -132346
302 -132346 42562 186582 3905 -202603 -74140 149920 98974 -75170 -36376 115002
312 115002 58093 -144158 -120001 149398 217637 -77453 -261290 -20469 218401 54677
322 54677 -169253 -24482 214969 84804 -225868 -179002 192677 292938 -67809 -318789
332 -318789 -62440 245539 96742 -184547 -73103 200657 110179 -206439 -196490 153771
342 153771 287595 -17126 -280633 -103436 186216 116543 -118441 -70201 127399 60838
352F0838k27713K9354K63176P8770k24030j76601J22696J90805m3194j39543M5510
363a9932J10576r3663j57138P9060K06742P604j85042q8131J10735J11050m5391
374C6470p8732N0735O7672r2597j21691P4182J60145l834j33035n2816O3527O0281
386C0307m585k0152J4787J1276n3534n4959M2721P7830k501m6554j3458j1264
398c0086j9119L9428P4535K532p4842n4998K0947N5961J4249l0606O053L6414
410D0468m2512r1995L3369J42363L3727j21549q9221M6332Q0555P377l6478R890
422A2326L7433m5466r5996K8944J46038L4460j29150q4242N5142O3443o308m510
434A2114L9785O200q6095p7937P6161J49229j2186j61026n1651J06514M5751o9619
$$ plain form
352 60838 -166875 -137521 125655 204425 -19605 -196206 -73510 117295 74101 -65442 -19932
363 -19932 90644 -3019 -160157 -81097 125645 133249 -51793 -139924 -29189 81861 36470
374 36470 -42262 8473 76145 -16452 -138143 -63961 96184 92350 -40685 -93501 -29974 30307
386 30307 25722 5570 20357 31633 -21901 -76860 -34139 43691 41190 -5364 -18822 -30086
398 -30086 -49205 -9777 64758 67290 -7552 -62550 -41603 14358 28607 -1999 4054 40468
410 40468 -2044 -94039 -60670 81693 115420 -6129 -95350 -49018 31537 38914 2436 12326
422 12326 49759 4293 -91703 -62759 83279 117739 -11411 -95653 -40511 22932 16624 12114
434 12114 51899 58099 -27996 -105933 -29772 119457 107271 -53755 -105406 1108 46859 -22760
446b2760m434J01698K3719j35287j04298J09940J87051k5374k10246o4379J59588
457A5218Q3613j15258o4855J18047Q3119j18931j43084P1487J99536K4196j99066
468d5978j11145J36197J30468q2586j06981O6291J01843n6461j26806R731J42770
479E7343O3463j14565j13214O0311J07984k8015p6385L4103O6467l9889q7221
490f9618M521Q8004M3973n6457o4334K5203N2044k5271l3250N9474N3605p2783
502E111r7523K6264R9824K8890o3765n1395L0735M3022l3583l6885P0837Q1192
514A02724p0901j35338M033J27875O4900o6461q6809L746O1700R041l9320K4531
526b79P3441k5743j18084l1992J03103R1296k7140r4503m9050M1423O2349M882
$$ plain form
446 -22760 -27194 74504 98223 -37064 -141362 -31422 155629 130255 -79991 -144370 15218
457 15218 98831 -16427 -81282 36765 119884 953 -142131 -70644 128892 153088 -45978
468 -45978 -157123 -20926 109542 26956 -80025 -13734 88109 31648 -95158 -85427 57343
479 57343 120806 6241 -106973 -46662 61322 33307 -43078 -8975 57492 17603 -69618
490 -69618 -65097 22907 66880 10423 -53911 -28708 23336 -1935 -35185 24289 77894 5111
502 5111 -92412 -66148 33676 62566 -1199 -52594 -21859 21163 -12420 -49305 21532 102724
514 102724 31823 -103515 -99482 28393 93293 26832 -59977 -56231 5469 14510 -24810 -279
526 -279 73162 47419 -70665 -102657 446 91742 64602 -29901 -78951 -37528 24821 29703
538B9703j8752J1101o146n5463k1494N6971O3442J043n3829n9825n384O2469N1963
551E5799j3026l9350k7151j5405J2910M1681K4972j0380k1247k7623j8636L0471
563f985N1795L167m1431l1581q815J2906L3254K0873j1804j8833j3833q375K0281
576F19L6885m716l6459p351J0970j2148q890K4923K8344n898l5695k7744K5549
589a1611N4286l975n5866m730M5740o236n5637j052O6176L7274m8856p5104M701
602e4890Q4379L4252o4482m0525M7631K4426n7656k6984O7704O2495m0740r4100
614e8490k2266Q1313O6863m0119o2388J4619K9043l0268j5400O0163M7515m5593
626B4992q2319j4582O6714N9361k3705n4875j973J7078k1617J293O8737L6873
$$ plain form
538 29703 10951 22052 15906 -39557 -61051 -4080 59362 60405 6576 -53249 -58633 3836 55799
551 55799 42773 3423 -23728 -39133 -26223 15458 40430 30050 8803 -18820 -37456 -6985
563 -6985 44810 47977 6546 -25035 -33850 -20944 12310 33183 21379 2546 -11287 -19662 619
576 619 37504 32788 -3671 -11022 -52 -12200 -21090 3833 32177 26279 -9416 -37160 -11611
589 -11611 42675 38700 -17166 -21896 23844 17608 -38029 -39081 27095 64369 15513 -59591 -54890
602 -54890 29489 63741 -741 -41266 6365 30791 -26865 -53849 13855 76350 35610 -58490
614 -58490 -80756 557 67420 27301 -35087 -20468 8575 -21693 -37093 23070 70585 24992
626 24992 -57327 -71909 -5195 54166 30461 -24414 -26387 -9309 -30926 -29633 39104 75977
638G5977o8949q0423J4549P6370L7770l8275m9712P084K3166k1894r057O4070
650C0676M5555o6354q6280J7557Q6440L6730m5881n8092M639M1125l239k8045
662b5169K8827M9416l1048p4321r94O7583L9254k7634m9539j0096L3129J8022
674A7430j9465k265K8048o144m1692o202L3281J9035n524j2763j2559o7J2856
687C969M110L66Q707n770k4074l853J6792K189j591J4548K042k1625j0202J1402
701b990J6564J3327n015k8272j6160J3126J0185K872J3810K631k5502j5143J3779
714f788J6204J3268P656k0284l6804n640K7672K8083Q804k1168l6973l919L2899
727C010J5339q385N990J192l3691k6463K5630M8470J7288l5180n3573n035N0582
$$ plain form
638 75977 7028 -73395 -58846 17524 55294 17019 -32693 -25609 -2443 -24337 -33394 30676
650 30676 76231 9877 -76403 -58846 27594 64324 18443 -39649 -35010 6115 2876 -25169
662 -25169 3658 53074 22026 -52295 -53289 14294 53548 25914 -23625 -33721 -592 17430
674 17430 -2035 -4300 23748 17604 -24088 -30290 2991 22026 16502 3739 -8820 -8887 3969
687 3969 8079 8445 17152 11382 -12692 -16545 247 2436 845 15393 17435 -4190 -14392 -2990
701 -2990 13574 26901 21886 -6386 -22546 -9420 765 3637 17447 20078 -5424 -20567 -6788
714 -6788 9416 22684 30340 10056 -26748 -32388 -4716 23367 32171 11003 -25970 -29889 3010
727 3010 18349 9964 15954 17146 -16545 -43008 -17378 31092 48380 13200 -40373 -45408 5174
740E174K9397k5099j6275J0766j1116k7241J2604M6167K1177k9596n1104j1869
752d7015M6054L8147k2166l0638N171J082j6631J0020L7463J1033k7125l2074
764b6679m543K9712K7771j3878k5390K202K548j6623P505L7474Q293l1087k2767
777b5462P866K3055J1300j3182j5501R880O031k4260o179L7152K1275k9013k7437
790b4475R135K1470O735j0516j1575R837J2365j9651k0725K4427L2868j3292l0033
803a3430l885J2709R980L400o064k333P010p666j6727J2445K9161k064k4359r835
817a1658L30L410J5647J1885j0666j3448l958n88J2804K0151k122k0867q760j259
831i099j923J4021K0223p797k3163q127P037J4433J9461m6k5824j3864O728N253
$$ plain form
740 5174 34571 9472 -6803 3963 -7153 -34394 -21790 24377 45554 15958 -35146 -47015
752 -47015 -961 37186 15020 -15618 -10447 -9365 -25996 -15976 21487 32520 5395 -26679
764 -26679 -31222 -1510 26261 12383 -13007 -10805 -8257 -24880 -17375 20099 28392 -2695 -25462
777 -25462 -17596 5459 16759 3577 -11924 -2044 3987 -20273 -26452 10700 31975 2962 -24475
790 -24475 -15340 6130 12865 2349 -9226 611 12976 -6675 -27400 -2973 29895 16603 -13430
803 -13430 -17315 -4606 5374 8774 2710 377 7387 -279 -17006 -4561 24600 22536 -1823 -11658
817 -11658 -11328 -7918 7729 19614 8948 -4500 -8458 -9046 3758 23909 21787 920 -7840 -9099
831 -9099 -11022 2999 23222 15425 -7738 -15865 -8828 5605 25066 25020 -804 -14668 -7940 -2687
845b687P036J4110m653k2552p626Q737J0361J5029O158k0542k1226L700J3391
858g64R395Q354o987k1408m489J3713N226K226Q368p104k0963m280J3802J1804
872F893P253l610k0800q234J6591R935o023Q8R97j2427p805Q059R661Q534K999
887A2111j5937j5896J2012J7022m522o359J405p419q024O236P474L789O621m600
901C913j7606K99J7474L400o391p96o040q923N605R844N51K680J130j3237o291
916a4388J4048Q531n593q47j217j1952k4J3005N413j809r61r268q009J1363J1322
931I614o695k889M500p582p532R736J0888j97k602q617j1144P485J6217l429j0056
946b303L296J010p533L493J0370L056p19o480j4712N05J9263M526j3723k889M389
$$ plain form
845 -2687 4349 18459 13806 -8746 -16372 -7635 2726 17755 23913 3371 -17855 -14155 -764
858 -764 8631 16985 9998 -11410 -15899 -2186 3040 5266 13634 6530 -14433 -18713 -4911 6893
872 6893 14146 10536 -10264 -18498 -1907 8028 2005 2093 3090 -9337 -17142 -9083 578 9112 12111
887 12111 -3826 -19722 -7710 9312 4790 -1569 -164 -7583 -15607 -9371 -1897 1892 8513 3913
901 3913 -13693 -13394 4080 7480 1089 293 -5747 -14670 -9065 779 1330 4010 5140 -8097 -14388
916 -14388 -340 8191 2598 1751 534 -11418 -11442 1563 6976 5167 4206 -5062 -13071 -1708 9614
931 9614 2919 30 4530 -3052 -10584 -848 10040 9843 7241 -1376 -12520 -5035 11182 7753 -2303
946 -2303 993 2003 -5530 -2037 8333 11389 10670 4190 -10522 -10017 9246 13772 49 -2840 1549
961A549m990P18J1147L833l088l684j0478n935J4511J1341r679q089J504k597
975c937k49J1679M909o825l867m422o523Q128J4494m652j2045m49J30j581J0285
990E075P090r263p258J062l710K665J3534R07j3847m286M347J069N272N688p509
1005H36q477L246j340j867J1608O345j3909q635Q396O133k78O70m633n394L887
1020c412K22p300P242J2839r340j4959P774J2978j550n900l688j159O374L70j1217
1035a0726P99J7593p24j9124J315J6240J243r058l324K242N797P11j1449l393
1049a1858J8017O634j8974o723J6193M201j0987k098P139L662k876r193k816J6165
1063F486J0433j7910j3016J5425R634j2067n681J0251L823n593p980j034J4229
$$ plain form
961 1549 -3441 -2723 8424 12257 9169 5485 -4993 -10928 3583 14924 5245 -2844 -1340 -3937
975 -3937 -4186 7493 12402 5577 1710 -2712 -9235 -1107 13387 8735 -3310 -3759 -3629 -5210 5075
990 5075 12165 2902 -4356 -3294 -7004 -4339 9195 10102 -3745 -8031 -3684 -2615 2657 8345 836
1005 836 -7641 -4395 -5735 -7602 4006 10351 -3558 -12193 -3797 2336 2058 2728 -1905 -7299 -3412
1020 -3412 -3190 -10490 -3248 9591 251 -14708 -6934 6044 4494 -1406 -5094 -6253 121 491 -10726
1035 -10726 -9927 7666 6942 -12182 -10867 5373 6616 -2442 -5766 -3524 2273 2984 -8465 -11858
1049 -11858 6159 12793 -6181 -12904 3289 7490 -3497 -5595 1544 5206 2330 -6863 -9679 6486
1063 6486 16919 -991 -14007 1418 11052 -1015 -6696 3555 7378 1785 -6195 -7229 7000
1076G000J3009j5534j9329J2175J6915r539j1552Q516P207p079p678J356J1689
1089G156J1001j1092j9979P560K0281n559j5692M971R184o429n854L434O690O316
1103A1988n511j5551K286J8786M7j7424j91J0785k081o200L557L328J14n37p851
1118d455k377J3081M329j4438n047J0472K781n442J488P66k773K043p69n249M718
1133h72P210q811q231R140O949m983k144L37l116L288M413o759l487Q150n21r700
1149i137L308R492r74m822j737k635M344Q466p118j1543P784R713q753o197R237
1164e72N233m650m790k354M516J1046n710j6243N330J7454n379j4924N322J2347
1178F626k122r022k918N592J0310k826j7063J298K0804m56k0570K43J9075J620
$$ plain form
1076 7000 20009 4475 -14854 -2679 14236 4697 -6855 1661 8868 1789 -5889 -4533 7156
1089 7156 18157 7065 -12914 -5354 14927 9368 -6324 -1353 7831 1402 -4452 -1018 5672 11988
1103 11988 6477 -9074 -6788 11998 12045 -5379 -5570 5215 3134 -3066 491 3819 3933 3396 -4455
1118 -4455 -6832 6249 10578 -3860 -8907 1565 4346 -1096 392 1158 -1615 428 -341 -5590 -872
1133 -872 6338 -2473 -10704 -1564 5385 402 -1742 -1405 -4521 -1233 3180 -3579 -7066 1084 563 -9137
1149 -9137 -5829 3663 2689 -2133 -3870 -6505 -2161 6305 -813 -12356 -4572 5141 -3612 -9809 -572
1164 -572 4661 11 -4779 -7133 -2617 8429 2719 -13524 -8194 9260 3881 -11043 -5721 6626
1178 6626 4504 -4518 -7436 -1844 8466 5640 -11423 -10125 10679 10223 -10347 -10104 8971 10591
1192A0591j3848n891P185J1035j369j5281k443K0533M159k2731m776K3192P200
1205A7556j9208j0206R653J2270j317j3599l810J6808P176k0579q600K4494J1048
1218B1686k2181j4628J3057J4467l063j2886m036J3217Q219j6736j1021K2043
1230H138J4838k1708j9253J4760J7055m774j2497l484R942P264j0407j1938J4740
1243B676J6812j6190k0419J1251J7490m241j0860j472N158N016m083r719O450
1256b131J4328p439j8692N515J5770k662r218J840L211p49r22l712Q90R794j129
1271D694j3658r86J1756n8n041L347R48n757J107K127k353M093N055p993q640
1286a1359N551O532Q42J198l400p899L069P803l452k492Q205j162j4133j490J2824
$$ plain form
1192 10591 -3257 -9148 -1963 9072 7703 -7578 -10021 10512 14671 -8060 -12836 10356 17556
1205 17556 -1652 -11858 -2205 10065 8748 -4851 -8661 8147 15323 -5256 -13856 10638 21686
1218 21686 -495 -15123 -2066 12401 9338 -3548 -7584 5633 13852 -2884 -13905 8138
1230 8138 22976 1268 -17985 -3225 13830 9056 -3441 -6925 3017 10281 -126 -12064 2676
1243 2676 19488 3298 -17121 -5870 11620 7379 -3481 -4953 205 5221 1138 -8581 -2131
1256 -2131 12197 4758 -13934 -8419 7351 4689 -4529 -2689 522 -227 -1149 -4861 -3971 5823 4694
1271 4694 -8964 -9950 1806 1748 -3293 54 1002 -4755 -3648 -1521 -3874 219 5274 -2719 -11359
1286 -11359 -5808 724 1566 2764 -636 -8535 -5466 2337 -1115 -3607 4598 3436 -10697 -12187 637
1301F37P653k513r156q793O791J2780n070r464R612O312j6195r694J6888J5450
1315A5238n582j5958q059J0585J5435m715j5484P339J3513j3726j6244J5108K2002
1328A9452o318k1158o231J2777J5306m903j7176M084J7319q514k0536J1455K4771
1341B0328n752k3505l563J5208J0815o707j4093L622J6881n663k1777O410K6142
1354A8346j986k4361l440J6381O478r440r114N441J5224m038k2178m05K5810N901
1368A8619k2064q078J3997N802r074m710N993J0234k191j9265o121K3274J2846
1381A9262j7486j3180Q162N313n105J098O159K415m545j2084n240J6473J6005
1394A7247j0926j6931J660O381j50M439N422m377p327n195j564J0852J4820o450
$$ plain form
1301 637 8290 5777 -3379 -12172 -5381 7399 2329 -7135 2477 8789 -7406 -17100 -212 15238
1315 15238 9656 -6302 -14361 -3776 11659 6944 -8540 -1201 12312 -1414 -17658 -2550 19452
1328 19452 13134 -8024 -14255 -1478 13828 8925 -8251 -4167 13152 4638 -15898 -4443 20328
1341 20328 14576 -8929 -12492 2716 13531 6824 -7269 -3647 13234 7571 -14206 -7796 18346
1354 18346 16360 -8001 -11441 4940 11418 1978 -7136 -1695 13529 9491 -12687 -13092 12718 18619
1368 18619 -3445 -11523 2474 8276 -798 -5508 485 10719 8528 -10737 -16858 6416 19262
1381 19262 1776 -11404 -3242 2071 -3034 -1936 4223 6638 2093 -9991 -15231 1242 17247
1394 17247 6321 -10610 -8950 -2569 -2719 1720 7142 2765 -4562 -9757 -11321 -469 14351 7901
1408G901j8884k803R098L968M948L238p773r623J356L336N043J0100r60j7622
1422h677q200J0893J0136K832k168r461n857O342M521k582N617O512j2489j3902
1436a6483Q581J5566K152p843q291k330R731M760q828j125J2782j634j7525p20
1450a1207J6209O714p941r249p62R551M951j1350n835J6004P780j7830j0697J3135
1464e27J1355m917o963m07M304J726q087l830J5103J0977j7759j6901J1216J5695
1478A0985l070n927N8R5l253m548J446J5008R681j8844k2194J1070K3148l07j2258
1493A090j832J257m080k372M194J3397P778j8360k4666Q937K9887M295j8179q241
1507f895K956K80J12M517P286M783j2087k1926L689K8998R828j9275j4146L757
$$ plain form
1408 7901 -10983 -13786 -4688 -720 4228 7466 -307 -9930 -8574 -5238 -195 9905 8945 -8677
1422 -8677 -16877 -5984 4152 6984 4816 -4645 -10502 -4160 361 -2221 3396 9908 -2581 -16483
1436 -16483 -7902 7664 9816 1973 -6318 -8648 1083 5843 -2985 -4110 8672 7038 -10487 -11207
1450 -11207 5002 11716 3775 -5474 -6236 3315 8266 -3084 -8919 7085 14865 -2965 -13662 -527
1464 -527 10828 5911 -1052 -1459 2845 4571 -3516 -7346 7757 18734 975 -15926 -4710 10985
1478 10985 7915 1988 2046 2141 -1112 -5660 -4214 10794 20475 1631 -20563 -9493 13655 13348 1090
1493 1090 -742 515 -3565 -5937 -1743 11654 19432 1072 -23594 -14657 15230 19525 1346 -6895
1507 -6895 -3939 -3659 -3547 970 8256 13039 952 -20974 -17285 11713 21541 2266 -11880 -8123
1521h123M900L167L762J219n52n503j2702o34K1025J1276j5936j4904L993O501
1535b511K304L572k22m181j809m589k742J1435J0327r514j2594M039O452j525
1549a558P10K085j401m87k120n365L498J1799j962j1677R29O831k884l121M108
1564f15K963J262k182r979k770J4905R181j0582q528L403J203j909M375N342N48
1579F617l783j1319o554J4936J8702o794j8185k998N026L891N854M040l508n802
1593A23p585n110J2253J9659k815k2639q198R635Q655M693K143n994q986l894
1607h060J79J0288J6700l103k3116r466J3155J1006J624n68n339q763k607L727
1621d343P900J1724j410k0946j1074J5198J4786l376o201k183l291j475K320L160
$$ plain form
1521 -8123 -3223 -56 3706 4925 4373 -1130 -13832 -14466 6559 17835 1899 -13005 -9012 -2511
1535 -2511 -207 3365 3143 -1038 -2847 -7436 -10178 1257 11584 2070 -10524 -6485 -33 -1558
1549 -1558 -848 1237 -164 -651 -2771 -8136 -4638 7161 5199 -6478 -5549 1282 -1602 -4723 -615
1564 -615 2348 3610 1428 -8551 -11321 3584 12765 2183 -6345 -2942 -1739 -3648 727 6069 6617
1579 6617 2834 -8485 -15039 -103 18599 11805 -6380 -9378 -4352 -461 5393 9433 5925 123
1593 123 -7462 -12572 -319 19340 16525 -6114 -14312 -4677 3978 8671 10814 4820 -4166 -8060
1607 -8060 -7881 2407 19107 16004 -7112 -16578 -3423 7583 9207 8639 3300 -5463 -8070 -4343
1621 -4343 3557 15281 13871 -7075 -18149 -2951 11835 8459 2258 75 -3216 -4691 -2371 789
1635G89P742L083j4707j3340J1278J6672l831j0080r54K351J98o39j378L497Q227
1650H908n173j5181J382J4613K063q639p43K951r31k379k092K030R569K550j4302
1665e374q157R718P484k962J75K268o096o159J868O058Q691K661j3266j2978P420
1680h649J2497M38j465J063p514r488L545J2432R467j524j5944j4958R376J9184
1694H460J589q116j617l692q403K643J3914R663l097j6553j5475Q658K3439N501
1708A6914j4568p588O67k310K819J0383N718m134j1474j1241M133K0432Q286j3762
1722D275j1788J953K993K605O959K390n533o461m307N52J2170Q271q786j0913
1736e620K093L494J9M723K908n125m024m88j379L777P681j881p697Q2K521l075
$$ plain form
1635 789 8531 11614 -3093 -16433 -5155 11517 7686 -2394 -3348 -997 -799 -1438 -2816 681 8908
1650 8908 3735 -11446 -10064 4549 6612 -2027 -2770 181 -750 -3129 -5221 -3191 6378 8928 -5374
1665 -5374 -13531 -3813 3671 709 884 3152 -2944 -9103 -7235 -1177 7514 10175 -3091 -16069 -8649
1680 -8649 3848 4286 2821 3884 -3630 -13118 -9573 2859 12326 10802 -5142 -20100 -10724 8460
1694 8460 10049 1933 316 -3376 -11779 -9136 4778 14441 11344 -5209 -20684 -12026 11413 16914
1708 16914 2346 -5242 -4575 -6885 -4066 6317 12035 7901 -3573 -14814 -10681 9751 18037 4275
1722 4275 -7513 -5560 -2567 38 6997 9387 3854 -2607 -6914 -6362 5808 14079 5293 -5620
1736 -5620 -3527 -33 -14 4709 7617 2492 -1532 -2020 -3399 378 8059 6178 -1519 -1437 1084 -1991
1752a991J465O123j89l719k296m233K94R314M255p375l678J947l231j724Q028
1767B990N779l504o590p625j315J2589J1714p382j2194j355J907P03P061O619
1781I397k813j0043q644j019J4142J6325o104j9620n943Q257N397N319M918n450
1795D119j1019n981K070J2561J4280m595k1026p714J0421R502K987K046n025j2052
1809i426l735O398J0683R278m572j8175o902J2321R710j388q42j339q220m611
1823a0820O374Q735N696l406j4228o271J1924R692m503m029L031k706n815J935
1837d391O886M129m75p906p304O282Q938l339m451M763J211p195k389M708M040
1852C507L560k102q458k184O286K145j560M497J326r497n285N474O677M339j36
$$ plain form
1752 -1991 -526 5597 5408 1689 -607 -4840 -4546 4768 9023 1648 -2030 -83 -3314 -5038 2990
1767 2990 8769 5265 -1325 -8950 -10265 2324 14038 6656 -5538 -6893 -4986 -4283 2778 9397
1781 9397 6584 -3459 -12103 -13122 1020 17345 11241 -8379 -14322 -6065 -668 4651 9569 4119
1795 4119 -6900 -12881 -10811 1750 16030 11435 -9591 -17305 -6884 2618 5605 7651 2626 -9426
1809 -9426 -13161 -6763 3920 13198 8626 -9549 -16451 -4130 5580 4192 3350 2011 -6209 -10820
1823 -10820 -4446 4289 9985 6579 -7649 -13920 -1996 7696 3193 -836 2195 -511 -6326 -4391
1837 -4391 2495 6624 6149 -1757 -9061 -2779 6159 2820 -1631 3132 4343 -2852 -5241 -533 3507
1852 3507 7067 4965 -3493 -5677 609 2754 1194 5691 7017 -2480 -7765 -2291 4386 8725 8589
1867H589q512r050L219Q671L591K772j798j1495p559Q435J0550L552k091r588
1881g14j0690K429J3139O025j092m439j0480p323Q730J4294L126o572j0613r355
1895a3535M246J5699O435o496p560n837l842O814J3523K304p959r949p340L988
1909i509J6308P717j0545j0432j457J465M148Q503J467p013o148l968J098J1591
1923C225Q316q679j0453M89M283J724L536J111m076l579j014r32M772P649k878
1938C494q458N29L779j995K07M557J23l152k061k382Q71P149K808n846k031J722
1954f86m434j330Q447N909m491o735m505Q22R178P278m966o381o55l353r83J0463
1970C578Q829n889j1461m927K755J0813R544n227j1139l998J658K191Q834Q763
$$ plain form
1867 8589 77 -8973 -5754 2917 6508 9280 7482 -4013 -11572 -3137 7413 10965 8874 -714
1881 -714 -11404 -8975 4164 10189 9097 4658 -5822 -13145 -4415 9879 13005 6433 -4180 -13535
1895 -13535 -9289 6410 12845 6349 -1211 -7048 -10890 -4076 9447 11751 3792 -6157 -13497 -9509
1909 -9509 6799 14516 3971 -6461 -7918 -6453 -2305 6198 7665 652 -5496 -9464 -8366 3225
1923 3225 11541 2862 -7591 -7102 -2819 -1095 2441 3552 -524 -4103 -5117 -6049 -1277 6372 3494
1938 3494 -4964 -4435 -656 -2651 -2444 2113 2236 -916 -2977 -5359 -4488 2661 5469 -377 -2408 -686
1954 -686 -5120 -6450 1997 7906 3415 -3320 -7825 -7003 2175 9453 4487 -1894 -2549 -5902 -6885 3578
1970 3578 12407 6518 -4943 -9870 -7115 3698 13242 8015 -3124 -7122 -5464 -3273 5561 14324
1984A4324o797j4516m635O428J1056Q853m409j4634o156N353O266O941N043q029
1998E088j3905k088R331R087M527l679j2880o309O935P872L513K070n775j1929
2012h142j357J0499P321K69m257q455m303O028O638M39j21j877p245k792P233
2027a22N502j038k010l595m626K651N573Lj656J429k586m581K204L677L06Q63
2043A994N80n598l294L966L132J23K348j227o412j963L771K495L006K378o166
2058h67q702J749P686L697J329j649q718m894N784P235L480k17o872j0413Q73
2073a0499J1697O092j021m224q537o046P416J1152K689l618q324r463K722J4111
2087D147O662m610o835n906l969O448J2178K554p012q842n580L600J3403N944
$$ plain form
1984 14324 7527 -6989 -11624 -5196 5860 14713 10304 -4330 -10486 -5133 1133 8074 13117 5088
1998 5088 -8817 -10905 -1574 7513 12040 8361 -4519 -10828 -3893 3979 7492 9562 3787 -8142
2012 -8142 -9499 1000 8321 8590 4333 -4122 -8425 -2397 4241 4680 4559 2682 -4563 -7355 -122
2027 -122 5380 4342 2332 -1263 -5889 -3238 2335 2338 682 2111 -475 -5056 -2852 825 1131 1994
2043 1994 2574 -3024 -6318 -2352 780 903 3251 2024 -4388 -6351 -2580 -85 2921 5299 -867
2058 -867 -9569 -7820 -134 3563 4892 3243 -5475 -10369 -4585 2650 6130 5913 -959 -11372 -10499
2073 -10499 1198 7290 6269 2045 -6492 -12538 -5122 6030 8719 5101 -3223 -12686 -9964 4147
2087 4147 10809 6199 -636 -6542 -10511 -4063 8115 10669 3657 -5185 -10765 -7165 6238 12182
2101A2182p250q126k241n36M120R584K000p299p027k807K969R746N922p036q235
2116d034p6K089K124M908K341n559n088kJ471M426M582k740o255J03J479r49K683
2133A503M299k530m582j85N82L13L608J610k673j061r81m029J266P988K084o246
2149I66l469l03n13M104N185j071m124l262m080J073J0157M983o539p624j938
2164f455Q43N617Q346q86q992n617k30L656Q719M993p043r651j600K789N942Q298
2180H729m68j1734p911K907P134P409K875p647r994r1N547N215M499j92r913q473
2196a2108M502Q851N240Oo869q548R22P788L779M29m34o489o512M031Q328K078
2212D994j521l366o010m03O214L764q44q30k954m860J856P139L15k716M14j514
$$ plain form
2101 12182 4932 -3194 -5435 -5971 -1851 7733 9733 2434 -4593 -7400 -4431 5315 11237 4201 -4034
2116 -4034 -4110 -2021 103 5011 7352 1793 -3295 -3297 -1826 2600 7182 4442 -1813 -1710 -231 -1180 1503
2133 1503 5802 3272 -1310 -1495 -913 -600 3008 4618 1945 884 -97 -4126 -2860 5128 7212 966
2149 966 -2503 -2806 -3319 785 5970 4899 775 -2487 -6567 -5494 4663 9646 3107 -4517 -6455
2164 -6455 -5612 5 8351 7465 -1527 -7144 -7374 -3718 5001 9994 2951 -6700 -8300 -5511 431 8729
2180 8729 8261 -3473 -11384 -8477 -1343 6066 8941 1294 -8700 -8791 -3244 1971 6470 6278 -3635 -12108
2196 -12108 -7606 1245 6485 6491 -378 -8926 -8004 -216 3563 3992 3558 -2931 -9443 -5412 2916 4994
2212 4994 3473 107 -5903 -6306 -92 3672 2828 1998 -956 -5816 -3960 3179 3494 778 1192 -322
2228c22k719J572K540L02J603k03n600j058N017K212k566J547J301n047k174K204
2244a391K791L466J397n938o792L158O210J250Q14n92o226m152L095O409K872
2259F371M32n757q425R71Q838M688Q2l229p891m943O712Q886J308l839n045o371
2275g212Q79Q747N661j165m865p097m514O909J0827J024p425o001k826K129Q389
2290C460N097m396n899l432k440M887R445J072p538n510r49K027O747M906m935
2305B542o439j294J035K645N012R37n604k930Q06L45K469M718r95o393j828K594
2321b380J464K050N73l282j202K141j175k194M274L799l797l588K5L57J875L258
2337B198p80k308M16j344l504L135P020m39n414k879q97J982O092K427l943m236
$$ plain form
2228 -322 -3041 -1469 1071 1373 2976 2773 -2827 -3885 1132 3344 778 2325 3626 -1421 -3595 -1391
2244 -1391 1400 4866 6263 325 -6467 -3309 2901 4151 4965 4373 -1853 -6005 -2910 3499 6371
2259 6371 6803 1046 -7379 -6408 2430 7118 7200 3971 -3920 -8863 -2151 6735 8043 4204 -841 -7212
2275 -7212 -6333 2414 8075 6910 2045 -5052 -9566 -2657 8170 9194 1769 -4232 -7058 -4929 3460
2290 3460 8557 4161 -1738 -5170 -7610 -2723 6722 7794 256 -5254 -6203 -4176 2571 7477 2542
2305 2542 -3897 -5191 -4156 -1511 3501 4438 -1166 -4096 -3290 -2945 -476 4242 3247 -3146 -4974 -2380
2321 -2380 -916 1134 1707 -1575 -2777 -636 -1811 -4005 269 4068 271 -3317 -3292 -2935 -1060 2198
2337 2198 1418 -890 -474 -1818 -5322 -2187 4833 4394 -1020 -3899 -4796 -2814 3278 5705 1762 -2474
2353b474j531p67L987P294o15p197l527M67K102N693N020m329p805k537J811N950
2369A542P229j090j0439m669M114M462L206L244l383p824k510L551N266O464j220
2384G943j0831n915N564P239K088j49l726o173n80N018K928K419j55o583o234
2399g147L915P609J215j578l307m555n42N728K867j399j146j958l593J691M736
2414B536J59j181j67l011k487L219L690j493j019L70k509n73L222k4j306K235
2430A661k29m309j263L529J262M24J085l268l507J918L228m0J474K20m372l933
2446f120K881L795J917J274l952p163P34P456K855p27k052m252l524L682M553
2461A357J891J34l076p559q41Q341O431k243n261m175j972N265N811J3k928k344
$$ plain form
2353 -2474 -4005 -4772 -785 6509 5894 -1303 -4830 -4363 -2261 3432 8452 4123 -3682 -6219 -4408 1542
2369 1542 8771 7681 -2758 -7427 -3313 1149 4355 7599 4216 -3608 -6118 -2567 2699 9163 7943
2384 7943 -2888 -8803 -3239 4000 6088 5939 2213 -3960 -4540 478 3406 5825 5670 -913 -7147
2399 -7147 -3232 4377 5592 4014 707 -3848 -4390 1338 4205 2806 1660 -298 -3891 -2200 2536
2414 2536 2695 1514 1347 -1664 -4151 -932 2758 1265 246 616 -1893 -2466 756 732 -574 1661
2430 1661 1432 -2877 -4140 -611 651 1075 2160 -1108 -4615 -2697 531 491 1965 2185 -2187 -6120
2446 -6120 -3239 556 2473 3747 -205 -7368 -6634 822 3677 2950 898 -3354 -6878 -3196 1357
2461 1357 3248 3382 306 -7253 -8094 247 6678 4435 -826 -5001 -6973 -1708 4103 4116 1188 -1156
2477a156l913j426O838O250j630n960m020q79M539P048K39n584l126q24N86M687
2493A669M678k477o148q63N96J632M578J945m548l262l3L92L807L947k778o024
2509b889N31L132k47K90K337j489j513n31n63J58N121J15m808j564K652N77j607
2526b98J721P89q76k64k574j632M184M430k551m091l08Q08R9K418J312j978j757
2543e68j067k196K398O475k45n760k395M38J008M439L006l496n314p72J115K709
2559b25M129J59n719l165J275J551L756L998k944p267j966L662L783L220j351
2574B896o348l003L548K890J145J918j133n554k465L826L440K505m17o045m590
2589g387M105N108K57j246p21l070j085L084J979M84Q00k422m883J122N494J068
$$ plain form
2477 -1156 -5069 -6495 343 6593 4963 -997 -5017 -5896 -1357 5691 5930 346 -2780 -3604 -3018 1669
2493 1669 6347 3870 -2278 -3141 -2545 -913 3665 5610 1062 -2200 -2233 -1841 1966 5913 3135 -2889
2509 -2889 -2358 774 527 817 3154 1665 152 -379 -942 -784 4337 4452 -356 -1920 732 1309 -298
2526 -298 1423 2212 1336 1072 -1502 -3134 1050 5480 2929 -1162 -1470 -662 -563 1855 3167 1189 -568
2543 -568 -1635 -3831 -1433 5042 4797 -963 -3358 -2920 -1912 2527 5533 2037 -3277 -4049 -2934 -225
2559 -225 3904 4063 -1656 -4821 -3546 -1995 1761 5759 2815 -4452 -6418 -2756 1027 4247 2896
2574 2896 -3452 -6455 -2907 -17 1128 3046 1913 -3641 -6106 -2280 1160 3665 3248 -2797 -7387
2589 -7387 -3282 1826 2083 837 116 -2954 -4039 -955 1024 1508 2308 -114 -4997 -3875 1619 2687
2605B687k039j088j906o24K974J423j397M80J198k695k130L245J706p26k94q30
2621a6k258R83K664l86m05J900j664k783J420K141NO14J35l679j773K783K511
2638B192J57L63k061l655Q56M418Q82r50M31k483l563J633M407J105L8l391m938
2655d559J148O430K469l653j295j094j835J084L680J542r20k312m711r64O849
2670A859M366l797m328k39P2J151L662O48k511j155k534j261M341M481k187m710
2686b142o28L08J095L640J200l539k386M82J06J504L101j783l438M30Q22r48J911
2703b65K827j510l150n42J202Q49K067m56l274L86J926k129n21L344J128k436
2719e54j610k11P71K812J236l082j546J884l93k036K399K554j516k459n99k53
$$ plain form
2605 2687 648 -440 -2346 -2970 4 1427 30 510 1708 -987 -3117 128 1834 1108 814 -16
2621 -16 -2274 -1291 1373 987 582 2482 818 -1965 -545 1596 1601 2215 2350 -1329 -3102 -319 2192
2638 2192 2349 2712 651 -3004 -2148 2270 3152 2202 2633 150 -3413 -1780 2627 3732 3770 379 -4559
2655 -4559 -3411 3019 5488 1835 540 -554 -2389 -1305 2375 3917 2997 685 -4026 -4990 1859
2670 1859 6225 2428 -1900 -2139 -2067 -916 2746 3394 883 -272 -2806 -4067 274 4755 2568 -2142
2686 -2142 -2770 -2462 -1367 2273 3473 -66 -2452 -1970 -1864 -360 2741 958 -2480 -2050 -1228 -2176 -265
2703 -265 2562 1052 -2098 -2640 -1438 -589 1478 1022 -2252 -1866 60 -2069 -2590 754 1882 -554
2719 -554 -2164 -2375 -1604 1208 2444 -638 -2184 -300 -693 -2729 -330 2224 708 -1751 -2350 -2603
2735b603K003L919p94m273l92J040l56K390K097k380k418L22n97J471L613R63
2751D005m583k555J672J727K372J691k719l925K18K147L75J734J462l575k996
2766b950J598K260J399J890j801m581k63L180J239P46L10k823l269K497K523r
2782A946J91K34l014j500K257J940L29M13k403l477J580M087o28k114Q90P2j631
2799h28J72J408M93J194q47l468j077M170R54k583j03P11j066m06J233P6Q72J151
2817B056k366k906K632K008j237m71M62j995j178K049J390k74O11q56k889R78
2833a986K840j74r33J223k084k944K045L255l45j094r98j522L32L115Q5q71N55
2850D99n70l824J204M122O26k336r76j651J26L477J516k336l61M89j877k31L611
$$ plain form
2735 -2603 -600 3319 2525 -1748 -2140 -1100 -1456 934 3031 651 -1767 -1445 -2042 -571 3042 4005
2751 4005 -578 -3133 -1461 266 2638 4329 1610 -2315 -2097 50 425 2159 3621 46 -2950
2766 -2950 -1352 908 2307 4197 2396 -2185 -2448 732 1971 2717 3027 204 -3065 -568 1955 1946
2782 1946 2137 2371 -643 -2143 114 2054 2383 2796 393 -3084 -1504 2583 1955 -159 731 803 -828
2799 -828 -656 752 1245 2439 1592 -1876 -2953 1217 2171 -412 -515 196 -870 -1276 -43 33 905 2056
2817 2056 -310 -3216 -584 1424 187 -284 178 -1817 -2995 -946 444 170 781 -75 -2964 -1986
2833 -1986 854 680 -253 970 -1114 -4058 -2013 1242 897 -197 -1195 -2717 -2385 730 815 -56 499
2850 499 -71 -3895 -2691 1431 2057 -279 -1255 -2906 -2780 697 2213 -123 -484 5 -1872 -2103 1508
2867A508J159k311j466q76k93K448K639j924k062L19K73J53J989J035k357o62
2883d28j20o78O55K997m13k914J05P41k85J821J615k034j741J365q7j371J779
2900A007J349k105p00M58k06J22K589k86k549M49Q17j108J142J617k003j031N68
2917A30p1j240K415J713k562p35K69J38M97K252j697k112N53R98j235P74K095
2934B182j487j851m7K24Q00K713k00l534o18K169l63l07J563n62k441r9P05K54
2952h99J747J213k983j871K288J345j000R49J69k701l64J323L36J67J183j587
2968f85k055J156J885o64O70Q11k284j459J734J418q08L02l09j963N89J823q81
2985g20j27K044j124k447J124K402p13r2n61j583J3K336l14j388J478N68k493
$$ plain form
2867 1508 2667 356 -1110 -1986 -2279 169 2808 884 -1178 -859 -586 -433 1556 2591 234 -428
2883 -428 -548 -1226 -571 2426 2013 -901 -796 -55 -340 1481 3096 1062 -679 686 599 -772 1007
2900 1007 2356 251 -449 9 -197 -75 2514 2228 -321 128 945 -163 979 2596 593 -438 130
2917 130 59 -1181 1234 2947 385 -350 -81 57 554 2806 1109 -1003 -450 548 -687 87 2182
2934 2182 695 -1156 -1203 -979 -179 2534 2334 -1200 -1818 351 -12 -319 1244 682 -1759 -1858 -1153 -899
2952 -899 848 2061 -922 -2793 -505 840 -160 789 958 -1743 -2107 -784 -448 -281 902 -685
2968 -685 -2740 -1584 301 -363 307 1118 -1166 -2625 -891 527 -281 21 -288 -2251 -1662 161 -720
2985 -720 -847 1197 73 -2374 -1250 1152 439 347 -214 -1797 -1784 552 238 -1150 328 896 -1597
3002a597L51K054L25n82N34j766j116K132R39j392J59J038j721o18J696J108r36
3019F08Q03l85k143O24K328n03j090N95j029j063J802J469j277j16M57j098n87
3036f05K144M20j661N87m63k047J574J702n37j362J006m87r23J534J371j551n5
3053F47P7j612j59K062M24j744lJ10p14Q59K103j658j035J571r74j044J548O64
3071A122r02j261P62r50j01K384k93j916O13N99j126O63J603q04j102N03r97o16
3089a819K239O73k240m77J116l50nJ743k15j530K89j00o94J029J349j483j449
3106a924J042q6j96J429O49k049j12J331o38L56J048q59j990J093O85j087P67
3123e41J958k031q69J445M51l98J116l48k437J134J406r68j035J910l42j621O93
$$ plain form
3002 -1597 -1246 808 1133 551 1085 -681 -1797 335 1274 -118 41 1079 -642 -1260 436 1544 608
3019 608 1411 1026 -1117 -493 1835 1332 242 837 -192 -1255 547 2016 739 623 1080 -18 -605
3036 -605 1539 1959 298 885 422 -1625 -51 1651 1114 -248 758 271 -652 882 2253 702 647
3053 647 724 -888 -1047 1015 1439 -305 -308 -198 -912 -53 2050 392 -643 928 -46 -1090 458 1122
3071 1122 220 -1041 -279 -1229 -1330 1054 761 -1155 -542 57 -1069 -406 1197 393 -709 -206 -1203 -1819
3089 -1819 420 1093 -1147 -1624 -508 -858 -863 880 665 -865 -576 -676 -1370 -341 1008 -475 -1924
3106 -1924 -882 -968 -1164 265 914 -1135 -1247 84 -554 -198 850 -9 -1999 -906 -221 -1308 -541
3123 -541 1417 -614 -1483 -38 413 15 1131 783 -1654 -520 886 -82 -1117 793 451 -1170 -477
3140d77J566n50L47L15j557N4J807o72j586J052R33j646MJ134n46J5J450r04j145
3159d06J138Q89j364L42J256j762o47J278O0j132J189O98j425%P05m37M95J597
3177B474j590j819Q63J036o32k15Q74j144q88J328j3k86J341m45j783k8J895m41
3195E27p47Q50q39j275J097P70p40k7Q91j139n52J818L86j341L37K71j976J054
3213f35J490q59j285R48n12k54J470J73r56k30Q41j193j74J921n78j631M44M82
3231e38o13Q78N35j169l28J894q49p92J118L0j357M03Q92o15m46R31l65r41J225
3250a07M90r40QJ126j205q4J632m02j614O08Q52j155M21R43j101k68J521j23r06
3269c04J417J78j920k82J751L4q59K2l97p32J742P74j003j95Q25j030o89K058
$$ plain form
3140 -477 1089 539 886 1201 -356 -302 1505 833 -753 299 1232 -414 -410 724 178 193 1643 739 -406
3159 -406 732 1621 257 599 1855 93 -554 724 784 -348 841 1539 114 114 819 382 877 2474
3177 2474 884 -935 -72 964 332 117 991 -153 -1041 287 274 -12 1329 884 -899 -927 968 527
3195 527 -220 630 -209 -1484 -387 383 -357 -384 507 -632 -1184 634 1020 -321 16 287 -1689 -635
3213 -635 855 -4 -1289 -341 -853 -1107 363 536 -420 -650 191 -1002 -1176 745 167 -1464 -1020 -538
3231 -538 -1151 -273 262 -907 -1235 659 -190 -982 136 166 -1191 -788 104 -511 -957 -26 -391 -1332 -107
3250 -107 383 -557 -549 577 -628 -712 920 518 -1096 -488 364 -791 -370 573 -528 -796 725 602 -304
3269 -304 1113 1291 -629 -911 840 874 15 37 -360 -1092 650 1424 421 226 1051 21 -668 1390
3287A390K50j217k46l4p23J129Q03p93j134J166m47j70J473M40k061N1J063l56
3305E84p45J016n70j099Q85O62r48P06Q16j525q27J910M02j034j81K12r61L88
3323c09J077q05o56Q72k14r95J743O96j489k42K90n24J39J444j192j439J122J21
3341c61j21M59M06j125m44J437k9o93P65n31r91L58Q98m94l6L45p39q43J522J214
3361I97j560l66O48l13l00J087j14p46J07p8r94J080J286r33j163R89P8j37J213
3380G81k72j534M87J063j082J6J032q87j122J396Q79o87j40Q84j098m77J584L5
3398H58o48j88l53n39J145J211j605p59J431j83l23P40M28r68n22N99j41K95P27
3417A205j182j372J258J130k19j66M79j237k4J171L28q66J86l50j279Q72J486
$$ plain form
3287 1390 1640 423 177 143 -580 549 1352 559 -575 591 144 -26 1447 1887 -174 -123 940 584
3305 584 -161 855 285 -814 71 733 -215 491 1307 -218 -1045 865 1267 233 52 264 -697 -309
3323 -309 768 -37 -693 179 -35 -1030 713 1409 -80 -322 -32 -556 -417 1027 -165 -1604 -482 -361
3341 -361 -482 -23 383 -742 -1186 251 222 -471 294 -237 -1228 -870 28 -466 -502 -157 -896 -1739 -217 997
3361 997 -563 -929 -281 -594 -894 193 79 -667 -560 -638 -1632 -552 734 -199 -1362 -373 -295 -432 781
3380 781 509 -1025 -538 525 -557 -541 491 -396 -1518 -122 757 70 -70 814 -284 -761 823 858
3398 858 210 22 -331 -870 275 1486 -119 -878 553 370 47 787 1215 247 -275 324 183 478 1205
3417 1205 23 -1349 -91 1039 820 654 1133 -104 -128 1043 1371 505 691 341 -938 -66 1420
3434A420n99o51P0o28r4J528J088j647l23k83r9N02J127j052j126J92M46k43N34
3453A62J285p54j652O48M70K56R04p32k147M33J587n99o0O22p46r98J194O92l08
3472B57n4K44j479J89J320l73q41O1p9n95J132J260j212r63M60N36m22P12r1j195
3492a133K47N70n47M04R94r46j435R45J257j53k57m58n96K92J728m21j302N16
3510b95R9j246R35J358k15r83l64o4M05J419L54k062l60N50J91N26Q88q74j432
3529a170M87P09L82L61J001j738q20P05Q86J69N68j112k193P43J975N33q09j37
3547E40p13m11R06J048k68j81j08j445m09K181L67j277o48j8k79J585R59j496
3565C33q77J321k70l01Q84L25j549n03P93o9p1R29q48q31O39Q27k12J60n8j647
$$ plain form
3434 1420 821 170 240 -388 -482 1046 2134 487 164 -119 -218 284 1411 359 -767 -575 -129 -372 162
3453 162 1447 693 -959 -311 159 415 1319 587 -1560 -1127 460 -139 -199 423 -323 -1321 -127 565 257
3472 257 203 447 -1032 -843 477 104 -737 -676 -755 -1350 -218 1042 -170 -1133 -673 -137 -559 153 62 -1133
3492 -1133 -886 -316 -863 -459 535 -411 -1846 -901 356 203 -54 -512 -1108 -816 912 491 -811 -295
3510 -295 -196 -1442 -507 851 636 -347 -711 -775 -370 1049 1403 -659 -1019 -469 -278 248 1136 262 -1170
3529 -1170 -683 26 408 769 1770 32 -788 -83 803 972 1540 428 -1765 -1022 953 1486 677 540
3547 540 -173 -584 322 1370 1102 921 813 -632 -1041 1140 1507 230 -418 -436 -715 870 1829 333
3565 333 -544 777 507 206 1090 1415 -134 -637 156 87 16 945 97 -734 -95 732 520 680 622 -1025
3585a025J03J685p2j292J01L2J32qJ318r93j33K23o85m5J768N5j995p07P23R17
3605A02j85M48p54j294Q43J001l47O58k27r32j241J851Q0o2K83j253j035Q05J722
3624D63M88p92o95p51qJ876N87j468o00L14q06L87J592N00j373j067r5M98K035
3643A085R46k159j506J268K24J05Q90k55j487m16R19K22P62R46j364j725R86J087
3661E28N60k70m01j220k2J362J75o80J31l24j57P46P45p11m72Q58q35m04J220
3680H29O46j427r17R48L30L82N38j203j040J437P05p20k97N69o52o68O97M68J66
3699G91m84k06j327J230J832p68j012n71K08M9J373O9j317m84M2JM13J243k25
3718H57j726J78J89M09J258M54k118j614J532J023K46k74n26j494N24J272l70
$$ plain form
3585 -1025 -922 763 691 -601 -500 -468 -336 -344 974 -19 -152 71 -614 -659 1109 1164 -831 -1538 -815 102
3605 102 -83 365 -389 -1683 -840 161 -186 472 245 -687 -1928 -77 3 -59 224 -1029 -2064 -1259 463
3624 463 951 159 -536 -1287 -1295 581 1168 -300 -900 -586 -1392 -1005 587 1087 -286 -1353 -1448 -950 1085
3643 1085 2031 -128 -1634 -366 -142 -37 853 598 -889 -1305 -386 -164 598 1544 180 -1545 -559 528
3661 528 1088 818 417 -803 -825 537 712 32 163 -161 -318 428 1173 462 -10 848 13 -391 829
3680 829 1475 48 -869 79 409 791 1329 126 -914 523 1228 508 211 780 128 -540 157 625 791
3699 791 307 101 -1226 4 1836 1068 56 -515 -307 -258 1115 1184 -133 -617 -575 -574 -161 1082 857
3718 857 -869 -691 -502 -93 1165 1619 -499 -2113 -581 442 688 414 -112 -1606 -1082 190 -180
3735a80M98P31j350j725R81J550L21p32o37j496L67J963J96j112N9r1p05Q00J356
3754G94j71r47j80m78k25J229R46j057p69r7M01O71J019q64j285N90J178r49p4
3773b68K71j83m67L39j66J5Q29m86j058O39J975j057o18j95K11M40N17k01j237
3792g00L46J023m30R0N87j53r85P3N31lN96N1j608o61J616P81k42k81j208o13
3812a190J380J134q9o50m9p82m59J190O34m1m68p19j191J331K002m21j530q18
3830g36N18N02L50M57p99k73l89k37J60J647M69j724j339P69O44J079L42j281
3848A59j192O94O10k24J25M16j043m37P46L17m57Q17j11j597M29J318k70l61j09
3867a70p12L18J131k35j154J91O61m50l05O88o8k43q8K54l71M71N93j215n74J133
$$ plain form
3735 -180 318 1049 -301 -2026 -1045 505 826 94 -543 -2039 -1672 291 487 -625 -566 -657 -1362 -562 794
3754 794 623 -324 -504 -982 -1207 22 968 -89 -858 -955 -554 117 1136 272 -1013 -423 755 -194 -268
3773 -268 3 -180 -647 -308 -474 -459 370 -116 -1174 -535 1440 383 -235 -430 -219 221 738 537 -700
3792 -700 -354 669 239 329 916 763 -222 -149 382 379 975 1026 -582 -1243 373 1154 912 631 -577 -1190
3812 -1190 190 1324 1235 585 536 -246 -705 485 1119 1078 610 -109 -1300 31 2033 1612 82 -736
3830 -736 -218 284 634 1091 292 19 -370 -607 -447 1200 1669 -55 -1394 -625 19 1098 1440 159
3848 159 -1033 -339 271 47 172 588 -455 -892 -146 171 -286 531 420 -1177 -748 570 300 -61 -170
3867 -170 -882 -564 567 332 -822 -631 30 -420 -725 -37 -105 -348 -436 -182 -553 -82 511 -704 -1278 -145
3887a45O66q05m37k01k16J187O42q56n99L37R9m62P82L37n48j95l76r0Q46J624
3907A590o34j655m41Q32R00M28m57j149l72R48m6J4P09L94j846Q2P59P69M80J32
3927A437k213p59J613R45k48q65lj80j72Q78N08l63K98o24j200Q96J180p0p57
3946C01j95n82K24J409N9j220n12R47k03q1P20k46n02L4j25o23P83R47j362k08
3966d35M88J96m5r8k17l5N37L28q16n87P79L63q89O34l39l13K87L48m47L10P42
3987G91m81j393N25Q93J53k38m67p74k26J829k30o88K33j14o36O2R74J76J94n86
4007cj142o10J712J194r14j188k82J71J051Q85o24o52K5k0o22O85J119k18j520
4026i53k05Q6J041J522o92j754l9P78L83k2M93p63n78N04j92O6R21%r67p48P72
$$ plain form
3887 -145 521 -284 -721 -922 -1138 49 691 -165 -764 -427 -328 -790 -8 329 -219 -414 -790 -880 -34 1590
3907 1590 956 -699 -1140 -308 592 1020 563 -586 -958 -10 -56 -42 667 1061 -785 -703 56 825 1305 1437
3927 1437 -776 -1535 78 1023 775 -90 -93 -273 -445 433 941 578 876 252 -948 -52 1128 1058 301
3946 301 106 -476 -252 1157 1216 -4 -516 431 228 147 867 621 119 153 28 -595 188 1135 -227 -435
3966 -435 53 249 204 106 -111 -146 391 719 -97 -684 95 458 -431 203 -136 -449 -162 186 -261 49 791
3987 791 310 -1083 -558 335 488 250 -217 -991 -1217 612 382 -306 -73 -187 -823 -761 213 389 583 -3
4007 -3 -1145 -1755 -43 1151 237 -951 -1233 -1062 -11 874 250 -402 -377 -397 -1019 -334 785 567 -953
4026 -953 -1158 -1072 -31 1491 799 -955 -994 -216 167 145 638 -125 -703 -199 -391 -325 596 596 -371 -1119 -347
4047c47R40J62m51n13n85Q93R84q70n31O43J01q09K48M21r3K03K49r90J28J026
4067H09L4j415N06O47L58m34j50r20N69Q85j09o97k42J88o1K97N51l34k81L48
4087E49j048K11J242O42j598r72L90O39Q59M73j093j120N27L83N8M29L57o82j133
4106h87K84J77J086P37j123j925N40J529O79o58l82p22o62J153L64n1J5j79j059
4125a084m41J533Q67n37m23j225p1J107J215o89p30k33K59j57M01M16k96l8j30
4144b56p00L87J128M4j436K9Q5N18L14r6q11o2J442m38o24K82J56o0J4K70n78
4165c92L15L61n95j18P75M09j096n2j0N36L72Q6q50o30J169L08m21r9K45q54n5
4186e96N08O15j0M49q71j311P31J671p6o83k75n51j81J536J10r27q3m1n94O11
$$ plain form
4047 -347 593 755 304 -209 -794 99 1083 213 -318 325 426 -383 -135 286 193 396 645 -345 -217 809
4067 809 843 -572 -66 581 939 505 355 -565 4 889 780 83 -159 29 -32 265 816 482 201 549
4087 549 -499 -288 954 1596 -2 -974 -584 55 914 1387 294 -826 -299 84 142 571 928 246 -887
4106 -887 -603 -426 660 1397 274 -1651 -1111 418 1097 439 57 -665 -1327 -174 190 139 154 -25 -1084
4125 -1084 -1525 8 875 338 -85 -1310 -1381 -274 941 252 -478 -711 -452 -609 -208 208 -88 -126 -256
4144 -256 -956 -569 559 603 -833 -804 -719 -201 113 17 -794 -856 586 148 -476 -194 -38 -98 -84 186 -392
4165 -392 -77 284 -311 -429 346 755 -341 -393 -403 133 505 591 -259 -889 280 588 167 68 313 -541 -596
4186 -596 -88 527 517 966 95 -1216 -485 1186 1110 427 152 -399 -580 956 1066 139 56 15 -579 32
4206C2J121pn52n89n97O1J637R00j287j407K61J28O72P45l79r81rL21l30O10R81
4227A331o79j322O8J74Q22M02j61j497l17J338M86o81M47K6q60kL72j88L04K88
4247C51j202l63J020Q46r19j52P2j45M15M06o30n38P09N92q67K66j19L7l4L03
4267D8j83l4O54p48o46L29J042l13n04j17m46N47R26l14o18o34O58O3J09N95l06
4288A08j23l22k51L81O95N77j242j114O45N96O16J47p69p90K08P26k97N05K69
4307E65o61l47q6P77L56R20j372j244K61J604J67r26K02m04k54O51M52n6l9Mj052
4328d82k91J172O88j56j031M0k92L96P56k17r24K59K30j57K00L20l41k08M8n3
4348d3J45N10J61j148r8Q86k63O6K02o28M6P84k58p37K06Q45n17l23N26k83j14
$$ plain form
4206 32 1153 1146 594 5 -592 -531 1106 2006 719 -688 -427 -299 373 1118 739 -242 -251 70 -260 350 1331
4227 1331 652 -670 -602 -428 394 796 635 -862 -1179 159 645 -36 411 437 -423 -425 -53 -241 63 351
4247 351 -851 -1214 -194 652 -267 -419 -347 -492 -77 329 -301 -839 -130 462 -405 -139 -258 -221 -255 48
4267 48 -135 -169 485 -263 -909 -580 462 149 -355 -472 -918 -371 555 241 -377 -1011 -353 -290 -181 414 108
4288 108 -15 -337 -588 -207 488 1065 -177 -1291 -646 -50 566 713 -56 -846 -638 88 -209 296 565
4307 565 -96 -443 -529 248 604 1524 152 -1092 -831 773 940 14 216 -188 -442 209 661 605 566 570 -482
4328 -482 -773 399 1087 931 -100 -60 -352 44 800 583 -341 -82 148 -9 191 511 170 -38 10 -43
4348 -43 102 612 773 -375 -473 413 150 216 418 -210 -164 620 362 -375 -169 676 159 -164 362 79 -35
4369c5m0L0j93N78K71p14q41J030M12p5j57p60m98R50N72l31o04M85p42k36Q28
4390g0K22K14k72k77j049N46J361l43o89m34K34j13R72L65p89o50O65o14j27J093
4410B45O3n63p67L35K65N20P69r08j037M34N06M5N87k02q20L17o5L76j40L41J76
4431D77j355N49J88M30L48p3p99J62N79J00o19P0M42q44J93J68J8K07M29l51q14
4452d95O51O46p49k21Q51m69Mk05k04l6O56J14l68n61J74L87j34M91j80k26j7
4473A09J1l82N05M29J6o78J37l22L21O98l6j122mO65j95j06M77J8q82n7N62q5
4495G9J91M55j241m44J074K98J97n53k7o26p3J112l83k22M13r09M1J41P35o7m09
4516b18l2m00j14J360O4p40l24K01Mr0N95k70l09M62o26j27R8P06j73n27Q8j13
$$ plain form
4369 -35 -75 -45 -238 340 611 -103 -944 86 498 423 266 -494 -992 -42 530 199 -405 80 -662 -898 -70
4390 -70 152 366 94 -183 -1232 -686 675 332 -357 -791 -557 -670 302 667 -122 -772 -107 -721 -848 245
4410 245 308 -255 -1022 -687 -422 98 867 -41 -1078 -644 -138 -93 494 292 -528 -211 -276 100 -40 301 477
4431 477 -878 -329 -141 289 637 564 -235 -73 506 606 -13 57 499 -345 -152 16 34 241 670 319 -495
4452 -495 156 802 53 -168 683 214 218 13 -191 -227 429 543 175 -386 -212 175 41 532 352 126 109
4473 109 120 -262 243 672 688 10 147 -175 146 844 808 -314 -318 347 152 46 523 541 -341 -398 164 79
4495 79 270 725 -516 -960 114 412 609 56 29 -597 -670 442 59 -163 250 -659 -618 -477 258 191 -218
4516 -218 -250 -650 -764 596 660 -80 -404 -203 -199 -289 306 36 -273 189 -437 -564 -466 240 67 -460 -372 -485
4538d85M65K67n09n48Q63o5m03k23P63k67L80l9n07J80K19j52k44j93N70k65k3
4559b16K78M41n54K64p7n17o3J070k07m67P7j12K09M7J91m04L67o5o88j21O78
4580A31O42n54n3n49J2M67M87k20n90K18P1k41O07J21k90j50l33kK53P74k43r63
4602d05r9P05j27N39J48p19k13N66j43Lp3K54l79m81O06m32M95J19l81p90O35
4623a72O19n90J35j69K03j77K89k90k3K03M9m11l21J039l90k86K57O7n71O54j17
4644bk52J47L12j59o11M37m9k66M36J58n47M7N54k96M6J19o2l05j77N0P3L40M74
4667D67n15n16N57k99J73L98N0p84O0K31k0L73N30o32n29Q5M67k13M80k76r2j14
4689a19K72J16m09M25j58p58N58K05J53j8j72k42m98P05M10l83n7j89j04M10M72
$$ plain form
4538 -485 -20 247 -262 -810 53 -12 -415 -638 125 -142 238 199 -308 -128 91 -61 -305 -498 72 -193 -216
4559 -216 62 503 -51 213 136 -381 -444 626 419 -48 29 -83 126 173 364 -40 327 262 -426 -547 131
4580 131 773 219 166 -383 -371 96 583 363 -227 -9 62 -179 428 549 259 109 -224 -226 27 801 558 -405
4602 -405 -504 201 74 613 761 42 -171 395 252 255 182 436 57 -424 182 -250 245 364 -17 -807 -172
4623 -172 447 -143 -8 -177 26 -151 138 -152 -175 28 77 -334 -655 384 -6 -292 -35 32 -539 115 -2
4644 -2 -254 -107 205 46 -565 -128 -177 -443 -7 151 -396 -349 205 -91 -45 74 12 -293 -470 -420 -347 -7 467
4667 467 -48 -564 -7 -306 -133 265 315 -469 -409 -178 -198 175 705 73 -456 -371 96 -117 363 87 -5 -119
4689 -119 153 269 -140 285 127 -631 -73 132 285 267 95 -147 -645 60 470 87 30 -159 -263 147 619
4710F19l93n11N15k30j72J10L75J01k31P0m78L82J19J13m06q2K11J56m38O20j07
4731C43o81L10N03m74J52K55m94L11J25J28o06L15O0n44O06J87m97j58K65Q0j07
4752G9j47K27m59R0N16k62n8j25J14k08O7M10k44M8On78L48N91m8o82K35K12m01
4775b69K13K45k92k83Mk30P5N30M95n95l47j67K53L62R3J26m27j35L25k12L69
4796A33J56m97k59N01k23k59O20k95l71k1O15l07M14l99J46l70L79K44k95K03
4816A15O8n28J65K47j48J04KJ48l05L58Jk57l2nJ73j43J13K74m5j98M7l89j07
4839c42P75j59k55M98n12k46M35j28j83p0N51k98j74R7L25k93L12j60l0L87k65
4860B65l13j44N65M5n01l88N53QK63N9k17o30M32L99l40K70k50j21L20m40j64
$$ plain form
4710 619 226 -285 230 0 -172 -62 313 414 183 253 -225 157 276 389 -17 -99 112 268 -170 450 343
4731 343 -338 -28 475 1 153 408 -86 225 350 478 -128 187 247 -297 309 496 -1 -159 106 186 79
4752 79 -68 159 -300 -210 306 44 -14 -139 -25 -233 -166 244 0 48 54 -524 -176 415 367 -315 -80 132 -269
4775 -269 -56 189 -103 -386 -382 -612 -537 -7 488 -107 -454 -621 -368 -6 87 213 -214 -349 -24 -236 133
4796 133 289 -208 -467 34 -189 -448 172 -123 -494 -515 100 -207 207 -192 -46 -416 -37 207 -88 115
4816 115 183 -345 -180 67 -81 23 25 173 -132 226 227 -30 -62 -67 106 -37 76 350 305 107 154 -235 -342
4839 -342 433 274 19 517 5 -241 194 66 -117 -187 364 66 -108 -11 314 21 333 173 143 530 265
4860 265 -48 -192 373 418 -83 -471 82 90 353 412 195 -435 -3 396 56 326 76 -45 275 -165 -329
4881c29P1M97k90j21O4K60j17p3J18k00q4J33O4j56K1Q3k17J42J21K50k30j73
4903a66L61n15K74qL28j87l49L87n57N3L8N29l42j14j09M02K87J3l70k62K39k50
4925c18L33L14n48o2K66k04J16M42k90j30L64k87p7j95M39l93m8J80j13Q4J33
4946FL12n04K46M96l70o79N33M4k8k8K9pp9R0N2k26J71J9o01P11j99j2O0m8k03
4971b15K86j0m3j17mJ89j69J3K75j53n16O05K2j38n0L58k40n5l10L69j53L25j74
4994I5L1q6K29n09L03j5J06m12J08J71J32Q3m3k21k41J36J55l7J75K08l05j81
5016a18k34N6O4J52K60l34O9K86n31N16m4k82K8O0p9J36n6J54l36J78J65o8k8
5039A4J1k40L1L11l03K9K16p8m0j04J78L6l76L38O5l16J9O17k72k27N7m04l1R26
$$ plain form
4881 -329 -258 239 -51 -172 -108 152 35 -38 80 -120 -204 -71 -7 -163 -142 -59 -276 -134 -13 237 7 -166
4903 -166 195 -320 -46 -54 274 87 -262 125 -432 -379 -341 188 -154 -268 -377 25 312 325 -45 -307 -68 -318
4925 -318 15 329 -219 -281 -15 -219 -103 339 49 -81 283 -4 -81 -276 163 -230 -278 -98 -211 -127 6
4946 6 318 -186 60 556 186 -493 40 84 56 28 57 50 -29 61 113 -113 58 77 -524 187 -12 -24 36 -12 -215
4971 -215 71 61 18 -99 -103 86 -83 -70 205 52 -464 141 163 25 -25 333 93 38 -272 97 -56 269 95
4994 95 126 40 269 -240 63 48 154 -258 -150 21 153 236 193 -28 -269 -133 22 -15 160 368 63 -118
5016 -118 -352 -296 -232 -80 180 -154 -85 201 -330 186 142 -140 -112 -52 -131 5 -51 103 -233 -55 110 42 14
5039 14 25 -215 -184 127 -176 -147 69 -9 -49 -153 25 61 -315 23 88 -228 -209 408 136 -91 -34 -438 -469 457
5063D57p60J67j77L31q1k22O20j29l99K45n8k13O4N0R4m56M54K98l52k3K35l62
5085b17M80l33p9l1K51J63k96J19K1r5O2m8j76L32Qj89M6j05Q5LJ85q6r8K05K17
5110D24n10K09M1J37l46J41n6l3PJ57k15k19O57k86k06O2jK43k58L03k21m8K40
5133B22l93J05K65o7j85kp5o1J69K24l0k45J16j40J2j91N65m0j84o6J82j04j16
5156c9J63m76J61K66n4J6j33l7Q0J2K91n48J73o3joK59j07k18p3J38N5Q0N3N4
5181D6k78q5m2L11n7J15k15K48k10r3k5L95j21m8J08L90m55M3k4Lk71L72J53n40
5205b80K95L49l75N8L57l41j57K94o3k96J16R6j76j72L52k96J71M81p9n43J23
5226h6k40L65J9J23m87L14qJ41j03J48K7m82L07J33J04k92J18J84l00O8K87j56
$$ plain form
5063 457 -303 -136 -313 18 -63 -285 335 206 -193 52 -6 -219 -155 -105 -11 -467 -13 285 -67 -90 145 -217
5085 -217 263 -70 -149 -180 71 234 -62 57 78 -17 45 -3 -179 153 161 -28 18 -87 -2 1 186 100 2 207 424
5110 424 -86 123 164 301 -45 96 40 7 14 171 -44 -263 394 108 -98 -36 -37 206 -52 251 30 -18 222
5133 222 -171 -66 199 132 -53 -55 -130 -191 -22 202 172 -73 43 -97 -85 -276 289 249 65 -1 181 77 -39
5156 -39 124 -352 -191 75 21 37 -96 -133 -53 -41 250 -298 -125 -188 -189 -195 64 -43 -261 -334 -196 -141 -61 -8 46
5181 46 -232 -317 -359 -48 -105 10 -205 43 -167 -260 -285 110 -11 -59 49 439 -16 27 3 6 -265 107 260 -280
5205 -280 15 364 -11 47 404 63 -94 200 137 -159 -43 53 -123 -295 57 -239 -68 413 334 -209 -86
5226 -86 -326 39 58 181 -306 8 0 141 38 186 213 -269 38 171 275 -17 101 285 -15 53 340 184
5248A84l85M74j73J92j23K2k53Q2j32Q3L09j82N5l1M3M2k06O4L9Jj7J28j89M7
5272G4M0jm27L49p8J8q0K28l77K10j08J50l6j7Lj47Q2NK4j89M35m08o9L97Rk51
5298a64k57M88j37P4L6j74oP0K10pl55K2j02J39N37p21J34K60k93L65n05M41M6
5321A01j91L22l82q1J25k9j53L27J87j72j72k8L60l93J90K17j73J12J12k08k82
5342b11J94M51m95K22p1p2r2M35l28J69j57m3R8J72k23l80L49k20J49L45l0L9
5364C01n92L21j4j86J82M93j46l97p1M15k25m4j66K0j30L42o4K80j74l33j33M32
5386A11K74k71p9n7r9N7p2K91k28j15L00l73O8K08K39j82j20j18J58N1k6k93K00
5409g6J04o9k19M99k10j42nq8M4K64L5k45K01j97l3r4L06j71p0J81J28j87k9N8
$$ plain form
5248 184 -201 273 100 292 169 191 -62 20 -112 -29 280 98 153 122 165 207 1 65 104 105 88 216 27 74
5272 74 114 113 -314 35 -43 -25 -105 123 -254 -44 -152 -2 -38 -55 -52 -199 -117 -112 -88 -277 158 -250 -319 78 87 -164
5298 -164 -421 67 -70 4 40 -134 -140 -70 140 133 -222 -200 -302 -163 374 -347 -213 47 -246 119 -386 55 101
5321 101 -90 232 -150 -231 -106 -135 -288 39 226 54 -118 -146 214 -179 11 228 55 167 279 71 -211
5342 -211 -17 434 -61 161 90 18 -74 361 33 202 45 2 100 272 49 -331 18 -202 -53 292 262 301
5364 301 -291 30 16 -170 12 505 359 -38 -109 306 81 37 -129 -109 -239 103 39 319 145 -188 -321 111
5386 111 385 114 35 -22 -121 -64 -136 155 -73 -188 112 -261 -193 15 254 72 -48 -166 -8 43 17 -276 -76
5409 -76 28 -41 -260 239 29 -113 -118 -206 -162 102 137 -108 93 -104 -137 -231 75 -96 -166 15 143 -44 -73 -15
5433a5L3j16M36k73j03L7K31n00J20K20O2l30J72J13n9N9j41k25p2M50N7Qk43
5456g9K03k15K62k62M16m31j42j51J06M25kJ45m47J58j98p8P90k71p0k8q5J94
5478B40k70J52j45K1j98J95j39L25q5K2k87J01j59K87K12j83j81J19O6J8K63p1
5500C03l35k19M30q1l35J78l4P7K24o0l69J95J98l32J29K32ll78R3L26j53j43
5522e7K54Q6m22K7J87k78M51j89j28l21N65j82j37mj61J28J5L31k16R5P3l41J
5545b23L05K31k64l86M01k91K18J33j3l60K93k78J46o6K85o7l69l2J09K28K02
5566B02J44m71j03L46J4Kl80K4K6M8L33j82J83O1o27Q9K92K20k57L29l96R2j22
5589a33N42p63K75L68m35J25J53l8j65K49m18K07K06K33k95k84N08l94L1m9M93
$$ plain form
5433 -15 18 -98 338 65 -38 -1 230 -270 -150 70 132 -198 -26 87 28 87 -54 -279 -351 99 156 164 -79
5456 -79 124 -91 171 -91 325 -106 -248 -399 -293 132 130 275 -172 -14 -212 -290 500 229 159 131 46 240
5478 240 -30 122 -23 -2 -200 -5 -144 181 96 118 -169 -68 -227 60 272 89 -92 27 93 111 374 303
5500 303 -32 -251 179 98 -237 -59 -93 -16 208 148 -221 -26 172 -160 -31 201 198 -180 -87 239 86 -57
5522 -57 197 283 -139 -112 75 -203 248 59 -69 -390 175 -7 -144 -148 -309 -181 -166 165 -51 44 117 -224 -223
5545 -223 82 313 49 -337 64 -227 -9 124 111 -249 44 -234 -88 -154 131 64 -305 -337 -228 0 202
5566 202 346 -125 -228 118 132 134 -246 -222 -196 -148 185 3 186 247 -380 -291 1 221 -36 293 -103 -11 -133
5589 -133 409 -354 -79 289 -146 -21 132 94 -71 178 -240 -33 173 406 111 -173 335 -59 -28 -77 416
5610D16l79l52N39j04k10L22k50J09J02q0K54n17N81j78k13k9J82l48K21N5j11
5631A0N21m64k38P0O4j36l36O25r3l14J46J31J52R7j99k37L69j51J90k45o5J16
5653A3l30J58K90k83M4P4J54n15J54N24k63j39OO3k53M71N2j03k72J39LQ2L9K85
5677C93l05j02j30j55N23j56l5k41n3L25M0K48k56l66J06Q2M0j28O32m40j41M0
5699g9j82J9K37k30k50Q2K15K00n6J45j48J50r1J69l11rJ42L09l15l4j16k0J67
5722fR9N4O4p3k05l32M47J76j06j47J51k78L38L71l81r7q8Kk00N9M87l81j2j6
5746g4k07M88J99k08l42j58j92N07K10R5k66l79J45J31R5O4J38m56Q5r8K33l36
5768c26Q11n86M0N1j67L21k61L08l04k60N58m19K9K43j62O4J75J87j8k72L0r3
$$ plain form
5610 416 37 -315 224 120 -90 232 -18 91 193 113 367 -150 431 253 40 11 193 -155 66 121 10
5631 10 531 67 -171 -101 -37 -173 -509 116 23 -291 -145 -14 138 235 36 -201 168 17 207 -38 -103 13
5653 13 -317 -159 131 -152 -108 -34 120 -395 -241 283 20 -119 -113 -50 -303 168 220 117 -155 -16 -13 69 108 393
5677 393 88 -14 -144 -299 224 68 33 -208 -261 64 104 352 96 -270 -164 -82 -42 -170 462 22 -119 -79
5699 -79 -261 -242 -5 -235 -485 -403 -188 12 -44 101 -47 103 12 181 -130 -139 3 312 -3 -37 -153 -173 -6
5722 -6 93 147 211 138 -67 -399 48 224 118 -29 122 -156 182 553 172 75 -13 -11 -211 -152 335 -46 -58 -74
5746 -74 -281 207 406 198 -144 -302 -494 13 223 318 52 -327 -182 -51 44 108 246 -210 -125 -223 10 -326
5768 -326 485 -101 -61 -10 -177 144 -117 191 -113 -373 185 -234 -205 38 -124 -60 115 302 284 12 42 -51
5790e1j69k65N21O8k61Q2K55k66j85K37J90k4K6p5m05N58m30J51N4J9L69k06l64
5813a71o8L51J77k02n05M6N12n5k8J75j63j61l0L4J90Q7j39k94P7L16K73k52J65
5836C35m42J69Jl43J61L62j64l78K79Q0L55m69M82m58JO5K7K34j24j59j10j33
5858b29N93Q9n78M15l97m75P30N1K8k10l01K56j74O61k40o79L93O8L2J01m2q4
5880Hm11N16R2k48J09K01l12k75K32J23J09j93m8k07J82N87l40N8m5k6q9l96L97
5903B4j67M0K27r3o5P4P7l95J45J02K76k02p4k60pJ64K29j44J33p4k28O9O16k06
5927B61l41k2Q3j64R3N90k96l76k9J30P1L40mm05k50p4K04L25j10J46n20K79L9
5950c0p7L37n9m79L20O5pj93J14j96K68j5O5j78OQ9j44j84L96K99j90l15J44l44
$$ plain form
5790 -51 -220 -485 36 104 -157 -75 180 -86 -271 -34 156 132 158 83 -322 236 -194 -43 11 30 399 193 -171
5813 -171 -239 112 289 87 -418 -372 140 85 57 232 69 -92 -122 -88 102 189 50 -244 -167 149 422 170 335
5836 335 -107 62 63 -280 -119 243 79 -299 -20 60 415 -54 428 -30 -29 36 63 297 173 14 -96 -229
5858 -229 364 453 -125 290 -107 -582 148 199 227 17 -284 -28 -202 459 219 -460 -67 1 33 134 92 8
5880 8 -403 113 205 -43 66 267 -45 -320 -88 35 144 -49 -97 -304 -122 465 125 183 138 112 23 -373 24
5903 24 -143 -103 124 31 -34 40 117 -278 -133 -31 245 43 -31 -291 -298 -134 95 -49 84 10 -218 -149 467 261
5927 261 -80 -102 -19 -183 -90 500 204 -172 -201 -71 0 340 336 -69 -319 -393 -189 136 26 172 -348 -69 -30
5950 -30 -107 230 171 -308 12 77 70 -123 -9 -205 63 48 113 -65 -59 30 -114 -298 98 397 207 -108 36 -308
5974c08L69M91m05n4k58j33Q7p5M86J76o18M11k38J97J7J0k67k01L13j66J12k5
5996g9J97k28PN5J88q5J29K8k02K47l56j26R3j00L22q3K12l86q3J61Q5J50R8k01
6020D3m45M62oK95l42K42l57j99L17j7M39j00j38o24L61M62r6k99J73m91j68N44
6042E6M39l39jo0m07L76N24j99j72m11J82m93O32M6n7m20K68p2j97N44Q8n9m38
6065a70r9K65K91r7N0j78n28N04l0J99K56l97m35M14j85m3L14J52n21J13M01p3
6087B03k80K66j26m65K93K00k57%J40K84k01L04l09p8J82J49l61N8R0k84L7K64
6109A09N3Ok34K99n59L0O94l56j0k86Q2K18k55O16o37j13L81l71L06K88j76o4
6131B1n76K89M40J4K79l26m58K21j28K78K3M1m80j73K76Q3K37K74n64l42K47O11
$$ plain form
5974 -308 61 552 147 93 -165 -298 -211 -286 200 376 -242 169 -69 128 145 155 -112 -313 0 -166 -54 -79
5996 -79 118 -110 -103 -48 140 55 184 212 10 257 -99 -225 -132 -232 90 7 219 -167 -250 -89 -4 146 244 43
6020 43 -402 60 54 349 7 249 -108 -307 10 -7 432 332 194 -430 -69 393 297 -2 171 -320 -488 56
6042 56 495 156 155 95 -312 64 588 389 217 -194 -12 -505 127 173 116 -304 -36 -108 -305 239 327 268 -170
6065 -170 -269 -4 287 190 240 62 -466 38 8 207 463 66 -369 45 -140 -183 131 283 -238 -125 276 203
6087 203 -77 189 63 -402 -109 91 -166 -166 -26 258 57 361 52 -26 156 305 -56 2 92 -192 -155 109
6109 109 162 168 -66 233 -326 -296 398 42 32 -254 -172 46 -209 407 -230 -343 38 -333 -27 261 85 21
6131 21 -555 -266 174 188 467 141 -317 -96 -224 54 77 118 -362 -535 -259 -176 61 335 -229 -571 -324 287
6153B87n7l22ln1J59L02j06l47J94q2k29J58P3%J80p3O9j82K37m4k6k95K74k77
6177a61J9K28j15j62j66J07K00J82M3o0r1J37J14l94L4K73l44J03L70l82j74K80
6199D1K13k05J80j09m0P9k09K03rK8j84j0K94k39k26M90j40j53J52K57m66J52
6221I9j21k65K43j72J85K58j21o7N9j66n0K81q3j70R7n0l23P24j16q0n65L95j21
6244a29K31L5j84K6j49J25j82N25p9l67P0J62k80m5L89l2o06M47J25j13M1M97
6266E07n85r7L99j05k2n0J01k22k66N29k72L1kK27l13K02J3k0l4J33n9l9J33O3
6290B52k79J00j03l05K90K76n43J30M26K7l14Qr9K41j5Mm9k48J11j68O5O28m62
6313b7J3n5j8k07M26J94l53J27o24L11J0P4J58j11j1Q9k16K6J38K89m50Q0L41
$$ plain form
6153 287 230 -92 -95 -146 13 315 209 -138 56 -26 -255 -97 -24 -24 156 83 152 -30 207 163 137 -158 116 -161
6177 -161 -142 86 -29 -191 -357 -250 -50 132 175 115 24 161 275 -119 -85 188 -156 -53 317 -65 -239 41
6199 41 254 49 229 120 80 159 -50 153 144 172 -12 -22 272 33 -193 297 157 4 156 413 -53 99
6221 99 -22 -287 -44 -216 -31 227 106 39 98 -68 -118 163 80 -90 7 -43 -366 358 242 162 -403 -8 -129
6244 -129 102 137 -47 -21 -170 -45 -227 298 219 -148 -78 84 -196 -241 148 116 -490 -43 82 -31 10 507
6266 507 -78 -175 224 119 97 47 148 -74 -340 189 -83 -52 -54 173 -140 62 75 55 21 154 95 56 189 252
6290 252 -27 73 -30 -335 -45 231 -312 -182 244 271 -43 -35 -134 107 92 96 47 -201 -90 -258 -193 435 -27
6313 -27 -14 -69 -87 -294 132 326 -27 100 -524 -213 -203 -129 29 -82 -93 -4 -220 -194 -56 233 -217 -137 204
6336B04l71L74J72o40K05M3m3r7j49O35m71k9L62j18j06K87k36l52K81K99m20
6357a70k1K21q7k54L96K24n27K09K30m11K16L4m8M7N3o9o9M3J07l4j53O1k2n00
6381e24O05n4r1M45l61j95M62l20O8j18L9k29l06K51J20J19K1L85m18J6L18j67
6403F6k7P7k61j93K34K19j08p4J45K0j01J4R4k2o49Q53n00k93N54k04K97r4j65
6426a18k09nK87J85j56K70l97r3J18L71m8j78k98J71K12K96j2m07m9k27O1K49
6448B3K46p6m02L70J37k55M3K5j70J69r7J08m5k12L23j30n3J41l39K55K24p3j71
6471D1k57M08l2o2K36m33J13L04j93P7q9J44k88r5M0j44L38K3k1n0K00m41K62
6494H1j29M29l65j39L26l93K12P1P1P3n25K15p5K26J37P9k18j95L55m40M90j35
$$ plain form
6336 204 -167 207 379 -261 -56 -13 -56 -153 -302 333 -138 -167 195 77 -29 258 22 -330 -49 250 -170
6357 -170 -191 30 -57 -311 85 309 -218 -9 221 -190 26 60 12 59 112 43 -26 17 124 90 -63 -2 -24 -524
6381 -524 81 27 -64 381 20 -175 287 -33 35 -83 -44 -273 -579 -328 -208 -89 -68 317 -101 -85 233 66
6403 66 39 116 -145 -338 -104 115 7 -67 78 98 -3 11 105 83 -566 287 -213 -506 48 -156 141 47 -118
6426 -118 -327 -332 -45 140 -16 254 -143 -236 -118 253 205 27 -271 -100 112 408 396 -11 -60 -287 -226 23
6448 23 269 193 -209 161 298 43 86 111 -59 110 13 121 76 -136 187 57 4 145 -194 61 285 212 41
6471 41 -216 192 160 98 334 -99 14 318 125 202 113 257 -31 -126 -86 -230 108 131 110 60 260 -181 81
6494 81 -48 381 16 -123 203 -190 22 93 164 237 -288 -73 -148 78 215 294 76 -119 236 -204 286 151
6516A51k34Q9k2j99R0J71o0l41K4K66J33J96l09j24l49L88L72j36p6L9j83j21
6538b35L51J22k55k03m01L67J91K04J6J57o70K45l89L38K62m8j83P4j06j13L35
6559E9M3j71L8P1J03j48J73j54j14L64q7k88J91J11l02M7J41q7J0n7P5k59L68
6582A27P9j51q4J04k73O37n50kl21L24R6J23o6K17m47M99k52j29J99K90j46l35
6604f1j62O84l23j57K5k43kK04K44k44R3k8k66o7O19R4l96K65l54M5Q3L72m36
6627a1j9r5M8L37q8J65l20l48m4K72K50K28m05K34n67M69J8J21j47j19K7j10o0
6650a64J98J37jm51q4K44n5J00K2q4m60R03j50m72p2N24k41j36L86o6OJ21l9m49
6674b83O00m07J16N8N7k21P8n5q6l2J96O7N0k53J50J19l03L23q8m37J22K16k66
$$ plain form
6516 151 -83 6 -16 -215 -125 46 -14 -355 -331 -65 68 264 -45 -169 -518 -130 242 106 30 69 -114 -235
6538 -235 116 238 -17 -220 -621 -254 -63 141 157 314 -356 -111 -500 -162 100 52 -131 -57 -163 -276 59
6559 59 102 -69 -31 40 143 -5 168 14 -100 264 177 -111 80 191 -111 -64 77 -10 0 -57 18 -241 127
6582 127 206 55 -29 75 -198 439 -111 -113 -434 -110 -14 109 43 260 -187 312 60 -69 130 420 274 -61
6604 -61 -223 461 138 -19 6 -237 -239 -35 209 -35 58 30 -236 -303 316 410 14 279 -75 -30 53 425 -11
6627 -11 -30 -125 -77 260 172 337 17 -331 -375 -103 147 375 -30 204 -363 106 124 245 98 -21 6 -104 -164
6650 -164 34 171 170 -281 -365 -121 -176 -76 -54 -138 -598 305 155 -317 -389 135 -106 -242 144 78 84 205 166 -283
6674 -283 317 -90 26 84 141 -80 -2 -57 -143 -175 21 88 138 -115 35 154 -149 174 86 -351 -229 -13 -279
6697b79QM54k09K3j33Jj40M15%L7n7n3o9j71M97j49l57K35r6J74M3Q5j88m31J38
6722b22L15p3K14j12l17l7N19j61m26L29L8k26N5M26j72M7J26j39j02P1j4J78
6744C17n09L04k04P5L8m3j15J19J88l18Q0L27O0l79J44k89j37N47k6j33J49Ol19
6767a18n8K22j04l20O38o70j4M89q9K38j77M4k0l49L30J37k24nK50m51L63n4K22
6790B80m8j48n0j54Q9P3j34L7r8J01j47J44L35k80k16J94j37L42m2j02k47L84
6812A76o1j57J48j31K73q49N22m7J72j61K95j65k99J51L55j62L23l40o4J04K38
6833C21m09O3K59k49l8L3k2Q6R2N7l18p5K49r1J58J55k28M2l0j10j22M25l30L23
6857B41k36j36J31K18n39K91k07K00K79j10J07M1l73l26K98O9l0K30j6j6l05K36
$$ plain form
6697 -279 -271 183 -26 -3 -136 -135 -275 140 140 177 120 67 -2 -173 324 175 -182 53 -43 131 174 259 71 -360 -222
6722 -222 93 20 234 122 -195 -232 287 126 -300 29 67 -159 -104 322 150 197 323 184 82 153 139 317
6744 317 -192 112 -92 -17 21 -22 -137 -18 170 -148 -68 259 319 -60 84 -205 -342 205 179 46 195 201 -118
6767 -118 -176 46 -58 -378 260 -410 -424 65 -24 214 37 81 61 -288 42 179 -45 -50 200 -251 112 58 280
6790 280 232 84 34 -120 -31 42 -92 -55 -153 -52 -199 -55 280 0 -216 -22 -159 183 141 39 -208 176
6812 176 115 -42 106 -25 248 -601 -79 -126 46 -115 180 15 -284 -133 222 60 383 43 -21 83 321
6833 321 -88 -25 234 -15 -53 -20 -42 44 136 193 -125 -200 49 -42 116 271 43 85 55 -55 -177 248 -82 241
6857 241 5 -131 0 218 -321 -30 -237 -37 242 132 239 280 -93 -419 -121 -52 -82 148 132 116 -189 47
6879D7O7k05L52j21o0J5j46j34J43K03k36r6J83L4M1k4K88p05M72O1Mj78J83J69
6903C57n85r4N69k76k41K88q6k4j61K65j88l2J53J49n02L37J92l26K83P0k45O4
6925c3J70j12o1M0j83N8n6K02j11J84n1j31N9K9m24L43K14l50K8L12K71q01J15
6948b88K72O8l98M25j3j63j61L14l09j06K97k4L13J3m2j76m8K36k12l3J98k80
6970a17J94J04j02pK7M2k41NM44r7l58L44r8l53L25K39m43J50M0j32J55L60k62
6993B19m88M87q3O7l56Q0J50K4k42R6o7J25mK3r5R9j26K6M03m03J8j48J70J14
7017H9p6J13k41n9J62Lm6k28N68m85K17j30M62m37K2J42l21K97M1L0l77J17K26
7040H9j62J86j36k25J69N4j70R2L4J69l73J27J77q5N9k06j5J82j88Nk66L41J20
$$ plain form
6879 47 114 -91 261 140 80 95 -51 -185 -42 161 -75 -171 12 46 87 63 351 -354 118 179 183 5 188 357
6903 357 -228 -322 247 -29 -270 18 -68 -92 -253 12 -176 -208 -55 94 -408 -71 121 -205 78 148 -97 -33
6925 -33 137 25 -36 4 -179 -121 -177 25 -86 98 47 -84 -25 4 -420 -77 137 -213 -185 127 398 -403 -288
6948 -288 -16 52 -346 79 66 -97 -258 56 -253 -359 -62 -86 227 240 198 22 -26 210 -2 -35 163 -117
6970 -117 77 181 79 72 99 141 -100 -95 349 252 -106 238 140 -213 112 351 -92 58 98 -34 121 481 219
6993 219 -269 218 135 202 -154 -74 76 100 -142 -46 -113 12 8 31 -64 35 -91 -65 338 -65 -47 -195 -25 89
7017 89 13 126 -115 -174 -12 -9 -55 -283 285 -200 17 -113 349 -88 -66 76 -245 52 93 123 -254 -137 89
7040 89 -73 113 -23 -248 -79 -25 -195 -103 -69 100 -273 -146 31 -54 5 -201 -216 -34 -222 -217 -483 -142 -22
7063b2k6L4p7j06J65Q5P5o06L33L80n28K4M31m91J40O29n68n9J22N50n31P8L95
7086D27k52l91N61k10k40L83k84j15M89k89m45M01K26k18J25K35l94J4l31M91
7106A83m61J80J63N6k06O4J4r5l5N50m54J68K03Q5m92J3J84l33JO67n23m3L20
7129B09l06J06K4J10j72k27K26O7k34M84l80J51J16j15O4k39K89l04j55N67m03
7150a22k31Q04o24KL34m9m57L07O33q50L01n6K09n99L51K07k68J36j16K0k60L22
7172fQ4j50l40L81k83M15K74m75J7j05J33o35O83Q6J0j76R8l9j2J46l93J14LJ91
7196B1n3j9J06k29j73N30m76K16L36k79k49K78J33m1k38L67l0k08J70j82Kj99
7218b17M47j93J10k82k6L82l89K86l57K18m0M6M6M82m05k13j2J66J18l3K36k01
$$ plain form
7063 -22 -48 -14 -91 -197 -32 53 128 -478 -145 235 -293 -269 162 -329 -189 440 -128 -187 -65 485 -46 32 427
7086 427 175 -216 345 135 -105 278 -6 -121 368 79 -366 35 261 43 168 403 9 23 -308 183
7106 183 -278 -98 65 121 -85 -21 -7 -102 -137 413 -41 127 330 415 -77 -64 120 -213 -212 455 -68 -111 209
7129 209 -97 9 33 143 -29 -256 -30 37 -197 287 -93 58 174 59 123 -116 173 -131 -286 281 -122
7150 -122 -353 451 -173 -171 163 114 -343 -36 597 -253 48 -8 201 -398 -47 160 -108 28 -88 -68 -328 -6
7172 -6 78 -72 -412 -31 -314 101 375 -100 -83 -188 -55 -690 -7 79 89 -87 11 -28 -40 106 -287 -173 -170 21
7196 21 -32 -51 55 -174 -347 183 -293 -77 259 -20 -269 9 142 101 -137 230 200 -8 162 -20 -18 -217
7218 -217 230 37 147 -135 -161 221 -168 118 -239 -21 -61 -15 31 513 108 -105 -117 49 167 134 370 169
7240A69l2J19j17j63O0O4l77L7J22K48j14K54j48l67L98m00M29j88J84O4l33J20
7262B9k03P4K38J46j44P1j92j46L87r0m6k92K72m71M38k49N76n04j79K70lk44
7284b62K96L50o59J19N4J44j33p0RM51j18l18K8R6K00k36k42J83o5J24O9k78j14
7307c72J32L71k40K94l43j68q7N53M4k16l29K30j1k34M43m3J3j09j42L15p4M8
7329G5j24j3L01k61j93J25L52m03r7K2R2K27l9qj28K51K07p22M68m0O9l50M56
7352B67n8l58O8K48k40j34M63o5j69rN9MJ1L02p14K65K86k56j69J32K43k12K37
7375B01j5j31j83M26m23J97l8K62l58j38J60M7p2M56m12l8O6J09l7o2K05m32J16
7398i4q9L54l23M79r0j41r6K52LnL8m79n4L41K2j51j0R9k72M8J66R5r7M15n42
$$ plain form
7240 169 137 256 139 -24 36 100 -277 -240 -118 130 16 270 122 -245 153 -247 182 -6 178 242 -91 29
7262 29 -174 -100 138 284 140 211 19 -127 260 170 124 -168 104 -367 71 -178 398 -106 -285 -15 -18 -262
7284 -262 34 384 -275 -156 -102 42 -91 -161 -152 299 181 -137 -109 -13 187 -49 -291 -108 -173 -49 20 -258 -372
7307 -372 -240 131 -109 185 -158 -326 -413 140 184 -32 -361 -131 -142 -376 67 24 37 -72 -214 101 27 75
7329 75 -49 -62 239 -22 -215 -90 262 -141 -238 -216 -124 103 64 56 -72 179 386 -336 132 92 161 -189 267
7352 267 209 -149 -81 167 -73 -207 256 191 22 13 72 76 87 389 -325 -60 226 -30 -199 -67 176 -36 201
7375 201 186 55 -128 298 -125 72 34 296 -62 -200 -40 7 -65 391 -21 -59 7 116 79 17 222 -210 -94
7398 -94 -183 171 -152 327 237 96 0 252 255 250 288 -191 -245 96 118 -33 -43 56 -216 -168 -2 93 -4 411 -131
7423a31j33L57P4l3j17l3k89JM28n72L85j19L77k84k89Q02l79k28K64j50j90K87
7445B8K04l17k07J20L26j71j2k90J49N91k57l41K50J56j56k94K89R2l37k15N30
7466A38k74L99l9k53l66K98N25m91K0L25n02l4N68l33J97J01k24k07M1RL26q8
7488A36J01n70M3M46j97J34N7r8j89J91L05j98j73L24k92k82L85J05k2l50O1l5
7510a18J57K89j39l65K53q3j95M18p8K15n33L91m22N80k31K83m38k95L75l0m1
7531gJ07O4l58M00m12L04j72K50O4m26KJ81j38L17k55k56N06L35l28n93L57K16
7553A58r2j39n5J50j41L3Rn7k1K37k84K69K94k35n4j57k50N09k39j19J6O0j32
7576b40L68j3k36n6m8K73j43P4O4K57l37k80L17k74L24L73j39o54k7K11J44J01
$$ plain form
7423 -131 -264 93 167 134 17 -16 -305 -304 124 -448 -63 -182 195 -89 -378 424 45 -183 81 -69 -259 28
7445 28 232 -85 -292 -172 154 -17 -29 -319 -170 421 164 -177 73 229 73 -221 68 160 -177 -392 138
7466 138 -136 263 224 -29 -395 -97 428 -63 -43 282 -220 -254 314 -19 178 279 55 -152 -111 -102 224 136
7488 136 237 -333 -290 156 -41 93 150 52 -137 54 359 161 -12 312 20 -262 123 228 206 -144 -83 -118
7510 -118 39 328 189 -176 77 -6 -201 217 139 354 -179 212 -210 370 139 422 -16 -311 64 34 -7
7531 -7 100 164 -194 206 -206 98 -74 176 240 -186 -184 -3 -141 176 -79 -335 171 506 178 -415 -58 158
7553 158 66 -73 -128 22 -119 -86 -77 -134 -155 82 -202 67 361 126 72 -85 -335 174 -65 -184 -168 -108 -240
7576 -240 128 115 -121 -177 -225 48 -95 -21 43 300 -37 -317 0 -274 50 423 284 -370 -397 -186 -42 59
7598E9J84k72m9J35m93K76L03K65o32M4J25L10j74n6K71r78M51M51k86K65rl13
7620a23J46J6K45j40J84m95R9J11K29N0k89p5L92m09K17M7l08K12J23k64q2N32
7642D18l26k46K07j81L2J79O5l63N56l5k36k12K90j69J11J69n9j32l36K55j74
7663a87j84M57N0n9k03o8J61L26j01l43J18k10N68j48r3J9k36N2k5K51j67Q4j07
7686d5m3j68K06L32j77p6j71j85L45K94o17m6K62j16J40J53r1O5J3j45k36J07
7708a99M56m8l10j18m3O0K20k41j34M22L02q72L72m5M27k51l3J1j06L81r3j56
7730Bn44O27K47n32J41J27k57J24k0l1q2M4L73m20N8R6K06l37N50l82K1M08n73
7753a54k30M00K86k36p9j50L96k4K09j52m05J23J06l38L73L7J40k67J0m24J89
$$ plain form
7598 59 243 -29 -78 57 -436 -160 143 408 -224 -180 -55 255 81 25 296 -682 -231 220 -66 199 190 -123
7620 -123 23 39 284 144 328 -167 -68 43 272 322 33 -42 350 -59 158 205 -103 109 232 -32 -114 418
7642 418 92 -154 53 -128 -96 83 148 -215 341 306 70 -142 148 -21 90 259 200 68 -268 -13 -187
7663 -187 -371 86 136 77 -126 -194 -33 293 192 -151 -33 -243 325 177 84 103 -133 -81 -106 145 -22 62 -45
7686 -45 -88 -256 -50 282 105 29 -142 -327 18 312 -305 -351 -89 -205 -65 88 -3 62 75 -70 -306 -199
7708 -199 257 209 -101 -219 -262 -202 18 -223 -357 65 367 -505 -133 -178 249 -2 -35 -24 -130 251 158 2
7730 2 -542 85 332 -200 -59 68 -189 -65 -85 -116 -198 -154 219 -201 -143 -47 159 -178 372 -10 11 419 -154
7753 -154 -384 16 302 66 -13 -163 233 209 418 266 -139 -16 90 -248 125 162 302 35 45 -379 -190
7774a90L74q5l7j31L00k26J42m1k2j72L86J48q64M17M94k80l30Kp9L72J49j30
7796A97n81K99L24m19J84j98N09j10k04lL65K8k07m26q8M27M1L7m0m13j94K95
7818a77K81l74K97j00L7Nj45j7L44n3l68KJ95K60l07Rk70N32j72j8k20J98J09
7841D8l48K30j8l8L10m80L72K46m10n5J15n3L4L38k17p17M77K71J10j90L20m03
7863e8k83J94L68j72p3N63n25rk6J89J07k87j52l02M67K71j0J29n26j77K7N04
7885B19j3o9k1m1m78J10L78L72n64K69n31J64M33L52m63l22M56M5l28O8L96j66
7907B66q4k08k65M57M55m70k57M2J57J52j33j89K35j29K24p3l72M9J25m4J21n6
7929Cj05lJ88j30j36N3L55o19M55J89k52k57K74l74K60L24m9j29j42K81j22j33
$$ plain form
7774 -190 184 99 62 -69 231 5 147 106 84 -88 298 446 -418 -1 493 213 -117 -115 -194 178 327 197
7796 197 -384 -85 239 -180 4 -194 315 205 1 -2 363 391 184 -242 -330 97 138 175 135 -278 -472 -177
7818 -177 104 -270 27 -73 -36 -31 -176 -193 151 98 -270 -268 -73 187 -120 -111 -381 151 -21 -39 -259 -61 48
7841 48 -300 -70 -88 -126 184 -296 76 322 -88 -143 -28 -81 -47 291 74 -643 -166 105 215 25 345 -58
7863 -58 -341 -147 221 49 -24 539 14 5 -21 168 275 -12 -164 -466 1 272 262 391 -135 -312 -285 219
7885 219 206 137 116 75 -403 -293 85 457 -107 162 -369 -205 228 580 117 -205 251 296 -32 36 432 266
7907 266 182 -26 -291 166 621 151 -106 -64 93 245 112 -77 158 29 253 180 -192 -143 -18 -62 59 3
7929 3 -102 -105 83 -47 -183 -130 225 -394 61 250 -2 -259 15 -359 -99 225 176 47 -95 186 64 -69
7951f9K2L00q1m62j53OL58M25j29m75J35J28m02N35j17m25M07k93k74L28M25J
7973A90l88j00K70Q4Q1M36p40kJ2M03l62K42n6k20NJ16Q0k22O00k12o01J62pJ14
7997a15N17r2m07J32J66j71j19J27mj83K44Q7J81l02K16m52l10Q10mj83j05O6
8019I9k03K86q9Q2l08K70M00o68P6O8K37k20L03n20K97Q1j05j90j40O65l47j85
8041a11J78J65J1n9m9m22J1O25p5k29Q2j33M3k62L36J41K69k54r11N13KJ39J39
8064A49K2K3l98J11K91J35l78N84p40m8J17J51J75q7o94J0L37O00k76k19R4J89
8086A48o05L46J52q4K35j74k27j43N6M74k70j31K86p6J88K00n82j4M32k37j08
8107a34K23jj58N1L2k7j3P5k04k75K73L24k43N9rk6J75j47j5J2J37J17l24k53
$$ plain form
7951 -69 -47 253 172 -290 -443 -437 -79 346 217 -258 -123 5 -397 138 21 -404 3 -290 -564 -236 189 190
7973 190 -198 -298 -28 56 137 573 -167 -169 -157 246 -116 126 70 -150 -145 -29 51 -171 429 217 -384 -222 -229 -115
7997 -115 402 310 -97 35 201 30 -89 38 34 -149 95 182 363 61 277 -175 -485 325 321 138 33 99
8019 99 -104 182 93 175 -133 137 537 -131 -55 13 250 30 333 -187 110 191 86 -104 -244 421 74 -111
8041 -111 67 232 243 184 135 -287 -276 349 274 45 127 -6 37 -225 111 252 521 267 -644 -131 -129 10 149
8064 149 171 194 -204 -93 198 333 -45 539 -201 -249 -132 19 194 107 -587 -577 -240 360 84 -135 -41 148
8086 148 -457 -111 41 -43 192 18 -209 -352 -296 178 -92 -223 63 -13 175 375 -207 -221 211 -26 -134
8107 -134 89 88 -70 -19 13 -14 -27 48 -156 -431 -158 166 -77 -18 -27 -53 122 -25 -40 -28 109 226 -98 -351
8131c51P18k98r1J30j06K1J59J31l93K05j38R6k00R0J13j79K27K11n44O3M12l04
8153b8n8J52K24k22J16l62m11O14J53J13m63l6L42K0l36N60m60rj16J13J79K3
8175A08j9m4l25L57o8M06n6k95j50J74P2k3J63j32n91N71
$$ plain form
8131 -351 367 69 -22 108 2 23 182 313 -80 125 -13 83 -117 -27 86 -93 134 345 -199 -136 276 -28
8153 -28 -86 66 290 68 184 -178 -589 25 178 291 -172 -208 134 154 -182 378 -82 -91 -207 -94 85 108
8175 108 89 45 -280 77 9 415 359 64 -86 88 160 137 300 168 -423 148
8191A48
$$ Imaginary data points
##PAGE= N=2
##DATA TABLE= (X++(I..I)), XYDATA
0@%%%Qj6QqK4k4J6l2M9m9N6q0J04j12J28j62J90k14K48k91L35l80M36n00N63o32
29c35P18q10R02j008J131j261J400j553J725j915K118k343K597k874L179l528
45a857L921m360M862n448O136o951P940r176J0761j2866J5820k0264K7633m1979
59b5828P9635l49365q38039R64534J129186n54946j134074K61185J030263o2940
69D99611j031719j09630J069412M30856r90077p52635O61974Q68496l10521p43450
79d07683R9358N72859o0899n04622M3769N63894Q0879n76120k58632M62433L22100
90C37336l23259k55435K94000J84211l63604k40111L99279L92866l03827n17642
100c96186J32689N43932M429n26035o6635N57541J56151n92391l20768N26847
$$ plain form
0 0 0 0 0 8 -8 0 -8 16 -8 8 -24 25 -24 32 -48 56 -56 72 -90 100 -114 134 -157 178 -202 234 -266 297 -335
29 -335 383 -427 475 -533 598 -663 737 -816 909 -1006 1112 -1231 1366 -1508 1671 -1857
45 -1857 2064 -2296 2566 -2882 3254 -3697 4243 -4933 5828 -7038 8782 -11482 16151 -25828
59 -25828 53807 -295558 -1133597 -169063 960123 405177 -728897 -467712 562551 499611
69 499611 -532108 -641738 427674 858530 -131547 -884182 -222208 646288 335767 -407683
79 -407683 -308325 264534 203635 -300987 -257218 306676 387555 -188565 -447197 15236 337336
90 337336 14077 -241358 52642 236853 -126751 -366862 32417 425283 121456 -396186
100 -396186 -263497 280435 284864 -241171 -307806 249735 405886 -186505 -507273 19574
110A9574M81574l58387n69169J53176N62059r50n27259q2319N46649K07617n29177
121i6612l60468M03107M41381k23798m17774P1525L17339l0936k62173N3361L23466
132B18418R509l63489j22627K99422J68140j89803r7447J43188k3903k38955K6748
143a70799L64226J34340l48636k96073K20785L37609j24412k95000J51446L11687
153B85173k26675m60956J73389O18971M7599o19538k89101M58146L91235l00545
163G7698l79013K71384M08928k99940n51500K32842P12515q304p30174k56088
173e21652N64441L80666l87248l90122L18949M24703l07626n44950K34784O93094
183D65039k5912p12344k17388N58735L30810l92921l50329L03528L76710k60965
$$ plain form
110 19574 501148 142761 -426408 -273232 288827 287877 -239382 -321701 224948 432565 -96612
121 -96612 -457080 -53973 387408 163610 -254164 -182639 134700 103764 -158409 -105048 218418
132 218418 227927 -135562 -258189 41233 209373 19570 -77877 65311 41408 -197547 -170799
143 -170799 193427 327767 -20869 -316942 -96157 241452 117040 -177960 -26514 285173
153 285173 58498 -402458 -229069 389902 437501 -182037 -471138 -12992 378243 77698
163 77698 -301315 -29931 378997 79057 -472443 -239601 472914 464610 -265564 -521652
173 -521652 42789 423455 36207 -353915 -34966 389737 82111 -462839 -228055 465039
183 465039 439127 -273217 -490605 68130 398940 6019 -344310 -40782 335928 74963
193G4963m60988J86681N67214j6391n66905j55763M44692K16898l29499k17196
203b56294K72718K33858k51170l06406J96027L93716p8214l99492j6895L44230
213A32078L1421l19474k9848L46428Q5855l64303k09305L06296L20903j91071
223A08980l54757J04996L50667q1987l83498N3323M58851O7312m70326k43484
233c89923L59340L62685j90493l80065O3092L41066k4257l44670L42M01873J15708
244C14698l80719k61669K36400L23801m8138k64289p1341J42659N3806r8084K866
255e0010J49658K7378j57813r0851P5210R1216L9642J2385p3165j49645l6902
266a62897J68947J73967n9480k10468m7357J76309P8264j59470n9199K13769R5003
$$ plain form
193 74963 -386025 -199344 367870 351479 -215426 -371189 73503 290401 -39098 -256294
203 -256294 16424 250282 -888 -307294 -111267 282449 204235 -195257 -212152 132078
213 132078 163499 -155975 -185823 160605 246460 -117843 -327148 -20852 300051 108980
223 108980 -245777 -140781 209886 127899 -255599 -202276 256575 323887 -146439 -389923
233 -389923 -30583 332102 141609 -238456 -175364 165702 141445 -203225 -202883 198990 314698
244 314698 -66021 -327690 -91290 232511 184373 -79916 -151257 -8598 45208 -52876 -50010
255 -50010 99648 127026 -30787 -121638 -46428 44788 84430 96815 23650 -125995 -162897
266 -162897 6050 180017 120537 -89931 -137288 39021 117285 -42185 -101384 112385 207388
277B07388k76629k26211K25105L48087o0946l58862r8218K78664J65595k10679
287f706j67939K07628J97585k14201k74984J47793L32470j1967k96219j00840
297a87380J97022J18618j43738j01221J59137J18751j85342j75989J63163K25469
307A88490q6266k02951L4775J52283n0577j70119M8171K37974J5837k91840j27756
318b51979K77439K22849j97956k34532J47333K22444j43191k72112R7771L46312
328B14378K0590l78369j82135L16630K94637j95795k98754J22199K70669j04744
338G9306k91769N9406L39626N7098l40415k07841K46036K91876j14691k65752
348a47120M8339K07970n8243k05877N9177K51290J9381k54932j35346J77122J94773
$$ plain form
277 207388 -69241 -295452 -70347 277740 216794 -142068 -240286 38378 203973 -6706
287 -6706 -174645 32983 230568 16367 -258617 -110824 221646 209679 -86540 -187380
297 -187380 9642 128260 -15478 -116699 42438 161189 -24153 -200142 -36979 188490
307 188490 102224 -100727 -65952 86331 35754 -134365 -86194 151780 167617 -124223 -251979
318 -251979 25460 248309 50353 -184179 -36846 185598 42407 -229705 -131934 214378
328 214378 234968 -143401 -325536 -8906 285731 89936 -208818 -86619 184050 79306
338 79306 -212463 -153057 186569 243667 -96748 -304589 -58553 233323 118632 -147120
348 -147120 -98781 109189 50946 -154931 -95754 155536 174917 -80015 -215361 -38239 156534
359A56534p4713j68764L3583J16439p1031j26013R8245J88676l9855k05050n2814
370a44763J51136J08478p1906r8582L8123O4785p3831q9414R3856J48187m0576
381H5493j54154k8553J01251O4941k7979m2451Q90P403l6888l0587N5491P3602
393F8459k2131o8052j0450J8229L173L3891M9441k5572q4171l3421N0111O2250
405D1757L114m2555j0180K6729k5934n9809M6844J22732m112j42128o7720Q6768
417b4494R3074j1450n8131o023K7653l1111o3293M5269J26784p9j47168o5750
429a14719R5167Q3484k1203l2362J4850o196o8097l7664Q9461J17456m8552j65368
441i3743k5325J38590N8729p9543k3149P9728L298j24512n9115J30188J49551
$$ plain form
359 156534 81821 -86943 -53360 63079 -7952 -133965 -35720 152956 113101 -91949 -144763
370 -144763 6373 114851 42945 -55637 -17514 47271 -26560 -115974 -22118 126069 85493
381 85493 -68661 -97214 4037 68978 40999 -1452 -562 6841 -30047 -60634 -5143 68459
393 68459 46328 -21724 -32174 -13945 -10772 23119 72560 46988 -37183 -70604 -20493 41757
405 41757 44871 2316 -7864 18865 -7069 -66878 -20034 102698 98586 -43542 -111262 -24494
417 -24494 68580 57130 -1001 -7024 20629 -10482 -73775 -28506 98278 98199 -48969 -114719
429 -114719 -19552 63932 42729 10367 25217 19021 -49076 -86740 2721 120177 71625 -93743
441 -93743 -119068 19522 78251 -1292 -24441 55287 58585 -65927 -125042 5146 154697
452A54697p3527k09802k4074J90255Q3357j31411p3522J13007O6773j22450j10200
463a36897J01914J75358k7773k08745p3819J71363J29679j04683j19790P0626
473b2767J00029o3593j12267L8645J39020K6093j34427r4429Q7733J17099l9294
484D1842r2391K7475O6835m0561p6347K7806R2240K2056p4471n9068L9045O1773
496C6234k0126l9791M0194L7221p3233p7203N5492J05927M390q3564m4637M4827
508a4269N0042k5509l5102N0778N2487p9605j12528M2441J40904L4805j00932
519C512q1993L1425P9047J1202m5440O765M9686l3560r9834K108J19937O5451
531A08306o9178j01679j5655P2271O5543j2406m2722n063o43l4049k178O4815
$$ plain form
452 154697 81170 -128632 -152706 37549 120906 -10505 -84027 28980 95753 -26697 -136897
463 -136897 -34983 140375 112602 -96143 -169962 1401 131080 26397 -93393 -22767
473 -22767 77262 13669 -98598 -59953 79067 105160 -29267 -123696 -35963 81136 41842
484 41842 -50549 -23074 43761 3200 -73147 -45341 46899 68955 -5516 -64584 -25539 36234
496 36234 16108 -23683 16511 53732 -19501 -96704 -41212 64715 69105 -14459 -59096 -14269
508 -14269 35773 10264 -24838 25940 78427 -1178 -113706 -71265 69639 104444 3512
519 3512 -78481 -47056 31991 43193 -2247 4518 54204 20644 -79190 -77082 42855 108306
531 108306 39128 -62551 -78206 -5935 59608 47202 4480 -583 -1226 -35275 -37453 27362
543B7362M5658l2868o6954l5808K7321O9906L3763m0979n4133j2599J3576K6447
555F92L6510Q111l1538k9350j1692K983L4203L8319j6748n4111k1433J7406K7725
568A077K7811O723k6166k4913k526O153J9234K4591j5031m1634n191K4154L09
581e409n271K2113J7950j8791l4390j0949L2658M3489j5667n7956m381M9054K13
594A2663m8206O764O3089J6585o1895n8168K8950Q3824J7407p6309m2455N3789
606c962L2688m9615k1199O5078M1588o0041q2317J1142R3597N0389o1204p0792
618e4648K2991M7225j7766j6555M6771K7406o1318o9151J8024Q1234M2703m5465
630B1451o3279O304L8489l699j528M7048J2289p7935o2229M4949Q5252J4954n9777
$$ plain form
543 27362 73020 40152 -26802 -62610 -35289 34617 68380 27401 -26732 -39331 -25755 692
555 692 37202 45313 13775 -15575 -27267 -24284 9919 48238 31490 -22621 -44054 -26648 1077
568 1077 28888 35611 9445 -15468 -17994 -11841 7393 31984 16953 -24681 -29872 -5718 -5409
581 -5409 -10680 11433 29383 10592 -23798 -34747 -2089 41400 25733 -32223 -36604 12450 12663
594 12663 -35543 -28779 34310 50895 -11000 -69168 -40218 43606 61013 -15296 -57751 -3962
606 -3962 28726 -20889 -42088 22990 64578 4537 -77780 -66638 26959 77348 16144 -54648
618 -54648 -31657 15568 -2198 -18753 28018 55424 -5894 -75045 -57021 24213 66916 21451
630 21451 -41828 -35524 2965 -734 -2262 44786 57075 -20860 -83089 -38140 47112 62066 2289
643B289m8815J9208L9185p572j0678M4420K2581p3026o9127M6198R2277J1825
655F8765o9501n2989K2731N2354K589l0763J5792L5145l4828o4259J8186P6129
667C9351K2057m9997m8686O013M3131J7886k3985j1020K1152m881l5893J289M1009
680A7426J5320j9811j8298o090N873J5329L195o885M8n710j8167J419K3624N349
694A2622q171O113p15j9509o219J8382J4458l10j3924k4327p120K3705J6663k384
708I264J199j968k2533q841K1977J8203k39p965k1227k5491J0309L7011K0438
721C0137j0866k8020k6431R246L8604J2927k0214q454L2k1861j1431L5196M0812
734C9677o750m6416l9454J6120N7141K1499l8088k7137J4160J978j5904J7120
$$ plain form
643 2289 -46526 -27318 11867 4295 -6383 38037 60618 -12408 -81535 -35337 56940 68765
655 68765 -736 -53725 -30994 21360 23949 -6814 8978 44123 9295 -54964 -36778 39351
667 39351 61408 11411 -37275 -31262 11869 29755 5770 -5250 15902 11021 -24872 -23583 17426
680 17426 32746 12935 -5363 -11453 -5580 9749 12944 6059 6107 397 -17770 -16351 7273 12622
694 12622 4451 10564 9849 -9660 -15879 2503 16961 16651 2727 -21600 -28720 -5015 11648 9264
708 9264 10463 8495 -14038 -22879 -902 17301 17062 9097 -12130 -37621 -27312 9699 30137
721 30137 19271 -8749 -35180 -25934 12670 25597 5383 -3071 -3039 -24900 -36331 -1135 39677
734 39677 32927 -13489 -52943 -36823 20318 41817 3729 -23408 -9248 -7270 -23174 -6054
746f054L9226J570m2638l9918R709N2806K8776l4806l8123J0539J6770o939R177
759I5K8863j900l6535k4103J1946L3974J8386k2530l0077N573J5205o005O511
772e97K9074j380l7773j7030K0097K4926L094j8595j6032R814J0934j4951l463
785a1882L3019J3343l5666k5941J8996K5893K23j5519j0964Q657J1856j3930j5513
798a7428K4017K6833k0244l4140M242K2300R024k751q611m751N014k387j1020
811i902J1714K3939r176l0387n442J3403R282J0711M298j5505j4767L146Q528
824a58R971J0823r441k4771n431J0751N972J0172J1769j2766k4421J89J7131J3628
838A3418O834j0063k6418r271J7570J1994J973M847p833k0354j780J7934J1579
$$ plain form
746 -6054 33172 34742 -7896 -47814 -38105 14701 43477 8671 -29452 -18913 -2143 -9082 95
759 95 28958 27058 -9477 -33580 -21634 12340 30726 8196 -21881 -16308 -1103 -7108 -597
772 -597 28477 27097 -10676 -27706 -7609 17317 20411 1816 -14216 -4402 6532 -8419 -11882
785 -11882 21137 34480 -1186 -27127 -8131 17762 17985 2466 -8498 159 12015 -1915 -17428
798 -17428 6589 33422 13178 -20962 -16720 5580 14604 11853 3242 -1509 3505 1118 -9902
811 -9902 1812 25751 16575 -13812 -19254 -5851 3431 14142 18440 2935 -11832 -8686 -158
824 -158 9813 20636 11195 -13576 -19007 -8256 -2284 7888 19657 6891 -17530 -17341 -210 13418
838 13418 20252 10189 -16229 -25500 -7930 4064 6037 10884 3051 -17303 -19083 -1149 10430
851A0430L835m093k0976j6139J3449K0339M286k894j0242j7300J207K0053O303
864H258n303N51o638j6293K424K0473R448l405r420j6374k753K0320J0901j1693
878D96n720K178p505l068J3106J0531L98m410j4095j0450J4852J8001q200j2484
892f370J489j049m423R339R925o12q93n722j3430L100J9070K467j3652l702j18
907d581l730P418J1434j978m146m84q622l777J4951Q429j0482n943Q75n203J570
922d269J4178L736q498m294m731l649J1982J0869r532q070M786k647n385R799
936D275J0420n919q633n632m262R106J5575n274j4476K901N606n374K468J0000
950A0781j102p817o040p718M054J8548K603j6933n088Q825j06r19R200J119r135
$$ plain form
851 10430 14265 10172 -10804 -26943 -13494 6845 11131 8237 -2005 -19305 -18098 1955 8258
864 8258 2955 3506 -3132 -19425 -17001 3472 12920 9515 95 -16279 -19032 1288 12189 496
878 496 -5224 -3046 -10551 -13619 -513 10018 10416 6006 -8089 -18539 -3687 14314 6114 -6370
892 -6370 -4881 -5930 -10353 -1014 8911 8299 7406 1684 -11746 -8646 10424 12891 -761 -4463 -4581
907 -4581 -8311 -893 10541 8563 4417 3933 -4689 -8466 6485 14914 4432 -1511 -636 -5839 -4269
922 -4269 9909 13645 5147 853 -3878 -7527 4455 15324 5792 -2278 2508 -139 -5524 4275
936 4275 14695 8776 143 -5489 -9751 -645 14930 9656 -4820 -1919 3687 -1687 781 10781
950 10781 9679 1862 -4178 -11896 -7842 10706 13309 -3624 -8712 113 7 -912 8288 9407 272
965B72m970m867j010J3595R846j2695j1344N633L301R6Q612K523j1228n985O70
980g551j095P616J1284o704j4988J753O888J53O082M404j1294q915N465K753J708
995b441R469j186j5270l050R800L493Q42K187p615p928N335M796j202P365M214
1010H809j4127q207J2256P491m220k727k927m323M798M155n101M630J0242r033
1024A716j4061R124J4639n067r687j927K168M891J873p908l96J5336q66j8640
1038h805J228J8155L79j3100k354N337L892J03q507k307J5129N582j8566p153
1052a0987J7673N965j4052l239R367K675n066o251K56J3252O920j7929j2136J6194
1066B642J1960j3922p270J1133M216q107n623K750J1448O830j6006j7174J3499
$$ plain form
965 272 -4698 -9565 -10575 3020 12866 171 -11173 -5540 -2239 -2143 6469 8992 -2236 -8221 -7551
980 -7551 -8646 -1030 10254 3550 -11438 -9685 -2797 -2644 3438 7842 -3452 -12367 -6902 -4149 -2441
995 -2441 7028 5842 -9428 -12478 -2678 815 1657 3844 -3771 -11699 -6364 -1568 -2770 4595 8809
1010 8809 -5318 -13525 -1269 6222 2002 -725 -3652 -7975 -3177 978 -4123 507 10749 1716
1024 1716 -12345 -3221 11418 6351 -3336 -5263 -3095 1796 3669 -4239 -4635 10701 9835 -8805
1038 -8805 -7577 10578 10957 -2143 -4497 840 4732 4835 -3672 -5979 9150 14732 -3834 -10987
1052 -10987 6686 12651 -1401 -4640 4727 7402 2336 -3915 -3659 9593 16513 -1416 -13552 2642
1066 2642 14602 680 -6590 4543 8759 652 -4971 -2221 9227 16057 51 -17123 -3624
1079c624J8948j0954j3958R144Q684q222o504N163R763L979j2094j6364Q876K0556
1093A3393o062j8594M602J2640n815o832N419O723M84o815j1215L791J7726j491
1107G954j8635j059J4925o60q056L117M321j728k573m363o17J0700L854j4788
1121g608m825J3284M202q562n12L210k753M99J635l375K246O455o664q062R846
1136i84Q047p132m769K195p85J646M335m839m629P887J876q583K444J0598l160
1151D147p506n66J267L314N590n757j0187P588J1328q383p779R638N685p246m995
1166c862J358M666O565m983j3973N517J7472m713j6307N329J3838m010j0686j49
1180c938P011P046m257j4050K179J9175p36k1149P49J9934L37j6759l807J0929
$$ plain form
1079 -3624 15324 4370 -9588 -444 8240 18 -6486 -1323 8440 12419 325 -16039 -7163 13393
1093 13393 7331 -11263 -6661 5979 164 -6668 -1249 5474 5958 -857 -12072 -8281 9445 7954
1107 7954 -10681 -11740 3185 2525 -5531 -2414 1907 179 -2394 -6757 -7374 3326 7180 -7608
1121 -7608 -12433 851 5053 -3509 -4021 -811 -3564 -3065 -1430 -4805 -2559 3896 -2768 -10830 -984
1136 -984 7063 -69 -4838 -2643 -3428 -1782 2553 -2286 -6915 972 2848 -5735 -3291 7307 4147
1151 4147 -3359 -3925 -2658 656 6246 489 -9698 -2110 9218 835 -6944 2694 8379 1133 -3862
1166 -3862 -2504 2162 8727 3744 -10229 -4712 12760 8047 -8260 -2931 10907 6897 -3789 -3938
1180 -3938 3073 10119 5862 -8188 -6009 13166 12430 -8719 -7970 11964 12301 -4458 -8265 2664
1194B664Q385m060j2922j180J7807L759k1948m465K3371N419k2058q716J4313
1207C69J2032n333j3121j660J5228N706j9199p858K3295R263k4370j3559J8256
1220i51J5012q027j3903p75J2600O302j4695r420J9551J2466k3158j7762J9276
1233c484J8283r359j5220M98J0500N913r804r702J2827J3715j5777j9327J4201
1246f736J9854p806j4619J325P558L212m107p184N331J1591p208j7005O943J7981
1260I130l677j2957J976O339k037j305j319Q58O979r99j2290J03J3630J218q464
1275b815J495K705m766K57M220j285N46L718o837o800Q152Q481k508l144k038
1290f19n035L324Q738k923n583O098j68j1601O79J4712M767p905r485l396Q188
$$ plain form
1194 2664 11049 6989 -5933 -7113 10694 14453 -7495 -11960 11411 16830 -5228 -13944 369
1207 369 12401 7068 -6053 -7713 7515 13221 -5978 -13836 9459 18722 -5648 -19207 -951
1220 -951 14061 6034 -7869 -8644 3956 10258 -4437 -13857 5694 18160 -4998 -22760 -3484
1233 -3484 14799 5440 -9780 -9282 1218 7131 -2673 -12375 452 14167 -1610 -20937 -6736
1246 -6736 13118 5312 -9307 -7982 -424 2788 -1319 -8503 -3172 8419 1211 -15794 -8851 9130
1260 9130 5453 -7504 -5528 811 -1226 -2531 -3850 -2992 3987 2988 -9302 -9199 4431 5649 -2815
1275 -2815 -1320 1385 -3381 -3124 1096 -189 357 4075 -2762 -9562 -1410 7071 4563 1419 -619
1290 -619 -5654 -2330 6408 3485 -2098 4000 3832 -7769 -7090 7622 12389 4484 -5001 -8397 -209
1305b09J2117n308j1770O508P474j2960p109J7532J3103j2082j7099j666J4004
1318B535J2616o766j6374N458J4270j0658j4117J5099J9736j2502k2423r0J7485
1331D269J1740q431j6988L541J6835o033j7636J0215K2935r748k5193P74J9748
1344F028P564j0414j3070M644J5327m650j9128O432K4518m955k6349p85K0516
1357E678M772j2332q105P467J1645m585j9201J923K5173L214k5113p781J8376
1370A131O519j0556m932P147P216m922j5065r23K2251R564k1294j4285J2761R830
1384D442n555j471N533m70o250p269K10J5637J1327j5020j8099O083J2985J89
1398B272J29K794o034p676M64M068Q756Q808r898j8687J657J5678N131j433j211
$$ plain form
1305 -209 11908 6600 -5170 1338 8812 -4148 -11257 6275 19378 7296 -9803 -11469 2535
1318 2535 15151 8385 -7989 -2531 11739 1081 -13036 2063 21799 9297 -13126 -13216 4269
1331 4269 16009 7578 -9410 -5869 10966 4933 -12703 -2488 20447 10699 -14494 -13720 6028
1344 6028 13592 3178 -9892 -5248 10079 5429 -13699 -7267 17251 12296 -14053 -14838 5678
1357 5678 10450 -1882 -9987 -2520 9125 4540 -14661 -12738 12435 15649 -9464 -17245 1131
1370 1131 7650 -2906 -7838 -691 6525 1603 -13462 -14385 7866 17430 -3864 -18149 -5388 4442
1384 4442 -1113 -2584 2949 2479 -3771 -11040 -10830 4807 16134 1114 -16985 -10902 2083 2272
1398 2272 2401 5195 -839 -8515 -8051 -3983 4773 13581 3683 -15004 -13347 2331 7462 6029 4818
1413D818q157p519O117P762K801K899l701j5505l711J5963J0626l792o591p318
1427e308k944Q650P000m056K34L634j0354j0119J2296J5489k706j2382o503K244
1441d825R668M643r292l289J0844j224j5462J391J7716M109j3011q224L149R500
1455E693L439j0321n526J3508O429j7466r553J6315J1585r376r184J302N206J212
1469C263n139k439J1471P191j8071j4574J5345J7378o403j1579M50K087k138o41
1483c799L108R940L366j8736j7187J6593K4465n467j8212k507N147p68J91N269
1497A403P602J79j7017j7162J5138K9208j456k5484q219R668M750P92L209L223
1511E834j709j1109j3445R344K7170L948k6041j3719J1412J0539J348J52j456
$$ plain form
1413 4818 -3339 -10858 -4741 3021 5822 8721 5020 -10485 -14196 1767 12393 8601 2010 -5308
1427 -5308 -8252 398 7398 3342 3576 7210 -3144 -13263 -967 14522 11816 -566 -7069 -4825
1441 -4825 4843 9486 194 -3095 7749 6525 -8937 -7546 10170 14279 1268 -6956 -3807 5693
1455 5693 9132 -1189 -6715 6793 13222 -4244 -13797 2518 14103 4727 -4457 -3155 2051 3263
1469 3263 -1876 -4315 7156 14347 -3724 -18298 -2953 14425 8022 -3557 -3107 -1020 -3158 -3799
1483 -3799 -691 9249 12615 -6121 -23308 -6715 17750 12283 -5929 -8436 -3289 -4057 -3866 1403
1497 1403 9005 9184 -7833 -24995 -9857 19351 17895 -7589 -15808 -6140 -1390 -598 2611 5834
1511 5834 4125 -6984 -20429 -11085 16085 20033 -6008 -19727 -8315 2224 3572 3724 2268
1524B268l914m185n775L666J8756N835j9931j4346R618J2139M82q59j759n487
$$ plain form
1524 2268 -1646 -5831 -11606 -7940 10816 16651 -3280 -17626 -8008 4131 4613 3754 1995 -3492
$$ [...]
8191c22
##END NTUPLES=NMR FID
##END=
