##TITLE=1H_CA-8575-10
 CDCl3, 8 sc, 
 2.4.2019
##JCAMPDX= 6.0         $$ Bruker NMR JCAMP-DX V2.0
##DATA TYPE= NMR FID
##DATA CLASS= NTUPLES
##ORIGIN= UXNMR, Bruker Analytische Messtechnik GmbH
##OWNER= root
$$ XWIN-NMR		Version 3.5
$$ Tue Apr  2 14:42:20 2019 Russian Standard Time (UT+4h)  she@DPX200
##.OBSERVE FREQUENCY= 200.1316
##.OBSERVE NUCLEUS= ^1H
##.DELAY= (6, 6)
##.ACQUISITION MODE= SIMULTANEOUS
##.ACQUISITION SCHEME= undefined
##.AVERAGES= 8
##.DIGITISER RES= 18
##SPECTROMETER/DATA SYSTEM= spect
##.PULSE SEQUENCE= zg30
##.SOLVENT NAME= CDCl3
##.SHIFT REFERENCE= (INTERNAL, CDCl3, 0, 15.7039)
##AUDIT TRAIL= $$ (NUMBER, WHEN, WHO, WHERE, WHAT)
$$ ##TITLE= Audit trail, XWIN-NMR		Version 3.5
$$ ##JCAMPDX= 5.01
$$ ##ORIGIN= Bruker BioSpin GmbH
$$ ##OWNER= she
$$ F:/spectra/data/she/nmr/H-F/1/audita.txt
$$ ##AUDIT TRAIL=  $$ (NUMBER, WHEN, WHO, WHERE, WHAT)
(   1,<2019-04-02 14:41:12.21 +0400>,<she>,<DPX200>,
      <created by zg, POWCHK disabled, PULCHK disabled
       configuration hash MD5:
       00 E9 B6 7A A2 85 ED C7 34 08 36 98 17 FE 4E 26
       data hash MD5: 16K
       BD E3 2B 9A 61 94 D7 61 1C A2 6E 53 BD F0 9A 73>)
$$ ##END=
$$ 
$$ hash MD5
$$ 8F 5A 31 71 F3 94 D2 0A 4D 54 61 8A 3E D3 23 2A
##$RELAX= 
##$RELAX= 
##$RELAX= 
##$RELAX= 
##$RELAX= 
##$RELAX= 
$$ Bruker specific parameters
$$ --------------------------
##$DU= <F:/spectra>
##$EXPNO= 1
##$NAME= <H-F>
##$PROCNO= 1
##$TYPE= <nmr>
##$USER= <she>
##$AMP= (0..31)
100 100 100 100 100 100 100 100 100 100 100 100 100 100 100 100 100 100 
100 100 100 100 100 100 100 100 100 100 100 100 100 100 
##$AQSEQ= 0
##$AQ_mod= 1
##$AUNM= <au_zg>
##$AUTOPOS= <>
##$BF1= 200.13
##$BF2= 200.13
##$BF3= 200.13
##$BF4= 200.13
##$BF5= 200.13
##$BF6= 200.13
##$BF7= 200.13
##$BF8= 200.13
##$BYTORDA= 1
##$CFDGTYP= 0
##$CFRGTYP= 5
##$CHEMSTR= <none>
##$CNST= (0..31)
1 1 145 1 1 1 1 1 1 1 1 1 1 1 1 1 1 1 1 1 1 1 1 1 1 1 1 1 1 1 1 1 
##$CPDPRG= <>
##$CPDPRG1= <>
##$CPDPRG2= <>
##$CPDPRG3= <>
##$CPDPRG4= <mlev>
##$CPDPRG5= <mlev>
##$CPDPRG6= <mlev>
##$CPDPRG7= <mlev>
##$CPDPRG8= <mlev>
##$CPDPRGB= <>
##$CPDPRGT= <>
##$D= (0..31)
0 1.2 0 0 0 0 0 0 0 0 0 0.03 0 0 0 0 0 0 0 0 0 0 0 0 0 0 0 0 0 0 0 0 
##$DATE= 1554201671
##$DBL= (0..7)
120 120 120 120 120 120 120 120 
##$DBP= (0..7)
150 150 150 150 150 150 150 150 
##$DBP07= 0
##$DBPNAM0= <>
##$DBPNAM1= <>
##$DBPNAM2= <>
##$DBPNAM3= <>
##$DBPNAM4= <>
##$DBPNAM5= <>
##$DBPNAM6= <>
##$DBPNAM7= <>
##$DBPOAL= (0..7)
0.5 0.5 0.5 0.5 0.5 0.5 0.5 0.5 
##$DBPOFFS= (0..7)
0 0 0 0 0 0 0 0 
##$DE= 6
##$DECBNUC= <off>
##$DECIM= 24
##$DECNUC= <off>
##$DECSTAT= 4
##$DIGMOD= 1
##$DIGTYP= 9
##$DL= (0..7)
0 120 120 120 120 120 120 120 
##$DP= (0..7)
150 150 150 150 150 150 150 150 
##$DP07= 0
##$DPNAME0= <>
##$DPNAME1= <>
##$DPNAME2= <>
##$DPNAME3= <>
##$DPNAME4= <>
##$DPNAME5= <>
##$DPNAME6= <>
##$DPNAME7= <>
##$DPOAL= (0..7)
0.5 0.5 0.5 0.5 0.5 0.5 0.5 0.5 
##$DPOFFS= (0..7)
0 0 0 0 0 0 0 0 
##$DQDMODE= 0
##$DR= 18
##$DS= 0
##$DSLIST= <SSSSSSSSSSSSSSS>
##$DSPFIRM= 0
$$ [...]
##$SUBNAM2= <"">
##$SUBNAM3= <"">
##$SUBNAM4= <"">
##$SUBNAM5= <"">
##$SUBNAM6= <"">
##$SUBNAM7= <"">
##$SUBNAM8= <"">
##$SUBNAM9= <"">
##$SW= 24.9336934301222
##$SWIBOX= (0..15)
0 0 2 0 0 0 0 0 0 0 0 0 0 0 0 0 
##$SW_h= 4990.01996007984
##$TD= 16384
##$TD0= 1
##$TE= 0
##$TE2= 300
##$TE3= 300
##$TEG= 300
##$TL= (0..7)
0 120 120 120 120 120 120 120 
##$TP= (0..7)
150 150 150 150 150 150 150 150 
##$TP07= 0
##$TPNAME0= <>
##$TPNAME1= <>
##$TPNAME2= <>
##$TPNAME3= <>
##$TPNAME4= <>
##$TPNAME5= <>
##$TPNAME6= <>
##$TPNAME7= <>
##$TPOAL= (0..7)
0.5 0.5 0.5 0.5 0.5 0.5 0.5 0.5 
##$TPOFFS= (0..7)
0 0 0 0 0 0 0 0 
##$TUNHIN= 0
##$TUNHOUT= 0
##$TUNXOUT= 0
##$USERA1= <user>
##$USERA2= <user>
##$USERA3= <user>
##$USERA4= <user>
##$USERA5= <user>
##$V9= 5
##$VALIST= <valist>
##$VCLIST= <CCCCCCCCCCCCCCC>
##$VD= 0
##$VDLIST= <DDDDDDDDDDDDDDD>
##$VPLIST= <PPPPPPPPPPPPPPP>
##$VTLIST= <TTTTTTTTTTTTTTT>
##$WBST= 1024
##$WBSW= 4
##$XGAIN= (0..3)
0 0 0 0 
##$XL= 0
##$YL= 0
##$YMAX_a= 190099
##$YMIN_a= -322120
##$ZGOPTNS= <>
##$ZL1= 120
##$ZL2= 120
##$ZL3= 120
##$ZL4= 120
##$ABSF1= 10
##$ABSF2= 0
##$ABSG= 5
##$ABSL= 3
##$ALPHA= 0
##$AQORDER= 0
##$ASSFAC= 0
##$ASSFACI= 0
##$ASSFACX= 0
##$ASSWID= 0
##$AUNMP= <proc_1d>
##$AZFE= 0.1
##$AZFW= 0.1
##$BCFW= 1
##$BC_mod= 2
##$BYTORDP= 1
##$COROFFS= 0
##$CY= 11.3945322036743
##$DATMOD= 1
##$DC= 2
##$DFILT= <>
##$DTYPP= 0
##$F1P= 18.9103706918063
##$F2P= -1.10871071338519
##$FCOR= 0.5
##$FTSIZE= 0
##$FT_mod= 4
##$GAMMA= 1
##$GB= 0.15
##$INTBC= 1
##$INTSCL= 1
##$ISEN= 128
##$LB= 0.24
##$LEV0= 0
##$LPBIN= 0
##$MAXI= 10000
##$MC2= 0
##$MEAN= 0
##$ME_mod= 0
##$MI= 1.114404
##$NCOEF= 0
##$NC_proc= 0
##$NLEV= 6
##$NOISF1= 3.799351
##$NOISF2= 2.8
##$NSP= 1
##$NTH_PI= 0
##$NZP= 0
##$OFFSET= 15.70392
##$PC= 1
##$PHC0= -9214.777
##$PHC1= 17.80025
##$PH_mod= 1
##$PKNL= yes
##$PPARMOD= 0
##$PSCAL= 0
##$PSIGN= 0
##$REVERSE= no
##$SF= 200.130013532006
##$SI= 16384
##$SIGF1= 3
##$SIGF2= 2
##$SINO= 400
##$SIOLD= 16384
##$SREGLST= <1H.CDCl3>
##$SSB= 0
##$STSI= 0
##$STSR= 0
##$SW_p= 3612.71676300578
##$SYMM= 0
##$S_DEV= 0
##$TDeff= 0
##$TDoff= 0
##$TI= <>
##$TILT= no
##$TM1= 0
##$TM2= 0
##$TOPLEV= 0
##$USERP1= <user>
##$USERP2= <user>
##$USERP3= <user>
##$USERP4= <user>
##$USERP5= <user>
##$WDW= 1
##$XDIM= 8192
##$YMAX_p= 0
##$YMIN_p= 0
$$ End of Bruker specific parameters
$$ ---------------------------------
##NTUPLES= NMR FID
##VAR_NAME=  TIME,          FID/REAL,        FID/IMAG
##SYMBOL=    X,             R,               I
##VAR_TYPE=  INDEPENDENT,   DEPENDENT,       DEPENDENT
##VAR_FORM=  AFFN,          ASDF,            ASDF
##VAR_DIM=   8192,          8192,            8192
##UNITS=     SECONDS,       ARBITRARY UNITS, ARBITRARY UNITS
##FACTOR=    0.0002004,     1,               1
##FIRST=     0,             0,               0
##LAST=      1.6414764,     0,               0
##MIN=       0,             -322120,         0
##MAX=       1.6414764,     190099,          0
$$ Real data points
##PAGE= N=1
##DATA TABLE= (X++(R..R)), XYDATA
$$ [...]
$$ plain form
2677 -608 -4343 -2668 2466 1479 -1958 -632 1614 4378 5574 -662 -7163 -5119 430 3292 4707
2692 4707 1816 -1869 -85 705 -2330 -1979 209 -1070 -724 1306 806 2295 3978 -1245 -7062 -5578
2708 -5578 -633 4675 6114 1035 -3502 -1151 1315 -31 -440 -1866 -2849 1775 4676 1875 709
2723 709 1370 -2048 -4114 -2362 -626 3182 5301 1487 -2705 -1425 -287 -175 157 -3109 -3971 2764
2739 2764 5758 2302 -882 -3185 -4463 -915 1111 -376 648 2812 1015 418 650 -1763 -1771 -90
2755 -90 -2020 -1535 3785 5746 2403 -1019 -4800 -4805 1077 3439 677 -24 -228 -271 2744 2132 -3154 -4295
2773 -4295 -2099 -1608 1097 4809 3184 302 -1605 -4776 -4498 1183 2921 1512 989 -1141 -595 3257
2789 3257 2356 -3101 -3901 -2025 -250 3793 5180 1546 -547 -1299 -3349 -2149 1041 589 1030 2521
$$ packed form
2677f08l735J675N134r87l437J326K246K764J196o236o501K044N549K862J415
2692D707k891l685J784P90l035L51K188j279L46K030n00J489J683n223n817J484
2708e578M945N308J439n079m537K351K466j346m09j426r83M624K901k801j166
2723G09O61l418k066J752J736L808K119l814m192J280J138J12L32l266q62O735
2739B764K994l456l184k303j278L548K026j487J024K164j797n97K32k413qJ681
2755i0j930M85N320J961l343l422l781nN882K362k762p01k04m3L015o12n286j141
2773d295K196M91K705L712j625k882j907l171K78N681J738j409n23k130N46L852
2789C257r01n457q00J876J775M043J387l634k093p52k050J200L190m52M41J491
$$ plain form
2805 2521 323 -809 1623 -391 -4123 -2671 -776 822 3976 3241 -758 -1703 -1718 -1874 107 342
2821 342 -1682 592 3717 2261 1422 1011 -3405 -4948 -645 1686 2875 4532 1776 -2030 -1814 -990
2837 -990 -553 758 -332 -2646 308 2750 2140 2380 -275 -5754 -5299 -322 2158 3769 3797 -785 -3209
2854 -3209 -1109 -722 -581 653 -981 -1560 2131 3276 1699 1094 -1266 -4588 -2609 826 2193 4130
2870 4130 2986 -1769 -2004 132 -718 -904 -324 -2073 -564 4483 3748 -514 -2341 -3537 -3346 139
2886 139 1671 966 2108 967 -915 399 -127 -2689 -1080 -61 -1862 1438 6078 3416 -1200 -2902
2902 -2902 -4092 -1846 3016 3096 674 50 -5 922 2134 -1114 -4193 -1625 -341 -194 3059 4060 90
2919 90 -1661 -2558 -4753 -1860 3177 2712 346 -377 -1244 836 2800 -657 -4477 -2620 83 2802
$$ packed form
2805B521k198j132K432k014l732J452J895J598L154p35l999r45j5j56J981K35
2821C42k024K274L125j456q39m11m416j543M303K331J189J657k756l806K16Q24
2837i90M37J311j090k314K954K442o10K40k655n479M55M977K480J611K8m582k424
2854c209K100L87J41J234j634n79L691J145j577o05k360l322J979L435J367J937
2870D130j144m755k35K136q50j86N80j749J509N047p35m262j827j196J91L485
2886A39J532p05J142j141j882J314n26k562J609J019j801L300M640k662m616j702
2902b902j190K246M862Q0k422o24n5R27J212l248l079K568J284J47L253J001l970
2919I0j751q97k195K893N037m65k366p23q67K080J964l457l820J857K703K719
$$ plain form
2935 2802 5126 2470 -1751 -1516 -1543 -2810 -34 2039 1510 2070 1275 -1803 -491 2260 -1323 -4327
2951 -4327 -2473 323 3504 4929 997 -3551 -3019 -1538 -31 940 -1078 -1063 3261 3293 -936 -760 -725
2968 -725 -3268 -1966 1394 1208 2767 4379 448 -3895 -2727 -262 1704 1477 -2234 -1870 3022 4099
2984 4099 1576 -989 -5184 -5562 728 3828 1107 1326 1731 -1564 -2755 -1427 -1502 541 1505 -903
3000 -903 -1211 1948 3282 2522 -400 -5811 -5050 1698 4459 3108 1782 -846 -2164 402 310 -2840
3016 -2840 -1012 1580 573 1206 2318 276 -501 -885 -3735 -3877 700 3170 3220 1143 -2755 -2216 1555
3033 1555 -52 -3001 -1581 -232 1194 4990 3357 -2712 -3272 -865 -1431 -288 1940 1857 1980 1197
3049 1197 -1134 -645 644 -872 -1841 -1489 -1709 1896 6524 2633 -3894 -4494 -2728 -1026 2433 2518 -998
$$ packed form
2935B802K324k656m221K35k7j267K776K073n29N60p95l078J312K751l583l004
2951d327J854K796L181J425l932m548N32J481J507R71k018J5M324L2m229J76L5
2968g25k543J302L360j86J559J612l931m343J168K465J966k27l711L64M892J077
2984D099k523k565m195l78O290L100k721K19M05l295j191J328p5K043R64k408
3000i03l08L159J334p60k922n411P61O748K761j351j326k628j318K566r2l150
3016b840J828K592j007O33J112k042p77l84k850j42M577K470N0k077l898N39L771
3033A555j607k949J420J349J426L796j633o069n60K407n66J143K228q3J23p83
3049A197k331M89J289j516r69L52k20L605M628l891o527o00J766J702L459Q5l516
$$ plain form
3066 -998 -374 1396 225 -497 -630 -2117 -1575 -107 -16 2689 4872 1396 -2558 -3101 -3453 -361 4466
3083 4466 2724 -1312 189 1395 335 302 -1115 -3625 -1635 1875 2175 2023 1606 -962 -1894 -2075 -2879
3100 -2879 -407 2481 814 -244 1175 22 -460 653 -2379 -4690 -40 3887 2864 2249 569
3115 569 -2623 -1970 -47 65 166 619 165 1795 2575 266 -568 -636 -3829 -3197 1878 3096 2583 2419
3133 2419 -1235 -4679 -1900 998 22 -45 -457 -821 1576 3056 845 -1191 -2861 -4095 -552 3422
3149 3422 2650 2201 1758 -2239 -3002 348 580 -737 909 564 -306 2258 2751 -469 -2199 -3195 -2872
3166 -2872 795 3285 2262 1017 -492 -2575 -1138 354 -1889 -1627 1080 721 1388 3397 1016 -2961
3182 -2961 -2277 -1674 -982 1929 3004 1305 672 -77 -1041 45 -104 -2051 -949 595 1061 3434 3786
$$ packed form
3066i98O24J770j171p22j33j487N42J468R1K705K183l476l954n43l52L092M827
3083D466j742m036J501J206j060l3j417k510J990L510L00j52m17k568r32j81q04
3100b879K472K888j667j058J419j153m82J113l032k311M650L927j023o15j680
3115E69l192O53J923J12J01M53m54J630P80k309q34o8l193O32N075J218n13j64
3133B419l654l444K779K898r76o7m12l64K397J480k211k036j670j234L543L974
3149C422p72m49m43l997p63L350K32j317J646l45q70K564M93l220j730r96L23
3166b872L667K490j023j245j509k083J437J492k243K62K707l59O67K009k381l977
3182b961O84O03O92K911J075j699o33p49r64J086j49j947J102J544M66K373L52
$$ plain form
3199 3786 -1882 -4414 -2189 -1383 521 3212 1707 -1096 -108 202 -1146 -638 -1153 -2148 -666 676
3215 676 1822 3566 2533 -2468 -3602 -2305 -1319 2480 4494 460 -1522 753 816 -287 -13 -1848
3231 -1848 -2842 678 2774 2233 2039 179 -2412 -2477 -2275 -1184 2315 2911 -234 -588 560 -696 -202
3248 -202 -437 -3371 -2611 2700 4059 1909 826 -1919 -2940 -341 370 -505 702 1117 1122 2125 741
3265 741 -1445 -719 -1120 -3041 -420 3486 2969 1800 304 -3951 -3699 894 1479 -436 -742 -375 915
3282 915 3201 1154 -2443 -2695 -2386 -1545 1993 2910 1578 2033 146 -3826 -2643 1142 1098 560 843
3299 843 -705 400 3571 1613 -2548 -3619 -2749 366 3587 2725 10 209 -605 -2389 -1264 -792
3315 -792 -924 1471 1631 -511 295 2393 -672 -2643 -2396 -2358 877 4407 2754 -912 -1179 -619 57
$$ packed form
3199C786n668k532K225Q06J904K691j505k803R88L10j348N08n15r95J482J342
3215F76J146J744j033n001j134J297R86L799K014m034j982K275O3j103K74j835
3231a848r94L520K096n41j94j860k591o5K02J091L499N96l145l54J148j256M94
3248b02k35k934P60N311J359k150j083k745j021K599P11q75J207M15NJ003j384
3265G41k186P26m01j921K621L906n17j169j496m255K52M593N85j915l06L67J290
3282I15K286k047l597k52L09Q41L538R17j332M55j887l972J183L785m4n38K83
3299H43j548J105L171j958m161j071Q70L115L221q62k715J99q14j784J125M72
3315g92j32K395J60k142Q06K098l065j971K47L8L235L530j653l666k67N60O76
$$ plain form
3332 57 545 -1491 -2390 975 2749 1993 1829 -2 -3135 -2236 -761 -1105 1358 4077 1217 -1246 -1503
3349 -1503 -1362 -75 857 -1633 -3044 168 2691 3469 2145 -2424 -5053 -1487 480 635 2255 2373
3365 2373 -75 26 249 -1593 -595 744 -1098 -1210 1106 2289 3034 1907 -2709 -4595 -1527 827
3381 827 1720 2144 -35 -1213 887 729 -1872 -1651 -1281 -1538 990 2516 925 873 793 -2174 -3149 -706
3399 -706 651 1664 2393 71 -512 1367 960 -1101 -1672 -2627 -839 3648 3856 481 -524 -1107 -2801
3416 -2801 -1201 868 -168 328 1074 38 -18 799 -496 -1590 -2216 -2805 -300 4286 3440 198 -1227
3433 -1227 -2554 -2363 1213 1880 -358 91 1070 939 1491 1275 -1614 -2171 -1505 -1196 1457 4066 2076
3450 2076 -256 -1233 -2880 -2170 1067 879 -831 369 743 665 1537 41 -3114 -2374 -879 -179 2112
$$ packed form
3332E7M88k036q99L365J774p56j64j831l133Q99J475l44K463K719k860k463k57
3349a503J41J287R32k490j411L212K523P78j324m569k629L566J967J55J620J18
3365B373k448J01K23j842R98J339j842j12K316J183P45j127m616j886L068K354
3381H27Q93M24k179j178K100j58k601K21L70k57K528J526j591n2q0k967r75K443
3399g06J357J013P29k322n83J879m07k061n71r55J788M487K08l375j005n83j694
3416b801J600K069j036M96P46j036n6Q17j295j094o26n89K505M586q46l242j425
3433a227j327J91L576O67k238M49R79j31N52k16k889n57O66L09K653K609j990
3450B076k332r77j647P10L237j88j710J200L74p8Q72j496l155P40J495P00K291
$$ plain form
3467 2112 3245 387 -815 -128 -1566 -1215 393 -60 146 1801 1614 1204 1345 -1361 -3320 -1182 223
3484 223 1014 3095 1953 -1327 -1128 -15 -952 -715 -428 -1777 -340 2339 1917 1190 -92 -3264 -3583
3501 -3583 -370 962 1891 3010 614 -1789 -556 -61 -581 176 -321 -1369 595 2460 2239 1513 -704
3518 -704 -4227 -2811 683 1437 1741 2177 -347 -1255 -29 -407 -1475 -644 -861 -584 1700 1727 529 248
3536 248 -1622 -3565 -1306 1266 1080 1621 1489 -742 -286 1313 -328 -2123 -1519 -678 1777 3858 1749
3553 1749 -708 -978 -2085 -1831 598 1044 305 1007 855 -621 130 439 -1317 -2138 -1784 -1177 2382 4220
3571 4220 1332 -1505 -2328 -2819 -684 1956 857 -703 947 1347 613 846 -431 -2171 -998 -387
3587 -387 -19 2912 3429 496 -1414 -1973 -2755 -176 2392 493 -1000 462 1123 1147 500 -2439 -3316
$$ packed form
3467B112J133k858j202O87j438L51J608m53K06J655j87m10J41k706j959K138J405
3484B23P91K081j142l280J99J113r37K37K87j349J437K679m22p27j282l172l19
3501c583L213J332R29J119k396k403J233M95n20P57m97j048J964J865k21p26k217
3518g04l523J416L494P54L04M36k524r08J226l78j068Q31k17K77K284K7j198k81
3536B48j870j943K259K572j86N41j32k231M56J599j641j795O04Q41K455K081k109
3553A749k457k70j107K54K429M46p39P02j52j476P51L09j756q21L54O07L559J838
3571D220k888k837q23m91K135K640j099j560J650M00p34K33j277j740J173O11
3587c87L68K931N17k933j910n59p82K579K568j899j493J462O61K4o47k939q77
$$ plain form
3604 -3316 -992 427 1339 2599 1061 -1221 -634 -1078 -2358 39 1672 125 178 888 908 1209 339
3621 339 -2632 -2886 -180 1828 2808 2530 -782 -2101 59 -115 -1498 -599 -421 -189 1918 2041 143
3638 143 -627 -1084 -3240 -2147 397 1608 2712 1910 -1708 -2199 267 422 -264 -599 -1460 -70 3131
3655 3131 2875 166 -836 -2369 -2450 371 1663 1142 1978 1480 -1388 -1810 -286 -428 -88 -105 -1416 69
3673 69 2604 2132 -54 -1784 -3638 -2037 1566 1592 375 1284 702 -706 -306 -450 -1780 -694 670
3690 670 612 1417 2281 1011 -116 -1516 -2989 -699 2431 1572 450 482 -417 -257 1003 -753 -3283
3707 -3283 -1560 528 1588 2611 1298 -1301 -1670 -1641 -1858 -202 1658 951 455 355 -634 237 1267
3724 1267 -1112 -2850 -1113 609 2473 4006 1099 -2505 -2068 -1006 -662 1011 1222 147 558 906
$$ packed form
3604c316K324J419R12J260j538k282N87m44j280K397J633j547N3P10K0L01q70
3621C39k971k54K706K008R80k78l312j319K160j74j383Q99J78K32K107J23j898
3638A43p70m57k156J093K544J211J104q02l618m91K466J55o86l35q61J390L201
3655C131k56k709j002j533q1K821J292n21Q36m98k868m22J524j42L40j7j311J485
3673F9K535m72k186j730j854J601L603K6j217R09n82j408M00j44j330J086J364
3690F70n8Q05Q64j270j127j400j473K290L130q59j122L2q99J60J260j756k530
3707c283J723K088J060J023j313k599l69K9k17J656J860p07m96j00r89Q71J030
3724A267k379j738J737J722J864J533k907l604M37J062L44J673K11j075M11L48
$$ plain form
3740 906 -184 -171 -464 -1918 -1808 -309 364 2175 2888 -473 -2480 -1628 -1155 -367 1232 518 -664 917
3758 917 1893 291 -634 -1336 -1766 -307 1442 1624 2146 1469 -1189 -1261 -512 -1127 -121 1336 -82 -281
3776 -281 1612 1387 -201 -1027 -2432 -2847 388 2333 1842 1213 -160 -1662 -924 51 -813 -205 217 -350
3794 -350 1120 2326 950 -669 -1025 -2632 -1874 1583 2866 1638 1059 -672 -1847 -429 556 -383
3810 -383 -401 -248 -30 1797 2239 -425 -1404 -1997 -2766 -277 2003 1393 659 853 -900 -1629 41 -186
3828 -186 -1197 -89 348 767 2056 1465 -861 -1405 -1925 -1427 1184 2219 590 570 602 -846 -373 78
3846 78 -1577 -1826 485 1108 1501 1909 -123 -2115 -1955 -1565 -678 1543 1511 164 117 -40 -579 378 -74
3865 -74 -2295 -1481 1118 1813 2599 2258 -1248 -2806 -1059 -211 494 1803 1140 90 514 191 -683 -24
$$ packed form
3740I06j090J3k93j454J10J499O73J811P13l361k007Q52M73P88J599p14j182J581
3758I17R76j602r25p02m30J459J749J82N22o77k658p2P49o15J006J457j418j99
3776b81J893k25j588q26j405m15L235J945m91o29j373j502P38R75q64O08M22n67
3794c50J470J206j376j619l56j607P58L457J283j228n79j731j175J418R85r39
3810c83j8J53K18J827M42k664r79n93p69K489K280o10p34J94j753p29J670k27
3828a86j011J108M37M19J289n91k326n44n20M98K611J035j629k0L2j448M73M51
3846G8j655k49K311O23L93M08k032j992J60L90Q87K221l2j347m7j57n39R57m52
3865g4k221Q14K599O95P86l41l506j558J747Q48P05J309o63j050M24l23q74O59
$$ plain form
3883 -24 -996 -1961 -740 776 1193 2634 1171 -2663 -2894 -797 -217 621 1438 47 -223 1236 702 -798
3901 -798 -1166 -1586 -1176 1019 1930 1587 1747 13 -1754 -1316 -426 -408 1241 1306 -459 435 1995 310
3919 310 -1262 -1825 -2231 -661 2308 2109 512 -279 -1213 -1434 -182 -675 -728 443 688 -22 1349 1367
3937 1367 -600 -922 -1549 -2313 25 3202 2333 692 -390 -1881 -1086 851 128 -633 10 655 1038
3954 1038 1871 127 -1684 -1143 -1784 -1805 850 2180 1038 793 -411 -2529 -1326 955 -60 -587 163
3971 163 493 1370 2043 -345 -2256 -1550 -773 351 2171 1326 386 981 -12 -1327 -479 147 -941 -24
3989 -24 982 615 1568 1682 -1227 -2965 -1713 -549 1535 2115 35 -792 99 -50 -514 -242 -1370 -1567
4007 -1567 708 1990 1222 1413 469 -2213 -2214 -839 8 1815 2349 342 -961 84 293 221 -243 -2104
$$ packed form
3883b4r72r65J221J516M17J441j463l834k31K097N80Q38Q17j391k70J459n34j500
3901g98l68m20M10K195R11l43J60j734j767M38Q90J8J649O5j765Q94J560j685
3919C10j572n63m06J570K969j99j597p91r34k21J252m93n3J171K45p10J371J8
3937A367j967l22o27p64K338L177q69j641j082j491P95J937p23p61O43O45L83
3954A038Q33j744j811N41o41k1K655J330j142k45j204k118J203K281j015n27P50
3971A63L30Q77O73k388j911P06P77J124J820q45r40N95r93j315Q48O26j088R17
3989b4J006l67R53J14k909j738J252J164K084N80k080q27Q91j49m64K72j128j97
4007a567K275J282p68J91r44k682jJ375Q47J807N34k007j303J045K09p2m64j861
$$ plain form
4025 -2104 -1729 1374 2256 1458 780 -1244 -2696 -919 -27 -310 1211 1482 -281 -145 171 -614 -433 -561
4043 -561 -1546 -597 1606 2114 1337 303 -1963 -1979 101 448 185 1313 628 119 1203 841 -1391 -1262
4061 -1262 -584 -880 440 1945 1390 486 -676 -2274 -1657 102 124 264 499 -309 220 1949 119 -2104
4079 -2104 -1620 -1340 -111 2234 2539 549 -151 -576 -1556 -463 643 207 214 673 366 574 1279 -579
4097 -579 -2229 -1564 -1358 567 2678 1774 -470 -601 -1160 -1596 291 41 -969 72 1048 664 1020 745
4115 745 -1315 -1772 -962 -401 1257 2497 1150 -216 -121 -1160 -854 730 -30 -775 886 1505 930 1015
4133 1015 -404 -2409 -1765 -251 535 1367 1517 -317 -398 -129 -1238 -697 -78 -984 -670 1378 1569 755
4151 755 589 -1198 -2672 -1123 510 1138 2011 782 -877 -42 599 -222 -383 -398 -1402 161 2283
$$ packed form
4025b104L75L103Q82p98o78k024j452J777Q92k83J521K71j763J36L16p85J81j28
4043e61r85R49K203N08p77j034k266j6K080L47k63J128o85n09J084l62k232J29
4061a262O78k96J320J505n55r04j162j598O17J759K2J40K35q08N29J729j830k223
4079b104M84K80J229K345L05j990p00m25r80J093J106m36PM59l07K08P05j858
4097e79j650O65K06J925K111r04k244j31n59m36J887k50j010J041R76l84L56k75
4115G45k060m57Q10N61J658J240j347j366R5j039L06J584p60p45J661O19n75Q5
4133A015j419k005O44J514P86Q32J50j834q1K69j109N41O19r06L14K048J91q14
4151G55j66j787j474J549J633O28Q73j229j659Q35O41q21j61j5j004J563K122
$$ plain form
4168 2283 1690 829 -96 -2204 -2281 -332 483 941 1781 61 -1322 -33 101 -972 -310 -577 -1055 714
4186 714 2107 1347 334 -852 -2272 -990 608 425 704 1166 291 133 809 -538 -1633 -274 -180
4203 -180 -29 1708 1954 326 -292 -1562 -2084 -389 771 134 428 306 -275 961 990 -1437 -2326 -870
4221 -870 -220 1004 2339 1126 -527 -717 -1262 -1042 355 741 414 906 487 -142 1127 1110 -1409 -1742
4239 -1742 -983 160 1815 2593 438 -1314 -972 -1494 -674 556 122 -217 1093 621 -240 452 -469 -1944
4257 -1944 -1356 -353 265 1905 2019 -215 -1074 -925 -997 115 808 -645 -219 1742 1399 265 128 -1533
4275 -1533 -1903 -154 762 860 1613 911 -699 -605 -847 -1202 133 60 -988 95 1683 969 493 -633
4293 -633 -2427 -1892 718 1540 1503 1197 -35 -627 403 -239 -1034 28 13 -384 1322 1673 534 10
$$ packed form
4168B283n93q61r25k108p7J949Q15M58Q40j720j383J289J34j073O62k67m78J769
4186G14J393p60j013j186j420J282J598j83K79M62q75j58O76j347j095J359R4
4203a80J51J737K46j628o18j270n22J695J160o37K94j22n81J236K9k427q89J456
4221h70O50J224J335j213j653j90n45K20J397L86l27M92m19o29J269j7k519l33
4239a742P59J143J655P78k155j752L42n22Q20J230m34l39J310m72q61O92r21j475
4257a944N88J003O18J640J14k234q59J49p2J112O93j453M26J961l43j134j37j661
4275a533l70J749R16R8P53p02j610R4k42l55J335p3j048J083J588p14m76j126
4293f33j794N35K610Q22l7l06j232n92J030o42p95J062j5l97J706L51j139n24
$$ plain form
4311 10 -887 -2472 -1402 911 1257 1374 446 -1169 -609 551 -447 -1232 -497 -500 225 1880 1520 -326 -648
4330 -648 -1215 -1615 -336 1033 966 1448 898 -915 -466 490 -530 -837 -55 -501 755 2489 912 -941
4348 -941 -1098 -1395 -858 629 651 145 968 553 -199 -189 -598 -1712 -746 183 26 1447 2022 276 -1049
4367 -1049 -1219 -1616 87 1497 564 -198 647 612 434 636 -907 -2186 -459 461 906 1943 1350 -512
4385 -512 -953 -1238 -1311 495 1096 -63 -128 509 -170 219 334 -1591 -2403 -257 728 1121 1949 318 -1474
4404 -1474 -916 -815 -439 525 770 50 877 1157 -6 113 -67 -1520 -1143 506 975 1459 1410 -549 -1416
4423 -1416 -558 -355 -490 266 -29 -297 1478 1125 -366 -629 -1213 -1779 -312 1114 1039 1293 618 -950
4441 -950 -854 62 -328 -418 433 -225 116 1959 1383 -329 -902 -1623 -1689 682 1831 920 649 -133 -1057 -234
$$ packed form
4311A0q97j585J070K313L46J17r28j615N60J160r98p85P35lP25J655l60j846l22
4330f48n67m00J279J369o7M82n50j813M49R56j020l07P82m46J256J734j577j853
4348i41j57k97N37J487K2n06Q23m15p52J0m09j114R66R29j57J421N75j746j325
4367a049j70l97J703J410r33p62Q45l5j78K02j543j279J727R20M45J037n93j862
4385e12m41k85p3J806O01j159o5O37o79L89J15j925q12K146R85L93Q28j631j792
4404a474N58J01L76R64K45p20Q27K80j163J19j80j453L77J649M69M84m9j959q67
4423a416Q58K03j35P56k95k68J775l53j491k63n84n66J467J426p5K54o75j568
4441i50R6R16l90r0Q51o58L41J843n76j712n73p21o6K371J149r11k71p82r24Q23
$$ plain form
4461 -234 142 -1059 -477 223 -552 908 1781 532 -1004 -981 -1661 -966 1195 1447 862 624 -275 -1038 96
4480 96 -52 -1040 -158 290 361 1698 1607 -435 -1193 -889 -1174 -171 1401 710 81 532 -132 -606 -324 -753
4500 -753 -1395 -199 446 495 1790 586 -1230 -1416 -1007 -884 885 1219 -277 195 806 -9 -301 101
4518 101 -1472 -1152 596 1192 1202 1669 -2 -1556 -1194 -747 -186 1274 841 -253 400 521 -134 108
4536 108 -566 -2190 -1046 1016 1289 1316 972 -893 -1751 -893 -522 -81 835 387 -18 648 494 -358 -108
4555 -108 -744 -1554 -6 1314 1297 1274 370 -1614 -1269 5 -293 -13 372 19 408 1107 346 -988 -957
4574 -957 -1559 -1172 676 1350 697 877 -234 -1584 -499 300 -349 167 199 -18 1159 1742 28 -1145
4592 -1145 -1274 -1321 -6 1728 1244 433 402 -579 -968 70 -164 -593 302 162 -107 1144 1335 -741 -1211
$$ packed form
4461b34L76j201N82P00p75J460Q73j249j536K3o80O95K161K52n85k38q99p63J134
4480I6j48r88Q82M48P1J337r1k042p58L04k85J003J572o91o29M51o64m74K82m29
4500g53o42J196O45M9J295j204j816j86M09J23J769L34j496M72O11q15k92M02
4518A01j573L20J748N96J0M67j671j554L62M47N61J460m33j094O53J21o55K42
4536A08o74j624J144K062K73K7l44j865q58Q58L71M41R16m48m05O66j54q52K50
4555a08o36q10J548J320j7k3r04j984L45J274k98K80L85l53L89O99p61j334L1
4574i57o02L87J848O74o53J80j111j350J085P99o49N16L2k17J177N83j714j173
4592a145j29m7J315J734m84q11l1r81l89J038k34m29Q95j40k69J251J91k076m70
$$ plain form
4611 -1211 -1431 -1336 373 1955 847 95 -82 -865 -414 180 -562 -650 563 611 622 1363 307 -1128 -731
4630 -731 -870 -753 1056 1799 474 -20 -126 -798 -153 85 -907 -815 470 823 1360 1020 -1021 -1700 -582
4649 -582 -630 -108 1215 935 101 449 40 -892 -182 5 -1182 -411 968 1353 1449 758 -1253 -1687 -385
4668 -385 1 717 1177 -133 -468 915 101 -499 -212 -893 -1408 541 1311 853 1034 58 -1756 -1387 -280
4687 -280 36 928 919 -245 -64 858 142 -499 -465 -1266 -742 1538 1472 616 719 -362 -1565 -622 -81 33
4707 33 740 870 -104 267 709 -273 -642 -913 -1425 -238 1740 1082 365 -1 -1213 -1311 161 42 -631
4726 -631 447 492 285 1150 520 -1249 -992 -600 -598 978 1786 975 421 -237 -1195 -598 680 -76 -452 402
4746 402 268 578 1350 -155 -1541 -1190 -604 -323 1122 1525 317 -385 -605 -824 -274 135 -241 -29 740
$$ packed form
4611a211k20R5J709J582j108p52j77p83M51N94p42q8J213M8J1P41j056j435L97
4630g31j39J17J809P43j325m94j06o72O45K38r92R2J285L53N37l40k041o79J118
4649e82m8N22J323k80q34L48m09r32P10J87j187P71J379L85R6o91k011m34J302
4668c85L86P16M60j310l35J383q14o00K87o81n15J949P70m58J81r76j814L69J107
4687b80L16Q92rj164J81R22p16o41L4q01N24K280o6q56J03j081j203R43N41J14
4707C3P07J30r74L71M42r82l69k71n12J187J978o58p17l66j212r8J472j19o73
4726f31J078M5k07Q65o30j769K57L92KJ576Q08q11n54o58r58N97J278p56l76Q54
4746D02j34L10P72j505j386L51N86K81J445M03j208p02k20k19N50M09l76K12P69
$$ plain form
4765 740 354 847 1089 -590 -1710 -595 -348 310 1816 979 5 82 -275 -624 -25 -264 -540 260 921
4784 921 612 850 82 -1436 -1339 -363 -496 669 1460 273 -638 16 -307 -477 -130 -699 -695 771 1388 752
4804 752 834 -586 -1785 -906 221 511 1081 981 -159 3 350 -390 -576 -377 -1099 -319 1202 1050 558
4823 558 179 -1257 -1877 -446 448 471 733 332 -625 191 209 -573 -472 -625 -916 551 1857 719 420
4842 420 187 -1192 -1274 -42 711 396 1055 551 -116 469 341 -568 -734 -780 -541 1189 1722 534 -336
4861 -336 -754 -1361 -504 423 -160 -76 796 501 378 556 -431 -1243 -690 -509 78 1604 1519 23 -281 -722
4881 -722 -974 98 638 -337 -112 542 474 697 408 -994 -1562 -490 -178 510 1722 594 -561 -446
4899 -446 -712 -1018 24 492 -327 181 297 216 904 139 -1598 -1025 -31 127 1320 1540 22 -465 -2
$$ packed form
4765G40l86M93K42j679j120J115K47O58J506q37r74P7l57l49N99k39k76Q00O61
4784I21l09K38p68j518R7R76j33J165P91j187r11O54l23j70L47n69MJ466O17o36
4804G52Q2j420j199Q79J127K90N70j00j140J62L47p40j86J99p22P80J521j52m92
4823E58l79j436o20J431Q94K3K62m01r57Q16J8p82J01j53k91J467J306j138k99
4842D20k33j379q2J232P53l15O59n04o67N85j28r09j66m6K39J730N33j188q70
4861c36m18o07Q57R27n83Q4Q72k95j23J78r87q12N53J81N87J526q5j496l04m41
4881g22k52J072N40r75K25O54o8K23k89j402n68J072L12O88J212j128j155J15
4899d46k66l06J042M68q19N08J16q1O88p65j737N73R94J58J193K20j518m87M63
$$ plain form
4918 -2 -514 -565 179 -22 22 894 621 335 301 -689 -1566 -647 61 281 1194 1056 -778 -626 -284 -533 -443 -470
4940 -470 -560 246 1278 909 249 -171 -1288 -1288 101 489 589 1076 665 -411 -237 -92 -445 -225 -510 -734
4960 -734 597 1393 917 29 -466 -1715 -1122 450 662 479 668 -111 -365 105 -280 -698 -342 -441 -265
4979 -265 1191 1322 447 86 -875 -1804 -358 1197 706 507 447 -83 108 485 -411 -959 -461 -328 173
4998 173 1369 705 -332 -531 -1042 -1467 123 739 248 334 436 -321 204 58 -944 -929 -246 -33 975
5017 975 1716 208 -800 -382 -588 -612 388 330 14 623 635 128 159 -541 -1161 -680 -114 212 1311 1303 -166
5038 -166 -1156 -705 -556 -133 301 -87 -275 503 489 182 259 -803 -1446 -448 186 432 1432 922 -768 -861
5058 -861 -477 -641 281 620 -91 136 595 586 273 -164 -1228 -1315 75 522 770 1025 237 -863 -483 -312
$$ packed form
4918bn12n1P44k01M4Q72k73k86l4r90q77R19P08K20R13j38j834J52L42k49R0k7
4940d70r0Q06J032l69o60m20j117%J389L88J00M87m11j076J74J45l53K20k85k24
4960g34J331P96m76q88m95j249N93J572K12j83J89p79k54M70l85m18L56r9J76
4979b65J456J31q75l61r61r29J446J555m91j99o0n30J91L77q96n48M98J33N01
4998A73J196o64j037j99n11m25J590O16m91Q6J02p57N25j46j002J5O83K13J008
5017I75P41j508j008M18k06k4J000n8l16O09J2n07L1p00o20M81N66L26J099qj469
5038a66r90M51J49M23M34l88j88P78j4l07P7j062o43R98O34K46J000n10j690r3
5058h61L84j64R22L39p11K27M59rl13m37j064q7J390M47K48K55p88j100L80J71
$$ plain form
5078 -312 -914 -72 91 -209 637 729 201 -66 -620 -1304 -734 687 895 747 625 -114 -729 331 -32 -501
5098 -501 -214 -20 147 1420 1054 -147 -329 -1115 -1269 -68 959 518 589 404 -623 -581 228 -375 -524
5117 -524 -186 -338 383 1276 845 -342 -818 -1398 -856 614 1091 384 494 281 -333 -10 265 -779 -700
5136 -700 -53 72 849 1251 85 -757 -767 -1122 -210 736 608 16 320 79 -233 197 -379 -1409 -462 391
5156 391 487 1117 687 -622 -894 -423 -412 -23 860 305 187 719 95 10 309 -835 -1030 -213 463 835
5176 835 1033 422 -983 -925 -397 -162 262 413 -435 205 621 153 -95 -451 -1111 -859 244 653 1009 1219
5196 1219 -133 -1062 -568 -288 -151 575 373 -96 495 779 218 -89 -596 -1055 -372 841 845 773 585 -720
5216 -720 -739 -348 -364 -66 518 97 -50 626 532 -139 -433 -925 -1261 127 1059 749 526 303 -843 -473
$$ packed form
5078c12o02Q42J63l00Q46R2n28k67n54o84N70J421K08j48j22p39o15J060l63m69
5098e01K87J94J67J273l66j201j82p86j54J201J027m41P1j85j027M2Q09o03j49
5117e24L38j52P21Q93m31j187m76n80N42J470M77p07J10k13o14L23K75j044P9
5136g00O47J25P77M02j166q42j0l55R12R46j28n92L04k41l12M30n76j030R47Q53
5156C91R6O30m30j309k72M71J1L89Q83n55j18N32o24q5K99j144j95Q17O76L72
5176H35J98o11j405N8N28K35M24J51q48O40M16m68k48l56o60K52J103M09L56K10
5196A219j352r29M94K80J37P26k02m69N91K84n61l07n07m59O83J213Mp2j88j305
5216g20j9L91j6K98N84m21j47O76r4o71k94m92l36J388R32l10k23k23j146L70
$$ plain form
5236 -473 212 -286 -408 311 348 805 1056 211 -708 -646 -950 -517 730 982 484 442 -260 -965 -99 145 -672
5257 -672 -355 -71 -44 1097 1011 -236 -912 -872 -910 -38 1013 728 96 339 -221 -551 133 -170 -574 32
5277 32 222 427 1245 771 -446 -1000 -795 -737 440 1121 88 69 149 -240 -391 -69 -728 -788 178 476 347
5298 347 855 157 -716 -667 -508 -327 762 1024 59 206 99 5 -77 -39 -956 -354 653 796 793 635 -587
5319 -587 -950 -624 -180 -84 573 387 -93 50 399 -292 -242 -572 -1228 -189 786 775 802 24 -818 -1006 35
5340 35 73 144 705 107 -36 543 301 -387 -348 -822 -858 466 909 599 587 6 -1021 -706 -155 -121 205 319
5362 319 -158 251 761 -2 -721 -588 -876 -501 853 984 91 213 -342 -999 -277 -87 -356 252 321 40
5382 40 542 583 -126 -685 -676 -546 284 1232 487 -67 24 -203 -555 100 23 -370 158 407 501 868 145 -937
$$ packed form
5236d73O85m98j22P19L7M57K51q45r19O2l04M33J247K52m98m2p02p05Q66K44q17
5257f72L17K84K7J141q6j247o76M0l8Q72J051k85o32K43n60l30O84l03m04O06
5277C2J90K05Q18m74j217n54K05N8J177O81j033j9Q0l89j51L22o59o0R66K98j29
5298C47N08o98q73M9J59J81J089K62r65J47j07r4q2L8r17O02J007J43lj58j222
5319e87l63L26M44R6O57j86m80J43L49o91N0l30o56J039R75j1K7p78q42j88J041
5340C5L8P1N61n98j43N79k42o88L9m74l6J324M43l10j2n81j027L15N51L4L26J14
5362C19m77M09N10p63p19J33k88L75J354J31q93J22n55o57P22J90k69O08O9k81
5382D0N02M1p09n59RJ30Q30R48p45n54R1k27l52O55p7l93N28K49R4L67p23j082
$$ plain form
5404 -937 -869 -717 -501 666 1090 212 -153 -129 -603 -216 207 -257 -276 301 367 628 810 -327 -1027 -735 -350
5425 -350 60 829 811 2 67 -47 -528 -382 7 -421 -346 394 522 698 482 -720 -1150 -557 -226 213 1082
5446 1082 402 -212 109 217 -291 -415 -299 -509 365 956 554 660 373 -796 -691 41 33 410 664 31
5466 31 -197 367 29 -465 -326 -501 -462 607 942 608 88 -542 -1335 -637 10 120 450 497 -186 75 486
5487 486 -255 -498 -383 -459 -42 893 942 463 3 -706 -724 -30 181 92 330 458 -48 116 330 -661 -698 -469
5509 -469 -485 440 905 637 18 -229 -926 -639 184 150 -166 433 556 127 430 87 -859 -515 -322 58 984
5530 984 920 446 7 -78 -663 -279 205 -265 -214 561 173 151 526 -441 -1014 -626 -367 242 1021 673 -233
5551 -233 -261 -550 -588 123 242 -531 83 826 574 523 219 -697 -918 -130 -122 488 949 378 -198 -191 -424 -454 -19
$$ packed form
5404i37O8J52K16J167M24q78l65K4m74L87M23m64j9N77O6K61J82j137p00K92L85
5425c50M10P69j8q09O5j14m81J46L89m28P5P40J28J76k16j202m30N93L31M39Q69
5446A082o80o14L21J08n08j24J16k10Q74N91m02J06k87j169J05P32qL77K54o33
5466C1k28N64l38m94J39j75L9J069L35l34n20o30p93O98O47J10L30M7o83K61M11
5487D86p41k43J15p6M17R35M9m79m60p09j8O94K11q9K38J28n06J64K14r91l7K29
5509d69j6R25M65k68o19k47o97K87Q23l4l16N99J23m29L03l43r46L44J93L80R26
5530I84o4m74m39q5n85L84M84m70N1P75l88k2L75r67n73L88K59O09P79l48r06
5551b33k8k89l8P11J19p73O14P43k52n1l04r16k21P88QO10M61n71n76Pk33l0M35
$$ plain form
5574 -19 -168 -519 224 758 278 335 -123 -1074 -852 -61 226 519 703 143 -131 -72 -275 -573 -50 -40 -65 526
5596 526 632 501 489 -486 -1222 -207 294 291 913 484 -358 -42 435 -536 -767 -312 -504 159 872 872 0
5617 0 -285 -881 -899 2 -13 152 438 79 -423 17 198 -219 -235 -262 -388 600 1327 701 -22 -412 -761 -502
5639 -502 342 339 246 560 284 -120 538 -54 -609 -448 -349 -293 742 925 243 -118 -482 -726 -181 369 27
5660 27 106 554 130 41 297 -424 -843 -272 81 374 918 619 -238 -116 -497 -732 473 87 -114 292 318
5681 318 31 270 181 -996 -934 27 209 494 797 183 -534 -356 -478 -214 142 -4 -190 634 480 174
5701 174 286 -138 -971 -610 223 447 916 731 -105 -547 -278 -508 -120 228 -250 -66 755 617 87 -88
5721 -88 -515 -1163 -295 68 403 807 366 -609 -391 -279 -381 -126 183 -113 198 925 526 -74 -256 -892
$$ packed form
5574a9j49l51P43N34m80N7m58r51K22P91K87K93J84n60k74N9k03k98N23J0k5N91
5596E26J06j31j2r75p36J015N01lO22m29q42L16M77r71k31M55j92O63P13%q72
5617@k85n96j8R01j5J65K86l59n02M40J81m17j6k7j26R88P27o26p23l90l49K59
5639e02Q44lr3L14k76m04O58n92n55J61R9N6J035J83o82l61l64k44N45N50l42
5660B7P9M48m24q9K56p21m19N71L53K93N44k99q57J22l81k35J205l86k01M06K6
5681C18k87K39q9j177O2R61J82K85L03o14p17J78j22K64L56j46j86Q24j54l06
5701A74J12m24q33L61Q33K24M69j85q36m42K69k30L88L48m78J84Q21j38n30j75
5721h8m27o48Q68L63L35M04m41r75K18J12j02K55L09k96L11P27l99o00j82o36
$$ plain form
5741 -892 -857 265 347 502 732 58 -385 91 -113 -752 -240 58 -164 345 918 104 -414 -473 -864 -254 503
5762 503 284 382 314 -136 -316 461 -197 -635 -280 -179 64 832 594 158 -410 -845 -777 50 681 425 357
5783 357 382 -295 -24 209 -313 -540 -217 -143 589 1159 545 -531 -611 -648 -537 65 330 -66 260 214 -202
5804 -202 -33 173 -888 -606 2 106 620 743 178 -622 -401 -440 -192 526 142 -110 505 195 -32 -40 -507
5825 -507 -1066 -372 284 248 800 550 -483 -435 -428 -337 -38 294 -37 34 528 86 -227 55 -607 -1015 -19 398
5847 398 487 684 260 -573 -539 28 -259 204 113 -224 218 636 91 5 -291 -707 -928 186 345 491 611
5868 611 -251 -739 -167 -259 -406 298 116 -176 503 624 -98 -155 -521 -791 7 475 348 682 473 -294 -536
5889 -536 -86 -326 -217 238 49 31 560 458 -348 -323 -613 -628 68 522 160 260 222 -480 -230 0 -550
$$ packed form
5741h92L5J122Q2J55K30o74m43M76k04o39N12K98k22N09N73q14n18n9l91O10P57
5762E03k19R8o8m50j80P77o58m38L55J01K43P68k38m36n68m35O8Q27O31k56o8
5783C57K5o77K71K33n22k27L23P4P32N70o14j076q0l7J11O02K65l96L26m6m16
5804b02J69K06j061K82O08J04N14J23n65q00K21l9K48P18l84k52O15l10k27qm67
5825e07n59O94O56l6N52k50j033M8PR1K99L32l31P1M94m42l13K82o62m08R96M17
5847C98Q9J97m24q33L4N67k87M63r1l37M42M18n45q6k96m16k21J114J59J46J20
5868F11q62m88N72r2j47P04j82k92O79J21p22n7l66k70P98M68j27L34k09p67k42
5889e36M50k40J09M55j89j8N29j02q06K5k90j5O96M54l62J00l8p02K50K30n50
$$ plain form
5910 -550 -387 33 -36 269 726 181 -547 -531 -593 -454 620 679 237 319 95 -349 23 -126 -531 -280 281
5931 281 92 467 790 -264 -771 -603 -455 90 540 468 -35 123 -155 -403 64 -194 -723 -216 191 327
5951 327 933 385 -441 -497 -282 -473 233 463 89 109 328 -31 -273 22 -435 -703 226 451 435 912 35
5972 35 -797 -473 -181 -300 208 320 133 126 307 -92 -107 -374 -990 -360 474 610 608 357 -186 -866 -228 55
5994 55 186 419 301 -120 269 465 -138 -218 -484 -851 72 572 681 527 69 -536 -559 27 -160 -29 164
6015 164 106 217 571 124 -335 -253 -635 -594 309 586 349 423 36 -464 -338 95 -247 -70 320 79 388
6036 388 620 -57 -631 -402 -592 -360 547 474 -16 -10 -293 -541 -160 -125 -349 -2 327 155 594 534 -300 -674
6058 -674 -605 -219 220 968 316 -8 280 -240 -241 38 -259 -589 -27 559 449 620 227 -744 -479 -448 -374 346
$$ packed form
5910e50J63M20o9L05M57n45p28J6o2J39J074N9m42Q2k24m44L72j49m05K51N61
5931B81j89L75L23j054n07J68J48N45M50p2n03J58k78k48M67k58n29N07M07J36
5951C27O06n48q26n6K15j91P06K30l74K0K19l59k42K95m57k68R29K25j6M77q77
5972C5q32L24K92j19N08J12j87pJ81l99j5k67o16O30Q34J36kk51n43o80O38K83
5994E5J31K33j18m21L89J96o03q0k66l67R23N00J09j54m58o05k3N86j87J31J93
6015A64n8J11L54m47m59Q2l82M1R03K77k37P4l87n00J26M33l42J77L90k41L09
6036C88K32o77n74K29j90K32R07p3m90Ok83k48L81L5k24L47L29j72M39o0q34l74
6058f74O9L86M39P48o52l24K88n20jK79k97l30N62N86j10J71l93r71K65L1P4P20
$$ plain form
6080 346 760 137 -88 -109 -319 -296 -233 -416 -399 67 334 257 426 -223 -641 -520 -153 -47 445 462 131 297
6102 297 288 -348 -160 -19 -382 -15 450 404 322 469 -478 -828 -290 -36 178 299 49 -173 151 -25 -387
6123 -387 -258 -517 -641 102 447 396 493 134 -710 -609 15 58 112 439 208 -48 342 -34 -429 -389 -476 -308
6145 -308 579 782 365 238 -355 -774 -180 -128 -26 -1 459 -137 169 558 -143 -389 -105 -453 -99 726 728
6166 728 106 -6 -306 -654 144 43 -164 132 320 129 334 347 -368 -555 -482 -220 24 813 311 -195 -65
6187 -65 -409 -360 -82 -28 -68 164 228 185 431 53 -886 -519 -260 -248 527 1006 -51 -80 -1 -501 -130 178 -104
6210 -104 149 320 110 354 431 -124 -670 -252 -229 153 666 471 -76 -51 -90 -334 0 -57 -318 -97 215 259
6232 259 275 217 -761 -779 -297 -114 387 707 112 19 250 -317 -384 25 -77 -488 252 835 314 117 -31 -710
$$ packed form
6080C46M14o23k25k1k10K3O3j83J7M66K67p7J69o49m18J21L67J06M92J7l31J66
6102B97ro36J88J41l63L67M65m6q2J47r47l50N38K54K14J21k50k22L24j76l62
6123c87J29k59j24P43L45n1R7l59q44J01O24M3N4L27k31k56L90l76l95M0q7J68
6145c08Q87K03m17j27n93m19N94N2J02K5M60n96L06L89p01k46K84l48L54Q25K
6166G28o22j12l00l48P98j01k07K96J88j91K05J3p15j87P3K62K44P89n02n06J30
6187f5l44M9K78N4m0K32O4m3K46l78r39L67K59J2P75M79j057k9P9n00L71L08k82
6210a04K53J71k10K44P7n55n46M18K3L82N13j95n47K5l9k44L34n7k61K21L12M4
6232B59J6n8r78j8M82J83N01L20n95r3K31n67o7M09j02m11P40N83n21j97j48o79
$$ plain form
6254 -710 -484 -10 75 368 395 -36 35 49 -319 -483 -22 -170 -234 537 283 5 73 -339 -737 -167 269 69
6276 69 235 262 -134 -85 272 -72 -352 -326 -462 198 770 527 91 87 -327 -614 -17 65 -25 269 76 -169 206
6299 206 149 -473 -431 -292 -203 336 727 391 -201 -112 -673 -341 185 153 -31 607 256 25 84 -1 -480 -126
6321 -126 39 -54 723 603 -70 -147 -270 -355 -53 31 -65 99 283 269 113 204 -515 -710 -221 62 281 752
6343 752 271 41 -201 -292 -496 -115 49 -245 136 534 110 449 222 -735 -555 45 195 585 728 180
6363 180 -170 -37 -200 -381 122 -141 -310 123 316 259 291 -86 -690 -566 -104 207 571 381 -105 -227 -94
6384 -94 -381 -298 58 -249 -166 480 480 148 276 -439 -721 -119 388 66 260 399 -287 -195 -118 -419 -157 -107 -228
6407 -228 -92 443 462 -216 -72 -676 -503 -17 141 120 146 20 -133 158 -16 -387 -304 5 -195 522 744
$$ packed form
6254g10K26M74Q5K93K7m31P1J4l68j64M61j48o4P71k54k78O8m12l98N70M36k00
6276F9J66K7l96M9L57l44k80K6j36O60N72k43m36mm14k87N97Q2r0K94j93k45L75
6299B06n7o22M2J39Q9N39L91l36n92Q9n61L32N26l2j84O38l51k31N9q5m79L54
6321a26J65r3P77j20o73p7j23q5L02Q4r6J64J84j4j56R1p19j95M89K83K19M71
6343G52m81k30k42r1k04L81J64k94L81L98m24L39k27r57J80O00J50L90J43n48
6363A80l50J33j63j81N03k63j69M33J93n7L2l77o04J24M62L11L64j90m86j22J33
6384i4k87Q3L56l07Q3O46%l32J28p15k82O02N07l22J94J39o86R2P7l01K62N0j21
6407b28J36N35J9o78J44o04J73M86J58k1K6j26j53K91j74l71Q3L09k00P17K22
$$ plain form
6428 744 86 -281 -271 -732 -442 761 214 149 243 50 -267 182 -189 -635 -6 -141 30 702 418 -92 -360
6449 -360 -429 -718 -59 385 213 361 166 0 -29 115 -339 -585 -74 44 233 598 306 -160 -67 -191 -409
6470 -409 -3 49 -105 305 377 184 48 -232 -648 -467 51 93 241 633 7 -456 -218 -178 -220 75 3 6 300
6493 300 375 45 104 -382 -545 -160 240 142 456 367 -110 -189 -171 -30 34 228 -88 147 335 343 -1 -15 -710
6516 -710 -665 -12 328 396 377 229 -425 -29 19 -133 86 -81 -269 -60 473 156 70 -296 -407 -519 314 446
6538 446 365 613 56 -297 -11 -63 -321 -89 -125 55 425 516 -226 -361 -443 -583 -185 238 292 377 254 -166
6560 -166 -104 29 -284 -381 -116 -12 260 467 561 -365 -406 -327 -500 36 459 415 294 186 -12 -13 14 -483 -452
6583 -452 294 127 525 680 15 -163 -373 -404 -91 271 318 122 213 -96 -110 23 -275 -467 -195 256 357
$$ packed form
6428G44o58l67J0m61K90J203n47o5R4j93l17M49l71m46O29j35J71O72k84n10k68
6449c60o9k89O59M44j72J48j95j66k9J44m54k46N11J18J89L65k92m66R3j24k18
6470d09M06N2j54M10P2j93j36k80m16J81N18M2J48L92o26m63K38M0m2K95p2LK94
6493C00P5l30N9m86j63L85M00r8L14q9m77p9J8J41O4J94l16K35J88Ql44j4o95
6516g10M5O53L40O8j9j48o54L96M8j52K19j67j88K09N33l17q6l66j11j12Q33J32
6538D46q1K48n57l53K86n2k58K32l6J80L70R1p42j35q2j40L98M23N4Q5j23m20
6560a66O2J33l13r7K65J04K72K07R4r26m1P9j73N36M23m4j21j08j98jK7m97L1
6583d52P46j67L98J55o65j78k10l1L13L62M7j96R1l09j4J33k98j92K72M51J01
$$ plain form
6604 357 512 504 -6 -359 -149 -275 -219 304 39 141 278 179 -108 -113 -319 -552 -248 128 344 587 343 -265
6626 -265 -270 -88 -153 52 372 -29 116 362 260 -218 -60 -289 -402 192 337 412 420 8 -478 -365 -41 -74
6648 -74 179 215 -56 255 436 153 -87 -326 -727 -266 288 452 334 169 -248 -366 -353 -45 -373 81 64
6669 64 183 412 262 2 -315 -246 -506 -60 513 257 242 11 -244 -234 -144 43 8 122 -143 41 351 255
6691 255 -254 -296 -246 -373 346 431 215 111 31 -260 -31 -43 -270 -155 205 168 358 681 -74 -249 -243 -372 -160
6714 -160 463 399 124 205 20 -174 -111 -100 -401 10 75 0 353 339 -205 -762 -42 -398 -72 493 256 -195
6736 -195 110 -81 -311 -40 -217 -476 -48 208 277 559 247 -366 -420 -255 -322 142 390 25 -33 70 -171
6757 -171 -34 -136 -469 -228 85 470 401 282 -181 -360 -205 -159 -133 305 302 -125 379 80 -44 -282 -217 -513
$$ packed form
6604C57J55qn10l53K10j26N6N23k65J02J37r9k87nk06k33L04L76K16K43k44o08
6626b65nJ82o5K05L20m01J45K46j02m78J58k29j13N94J45P5Qm12m86J13L24l3
6648g4K53L6k71L11J81k83k40k39m01M61N54J64j18j65m17j18J3L08l28M54j7
6669F4J19K29j50k60l17O9k60M46N73k56j5k31k55J0R0J87l5J14k65J84L10r6
6691B55n09m2N0j27P19Q5k16j04q0k91K29j2k27J15L60l7J90L23p55j75Oj29K12
6714a60O23o4k75Q1j85j94O3J1l01M11O5p5L53j4n44n57P20l56L26N65k37m51
6736a95L05j91k30K71j77k59M28K56O9K82l12o13n4J65o7M64K48l65n8J03k41
6757a71J37j02l33K41L13L85o9j19m63j79J55M6K6M38lm27N04k99j24k38O5k96
$$ plain form
6779 -513 -401 450 285 202 136 -465 -395 77 45 -84 145 49 114 229 335 -257 -190 -220 -352 241 579 299 332
6802 332 -126 -467 -375 -60 -46 147 137 31 240 480 168 -493 -364 -421 -272 286 500 293 146 -17 -429
6823 -429 -37 135 -43 38 287 211 110 469 -69 -419 -311 -368 -72 457 247 41 205 -289 -331 -157 18
6844 18 -405 160 216 219 124 133 -88 -376 -182 -162 330 412 236 -61 152 -226 -112 197 -168 -144 88 342 283 412
6868 412 124 -361 -302 -83 -37 451 366 74 -32 -53 -250 -397 37 -336 -291 243 340 177 208 -291 -550 -195
6890 -195 -225 -9 332 159 -73 26 111 -252 -142 -186 -382 -111 619 242 88 203 -289 -415 -118 -23 57 283
6912 283 244 -160 -18 -18 -392 -56 -218 -169 373 459 223 308 98 -481 -304 52 16 12 156 13 91 201 -130
6935 -130 -287 -257 -255 56 534 487 195 -130 -255 -463 -154 52 -52 -34 117 37 47 102 -136 -349 -350 -336 84 584
$$ packed form
6779e13J12Q51j65q3o6o01P0M72l2j29K29r6O5J15J06n92O7l0j32N93L38k80L3
6802C32m58l41R2L15J4J93j0j06K09K40l12o61J29n7J49N58K14k07j47j63m12
6823d29L92J72j78Q1K49p6j01L59n38l50J08n7K96N29k10k06J64m94m2J74J75
6844A8m23N65N6Lr5Rk21k88J94K0M92Q2j76k97K13l78J14L09l65K4K32K54n9J29
6868D12k88m85N9K19M6M88q5k92j06k1j97j47M34l73M5N34R7j63L1m99k59L55
6890a95l0K16L41j73k32R9Q5l63J10m4j96K71P30l77j54J15m92j26K97R5Q0K26
6912B83l9m04J42%l74L36j62M9N42Q6k36Q5k10n79J77L56l6mJ44j43P8J10l31
6935a30j57L0KL11M78m7k92l25j25k08L09K06j04J8J51q0J0N5k38k13jJ4M20N00
$$ plain form
6959 584 336 34 245 -309 -510 29 31 59 -80 184 104 178 78 -176 -295 -255 67 305 547 72 -111 -56
6981 -56 -349 -381 -129 -56 -330 238 262 -68 170 -276 -299 -210 -13 117 362 502 -24 -44 -78 -229 12 12 -176
7004 -176 1 298 287 155 67 -422 -329 -130 -303 37 534 322 -41 -63 34 -297 -24 179 -111 210 434 179
7026 179 126 -49 -449 -554 -27 -2 65 312 57 -175 109 7 -266 94 -25 -238 187 398 183 306 -218
7047 -218 -665 -273 53 153 254 364 -392 -27 51 -163 -88 -176 -214 33 463 339 56 149 -409 -445 54 235
7069 235 227 365 337 -51 -4 225 -107 -271 -86 -253 220 552 275 -33 -75 -442 -209 69 17 27 197 205 -91
7092 -91 222 242 -393 -283 -220 109 304 356 135 -299 -209 -343 -239 146 113 -76 202 52 -23 244 -54 -563
7114 -563 -120 -158 70 224 198 -188 -228 -176 -448 6 231 43 -233 214 -25 -35 -12 -310 -329 -107 132 207 451
$$ packed form
6959E84k48l02K11n54k01N39KK8j39K64q0P4j00k54j19M0L22K38K42m75j83N5
6981e6k93l2K52P3k74N68K4l30K38m46k3Q9J97J30K45J40n26k0l4j51K41%j88
7004a76J77K97j1j32q8m89R3J99j73L40M97k12l63k2R7l31K73K03k90L21K24k55
7026A79n3j75m00j05N27K5O7K47k55k32K84j02k73L60j19k13M25K11k15J23n24
7047b18m47L92L26J00J01J10p56L65P8k14P5q8l8K47M30j24k83R3n58l6M99J81
7069B35qJ38k8l88M7K29l32j64J85j67M73L32k77l08m2l67K33K78n2J0J70Qk96
7092i1L13K0o35J10O3L29J95N2k21m34R0j34J04L85l3j89K78j50p5K67k98n09
7114e63M43l8K28J54k6l86m0N2k72M54K25j88k76M47k39j0K3k98j9K22K39P5K44
$$ plain form
7137 451 283 -179 -178 -124 -265 158 158 -185 245 401 142 135 -113 -427 -168 106 341 307 383 53 -278 61 -68
7160 -68 -171 -258 -186 -52 29 388 90 -200 -240 -635 -402 106 231 355 290 -127 -136 81 -39 -309 23 -185 80
7183 80 276 327 47 73 -281 -434 -76 185 79 431 188 -116 46 -167 -229 -529 117 -130 102 437 273
7204 273 155 -88 -549 -447 166 147 238 185 88 -327 126 29 -201 -118 2 155 310 318 -26 -311 -267 -277 -232 373
7228 373 251 130 346 57 -209 -100 -401 -323 12 -166 57 581 241 -272 -232 -395 -409 -6 169 -139 78
7249 78 367 59 -212 -208 -330 -136 -129 50 409 454 148 -141 -127 -211 -52 111 185 -133 161 225 -186 -99 56 -476
7273 -476 -336 165 33 207 346 -333 -269 -9 -231 -63 370 136 88 197 440 159 170 -243 -316 -65 147
7294 147 85 267 251 -156 -376 -162 -151 -86 48 -70 225 390 345 57 10 -434 -561 -50 304 153 91 -5 -128
$$ packed form
7137D51j68m62JN4j41M23%l43M30J56k59pk48l14K59K74K35l4P6l30l31L39j29
7160f8j03q7P2J34Q1L59k98k90m0l95K33N08J25J24o5m17rK17j20k70L32k08K65
7183H0J96N1k80K6l54j53L58K61j06L52k43l04J62k13o2l00O46k47K32L35j64
7204B73j18k43m61J02O13j9R1n3r7m15M53r7k30Q3J20J53J55Ql44k85M4j0M5O05
7228C73j22j21K16k89k66J09l01P8L35j78K23N24l40n13M0j63j4M03J75l08K17
7249G8K89l08k71Mj22J94PJ79L59M5l06k89J4q4J59J63P4l18K94O4m11Q7J55n32
7273d76J40N01j32J74J39o79O4K60k22J68M33k34m8J09K43k81J1m13p3K51K12
7294A47o2J82j6m07k20K14J1O5J34j18K95J65m5k88m7m44j27N11L54j51o2r6j23
$$ plain form
7317 -128 -54 79 -49 -20 40 3 176 486 -205 -233 -242 -515 -254 350 324 60 367 -185 -306 -123 70 -362 -53
7340 -53 -9 -138 381 335 -154 -138 -456 -487 20 323 199 96 203 -169 -278 -129 -217 -226 15 129 254 203 205 -211
7364 -211 -66 -230 -200 227 296 216 116 99 -121 -52 119 -222 -255 116 3 221 469 -34 -156 -210 -127 9 114
7387 114 116 376 103 25 -113 81 -66 -399 -109 149 237 448 298 -78 -347 15 21 136 284 46 -29 227
7409 227 2 -32 -89 -131 -405 107 267 263 194 117 -411 -183 -100 -235 -41 -3 19 0 112 -49 -353 -260 -244 -168 226
7434 226 233 492 169 -14 -286 -204 4 -223 45 224 -59 183 211 -107 -241 -218 -267 -250 398 272 66 167
7456 167 -192 -356 -57 -112 -265 193 258 76 502 256 -180 -362 -338 -354 87 358 313 123 32 -210 -242 88
7478 88 -111 -284 -106 46 90 445 -12 -120 -139 -326 -316 107 383 105 157 6 -240 -105 231 -188 -48 199
$$ packed form
7317a28P4J33j28K9O0l7J73L10o91k8rk73K61O04k6k64L07n52j21J83J93m32L09
7340e3M4j29N19m6m89J6l18l1N07L03j24j03J07l72j09J49q8rK41J14J25n1Km16
7364b11J45j64L0M27O9q0j00j7k20O9J71l41l3L71j13K18K48n03j22n4Q3J36J05
7387A14KK60k73p8j38J94j47l33K90K58Q8K11j50l76k69L62OJ15J48k38p5K56
7409B27k25l4n7m2k74N12J60mo9p7n28K28Q3j35J94L8K2j9J12j61l04R3J6P6L94
7434B26PK59l23j83k72Q2K08k27K68J79k83K42K8l18j34K3m9J7O48j26k06J01
7456A67l59j64K99n5j53M58O5j82M26k46m36j82K4j6M41K71m5j90r1k42l2L30
7478H8j99j73J78J52M4L55m57j08j9j87J0M23K76k78N2j51k46J35L36m19J40K47
$$ plain form
7500 199 187 334 364 100 -304 -148 -120 -72 382 239 56 178 108 27 -79 -10 -143 -30 325 229 288 293 -434 -304
7524 -304 -172 -232 49 192 -174 61 -6 51 -265 -12 -396 -137 25 371 107 386 9 -348 -249 -73 115
7545 115 112 114 -15 -5 150 -61 -65 -63 -203 -166 107 259 29 294 -206 -414 -412 49 -44 96 172 -55 154 170 -103
7570 -103 -187 -299 -202 25 349 346 165 -16 -98 -29 -59 -226 -94 135 205 -113 270 123 -305 -345 -107 -414 119
7593 119 269 124 31 57 -535 -286 -43 -168 -156 -26 57 -35 245 35 -537 -302 -249 29 450 401 49 54 -74
7616 -74 -208 -186 90 -97 -134 272 82 168 171 -200 -422 21 -133 19 262 343 30 -105 -167 -149 65 -150 2
7639 2 25 280 156 -38 42 -414 -115 -142 -149 362 238 91 -23 147 -91 -28 -18 -91 -222 33 271 129 159 -156
7663 -156 -268 -23 -97 35 204 252 25 -22 -71 -16 -177 14 -115 -324 285 334 168 31 -283 -354 -209 -64
$$ packed form
7500A99j2J47L0k64m04J56K8M8M54j43j83J22p0q1j06O9j33J13L55r6N9Np27J30
7524c04J32o0K81J43l66K35o7N7l16K53l84K59J62L46k64K79l77l57R9J76J88
7545A15lKj29J0J55k11mKj40L7K73J52k30K65n00k08KM61r3J40P6k27K09J6k73
7570a03q4j12R7K27L24lj81j81q2O9l0j67J32K29P0l18L83j47m28m0K38l07N33
7593A19J50j45r3K6n92K49K43j25J2J30Q3r2K80k10n72K35N3K78M21m9l52Nj28
7616g4j34K2K76j87l7M06j90Q6Ll71k22M43j54J52K43Q1l13j35o2J8K14k15J52
7639BK3K55j24j94Q0m56K99k7pN11j24j47j14J70k38O3J0p3j31K55K38j42L0l15
7663a56j12K45p4J32J69M8k27m7m9N5j61J91j29k09O09M9j66j37l14p1J45J45
$$ plain form
7685 -64 165 365 353 15 -178 -6 -138 -147 -38 -30 40 410 351 127 -54 -301 -492 24 -88 154 60 -145 -184
7708 -184 204 -71 -183 -151 -327 -189 88 335 102 -30 -93 -336 -336 127 13 170 295 -71 159 83 -32 -212
7730 -212 -216 -9 -8 175 186 66 60 -116 -500 -208 75 -87 188 127 -19 126 256 -257 -71 -239 -108 49 468
7753 468 264 -19 -116 -172 -323 39 83 -161 164 48 2 315 -148 -219 -169 -39 -10 284 302 -2 -108 -286 -257
7776 -257 -269 155 -147 -32 142 -18 244 -9 -30 -536 -207 127 75 256 378 19 -51 -101 -251 -15 -148 -29
7798 -29 174 431 144 -59 196 -166 -351 -226 212 89 250 219 -136 -10 93 -285 -284 -37 -310 180 375
7819 375 36 34 -101 -426 -321 156 138 344 215 -170 -10 32 -346 -360 -49 -165 -34 135 144 -25 158 -240
7841 -240 -300 -88 269 83 281 -59 -22 -60 -8 -188 2 212 -119 -154 244 153 101 -152 -266 -303 139 165 49
$$ packed form
7685f4K29K00j2l38j93J72j32rJ09QP0L70n9k24j81k47j91N16j12K42r4k05l9
7708a84L88k75j12L2j76J38K77K47k33j32o3k43%M63j14J57J25l66K30p6j15j80
7730b12mK07JJ83J1j20oj76l84K92K83j62K75o1j46J45J30n13J86j68J31J57M19
7753D68k04k83r7n6j51L62M4k44L25j16m6L13m63p1N0J30K9K94J8l04j06j78K9
7776b57j2M24l02J15J74j60K62k53k1n06L29L34n2J81J22l59p0n0j50K36j33J19
7798b9K03K57k87k03K55l62j85J25M38j23J61l1l55J26J03l78JK47k73M90J95
7819C75l39kj35l25J05M77j8K06j29l85J60M2l78j4L11j16J31J69Rj69J83l98
7841b40o0K12L57j86J98l40L7l8N2j80J90K10l31l5L98r1n2k53j14l7M42K6j16
$$ plain form
7864 49 202 136 22 130 -8 -108 -333 10 80 179 322 32 -176 -109 -348 -259 62 -9 46 54 135 11 -74 -95
7888 -95 -244 -163 -92 2 218 288 32 -108 -259 -128 -53 16 59 13 179 20 -18 118 -194 -395 -69 43 63 196
7912 196 272 -136 -174 -12 -279 11 109 -27 -82 222 45 14 -27 -286 -443 -54 87 198 231 178 -118 -100 -67
7935 -67 -228 -30 -19 30 204 306 21 117 -55 -198 -95 44 80 54 270 -101 -83 181 -129 -94 92 -1 -35
7958 -35 59 28 -41 -174 -201 -372 49 46 214 246 199 -98 -181 -25 -29 -115 -49 -129 119 514 226 -134 75 -128 -192
7983 -192 186 205 173 216 161 -134 160 -39 -146 -200 2 -90 24 308 3 -89 -27 -269 -162 257 76 129 227
8006 227 -193 -189 87 -122 -92 -30 80 138 370 231 -124 -164 -158 -263 -131 280 93 124 144 159 -109 173 -102 -444
8030 -444 62 64 16 387 110 -134 -184 -148 -138 25 40 17 139 143 -35 87 -9 -72 -281 375 181 348 446 -218
$$ packed form
7864D9J53o6j14J08j38j00k25L43P0R9J43k90k08O7k39Q9L21p1N5QQ1j24q5k1
7888i5j49Q1P1R4K16P0k56j40j51J31P5O9M3m6J66j59l8J36l12k01L26J12K0J33
7912A96P6m08l8J62k67K90R8j36n5L04j77l1m1k59j57L89J41J11L3n3k96J8L3
7935f7j61J98J1M9J74J02k85R6j72j43J03J39L6k6K16l71J8K64l10L5J86r3l4
7958c5R4l1o9j33k7j71M21lJ68L2m7k97q3J56mq6O6q0K48L95k88l60K09k03o4
7983a92L78J9l2M3n5k95K94j99j07n4K02r2J14K84l05r2O2k42J07M19j81N3R8
8006B27m20MK76k09L0O2J10N8K32j39l55m0Oj05J32M11j87L1K0J5k68K82k75l42
8030d44N06Km8L71k77k44n0L6J0J63J5k3J22Mj78J22r6o3k09O56j94J67R8o64
$$ plain form
8054 -218 -64 25 -140 -174 162 -11 -147 26 142 -26 34 -201 -351 -92 30 196 226 256 27 -192 80 -227
8076 -227 -114 96 54 55 148 239 -64 50 -130 -289 -6 199 155 30 -96 -237 -107 35 -189 -141 75 57 110
8099 110 256 50 -170 -31 -286 -114 232 124 -16 79 -78 -188 145 -134 -145 43 170 155 66 360 113
8120 113 44 -163 -348 -115 465 176 52 110 -62 -214 82 -34 -203 101 288 -58 205 146 -149 -134 -204 -149
8142 -149 156 216 168 60 -101 -82 -77 134 -170 -38 -111 108 215 82 73 -271 -4 -139 -94 90 246 -66 178
8165 178 17 -221 -107 9 -350 -469 87 -1 138 75 -69 -280 -59 -220 182 305 261 16 48 13 -94 -23
8187 -23 -63 -193 -1 384
$$ packed form
8054b18J54Q9j65l4L36j73j36J73J16j68O0k35j50K59J22J66L0L0k29k19K72l07
8076b27J13K10m2JR3R1l03J14j80j59K83K05m4j25j26j41J30J42k24M8K16j8N3
8099A10J46k06k20J39k55J72L46j08j40R5j57j10L33k79j1J88J27j5q9K94k47
8120A13o9k07j85K33N80k89j24N8j72j52K96j16j69L04J87l46K63n9k95J5p0N5
8142a49L05O0m8j08j61J9NK11l04J32p3K19J07j33rl44K67j35M5J84J56l12K44
8165A78j61k38J14J16l59j19N56q8J39o3j44k11K21j61M02J23m4k45L2l5j07P1
8187b3m0j30J92L85
8191C84
$$ Imaginary data points
##PAGE= N=2
##DATA TABLE= (X++(I..I)), XYDATA
$$ plain form
0 0 0 0 0 0 0 0 0 6 -8 8 -8 8 -8 16 -16 16 -24 25 -32 37 -43 50 -56 66 -75 86 -99 113 -125 142 -160 179
32 179 -200 224 -250 277 -307 342 -378 419 -464 514 -571 631 -700 777 -863 964 -1082 1218
50 1218 -1382 1582 -1833 2155 -2587 3201 -4136 5727 -8931 17866 -90579 -322120 -29651
63 -29651 190099 56876 -85609 -28330 14841 4760 15616 14553 -41277 -40522 27635 23176
75 23176 -67454 -39356 94156 89119 -45744 -82323 -40340 -7716 67511 94839 -41614 -109643
87 -109643 37340 118075 -15356 -106409 -29566 48263 35137 9736 9914 -4583 -21050 7847
99 7847 19912 -41406 -57612 32511 61617 -12536 -26049 22209 21033 1862 -19636 -70481 -40681
112 -40681 80379 89093 -21846 -45499 10348 1981 -24696 20666 47487 -23567 -60471 38119
$$ packed form
0@%%%%%%%Oj4J6j6J6j6K4l2L2m0M9n7O9q0R3j06J22j41J61j85K12k38K67l02L39
32A79l79M24m74N27n84O49p20P97q83R78j085J202j331J477j640J827k046K300
50A218k600K964l415L988m742N788p337R863j4658K6797j08445k31541K92469
63b9651K19750j33223j42485N7279M3171j0081J0856j063n5830P55O8157m459
75B3176r0630K8098J33512n037j34863l6579M1983L2624P5227K7328j36453o8029
87a09643J46983Q0735j33431r1053P6843P7829j3126k5401J78j4497j6467K8897
99G847J2065o1318j6206R0123K9106p4153j3513M8258j176j9171k1498n0845K9800
112d0681J21060Q714j10939k3653N5847q367k6677M5362K6821p1054l6904R8590
$$ plain form
124 38119 97285 -12498 -78067 25749 57177 -55661 -61599 51897 73662 26282 2195
135 2195 -51250 -79182 16066 89426 12239 -65801 -13654 55375 29970 -15628 -1780 145
147 145 -40193 -15782 48145 13557 -25717 55655 73523 -60021 -92617 33710 72283 -3024
159 -3024 -21390 11189 16437 21573 27292 -8988 -49541 -20396 47155 46421 -16497 -21429 27922
172 27922 23308 -9216 -6294 -21199 -33861 27706 58834 -6125 -16115 45357 13946 -67239 -39020
185 -39020 42293 49027 11439 -1878 -2721 -8652 8427 43360 21358 -47998 -42457 30412 41172
198 41172 18207 40711 20985 -54168 -45615 19575 19826 13915 45631 17872 -49415 -31049 37665
211 37665 39803 -9505 -24636 -4899 -4555 -1887 48006 63362 -16779 -63136 -13612 9919 -2008
$$ packed form
124C8119N9166j09783o5569J03816L1428j12838n938J13496K1765m7380k4087
135B195n3445k7932R5248P3360p7187p8040N2147O9029k5405m5598J3848J925
147A45m0338K4411O3927l4588l9274Q1372J7868j33544l2596J26327L8573p5307
159c024j8366L2579N248N136N719l6280m0553K9145O7551p34o2918m932M9351
172B7922m614l2524K922j4905j2662O1567L1128o4959r990O1472l1411q1185K8219
185c9020Q1313O734l7588j3317q43n931J7079L4933k2002o9356N541P2869J0760
198D1172k2965K2504j9726p5153Q553O5190K51n911L1716k7759o7287J8366O8714
211C7665K138m9308j5131J9737L44K668M9893J5356q0141m6357M9524K3531j1927
$$ plain form
224 -2008 41175 60695 -9791 -40922 8515 22628 -1785 2568 7003 -8635 -1781 28587 34822
237 34822 5600 -14940 -3059 -3994 -24918 1820 45840 19004 -15327 12047 14858 -25782 -15064
250 -15064 12971 -7044 -2869 41929 32605 -19193 -26008 3044 15313 7154 228 370 -2917 4608
264 4608 38184 38820 -18267 -37304 2450 4247 -11781 26711 48969 9492 -12490 -10387 -26818
277 -26818 -12111 38111 33788 -21873 -35429 9926 45410 23857 -17720 -25021 -15747 -11240 14797
290 14797 35910 8955 -1721 24184 -3627 -54211 -17302 47039 35871 -3931 -15172 -9762
302 -9762 15244 38275 12561 -36539 -41813 5584 47553 29781 -13459 -7990 15534 -3046 -20710
315 -20710 -8118 -4898 4938 32355 13427 -27620 -3042 33871 -85 -43516 -28151 16688
$$ packed form
224b008M3183J9520p0486l1131M9437J4113k4413M353M435j5638O854L0368O235
237C4822k9222k0540J1881r35k0924K6738M4020k6836l4331K7374K811m0640J0718
250a5064K8035k0015M175M4798r324n1798o815K9052J2269q159o926J42l287P525
264D608L3576O36n7087j9037L9754J797j6028L8492K2258l9477k1982K103j6431
277b6818J4707N0222m323n5661j3556M5355L5484k1553m1577p301R274M507K6037
290A4797K1113k6955j0676K5905k7811n0584L6909O4341j1168l9802j1241N410
302i762K5006K3031k5714m9100n274M7397M1969j7772m3240N469K3524j8580j7664
315b0710J2592L220R836K7417j8928m1047K4578L6913l3956m3431J5365M4839
$$ plain form
327 16688 44221 30380 -13050 -33352 -10188 23680 31216 -8188 -48426 -14683 46550 41947
339 41947 4426 -8288 -20581 -24457 2036 10293 -1108 20669 35624 -6775 -43058 -19752
351 -19752 23944 32198 -6157 -43720 -26060 22579 46512 32849 -15713 -60230 -32386 28518
363 28518 26086 -6172 1199 13395 4874 -736 -13183 -21841 5741 27298 1593 -23403 -6249
376 -6249 29391 36760 -4689 -48366 -29801 16733 25001 8754 -6258 -13028 9827 27839 -12680
389 -12680 -52249 -20414 25529 27896 6968 -15041 -16587 9490 14160 -16977 -28862 -5619 18602
402 18602 22387 -1695 -22210 3756 32122 4598 -36425 -37886 -6282 40175 53813 475
414 475 -46329 -22179 12976 7816 -6878 -10064 449 15442 4199 -18988 -7032 17752 8697
$$ packed form
327A6688K7533j3841m3430k0302K3164L3868P536l9404m0238L3743O1233m603
339D1947l7521j2714j2293l876K6493Q257j1401K1777J4955m2399l6283K3306
351a9752M3696Q254l8355l7563J7660M8639K3933j3663m8562m4517K7844O0904
363B8518k432l2258P371J2196q521n610j2447q658K7582K1557k5705k4996J7154
376f249L5640P369m1449m3677J8565M6534Q268j6247j5012o770K2855J8012m0519
389a2680l9569L1835M5943K367k0928k2009j546K6077M670l1137j1885K3243K4221
402A8602L785k4082k0515K5966K8366k7524m1023j461L1604M6457J3638n3338
414D75m6804K4150L5155n160j4694l186J0513J4993j1243k3187J1956K4784r055
$$ plain form
427 8697 -20443 -40948 -27037 29075 60348 16200 -39133 -43793 -17077 15511 28008 -766
439 -766 -22763 -530 17624 6329 -6082 -9331 -5236 1736 -10403 -20636 9778 39422 20400
452 20400 -16106 -35589 -29313 6579 28918 1972 -21272 -3880 15174 12531 -6462 -31029
464 -31029 -25729 8054 16063 -559 -3428 -720 213 6698 -4121 -25347 -13719 9212 6033 -2
478 -2 5779 8727 9414 -2858 -31522 -31370 6084 30436 24023 -1107 -27680 -19290 14865 14465 -12484
493 -12484 -17277 -11537 -5930 11516 17804 3215 -3361 -10556 -30450 -27093 4280 26391 25782 3090
507 3090 -27139 -25538 2557 13527 5883 -7380 -22147 -9597 23719 24239 -442 -8500 -14567
520 -14567 -23691 -7638 12899 11995 10435 7669 -9304 -16998 -7392 -773 -719 -6280 -10013 4709 17349
$$ packed form
427H697k9140k0505J3911N6112L1273m4148n5333m660K6716L2588J2497k8774
439g66k1997K2233J8154j1295j2411l249M095O972j2139j0233L0414K9644j9022
452B0400l6506j9483O276L5892K2339k6946k3244J7392J9054k643j8993k4567
464c1029N300L3783Q009j6622k869K708R33O485j0819k1226J1628K2931l179o035
478bN781K948O87j2272k8664J52L7454K4352o413k5130k6573Q390L4155m00k6949
493a2484m793N740N607J7446O288j4589o576p195j9894L357L1373K2111o09k2692
507C090l0229J601K8095J0970p644j3263j4767J2550L3316N20k4681q058o067
520a4567r124J6053K0537r04j560k766j6973p694R606O619N4n561l733J4722J2640
$$ plain form
535 17349 3150 -9568 -9020 -17078 -13510 9378 7509 -9194 1867 13237 675 -4849 -4425 -15516
549 -15516 -16657 18 15403 20763 10885 -8942 -15005 -11413 -8594 6250 13944 -4624 -9338 7721
563 7721 4684 -4321 6036 -498 -24871 -21211 678 12333 21474 17455 -9380 -29001 -23940 -3545
577 -3545 16100 13243 -4439 -5917 643 -1563 4914 9117 -10714 -18092 -1211 276 59 23415
591 23415 26134 -7997 -28069 -20503 -4128 15259 19488 -48 -13507 -4369 11060 11802 -11653
604 -11653 -28647 -7941 13605 5350 2966 10350 -3399 -11921 510 -5092 -18012 1106 16782
617 16782 1659 -4969 8165 12799 321 -18101 -24246 -5897 18494 28872 18560 -15131 -33169
630 -33169 985 30223 2682 -23633 -10186 1915 7668 20463 11293 -12652 -12977 -7197 -15698
$$ packed form
535A7349j4199j2718N48q058L568K2888j869j6703J1061J1370j2562n524M24j1091
549a5516j141J6675J5385N360r878j9827o063L592K819J4844P694j8568m714J7059
563G721l037r005J0357o534k4373L660K1889J1655R141m019k6835j9621N061K0395
577c545J9645k857j7682j478O560k206O477M203j9831p378J6881J487k17K3356
591B3415K719l4131k0072P566J6375J9387M229j9536j3459R138J5429P42k3455
604a1653j6994K0706K1546q255k384P384j3749q522J2431n602j2920J9118J5676
617A6782j5123o628J3134M634j2478j8422o145J8349K4391J0378j0312l3691j8038
630c3169L4154K9238k7541k6315J3447J2101N753J2795r170k3945l25N780q501
$$ plain form
643 -15698 -10781 14735 30027 14898 -19009 -29633 -3409 16836 9678 -2562 -16262 -17888 16429
656 16429 39353 6941 -24673 -13999 -2626 -2703 6562 9421 5704 13749 11234 -14344 -25300 -4433
670 -4433 19186 14576 -13070 -17761 12227 25366 4655 -12731 -20501 -19490 9430 26457 -2828
683 -2828 -18135 12365 22398 -5729 -20325 -13332 -2585 11287 17034 5400 -4788 756 12175
696 12175 3339 -24540 -20784 21983 31827 -4092 -16865 245 8907 15539 9822 -27065 -38537
709 -38537 8321 41518 19721 -9349 -13114 -5447 -3920 -9065 -4487 10129 14303 6516 -4154
722 -4154 -16525 -6382 26947 20577 -27761 -36270 3616 30162 31103 15550 -19563 -32639 -2233
735 -2233 18167 4506 -4751 6011 15399 6646 -10526 -10502 4688 6337 -2978 -7118 -10522 2177
$$ packed form
643a5698M917K5516J5292j5129l3907j0624K6224K0245p158j2240j3700j626L4317
656A6429K2924l2412l1614J0674J1373p7R265K859l717Q045k515k5578j0956K0867
670d433K3619m610k7646m691K9988J3139k0711j7386p770J011K8920J7027k9285
683b828j5307L0500J0033k8127j4596O993J0747J3872N747j1634j0188N544J1419
696A2175q836k7879L756M2767R844l5919j2773J7110Q662O632n717l6887j1472
709c8537M6858L3197k1797k9070l765P667J527n145M578J4616M174p787j0670
722d154j2371J0143L3329o370m8338q509L9886K6546R41j5553l5113j3076L0406
735b233K0400j3661r257J0762R388q753j7172K4J5190J649r315m140l404J2699
$$ plain form
749 2177 31822 22405 -25202 -30942 3533 11098 -432 1023 627 1497 16294 14733 -13275 -27592
763 -27592 -6957 19141 16366 -4024 -2010 14092 4859 -9691 -1947 -613 -6977 8914 13340
776 13340 -11624 -7543 27709 22959 -16646 -32310 -16569 7210 24898 21732 -350 -17422 -13711
789 -13711 5844 10225 -8144 -10304 9451 6252 -7974 5676 17897 3318 -6023 -11026 -22257
802 -22257 -5339 31987 31826 -1698 -19005 -10896 3329 8929 1979 -5940 -4174 3865 14320 12906
816 12906 -6969 -12000 3218 -2833 -17185 773 19062 8013 1115 1996 -11329 -12880 5704
829 5704 5601 -9831 -5086 14162 19327 4307 -12084 -10972 -2938 -1454 6380 13057 -862 -5738
843 -5738 13872 11015 -12331 -7542 5094 -7752 -9017 11805 16687 6763 1968 -7075 -18412 -14068
$$ packed form
749B177K9645r417m7607n740L4475P565j1530J455l96Q70J4797j561k8008j4317
763b7592K0635K6098k775k0390K014J6102r233j4550P744J334o364J5891M426
776A3340k4964M081L5252m750l9605j5664J5741K3779J7688l166k2082j7072L711
789a3711J9555M381j8369k160J9755l199j4226J3650J2221j4579r341n003j1231
802b2257J6918L7326j61l3524j7307Q109J4225N600o950p919J766Q039J0455j414
816A2906j9875n031J5218o051j4352J7958J8289j1049o898Q81j3325j551J8584
829E704j03j5432M745J9248N165j5020j6391J112Q034J484P834O677j3919m876
843e738J9610k857k3346M789J2636j2846j265K0822M882r924m795r043j1337M344
$$ plain form
857 -14068 4386 17511 9075 -7918 -5542 4603 104 -496 6140 -8666 -20828 1033 18414
870 18414 10814 10072 7419 -16463 -24165 -2011 13721 11771 7949 2260 -4959 -5586 1506 9354 1948
885 1948 -14956 -10635 6629 7920 9303 16479 -3041 -27268 -13148 7172 2920 3312 9675 -51
899 -51 -6014 3726 3637 -9242 -13284 -3028 9469 8800 2272 6014 4759 -10121 -8936 5524 -745
914 -745 -6896 8404 9115 -4615 5661 15830 -5142 -23405 -14653 1780 15286 19328 5699
927 5699 -11852 -16250 -4563 9859 4608 -12051 -7489 6736 2384 1164 11774 3499 -12315
940 -12315 -10473 -9595 -10104 13512 31600 10344 -17510 -18780 -4095 9395 9222 -2515 -7844 -1298
954 -1298 8278 13491 3299 -13208 -7830 3504 -8194 -12341 10211 19171 6214 -2767 -13362
$$ packed form
857a4068J8454J3125q436j6993K376J0145m499o00O636j4806j2162K1861J7381
870A8414p600p42k653k3882p702K2154J5732j950l822n689p219o27P092P848p406
885A948j6904M321J7264J291J383P176j9520k4227J4120K0320m252L92O363r726
899e1n963R740q9j2879m042J0256J2497o69o528L742j255j4880J185J4460o269
914g45o151J5300P11j3730J0276J0169k0972j8263Q752J6433J3506M042j3629
927E699j7551m398J1687J4422n251j6659M562J4225m352j220J0610q275j5814
940a2315J842Q78n09K3616J8088k1256k7854j270J4685J3490j73j1737n329O546
954a298R576N213j0192j6507N378J1334j1698m147K2552Q960j2957q981j0595
$$ plain form
967 -13362 -21081 -2222 16802 3435 -12887 -4263 12605 14443 -2723 -17681 -11166 1873 4960
980 4960 6548 2979 -5339 5033 16337 -4049 -21653 -4897 8072 865 986 5787 4413 7202
994 7202 3095 -16614 -23325 -3026 19810 19135 -5028 -20117 -3483 13842 5638 -6562 -12686
1007 -12686 -16475 -230 21857 11807 -6309 -202 1258 -14432 -15865 239 13622 18018 7089
1020 7089 -12393 -14637 2160 14988 8411 -15096 -23965 2427 25579 13952 -3192 -7931 -12561
1033 -12561 -7783 3938 -1741 -7330 10296 17236 -2567 -15766 -9222 2413 6560 -3585 -13579
1046 -13579 -3005 14406 16753 3876 -15452 -20819 1897 16908 -507 -11843 2187 11998
1058 11998 10442 4252 -12531 -20003 -793 11707 2579 -1266 5844 8665 921 -14097 -17584 947
$$ packed form
967a3362p719J8859J9024j3367j6322Q624J6868J838j7166j4958O515J3039L087
980D960J588l569q318J0372J1304k0386j7604J6756J2969p207J21M801j374K789
994G202m107j9709o711K0299K2836o75k4163j5089J6634J7325q204j2200o124
1007a2686l789J6245K2087j0050j8116O107J460j5690j433J6104J3383M396j0929
1020G089j9482k244J6797J2828o577k3507q869K6392K3152j1627j7144m739m630
1033a2561M778J1721n679n589J7626O940j9803j3199O544J1635M147j0145r994
1046a3579J0574J7411K347j2877j9328n367K2716J5011j7415j1336J4030R811
1058A1998j556o190j6783p472J9210J2500r128l845P110K821p744j5018l487J8531
$$ plain form
1072 947 13876 4156 -7318 -10513 -2054 18452 17861 -15247 -31680 -9784 10599 15390 13184 82
1086 82 -10034 -3389 -102 -6715 -3779 6166 8658 2341 -7485 -4447 13256 14118 -8335 -20250 -13054
1101 -13054 1043 20021 21986 -4129 -18376 -4648 2930 -3118 -4342 -3082 941 8923 5709
1114 5709 -4842 -4875 -681 -1729 -4166 -8801 -3997 13841 16950 -1532 -9861 -4362 -2468 1432 2176
1129 2176 -7204 -3591 15474 16190 -958 -10890 -11882 -5313 5139 5030 -108 2865 3834 -423 -1981
1144 -1981 -4326 -6370 1236 -46 -10431 -2945 14426 13770 2928 -9113 -21030 -13676 9940 17143
1158 17143 6318 -1458 -5669 -3599 4479 2846 -3265 -1802 -3562 -5275 5595 13182 8547 2966
1172 2966 -7974 -20482 -10524 10135 13761 6934 334 -8257 -6334 4035 1769 -6094 -5627 -3777
$$ packed form
1072I47J2929r720j1474l195Q459K0506n91l3108j6433K1896K0383M791k206j3102
1086H2j0116O645L287o613K936R945K492o317r826L038J7703Q62k2453j1915P196
1101a3054J4097J8978J965k6115j4247J3728P578o048j224J260M023P982l214
1114E709j0551l3M194j048k437m635M804J7838L109j8482q329N499J894L900P44
1129B176r380L613J9065P16j7148r932r92O569J0452j09n138K973R69m257j558
1144a981k345k044P606j282j0385P486J7371o56j0842j2041j1917P354K3616P203
1158A7143j0825p776m211K070Q078j633o111J463j760j713J0870P587m635n581
1172B966j0940j2508R958K0659L626o827o600q591J923J0369k266p863M67J850
$$ plain form
1186 -3777 651 10495 8631 -858 -4051 -7538 -9958 -466 6329 3087 4561 5459 -404 141 1937
1201 1937 -6722 -8963 -88 4388 8198 11326 2038 -7627 -5938 -4279 -1969 4856 2143 -4455 25
1216 25 4762 3955 5200 -2514 -16682 -12857 2381 9833 12584 8307 -5962 -10929 -4485 -2390 1159
1231 1159 6539 1780 -2554 2272 2993 2922 7718 -118 -14633 -11438 1546 11068 17123 8810 -8931
1246 -8931 -12854 -4950 -713 3398 3332 -2557 908 6947 -47 -4077 1149 -2638 -8636 -4499 -675
1261 -675 4410 14174 8994 -7614 -11502 -4717 1590 5710 471 -5042 4796 13671 4990 -4879 -8948
1276 -8948 -9971 932 11017 3676 -2315 4304 4215 -2290 -3715 -5455 -4086 2852 566 -5171 3429
1291 3429 12985 7230 -5183 -17902 -17717 3456 19331 10051 -3003 -6948 -4661 4580 7923 -5458
$$ packed form
1186c777M428R844j864r489l193l487k420R492O795l242J474Q98n863N45J796
1201A937q659k241Q875M476L810L128r288r665J689J659K310O825k713o598M480
1216B5M737q07J245p714j4168L825J5238P452K751m277j4269m967O444K095L549
1231A159N380m759m334M826P21p1M796p836j4515L195J2984R522O055q313j7741
1246h931l923P904M237M111o6n889L465O039o994m030N226l787n998M137L824
1261f75N085R764n180j6608l888O785O307M120n239n513R838Q875q681r869m069
1276h948j023J0903J0085p341n991O619q9o505j425j740J369O938k286n737Q600
1291C429R556n755j2413j2719J85K1173J5875r280j3054l945K287R241L343j3381
$$ plain form
1305 -5458 -10312 1493 5102 1765 6028 7631 3155 -1068 -10993 -15951 -734 16867 16366 2846
1319 2846 -12306 -12441 5553 10823 -4817 -11717 -3836 2356 9615 11221 -3199 -10496 -605 -690 -8824
1334 -8824 -4476 7272 12316 8043 -4882 -10889 -722 5770 140 -4435 -5977 1390 18028 15576
1348 15576 -9222 -17013 -2953 4577 4218 1669 -4588 -1529 11099 8410 -5605 -9789 -6041 -1814
1362 -1814 1157 -752 2041 12258 8768 -8284 -15076 -9292 2226 14903 8512 -12399 -9824 10633
1376 10633 13996 2911 -7442 -15258 -8983 9528 13770 4709 1825 1621 -2514 -7764 -10118 -861
1390 -861 13531 8756 -6223 -6092 699 4268 8479 -899 -20594 -14388 11417 16655 4007 -2571
1404 -2571 -4532 -4131 -1257 -3666 -4983 1730 7867 8455 2837 -6960 -5199 7351 2151 -12479 -5725
$$ packed form
1305e458m854J1805L609l337M263J603m476m223r925m958J5217J7601n01j3520
1319B846j5152j35J7994N270j5640o900P881O192P259J606j4420p297R891q5q134
1334h824M348J1748N044m273j2925o007J0167O492n630m575j542P367J6638k452
1348A5576k4798p791J4060P530l59k549o257L059J2628k689j4015m184L748M227
1362a814K971j909K793J0217l490j7052o792N784J1518J2677o391k0911K575K0457
1376A0633L363j1085j0353p816O275J8511M242r061k884k04m135n250k354R257
1390h61J4392m775j4979J31O791L569M211r378j9695O206K5805N238j2648o578
1404b571j961M01K874k409j317O713O137N88n618r797J761J2550n200j4630O754
$$ plain form
1419 -5725 9133 9914 7116 1009 -10154 -6655 6394 3065 -8145 -6744 3111 11845 11045 -3139
1433 -3139 -12205 -7799 -3258 -366 4440 3235 2958 6659 -1747 -12704 -3419 7955 2330 -3883 -4872
1448 -4872 -4394 7981 19468 5949 -14591 -16347 -5203 6474 11713 6740 1482 -683 -5000 -4277
1462 -4277 1251 -804 -2519 3687 -757 -7419 5944 15143 -247 -13316 -10427 -6261 1381 12173
1476 12173 9116 -2746 -6003 -1171 3162 -1136 -8841 -3539 7137 4495 1956 7817 1532 -8838
1490 -8838 -3193 427 -5200 1095 10478 3421 -3289 633 1971 -951 -4269 -8019 -4880 3330 8150
1505 8150 9257 3225 -10073 -11438 -340 810 -884 5109 2728 -4394 1697 5931 -1163 -3103
1519 -3103 -2154 -7761 -4676 7695 11927 7694 527 -7887 -9477 -3694 1801 7298 6334 -3244 -3769
$$ packed form
1419e725J4858P81k798o107j1163L499J3049l329j1210J401R855Q734q00j4184
1433c139r066M406M541K892M806j205k77L701q406j0957R285J1374n625o213r89
1448d872M78J2375J1487j3519k0540j756J1144J1677N239m973n258k165m317P23
1462d277N528k055j715O206m444o662J3363R199j5390j3069K889M166P642J0792
1476A2173l057j1862l257M832M333m298p705N302J0676k642k539N861o285j0370
1490h838N645L620n627O295R383p057o710L922J338k922l318l750L139Q210M820
1505H150J107o032j3298j365J1098J150j694N993k381p122O091M234p094j940
1519c103R49n607L085J2371M232m233p167q414j590N783N495N497r64r578n25
$$ plain form
1534 -3769 4648 1912 -2802 957 -4876 -13405 -1001 12714 7562 1187 -729 -7849 -10470 -2560
1548 -2560 3712 4149 1642 122 2307 1811 -3446 -345 2116 -7694 -7973 7629 10637 3021 3473 -815
1564 -815 -10782 -4977 5654 1590 -3763 652 6041 6447 1227 -5834 -6743 -5132 -3765 3454 7681
1579 7681 803 202 3315 -6081 -9588 2236 4725 -3822 -3096 1257 2832 9517 8859 -6621 -16301
1594 -16301 -8652 4680 12037 8496 -448 -2025 -1642 -4052 -385 2491 -3048 -1546 4301 -1409 -2256
1609 -2256 10289 8338 -9436 -14793 -7868 107 10629 13174 8 -9974 -6408 1570 3679 -3030
1623 -3030 -7575 1550 7583 1810 1600 4266 -3134 -5580 47 -4230 -5492 9877 14509 -68 -7761
1638 -7761 -3055 1416 1700 -2732 -7254 -1781 7884 10962 5251 -8346 -15274 -2538 7670 -365
$$ packed form
1534c769Q417k736m714L759n833q529J2404J3715n152o375j916p120k621P910
1548b560O272M37k507j520K185m96n257L101K461r810k79J5602L008p616M52m288
1564h15r967N805J0631m064n353M415N389M06n220p061r09J611J367P219M227
1579G681o878o01L113r396l507J1824K489q547P26M353J575O685o58j5480r680
1594a6301P649J3332P357l541q944j577L83k410L667K876n539J502N847n710q47
1609b256J2545j951j7774n357O925P975J0522K545j3166r982L566P978K109o709
1623c030m545R125O033n773k10K666p400k446N627m277j262J5369M632j4577p693
1638g761M706M471K84m432m522N473R665L078n711j3597o928J2736J0208q035
$$ plain form
1652 -365 -3849 2796 1854 513 4262 -1545 -8068 -1028 1484 -6193 -3053 9712 13828 5692 -9217
1667 -9217 -15733 -4963 8072 9717 4444 -4495 -7472 5441 11506 -2845 -10332 -2720 -1258 -2001
1681 -2001 5241 6009 2371 3294 -2013 -13694 -11574 3525 11681 6904 -4856 -7557 2512 6839
1695 6839 -231 -5207 -7311 -6146 7028 13978 997 -5692 2627 1706 -7059 -5392 281 3767 7877
1710 7877 5153 -3041 -3532 1321 1885 -3403 -10176 -4968 10724 12873 -771 -6886 -4906 -4195 2109
1725 2109 4767 -6070 -8112 5978 10513 1974 -2240 -3603 -5275 -3592 -1845 1031 8153 9555
1739 9555 2853 -5143 -10438 -4844 9644 8556 -6636 -7869 2768 7216 8737 4628 -10631 -15216
1753 -15216 -1602 6306 3557 3796 4282 78 -4410 -7090 -4605 2848 3473 -798 -1332 -1562 2024 10177
$$ packed form
1652c65l484O645r42j341L749n807o523P040K512p677L140J2765M116q136j4909
1667i217o516J0770J3035J645n273q939k977J2913O065j4351p487P612J462p43
1681b001P242P68l638R23n307j1681K120J5099Q156m777j1760k701J0069M327
1695F839p070m976k104J165J3174O950j2981o689Q319r21q765J667N673L486M110
1710G877k724q194m91M853N64n288o773N208J5692K149j3644o115J980P11O304
1725B109K658j0837k042J4090M535q539m214j363j672J683J747K876P122J402
1739I555o702p996n295N594J4488j088j5192j233J0637M448J521m109j5259m585
1753a5216J3614P908k749K39M86m204m488k680K485P453O25m271n34k30L586Q153
$$ plain form
1769 10177 4461 -12930 -12201 1789 6285 6047 5953 -907 -3628 2112 1183 -5481 -4809 596 4574 5224
1785 5224 1190 -62 2466 -2468 -8316 -3894 517 1707 7023 4779 -6333 -4369 4838 1198 -5951
1800 -5951 -5887 -3552 2711 10606 7774 -1701 -6043 -6306 -3383 1782 2636 3387 5673 562 -4237 1031
1816 1031 3454 -1784 -2033 -2633 -6392 1563 13131 8282 -2967 -7655 -9149 -5060 3894 5915 2741
1831 2741 303 -2123 -1331 1991 -887 -3482 -1204 -3341 -3786 5993 10108 1917 -1713 -3567 -8481
1846 -8481 -4111 6051 5945 1408 1417 802 535 762 -2576 -4409 -2427 -1242 3174 8638 3626 -4118
1862 -4118 -2749 -2827 -5390 289 2980 -2040 -569 4776 2837 226 -1153 -6091 -7081 -1167 3325 7002
1878 7002 7811 434 -5155 -3785 -3081 672 5672 1063 -5103 307 5957 4931 3599 -2680 -11145
$$ packed form
1769A0177n716j7391P29J3990M496k38r4o860k721N740r29o664O72N405L978O50
1785E224m034j252K528m934n848M422M411J190N316k244j1112J964R207l640p149
1800e951O4K335O263P895k832r475m342k63K923N165Q54P51K286n111m799N268
1816A031K423n238k49o00l759P955J1568m849j1249m688j494M089Q954K021l174
1831B741k438k426P92L322k878k595K278k137m45R779M115q191l630j854m914
1846h481M370J0162j06m537Ro15k67K27l338j833J982J185M416N464n012p744
1862d118J369p8k563N679K691n020J471N345j939k611j379m938r90N914M492L677
1878G002Q09p377n589J370P04L753N000m609o166N410N650j026j332o279q465
$$ plain form
1893 -11145 -6965 3219 5731 6350 5017 -1944 -5927 -4226 -3133 -180 3880 750 -2596 -222 1708
1908 1708 4129 4918 -4728 -12789 -4278 5271 6780 6840 2639 -5056 -3696 1181 -1304 -2701 738 2607
1924 2607 3719 3637 -34 -181 790 -4680 -6824 -682 2988 4936 6484 -758 -7792 -1636 3534 -1574
1940 -1574 -5537 -4101 204 8253 9295 -612 -7116 -5775 -3466 1279 4189 909 1728 5314 232
1955 232 -4509 -253 2014 -207 -2136 -4689 -1639 9470 11537 349 -8698 -10070 -5248 4910
1969 4910 8344 617 -2583 1020 827 -983 -1635 -4196 -2272 1606 -1102 -1511 5169 7137 1874 -4562
1985 -4562 -10436 -8003 5875 11062 2508 -2646 -1033 992 3441 160 -7158 -4657 3417 4860 3559
2000 3559 2361 -914 -1010 -54 -5911 -7067 2407 6684 2840 -726 -2702 -1389 3488 87 -8820 -7380
$$ packed form
1893a1145M180J0184K512O19j333o961l983J701J093K953M060l130l346K374J930
1908A708K421P89r646q061Q511R549J509O0m201p695J360M877k485j397L439J869
1924B607J112q2l671j47R71n470k144O142L670J948J548p242p034O156N170n108
1940a574l963J436M305Q049J042r907o504J341K309M745K910l280Q19L586n082
1955B32m741M256K267k221j929k553L050J1109K067j1188r047j372M822J0158
1969D910L434p727l200L603j93j810o52k561J924L878k708m09O680J968n263o436
1985d562n874K433J3878N187q554n154J613K025K449l281p318K501Q074J443j301
2000C559j198l275r6R56n857j156R474M277l844l566j976J313M877l401q907J440
$$ plain form
2016 -7380 1816 8399 9841 1642 -9261 -6667 2786 1958 -1497 -458 603 2649 5116 1527 -1782
2031 -1782 221 -1700 -5775 -3545 1454 7943 11455 1340 -11864 -8812 1484 4390 2954 -1513
2045 -1513 -6028 -510 8110 4997 -3214 -6350 -5979 -1846 2471 2114 3623 7053 1345 -6786 -5838 -2027
2061 -2027 2061 5951 2042 -4999 -48 7669 4917 -2195 -6847 -7684 433 7387 3994 -188 1075
2076 1075 -76 -1384 -2406 -5506 -3553 3375 3611 301 1222 1554 -399 -1418 -5552 -7857 1783 9330
2092 9330 4461 -1034 -2291 -2251 1547 3382 -3082 -6377 -889 4800 7197 5277 -1429 -4271 -2541
2107 -2541 -4821 -4014 4688 7147 2138 101 -3190 -5911 549 5369 -1533 -7373 -3777 2609 7860
2122 7860 6577 -1970 -6947 -6180 -4016 1533 6098 3345 1114 2530 -1621 -4933 503 2376 -1853
$$ packed form
2016g380R196O583J442q199j0903K594R453q28l455J039J061K046K467l589l309
2031a782K003j921m075K230M999O489L512j0115j3204L052J0296K906j436m467
2045a513m515N518Q620l113q211l136L71M133M317l57J509L430n708q131R48L811
2061b027M088L890l909p041M951P717k752p112m652q37Q117O954l393m182J263
2076A075j151j308j022l100J953O928K36l310R21L32j953j019m134k305R640P547
2092I330m869n495j257M0L798J835o464l295N488N689K397j920o706k842J730
2107b541k280Q07Q702K459n009k037l291k721O460M820o902n840L596O386N251
2122G860j283q547m977P67K164N549M565k753k231J416m151l312N436J873m229
$$ plain form
2137 -1853 -1568 804 2164 5742 5326 -2326 -6850 -4857 -1522 3099 4316 398 -508 2302 221 -2038
2153 -2038 -2600 -5022 -3664 3125 3903 2042 3891 139 -6374 -4413 -103 183 2217 3103 -636 -833
2169 -833 2934 2876 142 -3842 -6502 -2312 4489 6190 6270 3269 -5757 -8220 -434 1832 -259 2763
2185 2763 2192 -2878 -483 4216 1468 -3119 -5241 -5200 -1088 3767 5575 5458 204 -7282 -5599 418
2201 418 135 1137 4211 -15 -2785 3395 5188 -1200 -4029 -4246 -3204 2645 6729 4351 772 -1645
2217 -1645 -3720 -1873 -1291 -2015 999 2946 -385 424 3648 -140 -4117 -3513 -4893 -2683 5682 6966
2233 6966 652 -2133 -2098 -2156 886 839 -3148 -2411 2512 5635 5384 902 -4313 -3428 -1882 -3265 1223
2250 1223 7509 4221 -734 -670 -3389 -3811 2639 2496 -4791 -5088 1813 6380 5998 -42 -6568 -6877 -3477
$$ packed form
2137a853K85K372J360L578m16p652m524J993L335M621J217l918r06K810k081k259
2153b038n62k422J358O789P78j861J849l752o513J961M310K86K034Q86l739j97
2169h33L767n8k734l984k660M190O801J701Q0l001r026k463P786K266k091L022
2185B763n71n070K395M699k748m587k122M1M112M855J808j17n254p486J683O017
2201D18k83J002L074m226k770O180J793o388k829k17J042N849M084k378l579k417
2217a645k075J847N82p24L014J947l331Q09L224l788l977O04j380K210Q365J284
2233F966o314k785L5n8L042m7l987P37M923L123k51m482n215Q85J546j383M488
2250A223O286l288m955O4k719m22O450j43p287k97O901M567l82o040o526l09L400
$$ plain form
2267 -3477 457 5199 4235 -627 678 1168 -4439 -3910 3203 1527 -2784 -585 1622 3494 6667 3030
2283 3030 -6613 -8894 -2434 4568 6813 2075 -2244 237 1687 -1815 -2605 -2670 -3622 1237 5089 920
2299 920 -505 3034 -559 -6292 -4396 -850 2047 5267 2634 -3055 -1845 2628 3133 -1745 -7382
2314 -7382 -5802 4995 9660 4219 -205 -3155 -5757 -1277 3288 -727 -1274 4019 2959 -2371 -874
2329 -874 1976 363 -2531 -5732 -5351 1990 8519 7296 -7 -8750 -8619 1634 5073 -476 -1185 1848
2345 1848 698 1888 3344 -2057 -4805 -242 154 -2297 1554 5993 5591 774 -5883 -6891 -545
2360 -545 3502 2250 465 -1252 -655 5252 3365 -6246 -7154 -649 887 2196 3629 427 -1085 1264
2376 1264 -933 -5179 -3007 1120 2698 1933 -452 1061 4819 1764 -4638 -5726 -3331 1284 8870
$$ packed form
2267c477L934M742r64m862J305M90n607N29P113j676m311K199K207J872L173l637
2283C030r643k281O460P002K245m738m319K481J450l502p90o5r52M859L852m169
2299I20j425L539l593n733J896L546K897L220k633n689J210M473N05m878n637
2314g382J580J0797M665n441m424k950k602M480M565m015n47N293j060n330J497
2329h74K850j613k894l201L81P341O529j223p303q743J31J0253L439n549p09L033
2345A848j150J190J456n401k748M563L96k451L851M439m02m817o657j008O346
2360e45M047j252j785j717N97N907j887r611r08O505J536J309J433l202j512K349
2376A264k197m246K172M127J578p65k385J513L758l055o402j088K395M615P586
$$ plain form
2391 8870 6902 -3319 -4671 1193 903 -1528 -770 -1935 -1624 2982 3745 1415 464 -1094 -3794 -5330
2407 -5330 -4403 1961 8884 5096 -3712 -4416 -2306 -794 2754 1512 -5194 -3132 5562 6226 1892 -575
2423 -575 -3572 -4516 -1417 852 2634 4703 3103 -85 -1832 -3759 -2033 2771 224 -4560 74
2438 74 4886 3146 1851 -1453 -7432 -5313 2363 3082 598 875 875 717 780 -1847 -3013 -1750 -1344 789
2456 789 4625 3345 1709 1770 -3170 -7236 -1265 4611 2764 1434 1067 -1625 -79 3457 271 -4796
2472 -4796 -4859 -1853 2560 5716 3517 198 -2479 -6015 -4675 1619 2517 877 2393 320 -3035 1188
2488 1188 3715 -1591 -4459 -2556 -985 2984 7234 4495 -1239 -4032 -4379 -1207 2247 1331 995 2380
2504 2380 82 -524 2443 -463 -4951 -2706 -408 -456 3532 5128 129 -2780 -2308 -2941 -1715 874
$$ packed form
2391H870j968j0221j352N864k90k431P58j165L11M606P63k330r51j558k700j536
2407e330R27O364O923l788q808p04K110J512L548j242o706K062Q694O64m334k467
2423e75k997r44L099K269J782K069j600l188j747j927J726M804k547m784M634
2438G4M812j740j295l304n979K119P676P19k484K77%j58O3k627j166J263M06K133
2456G89L836j280j636O1m940m066N971N876j847j330l67k692J546L536l186n067
2472d796o3L006M413L156k199l319k677l536J340O294Q98j640J516k073l355M223
2488A188K527n306k868J903J571L969M250k739n734k793l47L172L454r16l36J385
2504B380k298o06K967k906m488K245K298m8L988J596m999k909M72o33J226K589
$$ plain form
2520 874 565 511 1884 1320 2006 1093 -3696 -4825 -1020 1037 3083 6026 2100 -3507 -1818 493 -1355
2537 -1355 -557 934 -1057 90 3493 2628 949 -1030 -4486 -4838 -1856 1050 4991 5686 -589 -4760
2553 -4760 -2387 -1242 -388 2070 -695 -3933 1004 5577 2819 -249 -2184 -4747 -3158 938 2720
2568 2720 4447 4150 -123 -2368 -2470 -2472 860 3010 -1421 -2983 2647 4561 1609 -190 -4368 -6921
2584 -6921 -1076 4261 2581 1055 569 -748 -354 -951 -3371 -2293 408 394 1840 3553 1765 671
2600 671 -257 -5104 -5026 2291 5086 2734 751 -1160 -1534 2706 2428 -3672 -5380 -1611 2462 5620
2616 5620 4219 -956 -2825 -2617 -3758 -1859 1832 1976 2027 1945 -2559 -3214 2335 2265 -3290 -4454 -2112
2633 -2112 1770 7206 5996 -1711 -5263 -3580 -900 1520 1712 85 2481 3704 -719 -2199 190
$$ packed form
2520H74l09n4J373n64O86r13m789j129L805K057K046K943l926n607J689K311j848
2537a355P98J491j991J147L403q65j679j979l456l52K982K906L941O95o275m171
2553d760K373J145Q54K458k765l238M937M573k758l068j935k563J589M096J782
2568B720J727k97m273k245j02kL332K150m431j562N630J914k952j799m178k553
2584f921N845N337j680j526m86j317L94n97k420J078K701j4J446J713j788j094
2600F71r28m847P8P317K795k352j983j911l74M240k78o100j708L769M073L158
2616E620j401n175j869K08j141J899L691J44N1q2m504o55N549p0n555j164K342
2633b112L882N436j210p707l552J683K680K420J92j627K396J223m423j480K389
$$ plain form
2648 190 -822 -1777 -490 -1478 63 5881 4811 -2333 -5306 -4380 -1307 3007 1963 -1897 -124 2748
2664 2748 1676 -29 -2750 -5133 -1647 3044 1771 1280 3482 1503 -1506 -2357 -3473 -1220 3650
2679 3650 2519 -1675 -438 2460 2845 1817 -3590 -7768 -2773 4388 5460 3307 -371 -3800 -1934
2694 -1934 427 -2029 -1984 1372 256 -125 1955 1142 379 1008 -2961 -6544 -2189 4241 6439 4639
2710 4639 -1279 -5380 -1705 2256 616 -926 -676 -710 2831 4723 406 -2322 -1287 -2649 -3399 135
2726 135 2351 3500 3682 -848 -4852 -2502 365 -98 -56 -1436 -1612 3766 5638 -186 -4090 -3653 -2750
2743 -2750 983 3432 1218 739 2390 482 -1490 -723 -1479 -1627 1007 383 87 4193 4316 -1408 -4420
2760 -4420 -5021 -2627 3127 4771 330 -1784 -745 -340 969 604 -4090 -4166 603 1801 2752 4317
$$ packed form
2648A90j012r55J287r88J541N818j070p144k973R26L073M314j044l860J773K872
2664B748j072j705k721k383L486M691j273m91K202j979l009q51j116K253M870
2679C650j131m194J237K898L85j028n407m178M995P161J072k153l678l429J866
2694a934K361k456M5L356j116l81K080q13p63O29l969l583M355O430K198j800
2710D639n918m101L675L961j640j542K50l4L541J892m317k728J035j362p50L534
2726A35K216J149J82m530m004K350K867m63M2j380j76N378J872n824l904M37R03
2743b750L733K449k214m79J651j908j972P67p56j48K634o24k96M106J23n724l012
2760d420o01K394N754J644m441k114J039M05J309l65m694p6M769J198R51J565
$$ plain form
2776 4317 1492 -3091 -3363 -3514 -1433 3915 4761 1141 -773 -1143 -747 2140 1429 -3745 -3625 746 2750
2793 2750 3878 3459 -1344 -4090 -2546 -2136 -678 2404 1818 392 1290 -492 -2269 -162 -679 -3709
2809 -3709 -1302 2344 2773 3331 1822 -2595 -3413 -870 -298 1046 1793 -263 918 3745 1021 -1369
2825 -1369 -1496 -3322 -3350 1656 4234 2847 2006 -753 -4258 -2572 -166 345 1026 294 -1650 843 3118
2842 3118 816 -850 -2144 -5050 -3132 3494 5104 3068 1493 -2632 -4266 -723 1047 482 1008
2857 1008 350 -263 2330 2852 -307 -1793 -2490 -3727 -674 3625 3415 2642 489 -3912 -3567 175 -28
2874 -28 -890 353 -326 601 3850 2265 -3334 -4059 -2268 -898 2469 3538 1381 626 136 -1894 -584
2891 -584 175 -1743 -450 1676 393 1706 4921 903 -4547 -4171 -2265 324 4087 3342 -814 -1592
$$ packed form
2776D317k825m583k72j51K081N348Q46l620j914l70L96K887p11n174J20M371K004
2793B750J128m19m803k746J544M10J458L082n86j426Q98j782j777K107n17l030
2809c709K407L646M29N58j509m417q18K543N72J344P47k056J181K827k724k390
2825a369j27j826k8N006K578j387q41k759l505J686K406N11O81p32j944K493K275
2842C118k302j666j294k906J918O626J610k036j575m125j634L543J770n65N26
2857A008o58o13K593N22l159j486o97j237L053M299k10p73k153m401L45L742k03
2874b8q62J243o79R27L249j585n599p25J791J370L367J069k157p55m90k030J310
2891e84P59j918J293K126j283J313L215m018n450L76J906K589L763p45m156p78
$$ plain form
2907 -1592 -714 -164 283 -1773 -4103 -334 2610 1691 2481 2502 -2182 -3916 -2231 -2198 680 5063 3264
2924 3264 -903 -1376 -814 418 1944 -1066 -4004 -562 3450 3868 3454 -98 -4215 -2565 -777 -1061
2940 -1061 1048 3272 1263 29 -293 -2448 -1720 1614 -1071 -3821 -395 3125 3581 3031 -1649 -5426
2956 -5426 -2959 707 1627 1805 324 -205 3150 2283 -2337 -2700 -622 -1643 -393 3294 2305 1673 1777
2973 1777 -1855 -4949 -2189 1576 2326 1102 -1573 -1475 2981 3002 -1462 -3649 -4297 -2945 3415 5877
2989 5877 1130 -862 -213 -2160 -2803 -138 795 1223 2109 90 -921 1923 2519 -259 -2847 -4714
3005 -4714 -2439 4701 6100 1296 -1352 -2329 -2923 -6 770 -1961 -583 2701 1290 2 449 -864
3021 -864 -2208 -1441 -2432 -1581 3132 4232 1957 -1089 -3416 -2295 1688 1186 -2305 -336 2441 2587
$$ packed form
2907a592Q78N50M47k056k330L769K944r19P90K1m684j734J685L3K878M383j799
2924C264m167m73N62J232J526l010k938L442M012M18m14l552m117J650J788k84
2940a061K109K224k009j234l22k155P28L334k685k750L426L520M56n50m680l777
2956e426K467L666R20J78j481n29L355q67m620l63K078j021J250L687r89o32J04
2973A777l632l094K760L765P50j224k675R8M456K1m464k187o48J352O360K462
2989E877m747j992O49j947o43K665R33M28Q86k019j011K844N96k778k588j867
3005d714K275P140J399m804k648r77n94K917P76k731J378L284j411j288M47j313
3021h64j344P67r91Q51M713J100k275l046k327J121L983n02l491J969K777J46
$$ plain form
3037 2587 3482 917 -4225 -4055 356 981 748 2775 1723 164 -498 -1983 -1923 340 -409 -1671 -137
3054 -137 735 2230 4404 -58 -6634 -4710 259 2066 3357 2732 -1238 -1610 965 -182 -1471 -713
3070 -713 -1011 -254 1758 1829 2350 2878 -1161 -4972 -2875 -459 1849 4852 2301 -2733 -1323 678 -600
3087 -600 -1367 -1276 -2452 -240 3650 2477 378 -252 -2243 -2887 -1017 -636 1435 3537 1098 -1167 337
3104 337 -115 -1573 -218 -1224 -2441 2052 5470 2208 -563 -1666 -3371 -1867 1358 1151 507 973
3120 973 263 454 1310 -1411 -2771 -1591 -2430 -1068 3635 4278 540 -589 -2761 -4519 -710 3130
3136 3130 1172 31 604 92 1538 2115 -782 -2915 -2211 -1613 1738 5105 2542 -343 -867 -3248
3152 -3248 -3288 1146 1877 -338 524 1060 -356 947 1255 -2165 -3351 -1993 -382 2602 3920 921
$$ packed form
3037B587Q95k565n142J70M411O25k33K027j052j559o62j485O0K263p49j262J534
3054a37Q72J495K174m462o576J924M969J807J291o25l970l72K575j147j289P58
3070g13k98P57K012P1N21N28m039l811K097K416K308L003k551n034J410K001j278
3087f00p67R1j176K212L890j173k099o30j991o44J870L81K071K102k439k265J504
3104C37m52j458J355j006j217M493L418l262k771j103j705J504L225k07o44M66
3120I73p10J91Q56k721j360J180q39J362M703O43l738j129k172j758L809L840
3136C130j958j141N73n12J446N77k897k133P04N98L351L367k563k885n24k381
3152c248m0M434P31k215Q62N36j416J303L08l420j186J358J611K984J318k999
$$ plain form
3168 921 -1287 -1621 -2591 -873 1323 -197 -673 2283 1948 582 1507 -549 -4166 -2050 951 1350 2887
3185 2887 2807 -55 -1435 -1032 -1571 -399 377 -1125 -403 1868 1568 1689 1013 -3656 -5246 -820 1655
3202 1655 1834 3072 1099 -2483 -1126 225 -962 -484 42 -775 883 2446 1970 1923 137 -3958 -3690
3219 -3690 -119 1513 3222 3865 -638 -3153 -236 498 -1119 -757 -1109 -1453 1922 3292 848 -579
3235 -579 -1828 -3363 -2194 -74 821 2910 2752 -1161 -1885 189 -739 -1030 58 -1296 -499 4111 4146
3252 4146 146 -1928 -2617 -2541 674 1945 376 739 1256 257 331 -631 -2411 -1562 -205 -1180 828 4095
3270 4095 2102 -1003 -2245 -3879 -2802 2421 3049 -272 -749 127 882 1779 -98 -3485 -2386 -92
3286 -92 1234 3213 3163 271 -867 -1333 -3653 -1727 2885 2346 193 203 -670 -10 2075 -89 -4030
$$ packed form
3168I21k208l34r70J718K196j520m76K956l35j366R25k056l617K116L001L99J537
3185B887q0k862j380M03n39J172P76j502P22K271l00J21o76m669j590M426K475
3202A655J79J238j973l582J357J351j187M78N26q17J658J563m76m7j786m095K68
3219c690L571J632J709O43m503k515K917P34j617L62l52l44L375J370k444j427
3235e79j249j535J169K120Q95K089j58l913p24K074r28k91J088j354P97M610L5
3252D146m000k074o89P6L215J271j569L63N17r99P4r62j780Q49J357r75K008L267
3270D095j993l105j242j634J077N223O28l321m77Q76P55Q97j877l387J099K294
3286i2J326J979n0k892j138m66k320J926M612n39k153J0q73O60K085k164l941
$$ plain form
3303 -4030 -3418 -200 2453 4135 1616 -2018 -1682 -1166 -2068 -669 865 242 1565 2018 -599 -509 1165
3320 1165 -1039 -3049 -1164 731 2444 4374 1461 -2978 -2304 -166 326 666 -592 -1216 1748 3053
3336 3053 726 -698 -1786 -3770 -1837 958 938 1473 3146 -188 -3229 -1996 -452 238 954 -770
3352 -770 -1766 1618 3658 2246 -349 -3509 -4391 229 3317 1940 1509 1415 -1194 -1568 -115 -1125 -621
3369 -621 1265 81 -687 1604 1886 788 -807 -3868 -4200 240 3179 2048 1070 -893 -2124 53
3385 53 683 -1986 -1504 605 548 2032 2851 343 -1101 -554 -2392 -2167 1362 2587 2095 1462 -760 -1693
3403 -1693 475 372 -1850 -1552 -644 771 3711 3154 -1824 -3029 -1571 -2135 -170 2014 777 199
3419 199 929 -158 -849 69 -639 -1761 -1082 -354 1799 4654 2406 -2395 -2829 -1961 -1023 2045 2778 -243
$$ packed form
3303d030O12L218K653J682k519l634L36N16r02J399J534o23J323M53k617R0J674
3320A165k204k010J885J895J713J930k913m439O74K138M92L40j258o24K964J305
3336C053k327j424j088j984J933K795k0N35J673l334l041J233J544O90P16j724
3352g70r96L384K040j412k595l160q82M620L088j377m31r4k609l74J453j010N04
3369f21J886j184p68K291K82j098j595l061l32M440K939j131r78j963j231K177
3385E3O30k669M82K109n7J484Q19k508j444N47j838K25L529J225m92o33k222r33
3403a693K168j03k222K98R08J415K940n57m978j205J458n64J965K184j237n78
3419A99P30j087o91R18p08j122O79P28K153K855k248m801m34Q68R38L068P33l021
$$ plain form
3437 -243 -374 1193 637 119 -216 -2438 -2661 96 1031 2008 3447 356 -2908 -2717 -2118 -995 1877
3454 1877 1852 -537 181 888 75 353 -744 -3100 -1475 1559 1921 2333 2146 -910 -2327 -677 -871
3471 -871 -682 1367 1115 415 1456 1147 -648 -837 -1930 -2786 -48 2098 1754 1920 460 -2921 -2202
3488 -2202 8 -304 -556 305 -376 434 2443 1407 -628 -1706 -3074 -2170 1946 3203 1934 1649 -495
3505 -495 -2880 -1068 690 -64 158 509 -689 1105 2660 978 -1111 -2334 -3758 -1627 2757 2684
3521 2684 1101 530 -1546 -2367 -302 62 -1176 -37 498 721 1818 1501 -924 -1495 -1545 -2296 298
3538 298 3001 1791 656 681 -942 -1182 722 -383 -1757 -313 1111 2231 2822 -51 -2816 -2117
3554 -2117 -1270 -1078 1588 2020 -67 253 298 -1292 -964 192 -1493 -1505 174 922 2653 3184 -548 -3389
$$ packed form
3437b43j31J567n56n18l35k222k23K757R35R77J439l091l264J91N99J123K872
3454A877k5k389P18P07q13K78j097k356J625L034L62M12j87l056j417J650j94
3471h71J89K049k52p00J041l09j795j89j093q56K738K146l44J66j460l381P19
3488b202K210l12k52Q61o81Q10K009j036k035j078j368R04M116J257j269k85k144
3505d95k385J812J758p54K22L51j198J794J555j682k089j223j424K131M384p3
3521B684j583n71k076q21K065L64j238J139N35K23J097l17k425n71n0p51K594
3538B98K703j210j135K5j623k40J904j105j374J444J424J120N91k873k765O99
3554b117Q47J92K666M32k087L20M5j590L28J156j685j2J679P48J731N31l732k841
$$ plain form
3572 -3389 -2376 -742 775 3048 1572 -682 223 927 -217 -473 -1016 -1836 -451 1229 1247 2136 2062
3589 2062 -1839 -3235 -2217 -1125 1028 3188 817 -1322 -82 1024 -38 -683 -2355 -2162 1190
3604 1190 2633 1792 1839 -28 -2486 -1346 -253 -778 694 2649 866 -302 518 380 -349 -593 -2544
3621 -2544 -1946 1546 2985 2047 586 -2356 -3049 -161 677 -892 -262 914 455 1562 1490 -1221 -1757
3638 -1757 -1131 -1565 -238 2333 2567 1775 313 -2418 -2531 751 1531 -138 -257 -53 660 2665 1676
3655 1676 -1987 -2681 -1996 -993 1747 2791 849 359 107 -2375 -2448 -94 482 133 187 -378 382 2278
3673 2278 921 -1940 -2459 -2336 -244 3238 2884 -163 -31 429 -1229 -1018 -74 -770 373 1806 884
3690 884 763 884 -633 -1784 -1967 -1697 547 3292 1494 -906 -490 -712 -1113 70 -724 -2546 -324
$$ packed form
3572c389J013J634J517K273j476k254R05P04j144k56n43q20J385J680J8Q89p4
3589B062l901j396J018J092K153K160k371k139J240J106j062o45j672J93L352
3604A190J443q41M7j867k458J140J093n25J472J955j783j168Q20j38p29k44j951
3621b544N98L492J439r38j461k942o93K888Q38j569O30J176m59J107p2k711n36
3638a757O26m34J327K571K34p92j462k731j13L282P80j669j19K04P13K005r89
3655A676l663o94O85J003K740J044j942m90k52k482p3K354N76l49N4n65P60J896
3673B278j357k861n19J23K092L482l54l047J32M60j658K11R44o96J143J433r22
3690H84j21J21j517j151j83K70K244K745j798k400M16k22m01J183p94j822K222
$$ plain form
3707 -324 2512 2300 1242 -346 -2518 -2280 -421 -89 1278 2639 895 -543 -159 -612 -127 945 -961
3724 -961 -2190 341 2284 2471 2020 -1024 -3909 -2152 513 489 1237 1439 -292 -380 233 -861 -1139 -399
3742 -399 -1146 -647 1080 1639 1861 1475 -1862 -3437 -1061 725 825 1688 1062 -679 530 1266 -731
3759 -731 -1570 -1162 -852 954 2444 1574 625 -329 -2309 -1995 -108 13 265 1468 452 -598 779
3776 779 599 -1595 -1611 -1616 -892 1806 3475 1334 -479 -1512 -2139 -593 1093 339 345 1004 351 792 1669
3795 1669 -407 -2141 -1273 -1282 -131 2810 2989 168 -1017 -1781 -2210 -143 1091 -127 -381 247 407
3812 407 1211 808 -1495 -2515 -1464 -742 1095 3237 1501 -514 -480 -1148 -1734 449 915 -394 549
3829 549 1437 929 1135 206 -1995 -2052 -870 -39 2187 2549 -144 -915 -323 -904 -930 196 -1081 -1172 1339
$$ packed form
3707c24K836k12j058j588k172K38J859L32J367J361j744j438L84m53M85J072j906
3724i61j229K531J943J87m51l044k885J757K665k4P48K02j731q8O13j094k78P40
3742c99p47M99J727N59K22l86l337j575K376J786J00Q63o26j741J209P36j997
3759g31q39M08L10J806J490q70r49r54j980L14J887J21K52J203j016j050J377
3776G79j80k194j6nP24K698J669k141j813j033o27J546J686p54OO59o53M41Q77
3795A669k076j734Q68rJ151K941J79k821j185p64m29K067J234j218k54O28J60
3812D07Q04m03k303j020J051P22J837K142j736k015L4o68n86K183M66j309R43
3829E49Q88n08K06r29k201n7J182Q31K226L62k693p71N92n81k6J126j277r1K511
$$ plain form
3848 1339 2006 701 142 -1123 -2824 -1489 219 1042 2142 1683 -466 -817 -239 -597 173 180 -1405 -304
3866 -304 2248 2113 1310 268 -2126 -3132 -191 1296 1115 1524 566 -1073 -485 -346 -1028 -384 -456 -993
3884 -993 463 1913 1448 1033 -675 -3090 -2436 681 1452 1065 1559 -293 -834 657 310 -1456 -890
3901 -890 -317 322 1879 1964 460 -34 -954 -2299 -994 646 860 1185 1371 -794 -695 890 -516 -2116
3919 -2116 -1442 -477 795 2994 2033 -750 -1599 -1406 -1056 393 532 -5 941 1002 -64 434 534 -1449
3937 -1449 -1481 -437 -641 1359 3526 1483 -1378 -1930 -1807 -694 1289 581 -754 270 963 510 576
3954 576 -895 -2177 -1193 -382 65 1753 2590 474 -1206 -1258 -2000 -384 1936 1002 -644 703 1100
3971 1100 951 772 -1094 -2641 -930 719 1498 2017 887 -897 -366 -553 -1807 -507 794 -160 45
$$ packed form
3848A339O67j305n59j265j701J335J708Q23J100m59k149l51N78l58P70Pj585J101
3866c04K552j35q03j042k394j006K941J487j81M09r58j639N88J39o82O44p2n37
3884i93J456J450m65m15j708k415O54L117P71l87M94j852n41J491l47j766N66
3901h90N73O39J557Q5j504m94r20j345J305J640K14L25J86k165R9J585j406j600
3919b116O74R65J272K199r61k783q49J93L50J449J39n37R46O1j066M98J00j983
3937a449l2J044k04K000K167k043k861n52J23J113J983p08j335J024O93m53O6
3954E76j471j282R84Q11M47J688Q37k116j680n2p42J616K320r34j646J347L97
3971A100j49j79j866j547J711J649P79N19j130j784N31j87j254J300J301r54K05
$$ plain form
3988 45 1215 392 165 -117 -2236 -2791 -299 1519 2040 1776 -461 -1721 -32 168 -464 -219 -254 -613
4006 -613 1926 2603 468 -79 -757 -2483 -1719 767 1645 1830 1683 -612 -2024 -244 62 -340 -293 -1198
4024 -1198 -396 2046 2288 227 -1183 -2141 -2500 -178 1645 763 1333 1284 -523 -737 -10 -565 -512 266
4042 266 -49 342 2248 1713 -118 -1140 -2378 -1430 1047 1592 545 722 533 -541 101 -100 -1886
4059 -1886 -1554 409 470 1115 1876 295 -1142 -1680 -1994 -894 1223 1186 305 391 110 -126 877 -190
4077 -190 -2498 -1176 659 1301 2598 1940 -829 -1754 -1082 -1149 -55 1395 402 227 432 3 -200 339
4095 339 -1122 -2392 -677 511 1254 2390 815 -1816 -1599 -756 -736 751 1110 -266 316 1312 498
4112 498 89 -215 -1496 -1190 503 1203 1895 1876 -2 -1271 -975 -1089 -426 1082 622 -643 764 1560
$$ packed form
3988D5J170q23k27k82k119n55K492J818N21k64k237j260J689K00o32K45l5l59
4006f13K539O77k135n47o78j726P64K486Q78J85j47k295j412J780L06m02M7r05
4024a198Q02K442K42k061j410r58l59K322J823q82N70m9j807k14P27n55N3P78
4042B66l15L91J906n35j831j022j238R48K477N45j047J77j89j074O42k01j786
4059a886L32J963O1O45P61j581j437n38l14J100K117l7q81Q6k81k36J003j067
4077a90k308J322J835O42J297o58k769r25O72o7J094J450r93j75K05m29k03N39
4095C39j461j270J715J188P43J136j575k631K17Q43K0J487L59j376N82R96q14
4112D98m09l04j281L06J693P00O92j9j878j269K96j14O63J508m60j265J407P96
$$ plain form
4130 1560 -45 -660 -1155 -2219 -1075 1180 1513 1310 692 -874 -1257 -327 -686 -441 727 40 273 1667
4148 1667 1562 -261 -583 -1349 -2014 276 2014 1702 1181 3 -1504 -682 240 -500 -430 156 -176 576
4166 576 2184 765 -1053 -1444 -2161 -1382 1178 1761 915 877 -464 -1523 -261 423 -566 -191 259 17
4184 17 1247 2268 502 -1356 -1706 -1517 -83 1803 1405 546 726 -269 -827 -93 -573 -1576 113 953
4202 953 489 1157 1128 -934 -1771 -1361 -1177 588 1620 363 201 254 -282 -40 207 -1484 -1866 460 1345
4221 1345 1433 1761 -14 -1713 -1107 -603 -394 1162 1602 183 177 177 -479 -109 63 -1764 -1639 534 1273
4240 1273 1873 1564 -1040 -2399 -1275 -603 61 1236 631 -100 811 496 -754 -324 -438 -1307 -363 1137
4258 1137 1227 1721 1226 -1179 -1886 -627 -351 660 1109 -219 -486 1210 744 -858 -930 -1500 -1419 659
$$ packed form
4130A560j605o15m95j064J144K255L33k03o18j566l83R30l59K45J168o87K33J394
4148A667j05j823l22p66o65K290J738l12n21j178j507Q22R22p40P0N86l32P52
4166E76J608j419j818l91p17P79K560N83q46l8j341j059J262O84r89L75M50k42
4184A7J230J021j766j858l50J89J434J886l98q59J80r95n58P34m80j003J689Q40
4202I53m64O68k9k062q37M10J84J765J032j257j62N3n36K42K47j691l82K326Q85
4221A345Q8L28j775j699O06N04K09J556M40j419o%o56L70J72j827J25K173P39
4240A273O00l09k604j359J124O72O64J175o05p31R11l15j250M30j14q69R44J500
4258A137R0M94m95k405p07J259K76J011M49j328k67J696m66j602p2n70Q1K078
$$ plain form
4276 659 1813 803 756 -258 -1407 -1331 -473 -414 546 1094 -399 259 1704 580 -860 -1311 -1800 -668
4294 -668 2025 2159 690 85 -756 -1300 143 71 -765 107 686 43 946 1200 -448 -1290 -1317 -1631 -240
4313 -240 2072 1604 461 -474 -1787 -1121 631 86 -1022 -61 681 784 1877 971 -1435 -1477 -753 -586
4331 -586 897 1748 1032 610 -158 -1479 -639 437 -338 -796 447 540 928 1809 -299 -2267 -1680 -508
4349 -508 151 1205 1219 6 152 197 -1005 -462 -353 -902 -245 1218 866 1091 1301 -750 -2040 -980
4367 -980 -113 911 1836 466 -535 375 317 -273 -261 -930 -1581 363 1911 1006 793 232 -1889 -1841 -762
4386 -762 -289 1005 1379 -3 -649 386 -64 -495 139 -1123 -1697 859 1971 1265 772 -520 -2133
4403 -2133 -984 234 314 823 1186 184 246 763 -645 -615 -394 -1322 -459 1358 1606 622 199 -1167 -1980
$$ packed form
4276F59J154j010m7j014j149P6Q58N9R60N48j493O58J445j124j440m51m89J132
4294f68K693J34j469o05q41n44J443p2q36Q72N79o43R03K54j648q42k7l14J391
4313b40K312m68j143r35j313O66J752n45j108R61P42J03J093r06k406m2P24J67
4331e86J483Q51p16m22p68j321Q40J076p75m58J243R3L88Q81k108j968N87J172
4349e08O59J054J4j213J46M5j202N43J09n49O57J463l52K25K10k051j290J060
4367i80Q67J024R25j370j001R10n8n90J2o69o51J944J548r05k13n61k121M8J079
4386g62M73J294L74j382o46J035m50m31O34j262n74K556J112p06m93j292j613
4403b133J149J218Q0N09L63j002O2N17j408L0K21r28Q63J817K48r84m23j366q13
$$ plain form
4422 -1980 -369 267 156 512 404 88 926 778 -1202 -1254 -1018 -857 884 2320 1265 74 -60 -1510
4440 -1510 -1047 554 170 -107 669 349 -40 1243 598 -1471 -1586 -1020 -251 1498 2195 461 -542 -867
4458 -867 -1516 -331 481 -254 -152 810 385 540 1290 -283 -1661 -1260 -482 276 2001 1836 242 -281
4476 -281 -792 -923 174 400 -394 -7 1157 811 1000 422 -1506 -2038 -362 -32 634 1717 575 -563
4494 -563 -269 -622 -957 -70 -281 -544 451 1329 583 861 -96 -1940 -1502 -93 582 1358 1498 -249 -351
4513 -351 491 -217 -712 11 -687 -519 1364 1496 563 282 -1081 -2183 -930 305 497 1476 753 -778
$$ packed form
4422a980J611O36j11L56j08l16Q38j48j980n2K36J61J741J436j055j191j34j450
4440a510M63J601l84k77P76l20l89J283o45k069j15N66P69J749O97j734j003l25
4458h67o49J185Q12p35J02R62m25J55P50j573j378M01P78P58J725j65j594n23
4476b81n11j31J097K26p94L87J164l46J89n78j928n32J676L30O66J083j142j138
4494e63K94l53l35Q87k11k63R95Q78p46K78r57j844M38J409O75P76J40j747j02
4513c51Q42p08m95P23o98J68J883J32r33k81j363j102J253J235J92R79p23j531
$$ [...]
8191A14
##END NTUPLES=NMR FID
##END=
