##TITLE=1H_CA-8573-1
 CDCl3, 8 sc, 
 15.3.2019
##JCAMPDX= 6.0         $$ Bruker NMR JCAMP-DX V2.0
##DATA TYPE= NMR FID
##DATA CLASS= NTUPLES
##ORIGIN= UXNMR, Bruker Analytische Messtechnik GmbH
##OWNER= root
$$ XWIN-NMR		Version 3.5
$$ Fri Mar 15 16:29:20 2019 Russian Standard Time (UT+4h)  she@DPX200
##.OBSERVE FREQUENCY= 200.131
##.OBSERVE NUCLEUS= ^1H
##.DELAY= (6, 6)
##.ACQUISITION MODE= SIMULTANEOUS
##.ACQUISITION SCHEME= undefined
##.AVERAGES= 8
##.DIGITISER RES= 18
##SPECTROMETER/DATA SYSTEM= spect
##.PULSE SEQUENCE= zg30
##.SOLVENT NAME= CDCl3
##.SHIFT REFERENCE= (INTERNAL, CDCl3, 0, 15.7039)
##AUDIT TRAIL= $$ (NUMBER, WHEN, WHO, WHERE, WHAT)
$$ ##TITLE= Audit trail, XWIN-NMR		Version 3.5
$$ ##JCAMPDX= 5.01
$$ ##ORIGIN= Bruker BioSpin GmbH
$$ ##OWNER= she
$$ F:/spectra/data/she/nmr/H-F/1/audita.txt
$$ ##AUDIT TRAIL=  $$ (NUMBER, WHEN, WHO, WHERE, WHAT)
(   1,<2019-03-15 16:28:01.23 +0400>,<she>,<DPX200>,
      <created by zg, POWCHK disabled, PULCHK disabled
       configuration hash MD5:
       00 E9 B6 7A A2 85 ED C7 34 08 36 98 17 FE 4E 26
       data hash MD5: 16K
       33 8D BE 59 6F 08 C5 C8 85 40 6D 93 EF 70 A3 2C>)
$$ ##END=
$$ 
$$ hash MD5
$$ F8 EF 0B F1 F0 09 FE 6C 20 3D AC EA C7 54 53 F0
##$RELAX= 
##$RELAX= 
##$RELAX= 
##$RELAX= 
##$RELAX= 
##$RELAX= 
$$ Bruker specific parameters
$$ --------------------------
##$DU= <F:/spectra>
##$EXPNO= 1
##$NAME= <H-F>
##$PROCNO= 1
##$TYPE= <nmr>
##$USER= <she>
##$AMP= (0..31)
100 100 100 100 100 100 100 100 100 100 100 100 100 100 100 100 100 100 
100 100 100 100 100 100 100 100 100 100 100 100 100 100 
##$AQSEQ= 0
##$AQ_mod= 1
##$AUNM= <au_zg>
##$AUTOPOS= <>
##$BF1= 200.13
##$BF2= 200.13
##$BF3= 200.13
##$BF4= 200.13
##$BF5= 200.13
##$BF6= 200.13
##$BF7= 200.13
##$BF8= 200.13
##$BYTORDA= 1
##$CFDGTYP= 0
##$CFRGTYP= 5
##$CHEMSTR= <none>
##$CNST= (0..31)
1 1 145 1 1 1 1 1 1 1 1 1 1 1 1 1 1 1 1 1 1 1 1 1 1 1 1 1 1 1 1 1 
##$CPDPRG= <>
##$CPDPRG1= <>
##$CPDPRG2= <>
##$CPDPRG3= <>
##$CPDPRG4= <mlev>
##$CPDPRG5= <mlev>
##$CPDPRG6= <mlev>
##$CPDPRG7= <mlev>
##$CPDPRG8= <mlev>
##$CPDPRGB= <>
##$CPDPRGT= <>
##$D= (0..31)
0 1.2 0 0 0 0 0 0 0 0 0 0.03 0 0 0 0 0 0 0 0 0 0 0 0 0 0 0 0 0 0 0 0 
##$DATE= 1552652880
##$DBL= (0..7)
120 120 120 120 120 120 120 120 
##$DBP= (0..7)
150 150 150 150 150 150 150 150 
##$DBP07= 0
##$DBPNAM0= <>
##$DBPNAM1= <>
##$DBPNAM2= <>
##$DBPNAM3= <>
##$DBPNAM4= <>
##$DBPNAM5= <>
##$DBPNAM6= <>
##$DBPNAM7= <>
##$DBPOAL= (0..7)
0.5 0.5 0.5 0.5 0.5 0.5 0.5 0.5 
##$DBPOFFS= (0..7)
0 0 0 0 0 0 0 0 
##$DE= 6
##$DECBNUC= <off>
##$DECIM= 24
##$DECNUC= <off>
##$DECSTAT= 4
##$DIGMOD= 1
##$DIGTYP= 9
##$DL= (0..7)
0 120 120 120 120 120 120 120 
##$DP= (0..7)
150 150 150 150 150 150 150 150 
##$DP07= 0
##$DPNAME0= <>
##$DPNAME1= <>
##$DPNAME2= <>
##$DPNAME3= <>
##$DPNAME4= <>
##$DPNAME5= <>
##$DPNAME6= <>
##$DPNAME7= <>
##$DPOAL= (0..7)
0.5 0.5 0.5 0.5 0.5 0.5 0.5 0.5 
##$DPOFFS= (0..7)
0 0 0 0 0 0 0 0 
##$DQDMODE= 0
##$DR= 18
##$DS= 0
##$DSLIST= <SSSSSSSSSSSSSSS>
##$DSPFIRM= 0
$$ [...]
##$SUBNAM2= <"">
##$SUBNAM3= <"">
##$SUBNAM4= <"">
##$SUBNAM5= <"">
##$SUBNAM6= <"">
##$SUBNAM7= <"">
##$SUBNAM8= <"">
##$SUBNAM9= <"">
##$SW= 24.9337681822398
##$SWIBOX= (0..15)
0 0 2 0 0 0 0 0 0 0 0 0 0 0 0 0 
##$SW_h= 4990.01996007984
##$TD= 16384
##$TD0= 1
##$TE= 0
##$TE2= 300
##$TE3= 300
##$TEG= 300
##$TL= (0..7)
0 120 120 120 120 120 120 120 
##$TP= (0..7)
150 150 150 150 150 150 150 150 
##$TP07= 0
##$TPNAME0= <>
##$TPNAME1= <>
##$TPNAME2= <>
##$TPNAME3= <>
##$TPNAME4= <>
##$TPNAME5= <>
##$TPNAME6= <>
##$TPNAME7= <>
##$TPOAL= (0..7)
0.5 0.5 0.5 0.5 0.5 0.5 0.5 0.5 
##$TPOFFS= (0..7)
0 0 0 0 0 0 0 0 
##$TUNHIN= 0
##$TUNHOUT= 0
##$TUNXOUT= 0
##$USERA1= <user>
##$USERA2= <user>
##$USERA3= <user>
##$USERA4= <user>
##$USERA5= <user>
##$V9= 5
##$VALIST= <valist>
##$VCLIST= <CCCCCCCCCCCCCCC>
##$VD= 0
##$VDLIST= <DDDDDDDDDDDDDDD>
##$VPLIST= <PPPPPPPPPPPPPPP>
##$VTLIST= <TTTTTTTTTTTTTTT>
##$WBST= 1024
##$WBSW= 4
##$XGAIN= (0..3)
0 0 0 0 
##$XL= 0
##$YL= 0
##$YMAX_a= 249055
##$YMIN_a= -387856
##$ZGOPTNS= <>
##$ZL1= 120
##$ZL2= 120
##$ZL3= 120
##$ZL4= 120
##$ABSF1= 10
##$ABSF2= 0
##$ABSG= 5
##$ABSL= 3
##$ALPHA= 0
##$AQORDER= 0
##$ASSFAC= 0
##$ASSFACI= 0
##$ASSFACX= 0
##$ASSWID= 0
##$AUNMP= <proc_1d>
##$AZFE= 0.1
##$AZFW= 0.1
##$BCFW= 1
##$BC_mod= 2
##$BYTORDP= 1
##$COROFFS= 0
##$CY= 11.3945322036743
##$DATMOD= 1
##$DC= 2
##$DFILT= <>
##$DTYPP= 0
##$F1P= 18.9103706918063
##$F2P= -1.10871071338519
##$FCOR= 0.5
##$FTSIZE= 0
##$FT_mod= 4
##$GAMMA= 1
##$GB= 0.15
##$INTBC= 1
##$INTSCL= 1
##$ISEN= 128
##$LB= 0.24
##$LEV0= 0
##$LPBIN= 0
##$MAXI= 10000
##$MC2= 0
##$MEAN= 0
##$ME_mod= 0
##$MI= 1.114404
##$NCOEF= 0
##$NC_proc= 0
##$NLEV= 6
##$NOISF1= 3.799351
##$NOISF2= 2.8
##$NSP= 1
##$NTH_PI= 0
##$NZP= 0
##$OFFSET= 15.70392
##$PC= 1
##$PHC0= -9221.953
##$PHC1= 19.00026
##$PH_mod= 1
##$PKNL= yes
##$PPARMOD= 0
##$PSCAL= 0
##$PSIGN= 0
##$REVERSE= no
##$SF= 200.130013532006
##$SI= 16384
##$SIGF1= 3
##$SIGF2= 2
##$SINO= 400
##$SIOLD= 16384
##$SREGLST= <1H.CDCl3>
##$SSB= 0
##$STSI= 0
##$STSR= 0
##$SW_p= 3612.71676300578
##$SYMM= 0
##$S_DEV= 0
##$TDeff= 0
##$TDoff= 0
##$TI= <>
##$TILT= no
##$TM1= 0
##$TM2= 0
##$TOPLEV= 0
##$USERP1= <user>
##$USERP2= <user>
##$USERP3= <user>
##$USERP4= <user>
##$USERP5= <user>
##$WDW= 1
##$XDIM= 8192
##$YMAX_p= 0
##$YMIN_p= 0
$$ End of Bruker specific parameters
$$ ---------------------------------
##NTUPLES= NMR FID
##VAR_NAME=  TIME,          FID/REAL,        FID/IMAG
##SYMBOL=    X,             R,               I
##VAR_TYPE=  INDEPENDENT,   DEPENDENT,       DEPENDENT
##VAR_FORM=  AFFN,          ASDF,            ASDF
##VAR_DIM=   8192,          8192,            8192
##UNITS=     SECONDS,       ARBITRARY UNITS, ARBITRARY UNITS
##FACTOR=    0.0002004,     1,               1
##FIRST=     0,             0,               0
##LAST=      1.6414764,     0,               0
##MIN=       0,             -387856,         0
##MAX=       1.6414764,     249055,          0
$$ Real data points
##PAGE= N=1
##DATA TABLE= (X++(R..R)), XYDATA
$$ [...]
3145F012q5J569J277j042m407l735J90K638j69m553n216j574K213K112p29k810
3161h309K22K903L304J497L47J020K295J365r80j270J133K493l35l880l884j12
3177b191L213J608l123m907j229K656L207J145j172m7K285K908L4n02N82J239
3193E706l57k147k743L32K364J68l956n436k021K829K487n82k998o81K948M073
3209a4J936j49N20J899J838m32k49O89K161m6l213m598j861J366O36l228n218
3226g963k609J985L236L93k111q69K506L579J884N24P20K010K166l87j487O01
3242D178K158O72l092m925k673J770K010r10m107k099K181L580Q99j559o89J768
3258h38L072J384L35L44J675R53k092l436j452J270J315k594m764k680K461L194
$$ plain form
3145 6012 5927 7496 8773 7731 3324 -411 -221 2417 2248 -2305 -7521 -9095 -6882 -4770 -5499 -8309
3161 -8309 -8087 -5184 -1880 -383 -36 984 3279 4644 3664 2394 3527 6020 5685 1805 -2079 -2191
3177 -2191 1022 2630 -493 -5400 -6629 -3973 -766 379 -793 -840 1445 4353 4387 3885 4467 5706
3193 5706 5349 3202 459 791 3155 3323 -633 -6069 -8090 -5261 -2774 -3356 -6354 -7035 -4087 -14
3209 -14 1922 1773 2293 4192 6030 5598 5349 6038 8199 8153 4940 342 -1519 -153 483 -2745 -7963
3226 -7963 -10572 -8587 -5351 -4958 -7069 -7938 -5432 -1853 31 555 1275 3285 5451 5064 3577 4178
3242 4178 6336 7008 3916 -1009 -3682 -1912 98 -812 -4919 -7018 -4837 -1257 -358 -1917 -2606 -838
3258 -838 2234 3618 3953 4297 5972 6925 4833 1397 -55 1215 2530 -64 -4828 -7508 -5047 -1853
3274a853N82k953j688J108M256K732L40N20J983K459J66j281l43R70J73l118m547
3291d94l052J147J282j966l823l913R78L238J661j270q24J672M080K656J058P17
3307C147K626J494m00k121j783R40J568j622m291k948J3K312r72l339k898J183
3323g091L593K306j95n70J797K866J771m70n58O32J234p31k850j738Q26J470j551
3340G41m108l621J012L007J466j097j943J443L912L539L85p87P66J493P74j701
3356E281j001L81P62j703m680l483l33K134n04l523l914L28L749L497Q05j196
3372c400J339K658K493J27N7J347K204Q89k448k459k67J366o71m140m142r02J608
3389d341Q91j769k149O05L212K344J29j302J149K730K249l47r99O38J892R43k104
$$ plain form
3274 -1853 -1271 -4224 -5912 -4804 -548 2184 2524 3044 5027 7486 7652 6371 6028 6998 7171 4053 -494
3291 -494 -3546 -2399 -1117 -3083 -6906 -10819 -9841 -6603 -4942 -6212 -7036 -5364 -1284 1372 2430 3147
3307 3147 5773 7267 6867 4746 2963 3903 5471 3849 -442 -3390 -3377 -1065 -2037 -5376 -8274 -7091
3323 -7091 -3498 -1192 -1387 -1957 -160 2706 4477 4007 3449 4081 5315 4584 1734 -4 822 2292 741
3340 741 -3367 -6988 -5976 -2969 -1503 -2600 -4543 -3100 812 4351 4736 3949 4715 6208 6982 5281
3356 5281 4280 4661 5423 3720 -960 -4443 -4776 -2642 -3146 -6669 -10583 -10255 -6506 -3009 -2204 -3400
3372 -3400 -2061 597 3090 3217 3274 4621 6825 7714 5266 2807 2540 3906 3235 -905 -5047 -5949 -4341
3389 -4341 -3450 -5219 -7368 -6763 -3551 -1207 -1078 -2380 -1231 1499 3748 3401 2402 3040 4932 5875 3771
3406C771l024j213R31j99k410k566M74K890K244j321k404L61L425L001O47j347
3422C260r5J441J708p79j643p80P2j077l649l711p01K106R81j334l463n00K603
3439e561L307P05o96K0K788L304N57K8O35K131M50k095l292j746J226R50k425
3456B86m093k234J226J637j231k106j034J875K622P02n2R33L535K711k85k050
3472B442r27J338J742m45k784j725J08Q74j545k619o32J986J529n23k031N05K934
3489B27M244O42r32j483J248J918j91j822j849L73P0j912l154j712R23Q36j663
3506d237k939j310K488M234K093q60k83J970K956L82n48l50J831J467j205l316
3522B373j840r4Q18j848m001l509L07J824Q99l97p68J383K836J395n33O34K725
$$ plain form
3406 3771 747 -466 465 266 -2144 -4710 -4236 -1346 898 -423 -2827 -2466 959 3960 4607 3260
3422 3260 3165 4606 6314 5535 3892 3112 3184 2107 -1542 -5253 -5954 -3848 -2867 -4201 -7664 -8164 -5561
3439 -5561 -2254 -1549 -2245 -2225 563 3867 4424 4452 5087 7218 7668 5573 2281 535 1761 2711 286
3456 286 -3807 -6041 -4815 -3178 -4409 -6515 -7549 -5674 -3052 -2350 -2402 -1469 2066 4777 4492 2442
3472 2442 1515 2853 4595 4150 1366 -359 -251 623 -922 -3541 -4173 -2187 -658 -1181 -3212 -2707 227
3489 227 4471 5113 4181 2698 3946 5864 5673 3851 2002 2375 2445 533 -2621 -4333 -3410 -2574 -4237
3506 -4237 -7176 -8486 -5998 -1764 329 -531 -814 1156 4112 4494 3946 3596 5427 6894 5689 2373
3522 2373 533 439 1257 -591 -4592 -8101 -7794 -5970 -5071 -5468 -6236 -4853 -2017 -622 -1155 -521 2204
3539B204L479P82k855j124J209K126O4l042l207j782R6J31j939j088J085J772
3555b089K62j488k29K694L754J248j277j856J763K827R26j659k882j046J3r18
3571D3k190k169O47J804l85j985j031J430L317K060l79p50J732L235J859q41j472
3588D925j69O42j043k966l210p98J403m24l389k893r02K052J475m89l16J152K450
3605b500J975M24L91K839L502J060k501k946j21K113J098k545l136j776M32O11
3621a080j014j762m13J286P44o73j35K512L400J753j275k260O0K471J685j503
3637C796l380j421N40P65j043k210j163J325O23j176p57J341L234K437K20j475
3653A656J110K480J789r96k414o14Q05N88j720l781j835O13K20j753k977j797
$$ plain form
3539 2204 5683 6465 3610 2486 3695 5821 5885 2843 -364 -2146 -2050 -1919 -3858 -4946 -3861 -2089
3555 -2089 -1827 -3315 -3544 -850 2904 4152 2875 1019 2782 5609 6535 4876 1994 948 961 43
3571 43 -2147 -4316 -3669 -1865 -2250 -4235 -5266 -3836 -519 1541 1162 412 2144 5379 7238 6397 4925
3588 4925 4756 5398 4355 1389 -1821 -2619 -1216 -1640 -5029 -7922 -8824 -6772 -5297 -5786 -6102 -4950 -2500
3605 -2500 -525 -101 290 3129 6631 7691 5190 2244 2123 4236 5334 2789 -347 -2123 -1691 -1080
3621 -1080 -2094 -3856 -4269 -2983 -2239 -2912 -3047 -535 2865 4618 3343 1083 1143 3614 5299 3796
3637 3796 416 -1005 -465 300 -743 -2953 -4116 -2791 -2168 -3344 -4101 -2760 474 2911 3131 1656
3653 1656 2766 5246 7035 6039 3625 3011 3816 4404 2684 -1097 -2932 -2319 -2099 -3852 -6829 -8626
3669h626J317K351O28l6J028K641J929j62q68J312L040K132j226k950j015J665
3685C160J223j548m004k674m5J189p1j187o42J226J550j97k81R14K949K317r58
3702B921k066l6K703L035p55l267l034K25O16o41k335r09Q18J239K26j161K59
3719b162J918K352k58j495N43L023K517j19k391j564N91R30r57m248k663n2J052
3736b983j72j927j355P39J344R21m92N48K597K804M37l78N63K362K485n48l273
3753C672k631J95J615q86k867l376n60P86P24j137j351N2J574N01P3J274L504
3770A162L307P6j846j395J593K696j70k999k799m0J485M53j860k582n40O37O91
3787b131p04N90J754K760O26j097oK127K280j89k678k610N10J696n0k514l690
$$ plain form
3669 -8626 -7309 -4958 -4330 -4366 -3338 -697 1232 1070 202 1514 4554 6686 5460 2510 1495 3160
3685 3160 4383 2835 -1169 -3843 -3888 -2699 -2770 -3957 -4599 -3373 -1823 -2020 -2301 -1387 1562 3879 2921
3702 2921 855 819 3522 6557 5802 2535 -499 -274 342 -299 -2634 -3543 -2725 -1486 -1260 -2421 -2162
3719 -2162 -244 2108 1850 355 898 3921 6438 6319 3928 2364 2955 3885 2928 -1320 -3983 -4035 -2983
3736 -2983 -3155 -5082 -6437 -5698 -4354 -3433 -3925 -3377 -780 2024 2461 2083 2646 5008 7493 6945 3672
3753 3672 1041 1236 2851 1965 -902 -4278 -4838 -4052 -3328 -4465 -5816 -5764 -4190 -3689 -3616 -2342 1162
3770 1162 4469 4545 2699 1304 2897 5593 5423 2424 -375 -415 1070 1523 -337 -2919 -3459 -2822 -2131
3787 -2131 -2835 -2245 -491 2269 2895 1798 1792 3919 6199 6010 3332 722 1232 2928 2878 364 -3326
3804c326j382J082K86j489j695N55J655J811P2R21K012K862J244j335l76J389
3820D286K133L16k779l075n14J565J83l044m198j757N95J206m53k77J061K171
3836b581J131o7L6K035K858R97j230j429J051K431R62k770l836r87P76R46j458
3853a135k214r64J345J462K88l09J195J908J081o65q76J077K726J460k277l047
3869A055l93J193P53k620l680j505Q73J504J36j575K36J540J747N31j97J064K612
3886C274J747r25j043R18J789O14k349l714k153M86J057j572l002j716P15J953
3902c921M1j154J02J543J841N20k35J926L169J385n43k609k69J962J204j854l211
3919a03k303J224J536m60j944j720O31J199R5m88J082K160J577l13n96N75K222
$$ plain form
3804 -3326 -4708 -3626 -3340 -4829 -6524 -5969 -4314 -2503 -2431 -1510 502 3364 4608 3273 2897 4286
3820 4286 6419 6735 3956 881 367 1932 2115 -929 -5127 -6884 -6289 -5083 -5536 -5813 -4752 -2581
3836 -2581 -1450 -1517 -1481 554 3412 4409 3179 1750 2801 5232 6194 3424 -412 -1399 -623 323 -1135
3853 -1135 -3349 -4313 -2968 -1506 -1218 -1527 -332 1576 2657 1992 1116 2193 4919 6379 4102 1055
3869 1055 662 1855 2608 -12 -3692 -5197 -4324 -2820 -2684 -4259 -4023 -2483 -736 -205 -402 662 3274
3886 3274 5021 4096 3053 3971 5760 6374 4025 311 -1842 -1356 -299 -1871 -4873 -6589 -5874 -3921
3902 -3921 -3880 -5034 -4932 -3389 -1548 -1028 -1263 663 3832 5217 4674 2065 1796 3758 4962 3108 -103
3919 -103 -2406 -1182 354 -106 -2050 -3770 -3139 -1940 -1845 -2333 -1251 909 2486 2173 1577 2152 4374
3936D374O92j436k898j431R94J829p71k813j998M95J300K18j467p74Q41K397R75
3953E27r6J013J964K161o19k057o25J252J036j121l349k240L61J376p84l284k387
3970f872N0J592J036m68J51J803K351J301n67M31K314J830o53j429q95J130J856
3987D961j052l351l062Q2J298n7j818k150M06J986J067L9J55J692J767O04j178
4004A389m48K090J939m8k420k040J45J543p03k402k889l76K011O10q44n0J012
4021a481J981J109p99p6J565K115O22j116j469N63J727r15l229l402r10J244j04
4038b575k310j826K61J835J690l80r96J646K740J712j23L85J750K299j76j420
4054D512k299J6J345o14l131l449q26J373J068j585j477l85J597J993j99r5J791
$$ plain form
3936 4374 5066 3630 732 -699 295 2124 1353 -1460 -3458 -2963 -1663 -1445 -2912 -3686 -2845 -448 527
3953 527 431 1444 3408 5569 4950 2893 2268 3520 4556 3435 86 -2154 -1793 -417 -1201 -4485 -6872
3970 -6872 -6822 -5230 -4194 -4662 -4511 -2708 -357 944 377 808 3122 4952 4299 2870 1975 3105 4961
3987 4961 3909 558 -2504 -2422 -1124 -1181 -2999 -5149 -4743 -2757 -1690 -1651 -1496 196 1963 2567 1389
4004 1389 941 3031 4970 4922 2502 462 607 2150 1447 -955 -3844 -4220 -2209 -1599 -2443 -2493 -1481
4021 -1481 500 1609 810 734 2299 4414 5036 3920 2451 3014 4741 3826 597 -2805 -3715 -2471 -2575
4038 -2575 -4885 -6711 -6450 -4615 -2925 -3305 -4301 -2655 85 1797 1674 2059 3809 6108 5932 4512
4054 4512 2213 2229 3574 2960 -171 -3620 -4446 -3073 -2005 -3590 -5067 -5452 -3855 -1862 -2061 -2156 -365
4071c65K383J355o30n34J116J759L84k697k845p09J378R70j481k728q02J183Q67
4088a396k99q87R64J876J591K66l67J020K408P64j619k470m11J126J24k348k818
4105b476j221R33L81j587k133p35K591J681J77n77J138K706K435N54j233R68J052
4122D654R42j847j928q07J148M53k561l439j249M63J377p92j884p72K275K350
4138a617J104J50N13J611J524n68j215K58K405J079j833k815j330Q54J183j252
4154E1k817j188L81K076P5m18O72J888J783l63j346O43J990J523m80k249j184
4171A037Q31J075j200l072j725L83M29o44j406q17K137K303L73j017p84K508K094
4188B505J085n22q47J230Q40n27k021j512J19K20j948k807j477R97J961j93j869
$$ plain form
4071 -365 2018 3373 2743 2209 3325 5084 5468 2771 -74 -783 595 1565 84 -2644 -3446 -2263 -1396
4088 -1396 -1695 -2582 -1618 258 1849 2115 1748 2768 5176 5940 4321 1851 1440 2566 2690 342 -2476
4105 -2476 -3697 -2764 -2383 -3970 -6103 -6838 -4247 -2566 -2389 -2966 -1828 878 3313 3867 2634 3602 4654
4122 4654 5596 3749 1821 1014 2162 2615 54 -3385 -4634 -4171 -2794 -3586 -5470 -6242 -3967 -1617
4138 -1617 -513 -363 150 1761 3285 2717 1502 1760 4165 5244 3411 596 -734 120 1303 51
4154 51 -2766 -3954 -3573 -1497 -1422 -1840 -1168 720 2503 2140 794 1437 3427 4950 4470 2221 1037
4171 1037 1868 2943 1743 -1329 -3054 -2671 -2242 -2886 -4292 -5109 -2972 -669 -296 -1313 -2097 411 2505
4188 2505 3590 3068 2221 3451 4291 3764 1743 231 350 570 -1378 -4185 -5662 -4665 -2704 -2897 -4766
4205d766j168J550K453J524j04M61J615J780L70o80o13J735J180j210l116k101
4221a090P31J132K84k322k061J16J183P15q25o10J444J937Q83n49q1J532K307
4238D726l7k738k088J60J587J18k104k411M19P81l26j461p49J620K292M71r64
4255g04k13K087L065R79q07j833K11P85j4j719j953j89J63j159k909j802J96J989
4273c827M12j548j665J578L166J981N62l65J330J499J272j054r09R03J249m26
4289D158k493k471NQ80J77k431k040j66K011J503l65k71R91K125O58l53j149J196
4307A965K118P97k152k497pP99N75j836k656p54N19Q54r90k93J000K696J199o87
4325F50o80J324K182J649n03k437l91J304O35j466k525j432J28p64j598j811J32
$$ plain form
4205 -4766 -5934 -4384 -1931 -407 -511 -50 1565 3345 3715 3035 2422 4157 5337 4127 1011 -1090
4221 -1090 -359 773 1057 -1265 -3326 -3210 -2027 -1312 -2137 -2747 -1303 634 1517 968 887 2419 4726
4238 4726 4689 1951 -137 23 1610 1728 -376 -2787 -2368 -1587 -1913 -3374 -4123 -2503 -211 260 -704
4255 -704 -917 1170 4235 5214 4407 2574 2785 3570 3556 1837 -116 -305 -142 -1301 -4210 -6012 -5816 -3827
4273 -3827 -3415 -4963 -6628 -5050 -1884 97 659 294 1624 3123 4395 3341 2432 3335 4584 4158
4289 4158 1665 -806 -801 79 256 -2175 -4215 -4381 -2370 -867 -1232 -1503 -512 1613 2271 1918 769 1965
4307 1965 4083 4880 2728 231 224 1023 1598 -238 -2894 -3648 -3129 -2275 -3265 -3558 -2558 138 1337 650
4325 650 -30 1294 3476 5125 4622 2185 1794 3098 3733 2267 -258 -1690 -1562 -2326 -3924 -5735 -5603
4342e603K060R08p73j260O14L084K708M6q22L06J935J360Q3j751q75O26L6k206
4360D76k506p54Q07N28j196j882k33K105J653J51r54L98K214J961N9p68K45J649
4378C953J272j673k525j098K22J074j141j668j077O34J234m17j450N4K127J553
4394A074K03q57K87K486J908l47k134j892Q63M26o42k248j421j2K99q88j647o01
4412e143J761J207l58j321N03L046K609J177j051q67J551J641k95j667j284p3
4428A436N60r82k409j232MP24q87k099n85J433K301R89q94k09K073K320P42j390
4446A895r73J509J568R7j848j436r4J208r30j968j752K59J489l44q26k99J965
4463d80K313N76j668n63J451K599J47j905j892N45J158j71j505k553o87K85m20
$$ plain form
4342 -5603 -3543 -2635 -3408 -4668 -4054 -970 1738 1784 962 1268 3203 4563 4646 2895 2020 2646 2682 476
4360 476 -2030 -2784 -1977 -1449 -2645 -4527 -4760 -2655 -1002 -851 -1805 -1407 807 2768 2827 2059 2304 3953
4378 3953 5225 3552 1027 -71 151 1225 84 -1584 -2661 -2027 -793 -1210 -2660 -2606 -479 1074
4394 1074 1277 420 707 3193 5101 4754 2620 728 1591 2017 1375 -873 -2294 -2306 -2007 -2895 -4542 -5143
4412 -5143 -3382 -2175 -2533 -3854 -3351 -305 2304 3481 2430 1563 3114 4755 4460 2793 1509 1436
4428 1436 1996 1014 -1395 -2627 -2623 -1899 -2786 -4885 -5470 -4037 -1736 -747 -1641 -1850 223 2543 3285 1895
4446 1895 922 2431 3999 4096 2248 812 718 1926 996 -972 -2724 -2465 -976 -1320 -2146 -2445 -480
4463 -480 1833 2409 741 178 1629 4228 4375 2470 578 1123 2281 2110 605 -1948 -2635 -2350 -2770
4480b770j335q08J107J757O70r60q4J772K679J024q06j279J191K265P82j463k508
4497A234l06J88n32k473j773J82M22K53j416j105J386K214O82o61o65J883K724
4514B237J527o82j113M60J722M02j660k439j002J016m8j528j446J64J133K62o57
4531a652r56J119J827J278n57o45P39K722J337j661k287q76Q28O95j765j825q65
4548b544M72M96j154j266M40J654J290r40n86J406L417J749j097j135k88J564
4564C478R50j479k730j010K54L78j220k216p79N37N63j057j104J022K271J963
4580a79j06p23J235K743J796p33k272k70J305J028j033k140j095J72K28r89j887
4597b920l72Q44J027k75o72Q15K460J716k64j478j9J638J685p01k162r33O19P75
$$ plain form
4480 -2770 -4105 -4913 -3806 -2049 -1379 -2339 -2423 -651 2028 3052 2246 967 2158 4423 5205 3742 1234
4497 1234 928 1116 584 -1889 -3662 -3480 -3058 -2805 -4221 -5326 -3940 -1726 -1044 -1705 -2370 -487 2237
4514 2237 3764 3082 1969 2429 4151 4553 2893 454 -548 468 420 -1108 -2554 -2390 -1257 -995 -1652
4531 -1652 -2608 -1489 338 1616 1059 414 1153 3875 5212 3551 1264 388 1216 1911 146 -1679 -2544
4548 -2544 -2072 -1576 -2730 -3996 -3556 -1902 -612 -1552 -2138 -732 2685 4434 3337 2202 1914 3478
4564 3478 4428 2949 219 -791 -537 -159 -1379 -3595 -4374 -3837 -3274 -4331 -5435 -4413 -2142 -179
4580 -179 -285 -1008 227 2970 4766 4033 1761 1491 2796 3824 2791 651 -444 -272 -44 -1033 -2920
4597 -2920 -3292 -2448 -1421 -1696 -2368 -1553 907 2623 2359 881 862 2500 4185 3484 1322 389 1008 1783
4615A783r36k083j614L61P59o90j037J70K197J612q7q88Q22J955J938q06j420
4632B036r22J252J452l13k596k073k18N01r66k097j291O94J274l54k00K71K238
4649a312J868K40j106Q6K518J991j21j616o84O94Q56p85k546j933N2P54Jj731
4667b774q47J451J029P9q24o2J958J690M00j058l53J486K363l60j847k035J26
4684D22J039m67j547k053N13Q52J59j008k59R42J544J84n71J8J916K170L12j581
4702B585j589P40J157j00k496k544k9L37K91j273j277M70Q00j87n03k19J927K300
4720C90J185p00l02J374K584L91j687j728j76Q82k1j692k180P1O12j66j631j596
4738d390N85J403R27p81K39J493K249R03p03r07R39J635M70j781j772J25J193
$$ plain form
4615 1783 847 -1236 -2850 -2489 -1730 -2420 -3457 -3287 -1090 522 435 -453 369 2324 4262 3456 2036
4632 2036 1114 2366 3818 3505 909 -1164 -1382 -881 -1847 -3944 -5235 -4541 -3267 -3621 -3821 -3550 -1312
4649 -1312 556 796 -310 -224 2294 4285 4164 2548 1864 2558 3414 2629 83 -1850 -1798 -1044 -1043 -2774
4667 -2774 -3621 -2170 -1141 -1062 -1886 -1948 10 1700 2100 1042 689 2175 4538 4178 2331 296 422
4684 422 1461 994 -553 -2606 -2093 -1241 -1082 -2090 -2349 -1407 137 321 -250 -232 1684 3854 4166 2585
4702 2585 996 1736 2893 2793 297 -2247 -2276 -1939 -1648 -2921 -4198 -3728 -2928 -3115 -3618 -3837 -1910 390
4720 390 1575 875 573 1947 4531 4922 3235 1507 1331 2213 2192 500 -1680 -1609 -997 -1163 -2794 -4390
4738 -4390 -3805 -2402 -1475 -2256 -2017 -524 1725 2628 1925 1018 1957 3592 4062 2281 509 634 1827
4755A827J96j929k363l50J189L85q76q41J019J715J264l62m85J409J652P65j596
4772B619j695R1J803K46j845k325j166L53K91j006j860K4J134J110j93n22J542
4789a399K670Q25l05j141L14K684J047j013k007o95N93r3j689j863j329L86M77
4806b538o39j231N62J753J522l57j054J269J976J832k11r77K09J219Q87q81k232
4823A109o99L17L62j687j867o03J167J225l13j108N0J716J069J17m47N84J931
4840B923J188q58j864l74P93P51j575k253j666K38J081J98j455o46J047J130J25
4857a217m46N92K274J654mj348K92J593J152q45k678j700J94N48q82j756j270
4874c847N79M77n28j441K50J766J864K87m35N00K071K201L03j078p28O50O06q50
$$ plain form
4755 1827 2023 94 -2269 -2619 -1430 -1045 -1921 -2762 -1743 -28 1236 874 389 1798 3450 4215 2619
4772 2619 924 1015 2818 3064 1219 -1106 -2272 -1919 -1628 -2634 -4494 -4470 -3336 -2226 -2419 -2941 -1399
4789 -1399 1271 2096 1791 650 964 3648 4695 3682 1675 980 1573 1480 -209 -2072 -3401 -3015 -2538
4806 -2538 -3177 -4408 -3846 -2093 -571 -928 -1982 -713 1263 3095 2884 1907 2116 3335 4222 3341 1109
4823 1109 410 727 1089 -598 -2465 -3068 -1901 -676 -989 -2097 -2047 -331 738 855 408 992 2923
4840 2923 4111 3253 1389 1015 1808 2559 984 -1269 -2935 -2697 -1616 -1418 -2873 -3519 -2472 -1342 -1217
4857 -1217 -1663 -1071 1203 2857 2853 1505 1797 3390 4542 3697 1019 -681 -487 61 -821 -2577 -3847
4874 -3847 -3268 -2791 -3319 -4760 -4510 -2744 -880 -593 -1028 -528 1543 3744 4047 2969 2241 2891 3497 2647
4892B647j701r20N77O57j135j909j089L70J349L15q57j003J746J977L91k20k35
4909I60J101J052k70j748r83O45J120k77k613j528j79J286L79j463o29L40J786
4926a021N49L91J70J323J706K58j429r68Q90J825k57j848j880m80O68l61j624
4943b088j835k11R39k83n32q7J794K065M00n81o89J515K329R47j044p12L61J211
4961C499k81j659j838k50M51n6j908j263O10J983M70q52p29N15J999R13l48m49
4979H07J104J095N06r47j463K51Q49m13j941k172l12R48J405j033j214L23J030
4996a177J011n75l26J140K056R10j077m94J65J459K71k042k211p67Q41J52j089
5013a753j511p20J092M28p81r1P49J746J466l06l65J040K135J227o04j318p03
$$ plain form
4892 2647 946 26 603 1260 125 -1784 -2873 -2503 -1154 -839 -1696 -2699 -953 1024 1415 1195 960
4909 960 2061 3113 2843 1095 112 757 1877 1600 -1013 -2541 -2720 -1434 -1055 -2518 -3147 -2807 -1021
4926 -1021 -472 -81 89 1412 3118 3376 1947 979 1869 3694 3437 1589 -291 -771 -103 -464 -2088
4943 -2088 -3923 -4134 -3195 -3478 -4010 -4097 -2303 -238 162 -419 -1108 407 2736 3683 2639 1927 2288 3499
4961 3499 3218 1559 -279 -529 -78 -134 -2042 -3305 -2695 -712 -242 -1094 -1823 -1308 691 1604 1256 807
4979 807 1911 3006 3512 2565 1102 1353 2202 1789 -152 -2324 -2636 -1688 -283 -1316 -2530 -2207 -1177
4996 -1177 -166 -741 -1067 73 2129 3039 1962 1468 1633 3092 3363 1321 -890 -1657 -816 -664 -1753
5013 -1753 -3264 -3984 -2892 -2464 -3245 -3336 -2587 -841 625 319 -46 994 3129 4356 3752 2434 1731
5030A731K85K95j472j621n46N56J2j403j435m63J518J223m39p83Q13J939J545
5047A755O10n88J23J030P55j010j524r2P60L06j509k117o24R58J019o01j700k49
5065b698J502J816j14k58O02J435N73o58r21m76J121K30p96k262r18P19lq19j755
5084c680p59R98P92L7J3O69J792J836j7o86j1J460J531k50j278j545J084J18r52
5103A152j928j155j80N04r32j665L76J142J800J07o70l27J422K115O22m47o13
5120A323Q25J203j39j452j150K74N66j067k022r57O95J499K89j379m74J171J552
5137G57N58p67l13J126R28Q00j109q79K24R19r75k200j753K80R04m29j277j45
5155c351O10J491J76m31n16J397J829N09j90k52R65J321J82j759j162m61N71n08
$$ plain form
5030 1731 2016 2311 839 -782 -1328 -772 -760 -2163 -3598 -4061 -2543 -1320 -1759 -2542 -1729 210 1755
5047 1755 2365 1777 1900 2930 3685 2675 1151 1059 1819 2125 616 -1501 -2125 -1167 -148 -749 -2449 -2698
5065 -2698 -1196 620 506 248 850 2285 2858 2200 1279 803 1924 2154 1358 -904 -1822 -1103 -1106 -1925 -3680
5084 -3680 -4439 -3441 -2649 -2612 -2599 -1930 -138 1698 1681 995 984 2444 3975 3725 2447 902 1986 2104 1152
5103 1152 -776 -1931 -2111 -1607 -2539 -4204 -3828 -2686 -886 -779 -1449 -1776 -354 1761 2383 1936 1323
5120 1323 2148 3351 3212 1760 610 884 1450 383 -1639 -2596 -1901 -402 -113 -1492 -1966 -795 757
5137 757 1315 548 235 1361 2289 3089 1980 1101 1325 2244 1269 -931 -2684 -2404 -1500 -1929 -3206 -3351
5155 -3351 -2741 -1250 -1074 -1505 -2021 -624 1205 1714 1524 1272 2237 3558 3740 1981 819 358 929 421
5173D21j918j388K24Q66r0j053j016J081J782O57q02k40J626J808R98k6j287P64
5191B407O33Jj332j307N3N55k49j619j125M38Q16O3r71j162J194J797J493n21
5209A164n95P65R99O06r63j276P8Q05k44j273j663J9J157k58j279j611L36J610
5227a623R94m47m59R33K087J072n04p26k91J299N61j144j464o5M90n06j328j521
5245b642o66N86L39j182p88R04J979J410J33p77M70J831J398m38o64J08J088M02
5263C491j053j552n23rj5j115j671k25R85P01n10r58L59J757J458L25j086J99
5281E58J157J007K94j274l59M45j67r64j712r66N11M48p83q33J80J537J268m49
5299a02r79J72J478J307N14p18j89N21Q62n90j753n94m00j86j042j527m54P27
$$ plain form
5173 421 -1497 -2885 -2661 -1795 -1885 -2938 -3954 -2873 -1091 -434 -1236 -1476 150 1958 2956 2930 1643 2407
5191 2407 3040 3041 1709 402 455 1010 761 -858 -1983 -1545 -729 -666 -1637 -2799 -1605 192 1685 1164
5209 1164 569 1334 2333 2939 1976 700 778 1583 1339 66 -1597 -1578 -421 -679 -1958 -3569 -3233 -1623
5227 -1623 -629 -1076 -1535 -602 1485 2557 2053 1327 1036 2335 2896 1752 288 223 713 207 -1121 -2642
5245 -2642 -3308 -2722 -2383 -3565 -4353 -3449 -1470 -60 73 -704 -234 1597 2995 2557 1893 2001 3089 3491
5263 3491 2438 886 363 354 339 -776 -2447 -2672 -1687 -986 -1496 -2454 -2095 -338 1120 1445 359 558
5281 558 1715 2722 3016 1742 1383 1828 1661 697 -1015 -1981 -1470 -1022 -1805 -2638 -2458 -921 347 -102
5299 -102 -1081 -909 569 1876 2390 1672 1483 2004 2866 2276 523 -71 -471 -657 -1699 -3226 -3680 -2953
5317b953N87q1q53mJ454J534N26k26J08J382J781K17q64n20L25L61q13j392j180
5336f11J37L44j168q93p53J018Q53n8j258J61J699J688P47q16M9P56J234j99j215
5355A715q12j36O92l75j428j165L35P03m22j223n54J043J667O60p26k52J376J489
5373B587K44r46j051L73P25n54j684q68J58M45r29j158r21N84P87m3l87n4J204
5392a488K365Q55o88o59P62J816J55j208r14K73Q01j58j417j321l47K58p8j513
5410b506q80Q38J498N31n89m48P65K244P31q05p67O75J156P05p15j008k63K79
5428A441m53j413j209M52N67K29j119p92P71J640J085o93q07N72J276Q42m92j005
5446H92m4Q56L21j132j868m82M87o10q43o44L14J326M94n87n13P66J393R55k12
$$ plain form
5317 -2953 -2366 -2447 -3300 -3304 -1850 -316 210 -16 92 1474 3255 3472 2608 2088 2413 2774 1961 569 -611
5336 -611 -474 -130 -1298 -2191 -2944 -1926 -1073 -1131 -2389 -2228 -529 1159 1906 1090 1139 1895 3129 2930 1715
5355 1715 903 767 1459 1084 -344 -1509 -1174 -471 -893 -2116 -2670 -1627 40 700 -26 -278 1098 2587
5373 2587 2831 1885 834 1207 1932 1378 -306 -1174 -1016 -571 -1500 -2658 -3579 -2995 -2208 -2251 -2638 -2692 -1488
5392 -1488 877 1732 1044 385 1147 2963 3118 1910 996 1269 2070 1912 495 -826 -1173 -915 -993 -2506
5410 -2506 -3386 -2548 -1050 -519 -1108 -1556 -791 1453 2184 1379 612 1287 2443 3148 2433 1425 1162 1441
5428 1441 988 -425 -1634 -1182 -615 -386 -1505 -2297 -1526 114 1199 506 -301 271 1547 2389 1897 892
5446 892 848 1704 2025 893 -975 -1457 -970 -1580 -2423 -3067 -2753 -1427 -933 -1520 -2033 -1267 126 1081 869
5465H69l80N33J458R27p41j340n28L21l4j028j952j96M41L39j181m85N1J453P25
5484g48o02l70P90J961J567j68q90l21J249J028q95j460m21J45R6j134j219r9
5502a491R94J97j075j209R4J811J515N1r96K98R89J678n63j008k91L19J70j042
5520D41j276m95K96N22p93j611k68J164R82km55l8J811J454Q7q12L35J182M36
5539B960m47j776q23L43O00q00j227j732O01M9m03r87K2J381J474Q9m51M81J626
5558I80J576J85j284l75Q42J370p2j111j338j26m9o06j326o19M46P58m26n98N4
5577a719J254J523L68r69k20Q74J079K08n80p75J4L57l79j408r65M2O63q29j351
5596b813j86R14J642M38r18j36J144J198N74m88l52R59R24l29j335j411q2N46
$$ plain form
5465 869 489 1022 2480 3407 2666 1326 798 1119 1085 57 -1895 -2091 -1650 -1311 -2492 -2977 -2926 -1473 -748
5484 -748 -1350 -1720 -930 1031 2598 2430 1540 1219 2468 3496 2601 1141 720 865 961 -173 -1392 -1491
5502 -1491 -497 -300 -1375 -2584 -2490 -679 836 887 -109 189 1178 2856 2293 1285 994 1313 1483 441
5520 441 -835 -1330 -1034 -512 -1305 -2916 -3184 -2020 -1038 -1040 -1495 -1533 278 1732 1819 1007 1342 2524 2960
5539 2960 2513 737 -86 257 857 57 -1170 -2902 -2301 -2252 -2655 -3642 -3620 -2239 -765 -676 -1127 -646 980
5558 980 2556 2741 1457 1082 1924 3294 3222 2111 773 647 598 -8 -1334 -1953 -1507 -749 -1175 -1773 -1719
5577 -1719 -465 1058 1426 457 237 1111 2190 2398 1818 1043 1057 1414 1035 -373 -1338 -1296 -633 -1462 -2813
5596 -2813 -2999 -2085 -443 -5 -923 -1059 85 1283 1857 1369 1017 1976 2900 2571 1236 -175 -257 289
5614B89n19j744r50j91J037L45o64j59N85J306J12k59k1J806J712M36j013q82
5632A226M24J243j1j534j614m93LL25q88p96N21O07j91q38j32J379J371P73n31
5651H44n87J033J382N87q19j459j09L80j18j331r00o6J147k48r19j429N36J518
5669e58O97l16q55O45J514Q29o51q27N31P68l51j234j117Q2Q21r2j084j584k43
5688c025J105M21l20q20L79J450J194j68j17J284J202L78o71j242n4J064K05q10
5706A455j688m21R0N07j118j276k6Q01M75n12l60J024J778J090o02j146J36J680
5724A887R42o55q99l94K69O56j035j466k01J62N36q96q77M8J420R20P1j060K26
5743c46J110R91m07o41j37R44O13j182j369q02Q32l3j023j627l48R93J087j43
$$ plain form
5614 289 -230 -1974 -2924 -3115 -2078 -1733 -2397 -2556 -1971 -665 -553 -812 -833 973 2685 3121 2108 1226
5632 1226 1650 2893 2882 1348 -266 -759 -756 -431 -1319 -2115 -1594 -987 -1178 -2016 -2148 -769 602 1375 844
5651 844 257 1290 2672 3259 2440 981 872 1252 1134 -197 -1097 -1163 -16 -264 -1183 -2612 -2076 -558
5669 -558 139 -177 -1032 -387 1127 1956 1305 478 1009 1777 1426 192 -925 -843 -22 -114 -1198 -2782 -3025
5688 -3025 -1920 -1499 -1819 -2639 -2260 -810 384 216 99 1383 2585 2963 2292 1050 996 2060 2265 1455
5706 1455 -233 -654 -564 -57 -1175 -2451 -2477 -1676 -1201 -1713 -2073 -1049 729 1819 1217 71 207 1887
5724 1887 2829 2174 1275 881 1150 1806 771 -695 -896 -734 -198 -1094 -1971 -1923 -503 417 488 -572 -346
5743 -346 764 1755 1348 707 570 1514 2127 945 -424 -1226 -394 -427 -1450 -3077 -3425 -2432 -1345 -1488
5761a488n04K83J110J091K44l25L64J002J098j90j274l80P76pp28j819j076L92
5779a431N24j84j035l43Q10P94k98k21MJ483J027M45q24K52J300R78k49j458p51
5798H23k69N21o45r23q75P08M24l91j155k28J146J058K26r57J93J179J509J17
5816B461j218k48L24K48p09j489p52O17L74l78j400n39N31J067j22l60%O41J857
5835I05L77N0j41O38M93K22j557q68M48N31p53j051j388R1R21k86j051n87N74
5854b432J280O59l97r4J351J640M57o94q69M63J310K72j173j184l2M56N3j884
5872h18o52P0M34j89r3p68P91J395J001p39n80O51J135M79q07p26J45R12k19p47
5892F75j595l9P23n85q65r51O18Q26J012n18k99P82Q63O14k42o41O68Q83K49q40
$$ plain form
5761 -1488 -1992 -1709 -599 492 736 411 775 1777 2875 2685 1411 1031 1807 1800 1072 -747 -1823 -1431
5779 -1431 -907 -1091 -2126 -2469 -1659 -865 -1163 -1384 -1380 103 1130 1575 751 1003 2303 3281 3032 1574 823
5798 823 554 1075 430 -493 -1368 -660 -236 -627 -1782 -2010 -864 194 420 -537 -344 835 2344 2461
5816 2461 1243 995 1319 1567 858 -631 -1383 -766 -392 -770 -2170 -2709 -2178 -1111 -1233 -1593 -1593 -952 905
5835 905 1282 1332 1191 1829 2322 2544 987 119 567 1098 345 -706 -2094 -2003 -1082 -1368 -2419 -3006 -2432
5854 -2432 -1152 -493 -890 -984 367 2007 2464 1770 901 1364 2674 2946 1773 589 557 1013 1066 -818
5872 -818 -1470 -1400 -966 -1155 -1248 -2016 -1225 170 1171 432 -148 503 1638 2117 1310 584 729 1641 1422 675
5892 675 -920 -959 -236 -821 -1686 -2637 -2019 -1193 -181 -699 -998 -216 647 1261 1019 378 1046 1929 2178 1338
5912A338r58l30N66k75j377j253n14R11N19n38n89N57R42O07Q8o47P74J532R75
5931B328l33n62J24J036M14p81j532j042J071J9j261j198k56J353J65o06r31O02
5949a390J133Q55j22r41O93J157J062m85p82l97Q49j42j145j352p10J387N44q85
5967f71j206j70P79J086l49n42J55J255J069k0n37q2N11O45q05j294l30O05J74
5986B73r44j235o52Q83N69m28r86L4Q67J465K71l04J45J503J121o1r62n02Q04
6005A861M40q38j089m53L97L41n84j858n45M56Q14j67m81j42J395J294K64p36
6023C69L75K69J261l38p02q43O93Q27n20j446q40K17N16o30j074o40J360J205
6041E9j1l43l97O54J619j03p04k06L80L19j3j034p79L41K40m27j638r35R46N18
$$ plain form
5912 1338 380 50 616 341 -1036 -2289 -2803 -1892 -1373 -1911 -2500 -1943 -1001 -394 -306 -953 -179 1353 2328
5931 2328 1995 1433 1557 2593 3007 2226 694 -348 723 742 -519 -1717 -1973 -620 -455 -1061 -1992 -1390
5949 -1390 -257 598 476 -465 228 1385 2447 1962 1180 783 1632 1490 345 -1007 -1717 -330 214 -671
5967 -671 -1877 -2047 -1268 -182 -531 -1073 -918 337 1406 1386 849 767 1278 1923 1118 -176 -506 99 273
5986 273 -671 -1906 -2558 -1675 -1106 -1534 -2520 -2486 -1619 -154 117 -187 -42 1461 2582 2521 1559 1057 1861
6005 1861 2301 1463 374 -79 318 659 75 -1783 -2328 -1872 -1058 -1225 -1706 -1848 -453 841 1105 369
6023 369 744 1013 2274 1936 1234 391 1084 1911 1391 -55 -895 -678 -162 -792 -1866 -2506 -1146 59
6041 59 48 -295 -692 -38 1581 1478 774 568 948 1267 1254 220 -559 -218 22 -405 -2043 -2978 -2032 -1514
6061a514L76p06k56J135R26O44k38k72R06R88M91r61o77R76L44o85j409j191L7
6080a086R13m30j380o01O50J157J27j95o06J070J005Q36r18J18N46J235K43j035
6098A649r95J14O65k89j543j018K26Q68K44r22q73N06J144M30p85l84P26J343
6116A106M91o6j200L90O04l44q97j049J9O98j99j165o90M06O37O24p95m58N20
6135a368J060J390m21l32N18J082L93o25j048m25P92R1j294j051k15K98O73r20
6153a402j025J18Q59J032k75n30O16J346J358n50n58K82J169K47j099p92n19Q38
6171A115K21q06j415j74N02J31n45j051L50J412Q89m06n94J9J233Q41m52p29k95
6190B46O58M95o82j288j62L66P1p99j186j16J159Q12k85q58N31R11J412k16o05
$$ plain form
6061 -1514 -1138 -1844 -2100 -965 -39 605 367 95 1001 1989 2480 1519 842 1818 2162 1477 68 -1123 -1086
6080 -1086 -173 -603 -1983 -2584 -1934 -777 -650 -845 -1451 -381 624 1460 542 660 1206 2441 2684 1649
6098 1649 654 768 1433 1144 -399 -1417 -1191 -323 -79 -1001 -1874 -1368 -224 206 -579 -963 -237 1106
6116 1106 1597 1531 331 721 1325 981 84 -965 -946 -248 -447 -1612 -2302 -1896 -1259 -635 -1430 -1888 -1368
6135 -1368 -308 1082 661 329 847 1929 2322 1697 649 224 1016 1107 -187 -1238 -1453 -1155 -482 -1402
6153 -1402 -2427 -2309 -1450 -418 -693 -1223 -607 739 2097 1547 989 1271 2440 2687 1588 796 277 1115
6171 1115 1336 530 -885 -1059 -557 -426 -971 -2022 -1672 -260 629 223 -371 -352 881 1722 1270 541 246
6190 246 904 1399 717 -571 -733 -367 -296 -1095 -2281 -2397 -1238 -426 -711 -1569 -1038 -127 1285 1069 464
6209D64o3Q10K39r6o81m04N90L81j212j760k47O82K21l14j051j28J145J332m9
6228a41o38J32R61J200R9k51k33P69P84n59p93r51M21K79q39j135n16K89M22k4
6248g24o68J7O88Q84m4l97l60J396J066M1q65k30M85K23l27j193j096J06O55n68
6268i11j304M1Q21J173m03r07j27Q73J355P04l85l31K39J082l70r53m69k2K23
6287C29m96j031q22N41L50J97r91l37N26J253M58l53j42J189J245J46o47k16N65
6306A764M95k41j063j190K34N81Q3j091j350l4O43K65r41O1N18J553N84j70p02
6325aQ01J014M13n32j106r6J198n40o46r10j63J58j78p21r32P11P88P55o31n40
6345a158Q53J226Q64p55r05P7P25L50p46p62L0N25k74j222j299L86O12J75o00
$$ plain form
6209 464 401 1211 1450 1354 673 269 859 1240 28 -1732 -1979 -1297 -1076 -1390 -2441 -2569 -1424 -92 -141
6228 -141 -779 -647 314 1514 1613 1362 1129 1898 2682 2123 1330 379 800 1079 240 -895 -1411 -1122 -700 -724
6248 -724 -1392 -1375 -687 197 153 -244 -604 792 1858 1899 1034 804 1289 1512 1185 -8 -1104 -998 -343 -911
6268 -911 -2215 -2174 -1353 -180 -583 -1490 -1617 -744 611 1315 930 599 838 1920 1550 597 128 106 329
6287 329 -167 -1198 -2020 -1479 -1129 -932 -1923 -2260 -1734 -481 -23 -376 -518 671 1916 2062 1415 1199 1764
6306 1764 2259 2018 955 -235 -1 580 663 -428 -1778 -1812 -1169 -904 -1845 -1784 -1266 287 871 701 -1
6325 -1 800 1814 2227 1695 589 493 1691 1151 505 -405 -568 -410 -588 -1309 -2241 -1530 -742 13 -618 -1158
6345 -1158 -305 921 1785 1030 125 202 927 1277 531 -231 -201 324 50 -1172 -2471 -2085 -1473 -1298 -1898
6364a898j86Q84J048O10P0n88N90O84P77o14j77M60L97K8q79j424m24L92J01j018
6384a167j063J70O66R84l48l97R6J239N41l66j19K59J330N74r13p40j14M73K17
6403A322q12j000k70K20M24p20l70J55N93M37l73o11J39J087J243k10r59n4P83
6422A024M02o08q55q58L33k4l03j005l3J015M52o87q09q2J353Q88J93l37kQ36
6442H93J050J27p91o17Q77m15m15j229j46M43J09k79j207l09O26N58K07m92J70
6461h40J002J034J68n22K12O43Q48q44r22n20M76O14m36j452m58K91j25J87o58
6480a302n21Q20Q62Q0n74J26J014J120j88r04n50P39P41l63q52o92K7M98p10m76
6500a105o73M87N86l23m49o5R41J304K74n13n05O18Q84K11q85l37K08K78J1j480
$$ plain form
6364 -1898 -2084 -1200 -152 458 528 -60 530 1214 1991 1377 1200 1660 2057 2085 1206 -218 -642 -250 -149 -1167
6384 -1167 -2230 -2060 -1394 -410 -758 -1155 -1059 180 721 355 236 495 1825 2399 1486 746 632 1105 1322
6403 1322 510 -490 -760 -540 -116 -836 -1206 -1051 -458 -21 -394 -1005 -866 221 1464 1254 295 241 1024
6422 1024 1426 818 -37 -895 -562 -586 -889 -1894 -1927 -912 -460 -1147 -1956 -2038 -685 203 396 59 57 893
6442 893 1943 2070 1279 662 1539 1124 709 -520 -666 -223 -114 -393 -1600 -1909 -1283 -725 -518 -1010 -840
6461 -840 162 1196 1364 842 1054 1697 2545 1701 779 259 735 1349 913 -539 -997 -706 -831 -644 -1302
6480 -1302 -1823 -1003 -141 -61 -635 -509 505 1625 1437 533 -17 722 1463 1100 248 -444 -417 81 -629 -1105
6500 -1105 -1778 -1291 -705 -1028 -1477 -1542 -601 703 977 464 -41 577 1461 1672 787 450 658 936 947 -533
6520e33p53J94O74o49o65n62O26J292N04o13k77Q46J314K06o69J14O97O75K75
6539B696j119j083L73K36j52j268q87L09K0J29m81o19R07R40L88j027j45J029
6557B46R02o2l5n11J73Q40l49p41q08m37M97k04p33n71L75P62L77n31n60P90R18
6578C38M50m05P9K10J112M27q45r81l60L44m4j004o52j84M52L08o27o12L18J135
6598e41O98l78k18N72J062N16k48j10J68N58J43q32j109j37K81K22r00p29l52
6617a334N14J63j58p45L60R50O67j10n03O08J066L34n03j010J75M30K38m52j237
6636e47L17j61N41j185m68k35N25O97Jl52n6J176Q52j51r41L70M37N93q00o29
6656a6q2L39J28p05q43l86K44M53o30n13P2J106R98n0j77mJ509K14K21r13J04
$$ plain form
6520 -533 -1286 -1092 -418 -1067 -1732 -2294 -1668 -376 128 -485 -762 84 1398 1604 935 1049 1746 2421 2696
6539 2696 1577 494 867 1103 951 -317 -1204 -895 -875 -746 -1227 -1846 -939 1 389 -638 -783 246
6557 246 1148 1086 1051 540 713 1553 1204 463 -345 -782 -285 -489 -1222 -1793 -1418 -656 -279 -810 -1370 -580 338
6578 338 788 383 462 672 1784 2211 1366 385 25 369 325 -679 -1331 -1515 -1063 -755 -1382 -1994 -1676 -541
6598 -541 157 -221 -439 133 1195 1711 1463 1353 1521 2079 2222 1390 281 144 425 647 -253 -982 -1334
6617 -1334 -820 -657 -815 -1560 -1200 -250 417 307 -196 412 1478 1812 1309 299 474 904 1142 690 -547
6636 -547 -230 -391 150 -1035 -1503 -1738 -1213 -516 -515 -867 -923 253 1105 954 13 383 820 1413 613 -16
6656 -16 -98 241 369 -336 -1179 -1565 -1321 -868 -1498 -2011 -1939 -833 165 115 -62 -66 1443 1657 1878 965 1069
6677A069L76M23p0j195l48p5M48p10j196r09R02M99K91r06J48J045K85N42k94
6696C25j59R58P05n5r80j60N83K74m33j235m44K77J30k71r42l26Q39Q06p6n06
6716f90J8M98N60M88o74l25R98M62j56p79q54J24L59j68j324l80M14P15k02m02
6736a318j72M48P39Q09q88L4P45J452k80k94k15k10Q19o02r35o57K11K60k20o40
6756i14o48O4O90J99o38K6M58J259M53k92K56K49R55n8j028k93L35N16l62j215
6776A2l77K6K75j03r08o03L14Q93j21O5m77J005J018R5n20l92J89O39l2n94p96
6797c92j12Q59n23q16n69j94O07L49o40m08P90J145M54k25R3P4P54L94j67j086
6817C87R6P22m3r37p70j35L79j1q47p84K79P47N47l67k93O00J005N36q7k81N21
$$ plain form
6677 1069 1445 1868 1798 603 255 180 628 -82 -1278 -2187 -1285 -786 -495 -1401 -1253 -208 77 619 325
6696 325 166 1124 1829 1774 794 634 1217 1491 1058 -177 -621 -344 -214 -485 -1427 -1753 -914 -108 -184 -690
6716 -690 -672 -174 386 874 200 -125 873 1335 1179 400 -454 -330 29 -139 -1463 -1843 -1429 -714 -916 -1318
6736 -1318 -1490 -1042 -303 506 -382 -348 397 1849 1569 1275 1060 850 1669 1067 132 -525 -314 -54 -274 -914
6756 -914 -1562 -1498 -808 -609 -1247 -1221 -763 496 949 657 913 1162 2117 2059 1031 738 1073 1589 1227 12
6776 12 -365 -339 -64 -167 -1075 -1678 -1364 -471 -592 -527 -1004 1 1019 1114 594 202 391 1030 998 404 -392
6797 -392 -504 355 -168 -984 -1553 -1747 -1140 -791 -1431 -1839 -1049 96 550 325 418 492 1246 1640 1473 387
6817 387 483 1205 1162 225 -545 -680 -301 -312 -1159 -1943 -1664 -917 -370 -737 -1030 -430 575 1111 1024 743 1264
6838A264P23O9p49m62j15L09l4q60j055k69M66M13p20k09p1P61P28k85l68L75
6858h9R87J34n07m31J83N61O22n83r92p23N54nn82q35J11N39M39q9l31K09N57
6879b71R74m00k28n3J049N28k06n41j85J8j45m87j260l07R00K00m89o48j23Q47
6899h27M20J27l56K58P85Q57K18n55N25MO57n69j081m86M75L60o17j105k80L44
6919h46M47L0p58qJ90P89K03j42o8J003Q30k16p45m15R02K58r27o73m29K51N55
6940B31m34r20k46J83L79j21k88K67M12J434j47o96J33N28M70O4r21m74j71J062
6960G45n12r10m49K97M00p50l43m55P63R44M26m37J3Q04Q79K57m86l85O88j6r1
6981A382n97k75K09l1l03j360m13K54N37Q6q51j02P48P44K29J9k74N20M44L24
$$ plain form
6838 1264 1987 2056 1307 845 730 1039 1005 145 -910 -1179 -713 -300 -1020 -1229 -1300 -539 189 -96 -464 -89
6858 -89 898 1032 525 94 277 838 1460 877 -115 -838 -284 -289 -871 -1706 -1595 -1056 -617 -706 -1037 -828 -271
6879 -271 703 303 75 22 1071 1599 1393 852 667 685 540 53 -1207 -1514 -614 -414 -903 -1551 -1674 -827
6899 -827 -407 -280 -636 -378 407 1264 1482 927 1452 1456 2113 1544 463 -23 452 812 195 -910 -1190 -846
6919 -846 -399 -369 -1127 -1135 -945 -156 47 -95 -163 840 1670 1454 709 294 1196 1454 527 -146 -575 -324 231
6940 231 -203 -1123 -1369 -1186 -807 -928 -1216 -949 -537 897 750 54 187 715 1185 1249 328 -146 -317 745
6960 745 233 -677 -1126 -829 -429 -1179 -1522 -1977 -1214 -270 156 -281 -268 536 1415 1672 1186 801 1489 1473 1382
6981 1382 785 510 719 688 385 -975 -1388 -1134 -597 -511 -1362 -1464 -716 28 257 276 2 522 966 1290
7001A290m05k40L11O59l70p89r51k20N34k13j78j095M35L75L70Qm94N42Q23nl82
7022Ek24K83J095L05q31p26j51O01l83n31o38k22L28N30q06l36M70J037O93q31
7042c32j11O77J039M76j53l72k30P09r7o63p60m18N04m56m31p43K05O29J5p0r27
7063a509K81Q86N50L94k38M88M21P18n78p13J11J38J78j015p21J85J35J24k04
7082c69q80j88L92O05l26l16N23Q93P06l45n37M70L99J52q19p55k01M58M89n41
7102a90r71j52L18J39l4n34P5R78P97k90q8n7P82J067l80p31j01M08J6l87m82
7123A83m87O3R7j36j213n9R27J27J28m19J1N68R71L94n61L0M27M13j55o12R9N19
7145A315Jq48r12p05P80J44m32n73l65O15Q89j70k7l90P26P19k55m89J99P14R7
$$ plain form
7001 1290 885 645 956 1615 1245 456 -495 -715 -181 -394 -572 -1667 -1232 -857 -487 -479 -973 -431 392 387 5
7022 5 -219 64 1159 1464 633 -93 -244 357 -26 -557 -1195 -1417 -1089 -559 -1365 -1701 -1231 -194 499 -332
7042 -332 -443 234 1273 1749 1596 1224 994 1703 1606 943 183 -235 269 -187 -618 -1361 -1156 -527 -512 -582 -1509
7063 -1509 -1228 -342 208 602 364 852 1273 1991 1413 700 811 949 1127 112 -609 -424 -289 -165 -369
7082 -369 -1249 -1437 -1045 -440 -766 -1082 -559 334 1040 695 158 628 1027 1179 360 -395 -596 -138 351 -190
7102 -190 -1161 -1313 -995 -856 -890 -1424 -1349 -371 426 136 48 -9 773 1840 1460 729 628 1036 1052 665 183
7123 183 -304 -241 -144 -280 -1493 -1552 -625 -498 -370 -789 -778 -210 761 1155 594 624 1051 1464 1309 697 796 1315
7145 1315 1316 468 -444 -1149 -369 -225 -657 -1230 -1595 -980 -91 -261 -288 -678 48 767 512 23 222 936 1033
7166A033m72r61j28K18L06k73o66n56O78N94l31n26K89N39L35J71k55j50N56J078
7186A479j48m55m32J27M29l41j061l51L7J19k6r35J96M38P51J73l77n35R31J005
7206A024K00l96j72L72N08K38q78k95r8L92o01p03p50J54N66K41p44o69M42Q13
7226c56K72o22K37K70J275J93p47j75N01M41k62r73p33O1O04j24m42p38K47M73
7246e98k2q39k3P52R65L58r2l17J7J105l7o26n63j6M66k57m92n39j39M46J1m20
7268h60q32M16O94O93m46m74P63J098J77L00q00J87N29K36o89p07r1Q27k40q55
7288g4r79r1O34P0n05n43K95J020L09M7j84O0J100K25n66p13M54M24L86p66p62
7309a59o48P00qp51o53L8M53M88Nk10J25O13Q55p73j05K60O05O29m23p52k62K07
$$ plain form
7166 1033 561 -400 -528 -310 -4 -277 -943 -1499 -821 -227 -558 -1084 -795 -256 79 250 -5 -155 401 1479
7186 1479 1331 876 444 571 1000 659 -402 -753 -716 -597 -623 -1558 -1362 -924 -173 0 -377 -912 19 1024
7206 1024 1224 828 656 1028 1536 1774 896 601 503 895 294 -409 -1159 -1005 -439 -198 -942 -1611 -1169 -356
7226 -356 -84 -706 -469 -199 1076 1269 522 347 848 1289 1027 54 -679 -618 -14 -138 -580 -1318 -1071 -598
7246 -598 -620 -1459 -1482 -730 235 593 501 184 201 1306 1269 643 80 64 530 273 -219 -758 -897 -451 -440 -860
7268 -860 -1692 -1276 -582 111 -335 -809 -46 1052 1229 1529 729 916 1445 1681 992 285 194 1021 781 -74
7288 -74 -1053 -1144 -510 -440 -945 -1488 -1193 -173 136 183 -1 59 1159 1384 818 105 559 983 1369 603 -159
7309 -159 -807 -107 -115 -866 -1519 -1481 -1028 -540 -535 -745 -620 -7 848 75 -30 230 835 1464 1041 289 27 234
7331B34O54r40q57o04N90J57k66k66l5Q32P99l56l28L44R55K50j7m13L59J58M73
7352A723n99n43l12k0j73o02n06p7P31k30k40m86L88O00N54k10P9k20Q84N74M51
7373A766q27m27L52L11m83r58m86M83J29l7q71l53N68M15j51l54j57P94M77M18
7393F09m09r3O42M69m23o50k83j91O94l65q45l17L85M81rr91j24J005L74M47l06
7414A00o5N67O28P4n57k71N42M38p35n85k26k22M64k58n64q25M73N26O3n50j85
7435a168N93J271J82m34r1O22O51n77m69j42K23N85l59p12m80oK66k99j018k24
7455a586M43N71L08k25M7L53O04M01n02j97L74J47J07n72m57k9L61K15q09q43
7475a289m2N99O13r94J78J33Q90L62k94j61K46O05J87m4p80M10M72J24j009r45
$$ plain form
7331 234 888 -52 -909 -1513 -923 -766 -1032 -1298 -1333 -501 298 -58 -386 -42 913 1163 1146 733 1092 1250 1723
7352 1723 1124 581 269 249 76 -526 -1032 -1109 -378 -608 -848 -1334 -946 -346 208 -2 77 -143 741 1315 1766
7373 1766 939 512 864 1175 692 -266 -752 -269 -140 -177 -1048 -1401 -833 -418 -569 -923 -1080 -286 191 609
7393 609 200 107 749 1218 795 145 -138 -329 365 0 -845 -1162 -777 -296 -305 -1296 -1420 -415 -41 406 100
7414 100 35 602 1230 1304 747 476 1018 1456 721 136 -90 -312 152 -106 -670 -1495 -1022 -496 -433 -983 -1168
7435 -1168 -575 696 878 444 353 975 1626 1049 580 438 661 1246 887 175 -305 -311 -45 -344 -1362 -1586
7455 -1586 -1143 -572 -264 -489 -442 -89 515 916 414 217 591 738 845 273 -184 -213 148 363 -446 -1289
7475 -1289 -1331 -732 -119 -1113 -935 -802 88 450 156 -5 241 846 1033 989 209 619 1091 1215 206 -739
7495g39K13J03K26p54n54K94Q82L24o46l2K41P93N07m71j52L85Q10K11m90m54
7515F97k25Q06m68p62o20l60R41L5p62j57l7L46O00l73m82PJ038M31k62k5J78
7536E46L71L97o82r53j55M90L47q25m73J07K98J52l76n25J36Q51O83l32q8K38
7556B07O94N08m84q36M52J1J94k32r16l76N37K07k94p59k07M50Q47l57n66O76
7576b44P38Q40k29n49J59P20j34j54n77o18N94K57m92r78l5K12K00n20m35r9Q38
7597e06O43k56l07M95J95O49j66k56j52K99J17j15n11m50L29M56p76j110Q0J34
7617a208P51n6j93l16P99L04j83L84j64L23L61p9m50n27Q32J23k14p77o36j52
7637a078Q35l99n71QN29P21O1m29M04K45J134q29k41P8L37M97k09l68l16m4J53
$$ plain form
7495 -739 -526 -423 -197 -951 -1505 -1211 -329 -5 -651 -683 -442 351 858 387 235 620 1430 1641 1151 697
7515 697 472 1278 810 48 -572 -932 9 44 -718 -875 -912 -566 34 -339 -821 -814 224 655 393 368 546
7536 546 917 1314 632 -321 -476 14 361 -464 -937 -830 -532 -380 -756 -1281 -1145 -294 389 57 -31 207
7556 207 901 1409 925 89 541 552 746 514 -402 -778 -241 -34 -328 -1087 -1294 -844 3 -354 -920 -244
7576 -244 494 1334 1105 556 715 1435 1301 1147 570 -48 546 803 311 -667 -702 -490 -290 -810 -1245 -1344 -506
7597 -506 137 -119 -426 69 264 913 747 491 339 638 755 640 129 -321 8 464 -312 -1422 -1342 -1208
7617 -1208 -457 -513 -706 -1022 -223 81 -102 282 118 441 802 723 273 -254 578 701 487 -290 -926 -1078
7637 -1078 -243 -642 -1213 -1205 -676 45 106 -323 81 326 1460 631 390 468 805 1302 1093 725 409 365 518
7658E18j51j175m75P11o4K34m39r6J44Q83K89k80l73J81J103J33o66k85O99J04
7678I95n24k02p79r8L77j36o31n13P47L22J46m12k86j33R70N17Jk16M53O80m16
7699H62n99n24Q6P09l15n54o26l8R19k22j47p62L46L92L56k04j0M63P84K17n11
7720F22j32K62K71K84n86r03K63N1R4n84o82K91M39J02o77n0L43Q51K91k65j57
7741A28K57N97K15j44m90K7L42k01j82p34j66J00j87n68p04J79R19M68l43k10
7761f97J14N41M80k7l24j03N79K41k87n10J48k3J76n25q11K51L83M45q29k86Q2
7782i82L86M47K53k25L87M32N15p38j05N5M60L16n54m53n68L61j91j53l71k02
7802i30R9N01j22l02K38N53O48J6j20m48N36R03m03m14j27L81l41Oj056l73L76
$$ plain form
7658 518 367 -808 -1283 -572 -636 -402 -841 -937 -793 90 379 99 -274 -93 1010 1143 477 192 891 995
7678 995 471 269 -510 -608 -231 -367 -998 -1511 -764 -442 -296 -708 -994 -1127 -157 360 361 145 598 1278 862
7699 862 263 -261 -175 534 219 -335 -961 -999 -80 -302 -449 -1211 -865 -473 -117 -321 -331 132 916 1133 622
7720 622 490 752 1023 1307 721 -182 81 132 226 -358 -1040 -749 -310 -208 -885 -935 -592 259 550 285 128
7741 128 385 982 1197 1053 563 590 932 731 549 -185 -351 -251 -438 -1006 -1710 -1531 -612 -144 -487 -697
7761 -697 -583 -42 438 411 87 -16 563 804 517 7 155 132 308 -217 -1028 -777 -394 51 -778 -1064 -982
7782 -982 -596 -149 104 -121 266 698 1213 475 370 425 885 1201 647 194 -374 -13 -204 -357 -728 -930
7802 -930 -831 -330 -452 -754 -516 37 685 701 581 133 669 1572 1169 755 628 1009 668 674 -382 -755 -379
7823c79M37n25j086L51N81L96l89J5j84M15R39k62j39L7L10L70m54j55m13K75
7843A40ml63n47k95K90K55R5k73k65L76N38Q2Q6q5L99P22J1q50j17K74M72m58
7865D83n11n10p9O88k19m86m71M38K39k12j17M8K78J006O0k31K65K05N38k36n05
7886F71k71J81J80k93q05n7Q6O4p3p18k36L83N12Q3j57J72K08N62M91n51j03J70
7908D99J74K79j000m64M92J52j97n39m40K2L70L10l87l21M60P05N1K44k73J18
7928B55O07o5j82o44N00L99m5j110k52P2L57j69n74j08m7Q18M61j55j50JQ25j82
7950F12j27j98M32N31P4m72o94N03M5j89o23m79l62M42K03n07J21j63O97L37k42
7971e9n81L37P63O32k83l81J5L79j12k76o22j21L33J23p30n68QN05K98l56l51
$$ plain form
7823 -379 58 -467 -1553 -1202 -621 -225 -614 -599 -783 -368 571 309 170 207 517 887 433 278 -135 140
7843 140 136 -227 -774 -1069 -779 -524 -429 -702 -967 -591 -53 29 115 30 429 1151 1162 312 195 469 941 483
7865 483 -28 -538 -617 71 -148 -634 -1105 -667 -428 -640 -757 -709 -431 575 635 404 669 874 1412 1176 671
7886 671 400 581 761 468 -337 -394 -308 -244 -317 -1035 -1271 -888 -376 -293 -450 -278 -70 492 983 432 329 499
7908 499 673 952 -48 -512 -20 132 -65 -604 -1044 -1022 -652 -342 -729 -1050 -590 115 166 410 137 255
7928 255 862 797 615 -29 471 870 825 -285 -537 -465 -108 -277 -851 -959 -1006 -188 273 118 -32 -31 794 612
7950 612 485 287 719 1250 1324 852 158 661 706 517 -106 -585 -947 -505 -302 -809 -688 -851 -154 183 -59
7971 -59 -640 -303 460 1092 809 428 443 822 710 434 -188 -309 24 147 -583 -1151 -1143 -638 -340 -696 -1047
7992a047L51N03L09M0k75J10M23Q53o39l67j88L26K09p60o92k28N94O69o96l43
8012h48O2N84N3k74k37P73N10J64J11j32l07L44N78n91o11k5n9M21m15o74m67
8033a040L60N06k17p12J33N34O72l26j15L05M19O05p2m43k98J79M87l82p13m09
8053e27N84n7l42m61k54J82P30m82k3j16N77L72K53k54k13M84M19k69n74m04L45
8074c0N69n86l34m17L00k40J41L1l71M00M73J35j92K12L72J78K84k94k88J39M62
8095I44p4o43n90N61K37m83p01m09M49L38K02o19K65M78P12l92k45K04K40K92
8115G66J64N3n19L16M8l10l10p15J61L02m57m75l36N86N61l24j49p9K43Q94J1
8136D31o8l79M70M33q4l41n75K43kP2p87m77K05P05k48j11m22K67Q93j51j49k76
$$ plain form
7992 -1047 -696 -193 116 156 -119 -9 414 1267 628 261 73 399 608 -152 -844 -1072 -478 191 -505 -848
8012 -848 -786 -202 -149 -423 -660 113 623 787 898 766 459 803 1381 790 179 154 95 516 101 -573 -1040
8033 -1040 -680 -174 -391 -1103 -970 -436 236 -90 -205 100 519 1124 1052 609 311 490 977 595 -118 -527
8053 -527 57 0 -342 -803 -1057 -875 -145 -627 -650 -766 -189 183 436 182 -31 453 872 603 29 -375 -30
8074 -30 539 -47 -381 -798 -498 -738 -597 -566 -937 -537 -64 71 -121 91 463 641 925 631 343 482 944
8095 944 870 227 -363 198 435 -48 -749 -1158 -709 -371 -169 -788 -523 -45 667 275 30 234 474 766
8115 766 930 983 464 780 828 518 208 -507 -346 -44 -501 -976 -1312 -726 -165 -489 -638 -717 -474 420 431
8136 431 363 -16 454 887 803 462 -113 130 128 200 -587 -1064 -859 -154 -402 -513 -935 -668 225 74 -75 -351
8158c51O08O86L5k68k81l2N52j83o57j39j83K44l03p6o12K22L64M69p03j96N10
8179b94O77M1m3j99L99O34j69j31m43lK64J0
$$ plain form
8158 -351 257 943 978 710 429 397 949 766 109 -30 -213 31 -272 -348 -960 -738 -374 95 -608 -804 -294
8179 -294 383 424 381 182 581 1215 1046 915 472 469 733 743
8191G43
$$ Imaginary data points
##PAGE= N=2
##DATA TABLE= (X++(I..I)), XYDATA
0@%%%%%%qQqJ6j6K4l2L6m4N6o7P5q9J08j29J50j73K01k32K65l02L45l91M41m99
31b65N62o30P04p86Q78r77J085j203J333j478J637j811K005k223K463k734L046
48A606l400L811m296M872n575O459p606R157j1393J4922k1362L7008j46332k65727
62c87856M3965J33065K20714P5011p4791j12751r011K5736M2968N4853L0122n1724
74i699m1652M7243J01607N5200J1338l5829q5976o0275M7517O3401m0415j09320
86e6860n8154P663N6257R7245O7051m3740r5481m1640J5706K0288M1421N6708
98F6464l953o6631l1604L0774K9740l095j4515m0539n4793Q411N9518M384n9378
111g5217k2557N1725O6807M9440J8287n1675q7401j6425Q2289J01675N6448R872
$$ plain form
0 0 0 0 0 0 0 0 -8 0 -8 8 -8 16 -16 20 -24 32 -35 40 -49 59 -70 80 -93 108 -124 141 -161 184 -207 234 -265
31 -265 297 -333 371 -415 463 -514 571 -632 701 -777 860 -951 1054 -1169 1294 -1440 1606
48 1606 -1794 2017 -2279 2593 -2982 3477 -4129 5028 -6365 8557 -12805 24203 -122129 -387856
62 -387856 -343891 -210826 9888 84899 10108 -102643 -111654 -85918 -42950 11903 42025 -9699
74 -9699 -51351 -4108 97499 152699 164037 128208 42232 -18043 29474 92875 52460 -56860
86 -56860 -115014 -107351 -51094 46151 113202 69462 -26019 -67659 -51953 -31665 9756 66464
98 66464 62511 -4120 -35724 -4950 24790 21695 7180 -33359 -88152 -79741 -20223 -15839 -75217
111 -75217 -97774 -46049 20758 70198 88485 36810 -50591 -67016 15273 116948 173396 183268
123A83268o2532j36664j01397K6206R2599N2962j1354o0818q6629l5156O0385
134g9130O2393k5032o1832j6812L2806N6272P5297N1407k4948n7955j2954L3775
146C3287M2753M2343J3070o9776j10728k5792P6484P9447J7670m4760q8751p9868
158a14621P051P7148M3150j8120k1880o087m570J5729M9009L0833k3373l4544
170b75j2481k683J2298L0146J354n2929l4289M3109N9505Q754l4519n1419m1500
183g4929J0628P3159O5345k209l3342j8016j0467l695K7593L6341j5116n8425
195c133l8839n536J5637L1648J1015n1786p3062n688N9144M3741o81k2604k6839
208f6983l915M7322P4556L4064j6049k1665j4796j2267J8785N4384K6619m3178
$$ plain form
123 183268 120736 -15928 -117325 -91119 1480 54442 43088 -17730 -104359 -139515 -79130
134 -79130 -16737 -41769 -103601 -120413 -87607 -31335 43962 95369 70421 12466 -488 33287
146 33287 76040 118383 131453 61677 -49051 -74843 1641 81088 98758 53998 -34753 -114621
158 -114621 -107570 -30422 12728 -5392 -27272 -33359 -37929 -22200 26809 57642 34269 -275
170 -275 -12756 -15439 -3141 27005 28359 -24570 -58859 -15750 43755 52509 17990 -33429 -74929
183 -74929 -64301 8858 74203 71994 38652 20636 10169 6474 34067 70408 55292 -3133
195 -3133 -41972 -47508 -31871 -223 10792 -40994 -114056 -119744 -60600 -16859 -17540 -40144 -66983
208 -66983 -70898 -23576 50980 85044 68995 47330 32534 20267 39052 93436 120055 76877
220G6877o7020l5051J614K9756L3358j6253o9865m9560J8880M2219J5252k438
232b2231q202j3933K031L4470L7326O120r431q253k0671j2578L1112M3271n203
245E3828m8015l3774J409K2456L2454R397l6315m2585N837M2535K4845j297l007
258B7768q620j3719N472K5466J1136j4968k4624l3760l6462O56L9733J7642l1489
271c5769l8907n285K1191K8974K1398r126k9246K3M3919M7139K0788R999M036
284G9134j8183k1075N146J6950l8k0032l2458m0194j9438K6737L1788j5453m5689
297e2805k6696N697K0139K1956J3209p539p728K0925L2859J6509P622J0576o267
310D8457k8857j4538J3204J6074o01j5649k6359j9870J1413L3348O425l0822k5675
$$ plain form
220 76877 9857 -25194 -23580 6176 39534 23281 -46584 -96144 -77264 -35045 -19793 -22231
232 -22231 -30433 -44366 -42335 -7865 29461 35581 26150 17897 -2774 -15352 15760 59031 53828
245 53828 5813 -27961 -26552 -4096 28358 37755 1440 -41145 -35308 7227 32072 30775 27768
258 27768 19148 5429 10901 36367 47503 32535 7911 -25849 -62311 -61655 -21922 -4280 -35769
271 -35769 -74676 -79961 -58770 -29796 -8398 -17524 -46770 -46747 -2828 44311 65099 75098 79134
284 79134 60951 39876 45022 61972 61934 41902 9444 -30750 -50188 -23451 8337 -7116 -52805
297 -52805 -79501 -73804 -53665 -31709 -18500 -26039 -33767 -12842 20017 36526 44148 54724 48457
310 48457 19600 5062 18266 34340 33739 18090 -8269 -28139 -16726 16622 23047 -7775 -33450
323c3450N276K0628J8467J4569K508j1853o894N590q03o049M297Q97k5635l1515
337d3967k571J6133N411r220j6489j3178Q757L5146K8951l825j3594R134K4630
350B5318J8325J2012R599m218j5080q800o162p748K657O084j8998m1830k6792
363e5633M199P777m290j0085p179M674K3877K9236Q420j0724J575J7655J0402
376A9904L354J1915J4749J499p715q309j0367m094P118l924k7245k4659M868J7722
390e184L733q392o142K49P626J3303N206r022m513J0297M556j2227p554P333N017
405D286o202j0115p758m633L847L091j2013j4149J0765K9919J9934j065k767M099
419A7239N438P286N947k013k647P088M108j6973k1560n078J27j1510j8533j2406
$$ plain form
323 -33450 -28174 -7546 10921 25490 27998 16145 9251 14841 14038 7989 12286 13183 -12452 -43967
337 -43967 -46538 -30405 -24994 -34214 -50703 -63881 -55124 -19978 8973 5148 -8446 688 25318
350 25318 43643 55655 65254 61036 45956 37156 30994 23246 25903 31987 12989 -28841 -55633
363 -55633 -51434 -43657 -47947 -58032 -65211 -60537 -36660 -7424 996 -9728 -8153 9502 19904
376 19904 23258 35173 49922 51421 43706 35397 25030 20936 28054 24130 -3115 -27774 -22906 -5184
390 -5184 -1451 -9843 -15985 -15736 -8110 5193 10399 1377 -3136 7161 11717 -510 -8064 -731 4286
405 4286 -1916 -12031 -19789 -24422 -20575 -17484 -29497 -43646 -32881 -2962 16972 15907 13140 17239
419 17239 22677 29963 35910 33897 31250 38338 42446 25473 3913 -1165 -1038 -12548 -31081 -43487
433d3487l262L420M864l682j3229l96K1403K2848P170L412J3639J4072M926J546
447C3244K09J623R891J0027p368k0865r166L851m024j8892j6730o458J652M290
461a8716K326m534l270Q278R938m743q768R192K0318R055m730p068n683K106P436
476A1137l016j5312j0306P226Q379n036p194K850Q075L868J889K109M872J2447
490B1988J2995l669j5950m583J2292O576j1220j7555j2936o397j158n308j3997
503c8922j2773R05R781K017j409Q899J6710R164K178M968J2199J8490J8495M710
517E5412j2613q274R211R391r449k2590j7702q040k735q89p014j1034n797Q20
531c1303k297m286O276J8264J0602l945l223Q274J7936J6313J796j6982j9013
$$ plain form
433 -43487 -46749 -43329 -38465 -42147 -55376 -55772 -34369 -11521 -4351 -939 12700 26772 31698 33244
447 33244 33453 35076 44967 54994 47626 26761 17595 21446 17422 -1470 -18200 -24658 -23006 -18716
461 -18716 -16390 -20924 -24194 -15916 -5978 -10721 -19489 -10297 10021 19076 14346 7278 1595 3701 11137
476 11137 8121 -7191 -17497 -10271 -1892 -6928 -14122 -11272 -3197 671 2560 4669 9541 21988
490 21988 34983 31314 15364 10781 23073 29649 18429 874 -12062 -18459 -19617 -24925 -38922
503 -38922 -51695 -50790 -41009 -38992 -40401 -31502 -14792 -5628 -3450 1518 13717 32207 50702 55412
517 55412 42799 34525 43736 53127 43678 21088 3386 -4654 -7389 -8278 -15292 -26326 -32123 -31303
531 -31303 -33600 -37886 -31610 -13346 -2744 -6689 -9912 -1638 16298 32611 34407 17425 -1588
544a588J038J4608M996j0171j2248m749j884m18K998K924L128L427k89l387M977
559C362J9620J5004p931j9195r287N630J0335L90j7382k5107j3238M798N167m844
573c2678p324N0K598O32N090J3100J5203J2006O624L06N402J9580K0737k450k1497
588C7379j7291L15Q808J952j2803k2078j7249l234K628n221r837l916J917J659
602c6971O633J7596J8971Q159n303j1027k963J6435K5874R120j7275k1722l658
615C869J1429Q412n350j7380j8218o253P703J0891O481L956o66r855q314P856
629e439K2194J4986o476k2216k0351O81J9933J4990j0672k6399j6621J471Q530
642b5389M291j180m781l393M382J2174J6503J8017J3133l312j5236m755J4929
$$ plain form
544 -1588 -550 14058 19054 8883 -3365 -8114 -9998 -10416 -7418 -4494 -1366 2061 1772 -1615 3362
559 3362 22982 37986 30055 10860 1573 7203 17538 17928 546 -24561 -37799 -33001 -27834 -32678
573 -32678 -40002 -39952 -37354 -36722 -31632 -18532 -3329 8677 15301 15607 21009 40589 61326 58876 37379
588 37379 20088 20403 29211 31163 18360 -3718 -20967 -24201 -21573 -26794 -36631 -40547 -38630 -36971
602 -36971 -30338 -12742 6229 14388 9085 -1942 -4905 11530 37404 46524 29249 7527 3869
615 3869 15298 23710 18360 980 -17238 -23491 -15788 -4897 1584 5540 4874 -4981 -13295 -5439
629 -5439 16755 31741 25265 3049 -17302 -16621 3312 18302 7630 -18769 -35390 -33919 -25389
642 -25389 -21098 -22278 -27059 -30452 -26070 -13896 2607 20624 33757 30445 15209 10454 25383
655B5383K0584N277j5058k0315r768N869O139j1265k7320k1659k961Q044N966
668c1084L172L17l539l180M253J2402J7507J6314L099j0518n119J5836K6082J0516
682E6058j5316k5049j3415P315J6542M581j6541k3470j1804K660R319R815O228
695F923n031j5602j1932M061J8736K1789N333j8233k4032l180K0631J8492m830
708A3125k4856k2665m379J3480J7886O981n792p558m239J281R930J8645J6405
721B8244j36j0612n271J1273J9597R590j4409k9272j9643M403J3044l12j8212
734a1716k0982j0250J801P870N256j133l777p57M396J1592K1181K1653N027j1213
748A8948r218Q858K2493J5822q421k8212k3243J261J7929J0302j2037k3498j8390
$$ plain form
655 25383 45967 51244 36186 15871 6103 11972 18111 6846 -20474 -42133 -45094 -37050 -31084
668 -31084 -27912 -27595 -31134 -34314 -30061 -17659 -152 16162 19261 8743 3624 19460 45542 56058
682 56058 40742 15693 2278 9593 26135 30716 14175 -9295 -21099 -18439 -9120 695 6923
695 6923 1892 -13710 -25642 -21581 -2845 18944 24277 6044 -17988 -21168 -537 17955 13125
708 13125 -11731 -34396 -38775 -25295 -7409 -428 -6220 -13778 -18017 -16736 -6806 11839 28244
721 28244 28108 17496 12225 23498 43095 52685 38276 9004 -10639 -6236 6808 6496 -11716
734 -11716 -32698 -42948 -41147 -33277 -28021 -29154 -32931 -33688 -29292 -17700 3481 25134 30161 18948
748 18948 9730 18588 41081 56903 48482 20270 -2973 -1712 16217 26519 14482 -9016 -27406
761b7406n202P364J3847R509j776r430r349K046K0052K7017R904j8076k8841r858
775b0199J6774K5356P216j8757k8336j4848Q712J7070P235m820r669p487O85J3785
789g283K1938J6023o50j4790j3703K764K0335J7662p871k9153k4247j712J3146
802g541P202j1370k2047j6151J441J3745J2851N428J796L5N09R176K1232K1670
816C7976P769j0130j5552k811J6719J9536j834k7783l0736j0014J0827J1123m051
829A039j7799j9987o305R016J5358J1596L391m944j0021k182J5799K6868J6393
842C8222q898k4223j5512P714K2931J2180j4680k8108j6436O679J7698J1663j189
855H041j0233j0329j530R447J5816J3973K754j2274j6493j961J5767J5852n223
$$ plain form
761 -27406 -32608 -25244 -11397 -1888 -3664 -13094 -22443 -20397 -345 26672 36576 18500 -10341 -20199
775 -20199 -3425 21931 29147 10390 -17946 -32794 -24082 -7012 223 -4597 -14266 -21753 -21068 -7283
789 -7283 14655 30678 30028 15238 1535 4299 24634 42296 34425 5272 -18975 -20687 -7541
802 -7541 -339 -11709 -33756 -49907 -48466 -34721 -21870 -16442 -14646 -14611 -14102 -4926 16306 37976
816 37976 45745 35615 20063 17252 33971 53507 51673 23890 -6846 -16860 -6033 5090 1039
829 1039 -16760 -36747 -43052 -34036 -18678 -7082 -3691 -8635 -18656 -20838 -5039 21829 38222
842 38222 29324 5101 -10411 -2697 20234 32414 17734 -10374 -26810 -20131 -2433 9230 8041
855 8041 -2192 -12521 -14051 -4604 11212 25185 27939 15665 -828 -2789 12978 28830 23607
868B3607k6800k6884o700J3845J4694k851j9793j6106K353J4803J6449R110J616
881b657l166j370P918J8826K1526J0905q013k0509j1779Q598J8403K863k1381
894B0164k9043j4627P522J5184K924j5524k0095r271N816J3788J4357R172j067
907g00q912m717R520K1223J8274j340k1378k0369R58K1353J7357n518k2447j9092
921a5788r47J1869J1412l87r220q573j419O118J2361J2975M647j0242j7194o729
935a1117R633J6280L916j6658k4518j0570J2351J7099J814j4923j6534m028J0626
948b6629J5703J1265M141p61o04L031Q680J4314J0853l219j6913j3949L467J4825
962B4204P942j2524k6493j9504R21J2976M969r576j4761o996M888J2287J3314
$$ plain form
868 23607 -3193 -30077 -36777 -22932 -8238 -11089 -30882 -46988 -44635 -29832 -13383 -4273 -2657
881 -2657 -5823 -7193 725 19551 41077 51982 43969 23460 11681 20279 38682 41545 20164
894 20164 -8879 -23506 -15984 -800 2124 -13400 -33495 -42766 -36950 -23162 -8805 367 -700
907 -700 -9612 -14329 -4809 16414 34688 33348 11970 -8399 -7441 13912 31269 25751 3304 -15788
921 -15788 -16735 -4866 6546 6159 -3061 -11634 -13053 -6935 5426 18401 23048 12806 -4388 -11117
935 -11117 -1484 14796 18712 2054 -22464 -33034 -20683 -3584 -1770 -16693 -33227 -37255 -26629
948 -26629 -10926 339 4480 3719 3115 6146 14826 29140 39993 36774 19861 5912 9379 24204
962 24204 32146 19622 -6871 -26375 -25454 -12478 -7509 -17085 -31846 -38842 -33954 -21667 -8353
975h353R367K775l517l857L030J4389J8518O278j1739j7649m107J2214J2577m667
989B5259k0587k0061m955J1302J0718j61q437p237j965L347Q363J0094N958l948
1003G690j0864p023O118J6118R599j0681k2612j4797M765J4605N682q562j3095
1016b3057m286Q799J4014R293K757J36j016k01M864J1246J2063J731j1768j6422
1030H153n888O965P915o436k1910k0815l792R683Q715j443q123m359L668Q570
1044a9097R800R497Q514N426J6l00O901J2347P328p232j6065j0947L037Q917n39
1059A7603j4802j8324o139N888P985N95m669l254J069M251N133O172P443K873
1073A1824m280p950j657Q292Q033m344j5466j3084M14J0891O672m982j1498l945
$$ plain form
975 -8353 1014 3789 272 -3585 -555 13834 32352 38630 26891 9242 5135 17349 29926 25259
989 25259 4672 -15389 -20344 -9042 1676 1515 -6922 -14159 -16124 -12777 -4414 5680 11638 7690
1003 7690 -3174 -10197 -4079 12039 21638 10957 -11655 -26452 -21687 -7082 -1400 -9962 -23057
1016 -23057 -27343 -18544 -4530 4763 7520 7656 6640 6439 11303 22549 34612 36343 24575 8153
1030 8153 2265 9230 17145 10709 -11201 -32016 -35808 -26125 -17410 -18853 -26976 -31335 -27667 -19097
1044 -19097 -9297 200 8714 14140 14156 13856 20757 33104 40432 33200 17135 6188 9225 18142 17603
1059 17603 2801 -15523 -21662 -15774 -7789 -7194 -11863 -15117 -14048 -9797 -4664 1508 8951 11824
1073 11824 7544 -406 -2063 6229 14262 9918 -5548 -18632 -18218 -7327 -655 -5637 -17135 -21080
1087b1080Q117J1556P457K820J576K381P12k1L452O592L022p087j4812j0668N40
1102e443O503j527j4493j5618n690O669R049J157l591l73O790J0332P792N443
1116G000P026O645J993j368M96O014O029k410j2446j3894l565N041J115j0460
1130b784j3924o508L859P052J795k634p95L795N051K020J070M835P245K003m819
1145G261m249K398O323J34r288j2061l653O850P325j723p219k921N192O609K396
1160C374J4J216N058L068k100l166J000M604j19q444j1307m755K069J172o287
1175a4603r757m388N086P285J731k823J086Q247R226L900J593M616R094P284J82
1190B7759m378j522K519N57p574j1391o430J80P81o170j0267o109J817M146k73
$$ plain form
1087 -21080 -12963 -1407 6050 8870 10446 12827 13539 13518 16970 23562 26584 19497 4685 -5983 -5443
1102 -5443 1060 -467 -14960 -30578 -36268 -29599 -20550 -19393 -22984 -23357 -16567 -6235 1557 7000
1116 7000 14026 20671 22664 21296 21792 27806 33835 31425 18979 5085 1520 6561 7676 -2784
1130 -2784 -16708 -23216 -19357 -12305 -10510 -13144 -13939 -10144 -5093 -3073 -2003 2832 10077 12080 7261
1145 7261 3012 5410 11733 11867 2579 -9482 -13135 -6285 1040 -683 -7902 -10823 -5631 978 3374
1160 3374 3388 4604 9662 12730 10630 7464 8464 13068 12949 4505 -6802 -11557 -9488 -8316 -14603
1175 -14603 -24360 -28748 -23662 -16377 -14646 -17469 -16383 -8136 1090 4990 6583 11199 20293 27577 27759
1190 27759 23381 21859 24378 24935 17361 5970 -460 -280 501 -5669 -15936 -22045 -20228 -16082 -16355
1205a6355m135Q36P969R075M025m92K741O707N865q47m949k272L639M026l802
1220A2031r585n910J464L014k281o473l752L320M919J019k189P29P343P032l80
1235A0301o539l567L644M028j919q166p524l17K151j365o370m518J149L728J7
1250a5267j558L463J0843J0720L295k750k87P571J0162L132n733p183r54K133
1264A7587k740p926q908m557l512n408p903k883M065N904Q00m175N36Q885J2921
1279B686P043j331j389M962Q950M530l402n477j496M02k535q132p597j832J062
1294c556j458n699l310L496O052J123m070j756N944R491L116m883n897J108O289
1309E990K108o656j0140m669R94J367j391j663J961K847K77j651K480J0339J1847
$$ plain form
1205 -16355 -20490 -19654 -11685 -2610 1415 923 3664 10371 16236 15389 10440 8168 11807 15833 12031
1220 12031 2446 -3464 -2000 1014 -1267 -7740 -11492 -8172 -3253 -2234 -4423 -3694 3649 10681 10301
1235 10301 3762 195 3839 7867 5948 -2218 -9742 -10059 -7908 -9273 -15643 -20161 -19012 -15284 -15267
1250 -15267 -16825 -13362 -2519 8201 11496 8746 8459 16030 26192 29324 23591 16408 15454 17587
1264 17587 14847 6921 -1987 -6544 -10056 -15464 -23367 -26250 -22185 -16281 -15481 -19656 -19120 -10235 2686
1279 2686 9729 8398 7009 11971 20921 25451 22049 16572 15076 15478 12943 4811 -2786 -4618 -3556
1294 -3556 -5014 -10713 -14023 -10527 -4475 -3352 -7422 -9178 -3234 6257 9373 4490 -1407 -299 5990
1309 5990 8098 1442 -8698 -13367 -12373 -11006 -12397 -14060 -12099 -9252 -8975 -10626 -8146 2193 14040
1324A4040L428n270m230N745J1756O404o322j2702q543j218Q01l889p417o879
1338a4296m027m186m063k6P046P249P75m850j029R916J6848J0916p67o793n37
1353A2176P120O383j159p139o182k156j358m506m748k490K47k537o157l846M592
1368a1760Q392M392l960l947L100R119O229m293q758l739M926N236j852p905o158
1383a0978p46J880K76j220R01K737L84j598K143R716J2774M811o798r379m48J0043
1399A4498Q959l113j2809j0954j958L505R90m865p347n933m733k259K860R442
1413a3717J0127L020n389m944O665J6186J3130k03j0218o474M277R307L171n442
1427A9496r573o532l388l754l664j377L50k251n335l432M345J0245O406l016p046
$$ plain form
1324 14040 17468 12198 7968 13713 25469 31873 25551 12849 4306 3088 3889 0 -7417 -14296
1338 -14296 -18323 -22509 -26572 -26598 -19552 -12303 -11528 -16378 -17407 -7491 9357 20273 19506 12713 12176
1353 12176 19296 25679 24520 17381 11199 9043 7685 3179 -1569 -4059 -3812 -6349 -12506 -16352 -11760
1368 -11760 -3368 1024 -2936 -6883 -3783 5336 11565 7272 -1486 -5225 -299 4937 3085 -4820 -10978
1383 -10978 -11724 -9844 -9568 -10788 -9887 -7150 -6766 -8364 -6221 3495 16269 21080 14282 4903 4455 14498
1399 14498 23457 20344 7535 -3419 -5377 -1872 -882 -5747 -13094 -19027 -23760 -26019 -23159 -13717
1413 -13717 -3590 -570 -5959 -10903 -4238 11948 25078 24875 14657 8183 12460 21767 24938 19496
1427 19496 9923 3391 3 -3751 -7415 -8792 -8442 -10693 -16028 -19460 -15115 -4870 1536 -1480 -8526
1442h526J47J0205J0907J329o711o026K169O487J208o314p750l937J90Q51k12
1457e983J375K205J32m189k726N076J1308O656m066r057l348Q659J1508Q83j2402
1472F031j4905n747L797M650M6n019n487m408k412J884R198J0903N465m774o718
1487g496L883J6601J6572M852r564j0513p76P658M895n467j1632j0037n074j942
1501h040j253m73p77l879p296o309L272J2290J1768J612n806k099Q615J3650N933
1516B1208n792q956k907M954M371k276o360n247k304j469j919L27J621Q89l035
1531f895l263L523J1283J0063k00j0330p719L029J1339M699p524j3899q455Q41
1545a3508N174J348l597n831m602k492J365Q516J1780Q638j130o316K28J2528
$$ plain form
1442 -8526 -8379 1826 12733 14062 7351 1325 3494 9981 11189 4875 -2875 -6812 -6622 -5771 -5983
1457 -5983 -4608 -2403 -2271 -6460 -9186 -4110 7198 13854 9788 731 -2617 6042 17550 18433 6031
1472 6031 -8874 -14621 -10824 -6174 -6128 -11147 -16634 -21042 -23454 -21570 -12372 -1469 3996 -778 -7496
1487 -7496 -3613 12988 29560 34412 24848 14335 13559 21217 26112 20645 9013 -1024 -6098 -8040
1501 -8040 -9293 -9766 -10543 -14422 -21718 -28027 -24755 -12465 -697 915 -4891 -6990 1625 15275 21208
1516 21208 15416 6460 3553 8507 12878 10602 4242 -1005 -3309 -4778 -6697 -6370 -4749 -3860 -6895
1531 -6895 -10158 -6635 4648 14711 14511 4181 -3538 -509 10830 15529 8005 -5894 -14349 -13508
1545 -13508 -8334 -6986 -10583 -16414 -21016 -23508 -22143 -13627 -1847 6791 5661 -655 -427 12101
1559A2101J6173O294r457j3577m733P500P802j512j1584j2955q149l122m22J329
1573a4312J470j037m756m570L019J2387J3411L902o547o563N365J3429R598k907
1587B1889r963o992J630M397o00o366p722m778k314n03K229M572L528j955o368
1602i316j286Q203J1587M235p437r679k54R398P948k997j2653j1132j901M122
1616a1162L581j51k500j853j767J084M668R778Q341K63o519m125P681J4944Q514
1631C0777o577j4845r448K105P367J162q550j2262p457j291K317K634K813J080
1645a0175k750m486O50J0278J3744P206l944p164J495J1868J1244j244j2551j1254
1659B917j775N273L473k955o847n473m293k010P07L706L690q9o108k778N952J1813
$$ plain form
1559 12101 28274 34568 25111 11534 6801 14301 22103 20591 9007 -3948 -12097 -15219 -15641 -14312
1573 -14312 -12842 -13879 -18635 -23205 -20186 -7799 5612 9514 2967 -3596 1769 15198 24796 21889
1587 21889 11926 4934 6564 10961 10361 3995 -3727 -8505 -10819 -11322 -9093 -4521 -993 -2948 -9316
1602 -9316 -10602 -2399 9188 13423 5986 -3693 -3947 5451 13399 10402 -2251 -13383 -15284 -11162
1616 -11162 -7581 -7732 -10232 -12085 -13852 -12768 -8100 1678 10019 10282 3763 -362 7319 22263 30777
1631 30777 24200 9355 -93 2012 9379 10541 1991 -10271 -17728 -19019 -16702 -14068 -11255 -10175
1645 -10175 -12925 -17411 -16761 -6483 7261 14467 10523 3359 4854 16722 27966 26722 14171 2917
1659 2917 1142 6415 9888 6933 86 -5387 -9680 -11690 -10983 -7277 -3587 -3676 -9784 -12562 -6610 5203
1675E203P866n108j0968n351O178R662K080q295j0236k740L872M553O61k543k468
1690g634j803l70L119P799R288L304n998o630J575J1060R669k740j3256j1105
1704c722p98P302L482n187j0297p484j957J787J394K100K493K03j249J216Q045
1719b672J2821Q084l162q493k474R197J2117L292r146j2145n432K544K352l132
1733C751p362o643l178j302M89L684N164J893l167m416K721J0407R197o35q554
1748B049o201M756J0249M259o954j1773o628J223L772J374j091j327o36n27P55
1763f700M896P820M878l089p275j519Q120J0614J755r649j1361m406M222K704
1777A010m605q962o551r17K988L214K826K842J964k41m58M634J1374J0620J857
$$ plain form
1675 5203 13069 7961 -3007 -8358 -2180 7482 9562 1267 -8969 -11709 -7837 -3284 -2623 -5166 -7634
1690 -7634 -9437 -9807 -6688 1111 10399 13703 7705 1075 2650 13710 23379 20639 7383 -3722
1704 -3722 -4520 2782 6264 1077 -9220 -16704 -18661 -16874 -15480 -13380 -10887 -10684 -11933 -10717 -2672
1719 -2672 10149 18233 15071 6578 4104 13301 25418 28710 19564 7419 1987 4531 6883 3751
1733 3751 -3611 -10254 -13432 -14734 -14245 -10561 -5397 -3504 -6671 -11087 -8366 2041 11238 10603 2049
1748 2049 -4152 604 10853 15112 8158 -3615 -10243 -9020 -5248 -3874 -4965 -6292 -6928 -7455 -6700
1763 -6700 -1804 6016 10894 7805 530 -989 7131 17745 19500 9851 -1510 -5916 -1694 1010
1777 1010 -3595 -12557 -19108 -20025 -17037 -13823 -10997 -8155 -6191 -6432 -6890 -2256 9118 19738 21595
1792B1595n770m887L450Q975L132p584j2066q157p55J531k591n394m867j173l42
1807a4903j10J376L766M195K51j131J958Q999J0470K705o818q327m09O320M461
1822A2803m505r381o169O28L327M91k669k373QK20M43L498O128O407N89n034l794
1839F17L275P668K519p639j1244n512L564M949j188o773o322j227J968K745K043
1854a0557L591M920K818k51K298P697R389L822n064p936j594M858L976l857r272
1869D838p659j438Q27k915n689m587M7J684R96J081M480O573M308r86j690L338
1885C208P535N056k335n969k301L139L666k921p662n561p67J813j360l193j997
1900i649K052L502J270q1J975L971J608k668l807Q46N935M479l619q273n194J429
$$ plain form
1792 21595 15825 10938 14388 23363 26495 18911 6845 -1312 -2067 -536 -3127 -8521 -13388 -14561 -14903
1807 -14903 -15013 -13637 -9871 -5676 -5425 -6556 -4598 4401 14871 17576 10758 2431 2022 8342 12803
1822 12803 8298 -1083 -7252 -6624 -3297 -2806 -5475 -7848 -7840 -7620 -7177 -3679 2449 8856 9445 4411 617
1839 617 3892 11560 14079 6440 -4804 -10316 -6752 -1803 -2991 -9764 -16086 -17313 -15345 -12600 -10557
1854 -10557 -6966 -2046 772 521 2819 10516 19905 23727 18663 10727 9133 13991 17967 14110 4838
1869 4838 -2821 -4259 -3432 -6347 -12036 -16623 -16576 -14892 -13896 -12815 -8335 -1762 2546 1560 -130 3208
1885 3208 10743 15799 13464 7495 5194 8333 11999 9078 1416 -4145 -4912 -3099 -4459 -7652 -9649
1900 -9649 -7597 -4095 -2825 -2906 -931 3040 4648 1980 -1827 -981 4954 9433 5814 -2459 -7653 -6224
1916f224L695p14n752m997Q82M106L177P94J721L870L497Q09j466L481O501M774
1932A8154j600o156l619K546L282k299q780q089k334J027o50m019k753J270K910
1947a1110Q10n53J894O491O666J886j589N0N318O577J456m041m302n78M32k595
1963F812n767m052k8J920j256n301l764J198M246J385j795m90L965N226K253j643
1979B909k321J754K560j389m982l489J193L075m12n488m276P91M312K521j382
1994d624j316L199N869L551K94j0L946M846o1n107m811n42K000j457o215o932
2010g370k214J016q59l841l025J061L842K317m19J425N912R432N400r25j918P63
2026A0597M346K722k345m349k115m98j908n625m973j823M43j725n462l357L343
$$ plain form
1916 -6224 -2529 -3243 -8995 -13992 -13110 -9004 -5827 -5033 -3312 558 4055 4864 3398 6879 13380 18154
1932 18154 16554 10398 6779 9325 12607 10308 1528 -6561 -8895 -7868 -8518 -12537 -15290 -14020 -11110
1947 -11110 -10300 -10853 -8959 -2468 4198 6084 4495 4545 9863 16440 17896 13855 9553 8975 9407 6812
1963 6812 1045 -3007 -3035 -1115 -2371 -7672 -11436 -10238 -5992 -4607 -6402 -6892 -2927 2299 4552 2909
1979 2909 588 2342 4902 3513 -1469 -4958 -3765 -690 -1102 -6590 -10866 -10075 -5763 -3242 -4624
1994 -4624 -5940 -2741 3128 6679 6973 6963 10909 15755 15694 10587 5776 5234 7234 5777 -438 -7370
2010 -7370 -9584 -8568 -9427 -13268 -16293 -15232 -11390 -9073 -9492 -8067 -2155 7277 12677 11752 9834 10597
2026 10597 14943 17665 15320 10971 8856 8358 6450 825 -4148 -5971 -5528 -7253 -12715 -16072 -12729
2041a2729P191M479r48l026R88N863M791R73k502n73J046P4k769l346n61J124
2057G5k456n713n190J277O105L808q74k949R98O337N372O73j751M93L319J846
2073A1370k041m069j902J55j488n475o461k419Q32J268k189k165K298N715M868
2088a703K11q80L388P885O472M89l310p15L257K972j495n660n578l468l066m369
2104e570l705o33K181m67m815l694K507P733N851J85l999q77O149Q480L642j849
2120A1119l515k471j078j421j588j56J247j599n100n090N10O280M487j942n421
2135e738j726N253P763L179j754k818l56J217q14k731k509r84q32l808m795j146
2151a2599K711K618j539l423N91N446O812K120j152J358N887P784J752k911l340
$$ plain form
2041 -12729 -5538 -1059 -2007 -5033 -4045 1818 6609 7582 5080 4507 5553 5627 2858 -488 -1049 75
2057 75 -2381 -8094 -13284 -12007 -5902 -2094 -2968 -5917 -4919 1418 6790 7463 5712 6205 9524 11370
2073 11370 9329 5260 3358 3513 2025 -3450 -9911 -12330 -11498 -10230 -12419 -14584 -12286 -6571 -1703
2088 -1703 -1492 -2372 1016 8901 15373 15862 12552 11837 15094 18066 16571 10911 5333 1865 -1201 -5570
2104 -5570 -9275 -9908 -7727 -8194 -13009 -16703 -14196 -6463 -612 -427 -4426 -5303 846 9326 12968 11119
2120 11119 7604 5133 4055 2634 1046 890 2137 538 -4562 -9652 -9142 -2862 1625 -317 -5738
2135 -5738 -7464 -2211 5552 8731 6977 4159 3803 5020 4206 1475 -1034 -2018 -2850 -6658 -11453 -12599
2151 -12599 -9888 -7270 -8809 -12232 -11641 -6195 617 2737 1585 2943 8830 16614 18366 15455 12115
2166A2115J8J687p44m857m229k809j773k764l608k511L95k3l999l675J969Q004
2182f804Q611J758m690l278L308P461N487o43m010k739p7K76r58m02m55k698n473
2199e326n121k90O482O127l01o062l828L556Q294M721j367m955j761K271K280
2214D720o31j936j834k575l665m055p70L033K839j377m693j692N539Q678M328
2229E909j424k487K256O043L851p00k994o49J366N2m311m699l756k366l272l417
2245a0598j248K123K893q79m103j025N155Q769M743j858l384K530P034O205R4
2260A6451m615m468j965r11j976j750n42j527m312n556j866M162N908P73n124
2275g318m118K710R141P533N90m903l274J309L149N91j945k399k718l327l109
$$ plain form
2166 12115 12133 13820 13076 8219 3990 1181 -592 -3356 -6964 -9475 -9080 -9103 -13102 -16777 -14808 -6804
2182 -6804 1807 3565 -1125 -4403 -1095 6366 11853 11210 7200 4461 4384 4660 3702 3300 2845 147 -5326
2199 -5326 -10447 -10737 -4255 1872 1571 -4491 -8319 -4763 3531 8252 6885 1930 169 2440 4720
2214 4720 4089 2153 319 -2256 -5921 -9976 -10746 -7713 -4874 -6251 -10944 -12636 -7097 1581 5909
2229 5909 4485 1998 4254 10297 14148 13448 10454 9805 11171 11223 6912 2213 -1543 -3909 -7181 -10598
2245 -10598 -11846 -9723 -6830 -7709 -11812 -12837 -7682 1087 5830 3972 588 3118 10152 16357 16451
2260 16451 11836 7368 5403 4492 2516 766 224 -1303 -5615 -11171 -13037 -8875 -2967 -2194 -7318
2275 -7318 -11436 -8726 415 7948 8538 3635 361 1670 4819 5410 3465 1066 -1652 -4979 -8088
2290h088j103K986L532l44m723l358L853Q037O409p95k671N38N930N137M82m998
2306A0824m644j442j081j827l331k023j959k870m667k156J636M382K209k276j905
2321a1130M510R813P408R87l629j321L910N003J053l827m136k708j492k235k332
2336a26j649j680l619n150k946L332P101L855k413m416J59P065P868J581m228
2351D734m667M01L054J469j488k976j890k704l324j896J857L398R84k595k738
2366h381K821Q248O301M24m991k721L324N529J801k920n058k391m70j450l112
2381c046k374j592k408l009k197K315N990M076n55l092J476P462Q022K203l292
2396I979l203J727M918K338k887m626l596l191k589k549j306J32j012l743l322
$$ plain form
2290 -8088 -9191 -6205 -2673 -3017 -7740 -11098 -7245 792 7201 6406 3735 4273 10203 15340 15822 10824
2306 10824 6180 4738 3657 1830 -1501 -3524 -5483 -8353 -13020 -15176 -13540 -9158 -6949 -9225 -11130
2321 -11130 -6620 3193 10601 11588 7959 6638 10548 15551 16604 12777 8641 5933 4441 2206 -126
2336 -126 -1775 -3455 -7074 -12224 -15170 -11838 -4737 -882 -3295 -7711 -7552 -487 7381 8962 4734
2351 4734 67 468 3522 4991 3503 527 -1363 -4067 -7391 -9287 -7430 -4032 -3048 -5643 -8381
2366 -8381 -5560 2688 8989 9413 4422 1701 5025 10554 12355 9435 4377 1986 1516 66 -3046
2381 -3046 -5420 -7012 -9420 -12429 -14626 -12311 -6321 -2245 -2800 -5892 -4416 3046 11068 13271 9979
2396 9979 6776 8503 13421 15759 12872 8246 4650 1459 -1130 -3679 -4985 -4853 -5865 -9608 -12930
2411a2930J034O156N343m96m669k296N198Q296M003k272m095r68J961J313j461
2426D117l271k051j397k354j488P28L230J838k337m153m00O201O491K126l763
2441C517l400J906N160L111k830n143l314r18l48j383j809q99r3k107k527P70
2457a0307M424N293K94l204k21N800Q622M775k350m302q30K766K081j871n012
2472E958l743k252j503k491j524k10l08l032m362p82N249O746L098k369k459K909
2488a075P221M681j336m498k047J509K180p99k775k239j605k709l213j364K209
2503e860L194q51l320j255L904P030M058k365m590j77M150L841j097m139l569
2518a046p22O01j855k522j157j75j347k250l3M465O328K490j449j717L312P177
$$ plain form
2411 -12930 -11896 -5740 -397 -893 -5562 -7858 -2660 5636 9639 7367 3272 2304 4265 5578 4117
2426 4117 846 -1205 -2602 -4956 -6444 -5716 -2486 -648 -2985 -7138 -7538 -1337 5154 7280 3517
2441 3517 117 2023 7183 10294 7464 2321 -993 -1911 -2259 -3642 -5451 -6350 -6443 -8550 -11077 -10307
2457 -10307 -5883 -590 -296 -3500 -3721 2079 10701 15476 13126 8824 7994 10760 12841 10970 5958
2472 5958 2215 -37 -1540 -4031 -5555 -5765 -6073 -9105 -13467 -14249 -9000 -2254 844 -1525 -3984 -1075
2488 -1075 6146 10827 9491 4993 2946 4455 6635 5836 3061 822 -783 -3492 -6705 -8069 -5860
2503 -5860 -2666 -3517 -6837 -8092 -4188 2842 6900 4535 -55 -232 3918 7759 6662 2523 -1046
2518 -1046 -1768 -1167 -3022 -5544 -6701 -6876 -8223 -10473 -10506 -6041 287 2777 1328 -389 2923 10100
2534A0100M829j363m500k136K149K411j229m631m868k839k128l097k774j63J450
2549h789j01j935l68L487O936M315j484k814R20O298O410N66l969l718k38J313
2565F829j786l548l359j751j357k188k256K153L214J457k687k756J965O457N424
2580E811j67l768j857K991M003l20l921m362j077r3j785j979j437J333Q05j026
2596f849j239K440N484M082N8j979R37N728N356K7m058l476j54J481j996n133
2612G09m682j353l51j217k616j041J504J469o98j257K945O082N949J119k129K67
2628D700L919M546M52m435m745o05J792l19l712l631j947q44j864k170j18K803
2644f178L058j095k321J53N593N884J293l375k893R52L508R58l041l748j168N58
$$ plain form
2534 10100 14929 13566 9066 6930 9079 11490 10261 5630 762 -2077 -4205 -7302 -10076 -10239 -8789
2549 -8789 -8890 -10825 -11193 -7706 -770 3545 2061 -753 167 6465 12875 13441 9472 5754 5516 6829
2565 6829 5043 1495 -1864 -3615 -4972 -7160 -9416 -7263 -4049 -2592 -5279 -8035 -6070 387 5811
2580 5811 5644 1876 19 3010 7013 6693 2772 -1590 -2667 -2760 -4545 -6524 -7961 -6628 -5823 -6849
2596 -6849 -8088 -5648 -164 3918 3976 1997 2934 8662 14018 14045 9987 6511 6357 7838 5842 709
2612 709 -3973 -5326 -5677 -6894 -9510 -10551 -9047 -7578 -8276 -9533 -6588 -506 5443 6562 4433 4700
2628 4700 8619 13165 13617 9182 4437 3832 5624 5305 1593 -2038 -3985 -4829 -6693 -8863 -8981 -6178
2644 -6178 -3120 -4215 -6536 -6383 -790 5094 6387 3012 119 1071 4579 5537 2496 -1252 -2420 -1862
2660a862m73k347j686P61J627p57k617O00N163N419J806j538j512K360M266J118
2676A0328k822l366j96J452o80m133m271j180M04j290l237k039J703L860K078
2691c389r77L26L490M981K155q11l03K475M274O91l569l839j217J198k93m616
2707E76m922j789J9L62k375j417J826K984J393j753l94L155N320K505j669k400
2723A421J266L891K012l058m629k060K37m54k216k468R51K262N51k524j592J807
2739d603M799K645n41k126J458M272K337j225l298j259Q98j387l554m251k60J734
2755d361N39k624l276Q61M024L392K36o69J592M724L985J024p28J571K479M91
2771A3260l807m736j832Q24l07m007n268k550R67J424j908k801l21L294L115Q84
$$ plain form
2660 -1862 -2335 -4682 -6368 -5607 -3980 -4737 -7354 -6754 -1591 3828 5634 4096 2584 4944 9210 10328
2676 10328 7506 4140 3944 5396 4716 583 -3688 -4868 -4464 -5754 -8991 -11030 -9327 -5467 -3389
2691 -3389 -4366 -4040 -550 4431 6586 5775 5472 7947 12221 12912 9343 5504 4287 5485 5192 576
2707 576 -4346 -6135 -6116 -5754 -8129 -9546 -7720 -4736 -3343 -5096 -5490 -2335 2985 5490 3821 1421
2723 1421 2687 6578 8590 5532 903 -1157 -920 -1374 -3590 -6058 -5107 -2845 -2294 -4818 -6410 -4603
2739 -4603 196 2841 2300 174 1632 5904 8241 7016 3718 2459 3357 1970 -1584 -5835 -6095 -4361
2755 -4361 -3822 -6446 -9722 -8861 -4837 -1445 -1209 -1878 -286 4438 8423 9447 8719 10290 12769 13260
2771 13260 9453 4717 2885 3709 3402 -605 -5873 -8423 -7456 -6032 -7940 -10741 -11062 -7768 -4653 -3769
2787c769J34K543N052L324j038k183l85K279J625k134l641k230N22J041l084l787
2803e731p16J952J784j260k084Q47M353M930M77j512o55J771J870r14k874j582
2819F56N60m98l157l892j573K128J640k167l829m77M784N843K930n79l1K645M055
2836I038J363q39j1J012Q8k692m452j971J111J27m154o074l592J260L558O06j938
2853g560q69K803M166J857K06P16K466L209J77k051j041J546J334j633m791l427
2869b892K46O93j743l825j424K799M172K12k274p69K738M419J810j292j017J007
2885B860K496O07k449k061o24o27k815m211j393L009L524q22l788k091L061O163
2901H39L382m22k134J099L203L100l5r21O5m43k955m236k523R59J440k602n576
$$ plain form
2787 -3769 -3635 -1092 3960 7284 6246 4063 3678 5957 7582 5448 1807 -423 99 1140 -1944 -5731
2803 -5731 -6447 -4495 -2711 -3971 -6055 -5208 -855 4075 4552 3040 2385 4156 6026 5112 2238 656
2819 656 1216 718 -2439 -6331 -7904 -5776 -4136 -6303 -10132 -10609 -5825 18 2948 2369 2338 4983 9038
2836 9038 10401 9562 9551 10563 10651 7959 3507 1536 2647 2774 -1380 -7454 -11046 -9786 -6228 -5622 -7560
2853 -7560 -8429 -5626 -1460 397 603 1319 3785 6994 7171 5120 4079 5625 6959 5326 535 -2892
2869 -2892 -2646 -1953 -3696 -7521 -8945 -6146 -1974 -1762 -4036 -4805 -2067 2352 4162 2870 1853 2860
2885 2860 5356 5963 3514 1453 829 202 -2613 -6824 -8217 -5208 -1684 -2506 -6294 -8385 -5324 839
2901 839 4221 3799 1665 2764 5967 9067 9032 8111 8176 7733 4778 542 -1981 -1022 418 -2184 -7760
2918g760l580J848M460K304k135k384J381M315M135J125Q49J307L012P69k003
2933G643j546J07R77j695m304l843K28J681j115m004l844O58L526K198j614j538
2949f485J770M397L650m14j771m4J681R21j252j458j02O91j619l873k176J503
2965d581L435L55l734l297J344O446M903R19k479o75K741K555p6j400p79Q2j354
2982D405l659k417L89J354j733n684n152M99M993M052k50k744J69M728M770K013
2998E733p30P97J806J758q07j493N99P95j570m384m897j596J811k82l455m259
3014a0174l03L766L626J18k421J92L694L886J043j364m64K204J425o50k230j069
3030A279L80j544l852l360J58L433K477j670l673NM432N336Q38j954j435K427
$$ plain form
2918 -7760 -11340 -9492 -5032 -2728 -4863 -7247 -5866 -1551 2584 3709 4558 5865 8877 9646 7643
2933 7643 6097 6204 7181 5486 1182 -2661 -2433 -752 -1867 -5871 -9715 -9057 -5531 -3333 -4947 -6485
2949 -6485 -4715 -318 3332 2918 1147 1103 2784 3705 2453 995 893 1584 -35 -3908 -6084 -4581
2965 -4581 -1146 -791 -4525 -7822 -6478 -32 4871 5790 3311 2636 5377 7932 7856 6456 5677 5759 4405
2982 4405 746 -1671 -1282 72 -1661 -7345 -12497 -11998 -7005 -2953 -3203 -5947 -5778 -1050 3720 5733
2998 5733 5003 5800 7606 9364 8557 7064 7663 8458 6888 2504 -2393 -3989 -2178 -2460 -5915 -10174
3014 -10174 -10477 -6711 -3085 -2967 -5388 -5196 -1502 2384 3427 2063 1599 3803 5228 4578 2348 1279
3030 1279 1659 115 -3737 -7097 -6939 -3506 -1029 -2699 -6372 -6367 -1935 3401 4239 2285 850 3277
3046C277L573J782q59j905p85j660l460l161q26J888L22l425n056m60M742M657
3062a356M96k667r86L546N264K972N10l26R13J237n26j792j384n41j131m375m702
3079d848j311K003J805k466m609j646L125M579J655j285p16K905M669K259q95
3094E224j032J80L66j111k590j128N44M08k598l661j546K695K729q60l453j019
3110f852L642N725K649j069j999L01J987J352j451j815m64l06k146l201j041J780
3126b908J187k234l955j444L116N608K150j536j114K218N100L645n46k219n43
3141F525P87j47j875j408k05p04l041m794k772J162K392l42l859k090K583N801
3157a987L300p21j847O30L792K605l28j155p6R45l75k224k570M39J66k075m401
$$ plain form
3046 3277 6850 8632 7773 5868 5083 3423 -37 -3198 -4024 -2136 -1814 -5239 -10295 -10755 -6013 -1356
3062 -1356 -860 -3527 -4513 -967 4297 7269 7779 7453 8366 9603 9077 7285 5901 5360 4229 -146 -4848
3079 -4848 -6159 -4156 -2351 -4817 -9426 -11072 -7947 -3368 -1713 -2998 -3714 -809 3860 6119 5224
3094 5224 4192 4372 4738 3627 1037 -91 453 861 -1737 -5398 -6944 -4249 -1520 -2380 -5833 -6852
3110 -6852 -3210 2515 5164 4095 2096 2397 4384 5736 4285 2470 2006 1700 -446 -3647 -4688 -2908
3126 -2908 -1721 -3955 -7910 -9354 -6238 -630 1520 -16 -1130 1088 6188 9833 9287 7068 6525
3141 6525 7312 7165 5290 3882 3677 2973 -68 -4862 -7634 -6472 -4080 -4422 -8281 -10371 -7788 -1987
3157 -1987 1313 592 -1255 -625 3167 5772 5444 4289 4213 5158 4783 2559 -11 428 594 -1481 -5882
3174e882k434K157M515J406k709k991J182M623L392n22k039k18K449K117j008
3189D038j892o77J44j934l062k298J336J927j21k746k148K187M702L334r67k208
3205c85Q98L801L686Q61j807q09O78K26k181k487j238k03k230l834k744K26L352
3222d190J174k140l637P40M551L918O39j016N35M106L206P50k193j224L55j110
3238D464k606k526o7Q88l60l749l613l3K923K472j615k487K26M014M345J323j734
3255A865p01J562K044q32j832j341K89l15k671k504l0K113Q37k373l110J96M668
3272b135M151K80j556K67L128M209P23j848j689l29L32j713k550j540O09q01l714
3289d176l725j029K248K421o04k835Q03M718N288J543j168q24J750L016O54j356
$$ plain form
3174 -5882 -8316 -6159 -1644 -238 -2947 -5938 -4756 -133 3259 2737 698 480 2929 5046 4038
3189 4038 2146 1469 1613 -321 -3383 -5681 -4345 -2418 -2539 -5285 -7433 -5246 -544 2790 1823 -385
3205 -385 513 4314 8000 8861 7054 6245 6923 7149 4968 2481 1243 1040 -1190 -5024 -7768 -7542 -4190
3222 -4190 -3016 -5156 -8793 -8053 -3502 416 1055 39 574 4680 7886 8636 6443 5219 5574 4464
3238 4464 1858 -668 -735 153 -207 -3956 -7569 -7602 -4679 -2207 -3822 -6309 -6083 -2069 2276 3599 1865
3255 1865 1164 2726 4770 3938 2106 765 1054 739 -1932 -4436 -4466 -2353 -1516 -3889 -6999 -6803 -2135
3272 -2135 2016 2296 740 1007 4135 8344 9067 7219 5530 5201 5533 3820 1270 -270 339 -462 -4176
3289 -4176 -7901 -8930 -6682 -4261 -4865 -7700 -6897 -2179 3109 4652 3484 2660 4410 7426 8080 6724
3305F724j002k2Rk680l462j935M04J7k962l617q38K402L725P06j996n89L423M144
3323B451J288j753j305J489K286P36k002k077j24m15k092l295j308J715J571n72
3339c407k223J56L238M765J157k017j151K149L353J976j694j927k42O1p13l174
3355C07k357m84j16k155k779k55K442L549M71j897j266K723N027K909o28j060
3371D431J199K415Q56k013k160q84n2k071l877k669O00J526r76k945j794J592
3387f822K780J430j318k88K052M340K371q62j317M49J913j52k259k750J65J002
3403G34n33k334k088n2J781M81k025r63K015L678K199j431j212J326L541J605
3419F722j604l340j505P49N89j785k267j36O68j160k733j252J226L575J832j253
$$ plain form
3305 6724 5722 5700 5709 3029 -433 -2368 -1964 -1947 -4909 -8526 -9364 -6962 -3237 -2531 -4527 -5116 -1693 2451
3323 2451 3739 1986 681 2170 4456 5192 3190 1113 989 574 -1518 -4813 -6121 -4406 -2835 -3407
3339 -3407 -5630 -5474 -2236 2529 3686 1669 518 2667 6020 7996 6302 4375 4133 4194 3481 307
3355 307 -2050 -2534 -2650 -4805 -7584 -7839 -5397 -1848 -1377 -3274 -4540 -1817 3210 6119 5491 4431
3371 4431 5630 8045 8901 6888 4728 3844 3792 1721 -2156 -4825 -4225 -2699 -3675 -6620 -8414 -6822
3387 -6822 -4042 -2612 -3930 -4218 -2166 2174 4545 3683 2366 2815 4728 4576 2317 -433 -268 734
3403 734 201 -2133 -4221 -4273 -2492 -2011 -4036 -4999 -2984 694 2893 1462 250 1576 5117 6722
3419 6722 5118 1778 273 1022 1611 -174 -2441 -2577 -1909 -3069 -5802 -7054 -5828 -2253 -421 -1674
3435a674j153K175M496L503J33j941n58J706Q86r45k225j409O26j121l459l346
3451d306n88J091L20k929k106K01L818L099K00j407R58K921K146k08j539J191
3467B862J873R06j938l160j148J197L44k405l294j004J609J451l41o52J144K786
3483B30K218j202j752Q70L279K264o29k882j741J046Q61j357l387j834L40L9r36
3500d573j302L92L279K054l80j443P26L801L845O09j815q06J176K339q24k776
3516D302k026k55p48k911l592j243K029J133q96k320n94K459L809P59m69L46K486
3533B269K783O16q93J1J142O19k783m189k201R49J519j209k999k464O39K067K37
3550c887q78J9K248K556J007q77R81K924K177n63l287k295O57J521n66k878k698
$$ plain form
3435 -1674 -2827 -652 3844 7347 7480 5539 4981 6687 7573 6628 4403 2994 3620 2499 -960 -4306
3451 -4306 -4894 -3803 -3483 -6412 -8518 -8317 -4499 -1400 -1200 -2607 -1649 1272 3418 3210 1671 2862
3467 2862 4735 5641 3703 543 -605 592 936 -1469 -4763 -5767 -4158 -2707 -3048 -3700 -2556 230
3483 230 2448 1246 -506 364 3643 5907 5278 2396 655 1701 2562 1205 -2182 -4016 -3676 -3637 -4573
3500 -4573 -5875 -5483 -2204 -150 -530 -1973 -1247 2554 6399 7008 5193 4387 5563 7902 7078 4302
3516 4302 2276 2021 1273 -1638 -5230 -6473 -4444 -3311 -4207 -6527 -7121 -4662 -853 -94 -563 -217 2269
3533 2269 5052 5668 4775 4786 5928 6547 3764 -425 -2626 -1677 -158 -1367 -4366 -6830 -6191 -4124 -3887
3550 -3887 -4765 -4746 -2498 58 1065 188 1169 4093 6270 5707 2420 125 782 2303 1737 -1141 -3839
3567c839m7J520k14r05n63J864K088L86q95O39L141L780R01j821j988N26J617
3584F190j072l119k849m56O32j114k856j786P19J616j21j682j029K424M604K462
3600B563L61l58J289K277K84j185q00Q05P95j271m127k902M14J449m80l546k879
3617g311k10K279J751R0k80J273K664N13l79L6J598K179k46k782k018L62K586
3634B105n37k821l345l18J581J187l33p19J051K682J710p75J5J974K121Q64k006
3651D436j652O64J822k04k597l148j362K81k98k691k191J93K676J863n93j291
3667d092J132K907K686K21n8O11K066P14o56j349k2J304j008l763l554j139J581
3684b419J239k166k942o24K169K292L90j113L98J994J631M66L06R83J886K19k438
$$ plain form
3567 -3839 -3886 -2366 -2580 -3485 -4048 -2184 -96 290 -605 34 3175 6955 7856 6035 4047 4573 6190
3584 6190 5118 1999 -850 -1306 -674 -1788 -4644 -6430 -5711 -4095 -4216 -5898 -6927 -4503 101 2563
3600 2563 2924 2566 3855 6132 6416 5231 4431 5236 6031 4760 633 -2269 -1855 -406 -886 -4432 -7311
3617 -7311 -7521 -5242 -3491 -3401 -3681 -2408 256 769 390 426 2024 4203 3957 1175 -843 -481 2105
3634 2105 1568 -1253 -4598 -4916 -3335 -2148 -2481 -3200 -2149 533 2243 1468 1483 3457 5578 6442 4436
3651 4436 2784 3448 5270 5066 2469 -679 -2041 -1760 -2058 -4749 -6940 -6747 -4071 -2208 -2801 -4092
3667 -4092 -2960 -53 2633 2854 2796 3407 5473 6187 5531 4182 4160 5464 4456 693 -2861 -4000 -2419
3684 -2419 -1180 -3346 -6288 -6912 -4743 -2451 -2061 -3174 -2776 -782 849 1315 1621 2604 4490 4709 2271
3701B271l171O4J596J819k704l352j794J960J746l26j486J18J460K402J17l55
3717C65J234K367J255r45j663q3J423L24k598l489r29J200J016j500k626j200
3733e849J495K230L53r20K02K650K987J310j17M72J467P63j150k629l63P64L40
3750D005k378l929k088R69J020j060l434j646J933K894J884k03OJ677K219M61
3766B330J6N16J923R42j970k818j267J367J170j451l699k343O26K236L36j311
3782c397q81J542K242J692L23k3J214J368n37j657m01J763P93j493l442k323L25
3799b892J612q29k662j572J517L050J784k87m02J590K392J644m29J72J444Q40
3815F972j10k831j404L06L75k336m147k986L22K465J50k375j820J077K911K318
$$ plain form
3701 2271 -900 -836 760 2579 -125 -3477 -5271 -3311 -1565 -1891 -3377 -3259 -1799 603 720 365
3717 365 1599 3966 5221 4276 2613 2530 3953 4277 1679 -1810 -2739 -1539 -523 -2023 -4649 -5849
3733 -5849 -4354 -2124 -1771 -2691 -2489 161 3148 4458 4341 4813 6280 7043 5893 3264 2901 3665 4005
3750 4005 1627 -2302 -4390 -3421 -2401 -3461 -6895 -8541 -6608 -3714 -1830 -2033 -2027 -350 1869 2330
3766 2330 2346 2862 4785 5727 3757 939 -328 1039 2209 758 -2941 -5284 -4658 -2422 -2086 -3397
3782 -3397 -4278 -2736 -494 1198 1521 1498 2712 4080 3543 1886 1485 3248 4041 2548 -894 -3217 -2892
3799 -2892 -1280 -2109 -4771 -6343 -4826 -1776 8 -279 -681 909 3301 4945 4516 4688 6132 6972
3815 6972 6862 4031 2627 2933 3308 972 -3175 -6161 -5839 -3374 -3224 -5599 -7419 -6342 -3431 -1113
3831a113K45j36J343K279R32k48n7J417J288j612k735k460L37J277j008l207k544
3848f002O35K794R56j080j523N55K458J794N32L13J027J597k7j579j331N02J317
3865B938j242l038k853R05K228L19j710k238J41K523K321P9p35J337K003K350
3881E328K33r80O19Q03p01k680j961k10J181j039l365k740J52K016O10j331j742
3898e807k9K842K747J014K21O71J641J424o56p13j43J282j84k639k704L0J542
3915E39l48k396l414p39K088K058m72q80k32K253K131Q24o42L75J367M63j094
3932A881j759O58J237L61k431k801p13J901Q73j169k272l08L035K510R95r96L2
3949A034J802J677j16j185K01Q09N70j438k550q07P69n28k437k994j098J915K046
$$ plain form
3831 -1113 -868 -1004 339 2618 3550 3302 3245 4662 5950 4338 1603 -857 -520 757 -251 -3458 -6002
3848 -6002 -5367 -2573 -1617 -2697 -4220 -3665 -1207 587 1119 1432 2459 4056 4029 2450 1119 1621 2938
3865 2938 1696 -1342 -4195 -3290 -1062 -743 -2453 -4691 -4550 -2027 294 373 -362 975 2978 5328
3881 5328 5561 4581 5200 6003 5302 2622 661 451 1632 593 -2772 -5512 -5360 -3344 -2734 -4065 -5807
3898 -5807 -5836 -2994 -247 767 988 1659 3300 4724 4068 3355 3212 4494 4310 1671 -1033 -1003 539
3915 539 191 -2205 -5619 -6358 -4270 -2212 -2684 -3564 -3796 -1543 588 1412 770 1145 2512 2975 1881
3932 1881 122 780 2017 2378 -53 -2854 -3567 -1666 -793 -1962 -4234 -4542 -1507 1003 1998 1002 1034
3949 1034 2836 4513 4397 3212 3413 4222 4792 3354 804 -3 766 238 -2199 -5193 -6291 -4376 -2330
3966b330j29j752j71K413K904Q97n39R4J684J795j56j062l12J297Pk179l289j428
3984b256J083K75k087k572r98J875K703K11j189r36J326K219J425L4O11J334R63
4001D021m33k089m81N30M29j949k926j610J927J861J11k429r73J366K279J124
4017G58j37k03J748K110M33j134k96J060J30j526k978j662O40P30j102k632j559
4034e620J199K028P17j506m87J994L120J709J5O3J262J709J37j338j832k2J97
4051C345j684k908j646N21J002j195l085k157J029L246J155l12n15J614K898J458
4067B766j61m87Q25J011n28k119p29N19J228j201l415k204O49J765R51j658j767
4084d555J218K819J990P8j77R77J366N21j120j371O45J163p05k334k354l54J262
$$ plain form
3966 -2330 -2459 -4211 -4382 -1969 935 1832 1293 1387 3071 4866 4710 3648 3336 4633 4640 2461 -828 -2256
3984 -2256 -1173 -898 -2985 -5557 -6555 -4680 -1977 -1766 -2955 -3891 -2565 -346 1079 1113 1724 3058 4021
4001 4021 3588 1499 1018 1548 1977 28 -2898 -4508 -2581 -720 -609 -3038 -4011 -2645 -366 758
4017 758 621 418 2166 4276 4709 3575 3279 4339 4469 2943 -35 -1697 -1057 -327 -1429 -4061 -5620
4034 -5620 -4421 -2393 -1676 -3182 -3669 -1675 1445 3154 3169 3232 4494 6203 6340 5002 3170 3148 3345
4051 3345 1661 -1247 -2893 -2372 -1370 -2565 -5650 -7807 -6778 -3532 -2377 -2689 -3204 -1590 1308 2766
4067 2766 2605 2118 2943 3954 3426 1307 578 1097 2325 1124 -2291 -4495 -3846 -2081 -1130 -2788 -4555
4084 -4555 -3337 -518 1472 1550 1373 2350 3716 4237 3117 1746 2391 3554 2849 515 -1839 -2193 -931
4101i31o28k219j785K36K373J475J28k83J823K903J698p51j506P89K384O45j084
4118E267k151n06M19j088k796k759m31R71p3j850j807J437K342K448k97j669O40
4135a903K816J836J25o22mJ412J05j415j787m99Q42p41k717k450N3K228J663o46
4153a704j739p0K094K203K51m25L45K182J203j164j130j47J302l48k058l157o94
4170c056J328J010m51k334l66J527K004j90r09P70K745J675J34p40j8J433J158
4187E720j082k656j612J29J83j523j980r05Q59O36j340j929L35K380K466L8j209
4204a490M62K799K576N08j062q92L52L42j175k045n68N92Q23k573k882j021J370
4221c884J672m8j927q31K096K824J114m75K22J167R04k01j361l42J402L92q53
$$ plain form
4101 -931 -1559 -3778 -5563 -5327 -2954 -1479 -1351 -1634 189 3092 4790 4039 2533 3322 5706 6351 5267
4118 5267 3116 2610 3029 1941 -855 -3614 -4045 -3074 -3147 -4997 -6804 -5367 -3025 -577 -874 -2543 -1903
4135 -1903 913 2749 2874 2252 2248 3660 3765 2350 563 64 906 165 -2552 -5002 -4949 -2721 -1058 -1704
4153 -1704 -3443 -3513 -1419 784 1035 610 955 3137 4340 3176 2046 1899 3201 2853 795 -2362 -3056
4170 -3056 -1728 -718 -1169 -3503 -3869 -2342 -338 -528 -1437 -667 2078 3753 3887 3147 3129 4562 5720
4187 5720 4638 1982 370 499 682 -841 -2821 -3726 -2867 -2231 -3571 -5500 -5165 -2785 -319 -281 -1490
4204 -1490 -1028 1771 4347 4855 3793 2901 3253 3595 2420 375 -193 399 1222 -1351 -4233 -5254 -3884
4221 -3884 -2212 -2260 -4187 -5018 -2922 -98 1016 541 763 1930 2834 2633 1272 930 2332 2724 1871
4238A871l134j082P19J402l98k110r38J007K243Q14j81N62K258J725j53j898o64
4255B043J359J806p15k287k366j35P50j010k446j713J24O43l6j173K13K695K787
4272E39K33q10o57K174K755J105j166j341N47N13l78j929j780j77rj434k610j611
4290f036J547K392P03j737j061J579K483J285l05o44P41J996M41j303r39M19O08
4307B169j149k747k122L59K033L74j137j368J118K058J218n55j04J713K023O77
4323D560q50j077J003J700o14k768l023m45P91J77j730j917j69J303L90o43m4
$$ plain form
4238 1871 -1263 -2345 -1626 -224 -622 -2732 -3670 -2663 -420 394 213 775 3033 4758 4605 2707 2043
4255 2043 3402 5208 4493 2206 -160 -295 455 -555 -3001 -4714 -4590 -3947 -3983 -5156 -4943 -2248 539
4272 539 772 -38 -695 1479 4234 5339 4173 2832 3379 3892 3514 1585 -195 -372 -381 -1815 -4425 -6036
4290 -6036 -4489 -2097 -1394 -3131 -4192 -2613 -130 1155 850 206 947 2943 3384 2081 1142 1561 2169
4307 2169 1020 -1727 -3849 -3490 -1457 -1083 -2220 -3588 -2470 -412 806 251 147 1860 3883 4560
4323 4560 3710 2633 3636 5336 4722 1954 -1069 -1514 -723 -546 -2276 -4193 -4362 -3059 -2669 -3312 -3356
$$ [...]
8191e43
##END NTUPLES=NMR FID
##END=
