##TITLE=1H_CA-8572
 CDCl3, 8 sc, 
 14.3.2019
##JCAMPDX= 6.0         $$ Bruker NMR JCAMP-DX V2.0
##DATA TYPE= NMR FID
##DATA CLASS= NTUPLES
##ORIGIN= UXNMR, Bruker Analytische Messtechnik GmbH
##OWNER= root
$$ XWIN-NMR		Version 3.5
$$ Thu Mar 14 16:25:05 2019 Russian Standard Time (UT+4h)  she@DPX200
##.OBSERVE FREQUENCY= 200.1315
##.OBSERVE NUCLEUS= ^1H
##.DELAY= (6, 6)
##.ACQUISITION MODE= SIMULTANEOUS
##.ACQUISITION SCHEME= undefined
##.AVERAGES= 8
##.DIGITISER RES= 18
##SPECTROMETER/DATA SYSTEM= spect
##.PULSE SEQUENCE= zg30
##.SOLVENT NAME= CDCl3
##.SHIFT REFERENCE= (INTERNAL, CDCl3, 0, 15.7039)
##AUDIT TRAIL= $$ (NUMBER, WHEN, WHO, WHERE, WHAT)
$$ ##TITLE= Audit trail, XWIN-NMR		Version 3.5
$$ ##JCAMPDX= 5.01
$$ ##ORIGIN= Bruker BioSpin GmbH
$$ ##OWNER= she
$$ F:/spectra/data/she/nmr/H-F/1/audita.txt
$$ ##AUDIT TRAIL=  $$ (NUMBER, WHEN, WHO, WHERE, WHAT)
(   1,<2019-03-14 16:24:00.35 +0400>,<she>,<DPX200>,
      <created by zg, POWCHK disabled, PULCHK disabled
       configuration hash MD5:
       00 E9 B6 7A A2 85 ED C7 34 08 36 98 17 FE 4E 26
       data hash MD5: 16K
       9A 3A 5B BD 9F 70 F0 A5 61 A0 15 24 84 24 5D 84>)
$$ ##END=
$$ 
$$ hash MD5
$$ 8F 69 F1 46 B8 64 D8 2E 57 72 C1 CD CB 9F D4 C8
##$RELAX= 
##$RELAX= 
##$RELAX= 
##$RELAX= 
##$RELAX= 
##$RELAX= 
$$ Bruker specific parameters
$$ --------------------------
##$DU= <F:/spectra>
##$EXPNO= 1
##$NAME= <H-F>
##$PROCNO= 1
##$TYPE= <nmr>
##$USER= <she>
##$AMP= (0..31)
100 100 100 100 100 100 100 100 100 100 100 100 100 100 100 100 100 100 
100 100 100 100 100 100 100 100 100 100 100 100 100 100 
##$AQSEQ= 0
##$AQ_mod= 1
##$AUNM= <au_zg>
##$AUTOPOS= <>
##$BF1= 200.13
##$BF2= 200.13
##$BF3= 200.13
##$BF4= 200.13
##$BF5= 200.13
##$BF6= 200.13
##$BF7= 200.13
##$BF8= 200.13
##$BYTORDA= 1
##$CFDGTYP= 0
##$CFRGTYP= 5
##$CHEMSTR= <none>
##$CNST= (0..31)
1 1 145 1 1 1 1 1 1 1 1 1 1 1 1 1 1 1 1 1 1 1 1 1 1 1 1 1 1 1 1 1 
##$CPDPRG= <>
##$CPDPRG1= <>
##$CPDPRG2= <>
##$CPDPRG3= <>
##$CPDPRG4= <mlev>
##$CPDPRG5= <mlev>
##$CPDPRG6= <mlev>
##$CPDPRG7= <mlev>
##$CPDPRG8= <mlev>
##$CPDPRGB= <>
##$CPDPRGT= <>
##$D= (0..31)
0 1.2 0 0 0 0 0 0 0 0 0 0.03 0 0 0 0 0 0 0 0 0 0 0 0 0 0 0 0 0 0 0 0 
##$DATE= 1552566239
##$DBL= (0..7)
120 120 120 120 120 120 120 120 
##$DBP= (0..7)
150 150 150 150 150 150 150 150 
##$DBP07= 0
##$DBPNAM0= <>
##$DBPNAM1= <>
##$DBPNAM2= <>
##$DBPNAM3= <>
##$DBPNAM4= <>
##$DBPNAM5= <>
##$DBPNAM6= <>
##$DBPNAM7= <>
##$DBPOAL= (0..7)
0.5 0.5 0.5 0.5 0.5 0.5 0.5 0.5 
##$DBPOFFS= (0..7)
0 0 0 0 0 0 0 0 
##$DE= 6
##$DECBNUC= <off>
##$DECIM= 24
##$DECNUC= <off>
##$DECSTAT= 4
##$DIGMOD= 1
##$DIGTYP= 9
##$DL= (0..7)
0 120 120 120 120 120 120 120 
##$DP= (0..7)
150 150 150 150 150 150 150 150 
##$DP07= 0
##$DPNAME0= <>
##$DPNAME1= <>
##$DPNAME2= <>
##$DPNAME3= <>
##$DPNAME4= <>
##$DPNAME5= <>
##$DPNAME6= <>
##$DPNAME7= <>
##$DPOAL= (0..7)
0.5 0.5 0.5 0.5 0.5 0.5 0.5 0.5 
##$DPOFFS= (0..7)
0 0 0 0 0 0 0 0 
##$DQDMODE= 0
##$DR= 18
##$DS= 0
##$DSLIST= <SSSSSSSSSSSSSSS>
##$DSPFIRM= 0
$$ [...]
##$SUBNAM2= <"">
##$SUBNAM3= <"">
##$SUBNAM4= <"">
##$SUBNAM5= <"">
##$SUBNAM6= <"">
##$SUBNAM7= <"">
##$SUBNAM8= <"">
##$SUBNAM9= <"">
##$SW= 24.9337058887773
##$SWIBOX= (0..15)
0 0 2 0 0 0 0 0 0 0 0 0 0 0 0 0 
##$SW_h= 4990.01996007984
##$TD= 16384
##$TD0= 1
##$TE= 0
##$TE2= 300
##$TE3= 300
##$TEG= 300
##$TL= (0..7)
0 120 120 120 120 120 120 120 
##$TP= (0..7)
150 150 150 150 150 150 150 150 
##$TP07= 0
##$TPNAME0= <>
##$TPNAME1= <>
##$TPNAME2= <>
##$TPNAME3= <>
##$TPNAME4= <>
##$TPNAME5= <>
##$TPNAME6= <>
##$TPNAME7= <>
##$TPOAL= (0..7)
0.5 0.5 0.5 0.5 0.5 0.5 0.5 0.5 
##$TPOFFS= (0..7)
0 0 0 0 0 0 0 0 
##$TUNHIN= 0
##$TUNHOUT= 0
##$TUNXOUT= 0
##$USERA1= <user>
##$USERA2= <user>
##$USERA3= <user>
##$USERA4= <user>
##$USERA5= <user>
##$V9= 5
##$VALIST= <valist>
##$VCLIST= <CCCCCCCCCCCCCCC>
##$VD= 0
##$VDLIST= <DDDDDDDDDDDDDDD>
##$VPLIST= <PPPPPPPPPPPPPPP>
##$VTLIST= <TTTTTTTTTTTTTTT>
##$WBST= 1024
##$WBSW= 4
##$XGAIN= (0..3)
0 0 0 0 
##$XL= 0
##$YL= 0
##$YMAX_a= 317982
##$YMIN_a= -627407
##$ZGOPTNS= <>
##$ZL1= 120
##$ZL2= 120
##$ZL3= 120
##$ZL4= 120
##$ABSF1= 10
##$ABSF2= 0
##$ABSG= 5
##$ABSL= 3
##$ALPHA= 0
##$AQORDER= 0
##$ASSFAC= 0
##$ASSFACI= 0
##$ASSFACX= 0
##$ASSWID= 0
##$AUNMP= <proc_1d>
##$AZFE= 0.1
##$AZFW= 0.1
##$BCFW= 1
##$BC_mod= 2
##$BYTORDP= 1
##$COROFFS= 0
##$CY= 11.3945322036743
##$DATMOD= 1
##$DC= 2
##$DFILT= <>
##$DTYPP= 0
##$F1P= 18.9103706918063
##$F2P= -1.10871071338519
##$FCOR= 0.5
##$FTSIZE= 0
##$FT_mod= 4
##$GAMMA= 1
##$GB= 0.15
##$INTBC= 1
##$INTSCL= 1
##$ISEN= 128
##$LB= 0.24
##$LEV0= 0
##$LPBIN= 0
##$MAXI= 10000
##$MC2= 0
##$MEAN= 0
##$ME_mod= 0
##$MI= 1.114404
##$NCOEF= 0
##$NC_proc= 0
##$NLEV= 6
##$NOISF1= 3.799351
##$NOISF2= 2.8
##$NSP= 1
##$NTH_PI= 0
##$NZP= 0
##$OFFSET= 15.70392
##$PC= 1
##$PHC0= -9222.263
##$PHC1= 18.40026
##$PH_mod= 1
##$PKNL= yes
##$PPARMOD= 0
##$PSCAL= 0
##$PSIGN= 0
##$REVERSE= no
##$SF= 200.130013532006
##$SI= 16384
##$SIGF1= 3
##$SIGF2= 2
##$SINO= 400
##$SIOLD= 16384
##$SREGLST= <1H.CDCl3>
##$SSB= 0
##$STSI= 0
##$STSR= 0
##$SW_p= 3612.71676300578
##$SYMM= 0
##$S_DEV= 0
##$TDeff= 0
##$TDoff= 0
##$TI= <>
##$TILT= no
##$TM1= 0
##$TM2= 0
##$TOPLEV= 0
##$USERP1= <user>
##$USERP2= <user>
##$USERP3= <user>
##$USERP4= <user>
##$USERP5= <user>
##$WDW= 1
##$XDIM= 8192
##$YMAX_p= 0
##$YMIN_p= 0
$$ End of Bruker specific parameters
$$ ---------------------------------
##NTUPLES= NMR FID
##VAR_NAME=  TIME,          FID/REAL,        FID/IMAG
##SYMBOL=    X,             R,               I
##VAR_TYPE=  INDEPENDENT,   DEPENDENT,       DEPENDENT
##VAR_FORM=  AFFN,          ASDF,            ASDF
##VAR_DIM=   8192,          8192,            8192
##UNITS=     SECONDS,       ARBITRARY UNITS, ARBITRARY UNITS
##FACTOR=    0.0002004,     1,               1
##FIRST=     0,             0,               0
##LAST=      1.6414764,     0,               0
##MIN=       0,             -627407,         0
##MAX=       1.6414764,     317982,          0
$$ Real data points
##PAGE= N=1
##DATA TABLE= (X++(R..R)), XYDATA
0@%%%oJ4j6J6k4L2m0N6p0Q6j04J26j51J82k21K62l08L62m24M91n69O57p53Q61
27D59r81J114j261J423j600J796k014K251k509K794l109L452l826M238m695N198
43B730n753O372p063P842q724R728j0887J2244j3855J5807j8228K1326k5458L1273
57A7354m0136N5459q9245K89808j86650n85180L37468L37089k0367j59005J11372
68F7967K8411j18892p4737J18432K3829q3419J9080J75563l5843k62884j06918
79b49411K00631J44976l773K1500j7890k13293r4783K30362J72083j92967j93607
90a96172J17368J87305k9535j03067J4761M8393n6237n7830O8777P4687p2191
101c741p1679P8720N9956r0630m4780R9115O6526k0272j5675q6510j66150K0126
$$ y = [0, 0, 0, 0, -6, 8, -8, 8, -16, 16, -24, 32, -38, 48, -56, 70, -81, 101, -120, 142, -166, 196, -228, 263, -306, 351, -402, 459, -522, 592, -669, 754, -846, 950, -1064, 1187, -1322, 1472, -1637, 1815, -2011, 2227, -2468, 2730, -3023, 3349, -3714, 4128, -4596, 5132, -5755, 6489, -7366, 8441, -9787, 11539, -13919, 17354, -22782, 32677, -56568, 233240, 46590, -538590, -201122, 135967, 115600, -43405, 67967, 96378, -22514, -97251, 21181, 45010, -38409, -19329, 156234, 120391, -142493, -249411, -48780, 96196, 92423, 113923, 96033, -117260, -212043, 18319, 190402, -2565, -196172, -78804, 108501, 78966, -24101, -9340, 39053, -17184, -75014, -6237, 68450, -3741, -75420, 3300, 63256, -27374, -72154, 26961, 93487, 73215, 57540, -28970, -195120, -174994]
113a74994K53069J26743j36690j03373N1150k2969j37866K6340K43476R7417k33246
124a0943k03382J30202J72010r7663r2533J78083J32724j72690j86176K4834N1115
135g4419J7287J32044J18950j31118k15510K0002J80026M3778r6979j4989O9563
146D8635m3301j15166N2765J49635l9397j24744R6028J46764j39919k12387Q7000
157i4087K00704k6607j31077Q227P0845l961j1705L9547o082r7579n5172R1032
169a5915J04190m2631r1485J2110L6388k4799K4261P6503l7407r5925L7399N8947
181D1636j06370q8601J42998J80621l6463j51849n8831K2637J1177K4649Q2643
192F4247M6170r0543j14423K8865Q6234j3663o281J04492K4776j57994j05522
$$ y = [-174994, 78075, 204818, 68128, -35245, 15905, -7064, -144930, -118590, 124886, 222303, -10943, -214325, -84123, 87887, -9776, -102309, 75774, 208498, 35808, -150368, -125534, -74419, -57132, 74912, 193862, 62744, -152766, -132764, 47262, 91040, -5939, -20928, 48635, 5334, -109832, -57067, 92568, 53171, -71573, 24455, 171219, 31300, -181087, -94087, 106617, 80010, -51067, -42840, 28005, 24044, 12339, 51886, 45804, -51775, -106947, -15915, 88275, 45644, -45841, -33731, 2657, -22142, 2119, 78622, 41215, -54710, -17311, 41636, -64734, -153335, -10337, 170284, 133821, -18028, -76859, -54222, -43045, -18396, 64247, 110417, 19874, -94549, -65684, 20550, 6887, 606, 105098, 129874, -28120, -133642]
203a33642O4866N4163L7Q1740Q2018r7895j60938O928J23888L7119n7636q525
215g877M7045l3835j01268J5263J31327K9280q2522L498N0704p8331r3827P9061
227d1482J08760m1449o8782L5120L9075k4929p106K9126j5705o5637j4590P3885
239F286N6506m4042n0760L5845K2630n8848l799R5426J8376r1133l4308K4628
251b3193l2999j5507J07730J01487m7200j14849n5429J654K4601N3628P3583J9899
263I3405q8101j05302J5473R1547K5583r824M2891j88j13309p5079N2602O1166
275i136K7725O4439L4245j00150j26619R646J09546O2325k8616m8494j3092l143
287b1324j1430L0545O2114j0198o5974R934M8936m8955p1891M7511Q2371j4283
$$ y = [-133642, -68776, -14613, -14576, 67164, 149182, 51287, -109651, -102723, 21165, 58284, 648, -7877, 39168, 5333, -95935, -80672, 50655, 79935, -2587, 911, 51615, -26716, -120543, -41482, 67278, 25829, -42953, -7833, 31242, 6313, -793, 28333, 12628, -53009, -67599, 6286, 62792, 18750, -32010, 3835, 26465, -32383, -36182, 59244, 77620, -13513, -47821, -23193, -56192, -71699, 36031, 137518, 90318, -24531, -79960, -78306, -53705, -77, 73506, 93405, 5304, -99998, -84525, 7022, 32605, 22781, 65672, 65484, -47825, -122904, -70302, -9136, 18589, 83028, 117273, 17123, -109496, -99850, 9696, 72021, 43405, -5089, -18181, -21324, -32754, -2209, 59905, 49707, -16267, -6333, 42603, -6352, -78243, -30732, 51639, 37356]
299C7356m4611N272J0083l076K1878J1867n1494o8034O146R3227P7600l4575r1918
312c0279k5409L1390J3974K5695M7593k3105q2959j4151M1211r050q568P7625
324D3967P3670m0810j05096o9369M098O7523Q2104L9443k9114q3525p3134K5233
336f5010R3556M0313k4898j3934k2332o5737k3017N8781M6602P296K6011R510
348F7141o9626p8439R363O7908M6724q711l9524k2677M876N191J8394M0271l334
361C7557o0675k1986L9622J0841k3660P124J3529j3888R011L8550j898l9484j4849
374b0206P389k869j0388J210L0638M8578N222n7314m7316J527K1462M1551M9660
387F9144k0470r0009m2388M1654M9269L0908K5169j2556n1529m0352j6388J48
$$ y = [37356, -7255, -1983, 8100, 5024, 26902, 38769, -12725, -80759, -74613, 18614, 96214, 61639, -30279, -55688, -24298, -10324, 15371, 62964, 39859, -43100, -57251, -16040, -25090, -33658, 43967, 117637, 76827, -28269, -97638, -93540, -26017, 56087, 95530, 66416, -17109, -90243, -65010, 28546, 68859, 43961, 30027, 7695, -58042, -81059, -22278, 24324, 31620, 57631, 67141, -2485, -80924, -71561, -3653, 43071, 34360, -5164, -27841, -22965, -17774, 620, 40891, 37557, -23118, -45104, -5482, 5359, -18301, -11177, 2352, -11536, -2525, 36025, 34127, -5357, -20206, -12817, -15686, -26074, -24864, 5774, 54352, 59574, 2260, -45056, -43529, -22067, 19484, 69144, 48674, -41335, -83723, -42069, 7200, 38108, 63277, 50721, -808, -41160, -57548, -57400]
399e7400L6461N5942K5694j3809m4191n9234j7155N8966O6462J1173k9813n6684
411b3588n8944J2076Q2935M7358j9711j8513k999k2098k7030o882J0467L4804
423G875L9481q079m4021k0388J0115K1371K8686K607m3344k9899J9160J8954P81
436C299R777O23k2355K507L1353N704k4834k4032j8880J72L1044K4240j066P835
450B5387Q337l0781l8949l047J8375K8744L8646o33o0029m8842J1911M8153N3514
463E0786K7354l3645o3815l4054o058J3495N4614N9982l140m6036l5313k5367
475d1197p649M0942N1861N523l0232l8621l7415L92N1692N3061J5266k0871n5516
488a2764n0644J0968M5661J6105m24J2010r003k9261J668K0441j411l993O468
$$ y = [-57400, -20939, 35003, 60697, 46888, 2697, -56537, -73692, -14726, 51736, 62909, 33096, -23588, -82532, -70456, 12479, 59837, 40126, 21613, 18614, -3484, -30514, -37396, -26929, 7875, 47356, 39277, -4744, -25132, -15017, 6354, 35040, 37647, -5697, -35596, -16436, 2518, 3299, 13076, 13699, -8656, -6149, 25204, 30908, 6074, -17958, -36838, -36666, -5622, 18618, 17552, 25387, 33724, 2943, -36006, -39053, -20678, 8066, 46712, 46079, -13950, -62792, -50881, -2728, 50786, 78140, 44495, -19320, -53374, -59432, -45937, 8677, 68659, 65519, 19483, -15830, -41197, -48846, -7904, 43957, 49480, 19248, -19373, -56788, -56396, -4704, 48357, 63623, 42752, -12764, -63408, -52440, -6779, 9326, 8902, 20912, 11909, -17352, -15684, 4757, 3346, -647, 5821]
501E821j1676k1226M809K1109J4628N608j2448j9801O506J8441k42l844k905l2846
515b8066k7690L6110N7600J2274j2452j7188m4111l8323K1240N2130K6604j930
527C6198k1347l6305k2153Q061L3981M9571K2221m3459o6348k4671O972K3868
539c3411O3653N6904k9841p4454k8933P941J0115L2571M2257m508m7825l5625
551d1156J95L0731L5998J5470j870j6917m2277l4447K4806M4038J35n835K1525
564C0396q204m1944J436M1130O04l2355r560Q184L252Q185J5879O138j4230k6233
578a7322m460L2099J9676k4584j8769L839j8369j6364M6964N7069j3099m1415
590E265j2931j6775k6548J5585N2862L0047j1428l2630l2861j2725J7476M3122
$$ y = [5821, -5855, -27081, -22272, -1163, 13465, 19073, 6625, -13176, -6670, 11771, 11529, 7685, 4780, -28066, -55756, -19646, 37954, 50228, 37776, 20588, -23523, -61846, -40606, 11524, 38128, 36198, 14851, -21454, -43607, -35546, -1565, 48006, 70227, 26768, -39580, -64251, -57279, -33411, 30242, 87146, 57305, -17149, -46082, -38141, -28026, 4545, 46802, 42294, -5531, -41156, -40961, -10230, 25768, 41238, 39368, 22451, -19826, -54273, -29467, 14571, 14706, 8871, 30396, 22192, -19752, -18316, 22814, 23418, -8937, -18497, -10313, -7061, 1124, 17003, 23141, 8911, -17322, -21782, 10317, 29993, 5409, -13360, -9521, -27890, -44254, 2710, 59779, 46680, 5265, -7666, -24441, -50989, -35404, 17458, 47505, 36077, 3447, -29414, -42139, -24663, 18459]
602A8459M5627m348p1186n7509J8363L9620J2984K9869L5852k9515o4445j5122
614d1351J6964J699J7716M3430N353m9581m0279J1414L6519K2482J872j014j4638
627A0586m6767k7209M5418N0379k2217k7355L2026J7258m0016j6865K7154k234
639A58k6736J2757L0991p808k3262J1206K9223o474m2193j0702M3519K4755l2177
652C257k2163J2571j2828j8979M8689O2515k3329o2656j6405J590j3057J8317
664b2478N3922K1266l0901l4882p536K372k645J4624M5516K0640n5946o6771M695
677e8124M0359K5822L8573L0852m8667q0643m278M5227J0109j515K9274J1889
689C8878l6035l2455J1362K6136N215k324J4092J165m8655m0301M2815O3005r641
$$ y = [18459, 64086, 59738, -11448, -68957, -50594, -10974, 2010, 31879, 67731, 38216, -26229, -41351, -24387, -22688, -4972, 38458, 43811, -5770, -46049, -34635, 1884, 24366, 26238, 25224, 10586, -36181, -63390, -17972, 32407, 10190, -17165, 14861, 32119, -7897, -24762, 2392, 158, -26578, -13821, 17170, 9362, -13900, -2694, 26529, 20055, -22138, -32840, 10679, 35434, 3257, -18906, -6335, -19163, -38142, 10547, 73062, 49733, -12923, -29328, -27738, -40795, -22478, 31444, 52710, 21809, -13073, -20609, -18237, -20882, -6258, 39258, 59898, 3952, -62819, -58124, -17765, 8057, 46630, 77482, 28815, -51828, -56106, -10879, -770, -2285, 26989, 38878, 2843, -29612, -18250, 7886, 13101, 10777, 24869, 26034, -22621, -62922, -20107, 42898, 33257]
702C3257l2489J3083R2l7912O505M8801j3849o1721K908O2270K1391l1788j7277
715f729J3028j820k6705j212L5686R922l1517j308K6456k5406m3166M4635Q0081
728G1945j2137p2469k8061L45p576L0371P0293K1199n6177n5705J323K8915P653
741h1J016K5836J1707m5402m5647J8649L3987P290K7648L5848m5613r0746q740
754g4248O4116L2111l751O376o846l8716j7540L4139L3826j2168l0603K623J5473
767D792k2414k3182L7935M5393k4933l4161K2050R091m1479j120N3161p78n9414
780c5059o469N4767K4833k0162j0115J834k5143l1144K3431O1629O449n6904j9958
793c2011L5600R63k7576L3288N2429l3505o7646m31K3298j0554J3713O2895K2522
$$ y = [33257, 768, 13851, 13943, -23969, -17464, 31337, 17488, -44233, -41325, 20945, 42336, 10548, -6729, 6299, 4479, -22226, -23438, 12248, 22170, -9347, -10655, 15801, -9605, -52771, -8136, 71945, 59808, -12661, -40722, -40377, -47953, -17582, 52711, 73910, 17733, -37972, -36649, -7734, -81, 935, 26771, 38478, -6924, -52571, -33922, 65, 7355, 35003, 70851, 25238, -65508, -74248, -10132, 21979, 18228, 24604, 17758, -20958, -38498, -4359, 29467, 17299, -13304, -10681, 4792, -17622, -40804, -2869, 42524, 17591, -16570, 5480, 14571, -26908, -28028, 25133, 24355, -35059, -41528, 13239, 38072, 17910, 7795, 9629, -15514, -46658, -23227, 38402, 44851, -12053, -32011, 3589, 4552, -23024, 10264, 62693, 29188, -38458, -38889, -15591, -26145, -12432, 50463, 72985]
806G2985o0624o2550L884L8331J9535O639J4646j1150n6839k7290N4132N0298
818D1997j7188j3246K2270k4137o3857M9N7850K1733j0138R852J349l8909k6719
831c9094K9321M1631n048l5231q782J6235m658j1973K8048K8589l0344l0888K9366
844G172J7891m0948j6393L8678P017l5124O166M4717N203l2916j1625P816j2966
857a5312j9951K1425M9517K237n0014j9990K8682L950j5401L4088L8140m5972
869A1399o6823J1025L9143p58J0319M6452M937o1889m6468J7675L3841O987K755
882H595K0861k785n2760l1022M5895M8046j3018j4604J5396k5467n8962P706O3976
895A1857K0650k0986J797O151k9250k5853J9456L2200l412k4370J55J8567p436
$$ y = [72985, 12361, -50189, -46305, -7974, 11561, 18200, 32846, 21696, -35143, -62433, -8301, 41997, 24809, 11563, 33833, 9696, -54161, -54112, 3738, 25471, 15333, 25185, 26534, -12375, -39094, -9773, 31858, 26810, -8421, -17203, -968, -5626, -17599, 10449, 39038, 8694, -22194, 7172, 25063, -15885, -32278, 6400, 13417, -21707, -15541, 29176, 34379, 1463, -10162, -2346, -15312, -35263, -13838, 35679, 37916, -12098, -32088, -3406, 544, -14857, 19231, 57371, 11399, -55424, -44399, -5256, -6014, 4305, 50757, 55694, -6195, -52663, -34988, -1147, 5840, 8595, 29456, 26671, -26089, -57111, -11216, 36830, 23812, 9208, 24604, -863, -59825, -52119, 11857, 32507, 11521, 13318, 19469, -9781, -35634, -16178, 16022, 12610, -11760, -11605, 6962, -474]
908d74j9866K1792L2764k2671l6233J8809K2643k6968j4850L1125P192k9991M317
921a2411M0426P161k9445j7768j264q176n048K5889M0609p80m6391k2115K3065
934f248P948j1813K5725L1020l6899n5943Q879L3500J580J2775M2700m00o2829
947a0005m8364J4171M0304K3367O952J892j7824m1410j2124M6431L7497k1025
959A9862k0926J2786j4144m2920Q098N4084J8901j5219j478o986l4094j5298L2239
972e095L4073r063l5027q717K4933J4929q685L81P181k1881j9379K5248K2160
985B1058k6074j7550K4846Q799k1745L689K8170K592k1519j3508q815j1821N206
998b6672L6353L9540p094n3293l3122K1268K6260M938J4170R333m0208m3340J9193
$$ y = [-474, -20340, 1452, 34216, 11545, -24688, -5879, 16764, -10204, -25054, 6071, 13263, -16728, -12411, 28015, 35176, 5731, -12037, -13301, -21477, -26525, -636, 39973, 39193, -7198, -29313, -6248, 1700, -10113, 15612, 46632, 9733, -46210, -37331, -3831, -2251, 10524, 53224, 52824, -10005, -58369, -44198, -3894, 19473, 26425, 28317, 10493, -30917, -43041, 3390, 40887, 19862, -1064, 11722, -2422, -45342, -37244, 16840, 35741, 20522, 19044, 12058, -22036, -37334, -5095, 28978, 19915, -15112, -23829, 1104, 16033, 7348, 7729, 14910, -6971, -26350, -1102, 21058, -5016, -22566, 2280, 11079, -10666, -6977, 21193, 23785, 2266, -11242, -20057, -31878, -26672, 9681, 49221, 42127, -11166, -44288, -23020, 3240, 8178, 22348, 31681, -8527, -51867, -32674]
1011c2674M1934P175K520J8636j1548m9080k9508J7201L5116K3846O654o330k3691
1024B51l4934n665M5478L8969k0507l5645k658k320j4493J9813M0474m01k7359
1037A003k404O749j4684j4148J1509J8704M269j2068q909Q926J0350j630N91J347
1051I605k2017j9225K6208L3570j3131k7084J250N000J248K0864J9550j9911l5038
1064a9111r494J0753J1204R934J2217J3749j623l0290k8961O041K2366J4347J6326
1077B7458K316l9964m0533J9823M8206J6867m642q118k6224k9799M88K4282J8668
1090H828R017K660l430j1431k3233j2964K5137L4327l735k6766j1148n526n354
1103b3618K3311L3975n217k9302p787N636l777k857N230L510K951L833M93L59
$$ y = [-32674, 9260, 16435, 18955, 37591, 26043, -23037, -52545, -35344, -228, 23618, 30272, 23942, 251, -34683, -40348, 5130, 44099, 23592, -12053, -14711, -17031, -31524, -11711, 28763, 28362, 1003, -1401, 5348, -9336, -23484, -11975, 6729, 10998, -1070, -9979, -1053, 9297, 7667, 8258, 9605, -12412, -31637, -5429, 28141, 15010, -12074, -10824, -5824, -4576, 16288, 35838, 15927, -19111, -28605, -17852, -6648, 3286, 15503, 29252, 27629, -2661, -31622, -25581, -3215, 11132, 27458, 29774, -10190, -50723, -30900, 17306, 34173, 29531, 21413, -4811, -34610, -34122, -9840, 8828, 17845, 20505, 17075, 5644, -17589, -30553, -5416, 28911, 25176, -1590, -12738, -18264, -23618, -307, 33668, 28451, -851, -8638, -3002, -6779, -9636, -4406, -896, 2055, 5888, 6381, 6740]
1117F740q86q983k533P893o363j4656J0789K2717l886j4689j07j718l340J6264
1131G242J8624j3258k8954j4579M319J9511K5086J0700p708j3841k0696j5844
1143b9398R484K1278R145N367K370k2506k9036P969L1891J8438M873q317l1309
1156i751l1404L169K8241K7260J4914p510k3687j5416k520M09J2783K0396j446
1169A5438j8441q039k138k639J5967K5822j048k2470j3960n110m86J3483J2351
1182H730l291n028J360J80L221O675p230j5337j653M724N30J1615J4661n880j6891
1197c614l966R84L460J4462R970j4821k0090q411O7J6142L0434J3643j5730k2601
1211g1k1328j3953J3915L2735J6816n151j4662k3908j5402J6934L0749J2976n117
$$ y = [6740, 5854, -3129, -5662, 2231, -4132, -18788, -7999, 14718, 10832, -3857, -3964, -5682, -9022, 7242, 25866, 12608, -16346, -30925, -26606, -7095, 17991, 28691, 20983, 7142, -13554, -29398, -19914, 1364, 10509, 15876, 18246, -4260, -33296, -25327, 6564, 25002, 29875, 21558, -9751, -41155, -37986, -9745, 17515, 32429, 24919, 1232, -14184, -16704, -16295, -3512, 16884, 15438, -3003, -11042, -13180, -15819, 148, 25970, 24922, 2452, -11508, -16618, -17104, -3621, 8730, 5439, 411, 1771, 1951, 5172, 11847, 4617, -10720, -12373, -7649, -7119, 4496, 19157, 13277, -3614, -7580, -6596, -3136, 11326, 21296, 6475, -13615, -22026, -21959, -5817, 24617, 38260, 22530, -71, -21399, -35352, -21437, 11298, 28114, 22963, 8301, -15607, -31009, -14075, 16674, 29650, 24533]
1224B4533j7099k9981j5865J6461K6281J7175J0546o891k8761k0303L729J1121
1236i054J3734J5246n303k2258r064P371R830J3660Q332j3783j9519k747L807
1249i748L155J0097L803r622q05J0540Q9m840K418o205j6451r42J2516Q055P686
1264I746R268q256k0063r732M285J4882K0126K52k4555k0459p80Q758K2442L0574
1278C6488m72l3698k3963l429O65J1322K6882J4371j0105j8250j6631o784J4211
1291i393K1980J1065k470k0328l2653p571L1217K8828L369l492q992k4168j1839
1304b4447J4264J1407j160K585M596m195o331j297K015R232P473r961j4378p28
1318a0925K068M614J4322L705j7590o196J7195Q822p447p149j1434j4042P999
$$ y = [24533, 7434, -22547, -38412, -21951, 4330, 21505, 32051, 25160, -3601, -23904, -20175, -9054, 4680, 19926, 14623, -7635, -16699, -9328, 502, 14162, 22494, 8711, -10808, -13555, -9748, -6593, 3504, 7307, -2315, -3120, 7420, 7509, 2669, 5087, -1118, -17569, -18511, -5995, 2060, 9746, 19014, 10758, -9305, -19037, -14752, 130, 20256, 20508, -4047, -24506, -25286, -16528, 5914, 36488, 36016, 2318, -21645, -25074, -24409, -13087, 13795, 28166, 18061, -189, -16820, -23604, -9393, 12587, 23652, 21182, 854, -31799, -39370, -8153, 20675, 24044, 20552, 11560, -12608, -24447, -10183, 1224, 64, 2649, 7245, 3050, -3281, -4578, -2563, 6669, 14142, 4181, -10197, -10925, -8857, -4243, 10079, 13784, -3806, -10002, 7193, 16015, 8568, 1419, -10015, -24057, -16058]
1331a6058K5605J0996n902o088p805q528j841K047P518J3884J855j6952j1967
1344a3236j553P95J8168L3752M14m1471k9207M736J2176J4140K2700Q012j8968
1357A0458k0367m421O002P709M474M711P198r744k9684q685K8953K4406N57q54
1371B0713q448l1053j7384K4431K6851k997j1062j451N16j124J078K340K753k226
1385B937r663j909P034m417m585J7665J3795j7460j5885R564Q018n078N09k181
1399a656j6008l610K2196K1133N55j3453j8685j0315M514J0866J1035Q125p927
1412F770j8538j511J0458q95M094K4571M362l4486k7303M835J2161J6033K8324
1425B8875J0391k8348l5316n499J9705K0718N066o337m951j1005j8380N500L1551
$$ y = [-16058, 9547, 20543, 14641, 8553, 748, -7780, -9621, -7574, -56, 13828, 15683, -1269, -13236, -14789, -13994, 4174, 37926, 38340, -3131, -32338, -27602, -15426, -1286, 21414, 29426, 10458, -9909, -14330, -8328, -619, 3855, 8566, 15764, 6020, -23664, -32349, -3396, 21010, 21567, 20713, 12265, -18788, -36172, -11741, 15110, 12113, 1051, -400, 116, -1008, 70, 2410, 5163, 2937, -6726, -8635, -1601, -6018, -10603, 7062, 20857, 3397, -12488, -2924, 5094, 16, 525, -1656, -17664, -21274, 922, 22055, 22610, 9157, -9528, -19843, -15329, -4463, 6572, 14697, 6770, -11768, -13279, -2821, -3716, 378, 24949, 29311, -5175, -32478, -27643, -15482, 551, 28875, 39266, 10918, -24398, -29897, -10192, 10526, 15592, 9255, 4304, -6701, -25081, -19581, 11970]
1438A1970J2328j2721j288K04k8943k1458K6134L4158k87j3879m454n122o065
1451i423O038J4151M169j6736j8341P446K2316p9j3465P677R740j5253q068J7223
1465G395M680j7584l653P677o340m801J9516K1409l538k1780j9987o583Q109J4507
1479i73J8037J1086j6744l3273m613K5003J2538J498J1097n836l6879j9576J9433
1492a9202K0909R999J5133M959k6148l2373m223K1498K1228L927o018n675j2502
1505h488j6517J0536L5322P675k4681r132O536j5966j3366K4287K4730j0757j4001
1518c822O872L949j0490m970Q329N125j0718j1727J2065J9970l937j4955N182
1531H73N388j7863l872K7769O636k6513j2152J1862K456o50J9385J6289j3393
$$ y = [11970, 24298, 11577, 10289, 10493, -18450, -39908, -13774, 20384, 20097, 6218, 1764, -3358, -9423, -3385, 10766, 14935, -1801, -20142, -12696, 9620, 9541, -3924, 3753, 13493, -1760, -9828, 7395, 12075, -5509, -9162, -1485, -7825, -12626, 6890, 28299, 24761, 2981, -17006, -23589, -15480, -973, 17064, 28150, 11406, -21867, -26480, -1477, 11061, 12559, 23656, 17820, -19059, -38635, -19202, 1707, 11706, 26839, 31798, 5650, -26723, -30946, -9448, 11780, 15707, 9689, 4014, -8488, -25005, -14469, 20853, 28528, 3847, -5285, 1251, -14715, -28081, -3794, 20936, 10179, -3822, 3050, 6999, -3491, -8461, -132, 4993, -5725, -17452, -5387, 14583, 10646, -4309, 873, 6261, -11602, -15474, 12295, 18931, -7582, -19734, -7872, -5416, -6066, 13319, 29608, 16215]
1544A6215k8038j4319N974J3389J0233J0708R011j3862k9639k633K4136Q757l076
1557F856R509l092l2977j6708K4102K3864M234N243J775k3451k6722J506K3114
1570b747J6227k784p813j77l527j2963M469K5352M012k2745m914R721j2613j2925
1584b3427K3222K4885j2100j6801M897M309q928k112Q954J378j3092o843J7854
1597B196K0971r944k0887M804R375j3749m867K2115N438k3708n735J6757k69q481
1611e984J4239J8093j1005k8500j3398P674J5479J2436J0942L762j8610k9666
1623b4538J955K8808Q446j0443L156K84k5363j2194K4814K1408j465N29J430j9897
1637c070k7314M04K6589K3205m00j4434r221m678n365J0682K3915j526k8893p373
$$ y = [16215, -11823, -26142, -20168, -6779, 3454, 14162, 23173, 9311, -20328, -22961, 1175, 9932, 6856, 16365, 13273, -19704, -36412, -12310, 11554, 15788, 21031, 22806, -645, -27367, -25861, -2747, 13480, 10696, 2883, 2706, -821, -13784, -9315, 16037, 20049, -2696, -7610, 2111, -10502, -23427, -205, 24680, 12580, -4221, 676, 4985, -3943, -6055, 2899, 4277, -8815, -15658, 2196, 23167, 13223, -7664, -2860, 6515, -7234, -12101, 10014, 15452, -8256, -13991, 2766, 2497, -5984, 8255, 26348, 15343, -13157, -26555, -18881, -3402, 9034, 19976, 23738, 5128, -24538, -22583, 6225, 14671, 4228, 7384, 7668, -17695, -29889, -5075, 16333, 14868, 15397, 16827, -3070, -30384, -29980, -3391, 19814, 19414, 4980, -4241, -8919, -14284, -3602, 20313, 18787, -10106, -17479]
1651a7479J5702k760r847J7707J8359j2927j4969N881J737j0788q85J3454M072
1664G257j3446r861J4170K1557l331j9699m641J594r533N475K8694L060l2065
1677a0769j1634J9454R371l387Q518O519j6355k1224l197J0678J1624J1006J1332
1690B1936L046k2672l2435R96L3144J7116q739m695q236k4154l750L4940K3731
1703C0228j1181j3766m308j1293j2820O447J9746J4013q70r995q174n712n545
1716a3230R823K3218l66k9694j1937J7048P972k443J1520N802j8719j2598J4075
1729D71R326j0189q846L979N495j43j62P508Q850p519j6792k189M843n326N265
1744e429K4565L081k8905j3600J4002J0598L707J0697j723k6088k1033P885K2356
$$ y = [-17479, -1777, -4537, -14384, 3323, 21682, 8755, -6214, -333, 1404, -9384, -10269, 3185, 7257, -6189, -16050, -1880, 19677, 16346, -3353, -7994, -6400, -15933, -10458, 18236, 21296, -10769, -22403, -2949, 6422, 3035, 11553, 18072, 1717, -19507, -22704, -12026, -402, 10604, 21936, 24982, 2310, -30125, -29129, 4015, 21131, 12392, 7697, -539, -24693, -28443, 6497, 30228, 19047, 5281, 973, -10320, -23140, -16693, 3053, 17066, 16196, 6201, -1973, -7685, -13230, -3407, 19811, 19445, -10249, -22186, -5138, 2834, 391, 11911, 17713, -1006, -13604, 471, 9797, -392, -9238, -5259, 236, 93, -69, 7439, 16289, 8770, -8022, -10211, -5368, -10694, -5429, 19136, 22217, -6688, -20288, -6286, 4312, 8019, 18716, 16993, -9095, -30128, -22243, 113]
1757A13J5181J960l254n100j3716j8345L697K4289J0301q106k065l968k0365m245
1771b3623K9819K2140j0160j7541r042j0193k573J5389J8021L738r324q937j44
1784b430K340o179j708J3438M273j6357p066J2348M307m215R119O583j5669j3031
1798a4247Q730R265k980n167j097L5M768P609N224r38j1853j5030J479J1289J485
1813a428J797J2961K6k0385p800J2231N851J062Q521j830k0508j4942P048J8609
1827A213J5405N619p242j3684j3872r557Q245K2066Q662r917m965k180j2757j284
1841a4248K2308J4173j0636j2521n386q899k808J4560J8192N366q433j4069o468
1854h869L856K088O03P756K619j3364n655J3164P175n758J108K157r956o778P010
$$ y = [113, 15294, 17254, 14000, 8900, -4816, -23161, -19464, 4825, 15126, 7020, 4955, 987, -19378, -23623, 6196, 28336, 18176, 635, -8407, -18600, -21173, -5784, 12237, 15975, 6651, -2286, -2430, -90, -6269, -7977, 5461, 9734, -6623, -13689, -1341, 2966, -1249, 7870, 14453, -1216, -14247, -5517, 3748, 768, -4399, -5496, -5461, -693, 6916, 12140, 11202, -651, -15681, -14202, -2913, -1428, 369, 13330, 13356, -7029, -14829, -2598, 3253, 4315, 12836, 11006, -9502, -24444, -17396, 1213, 16618, 22237, 14995, 1311, -12561, -22118, -13873, 8193, 16855, 6938, 1973, -207, -12964, -14248, 8060, 22233, 11597, -924, -6310, -15209, -18017, -3457, 14735, 20101, 11668, -2401, -8869, -5013, -2925, -2322, 5434, 8053, -5311, -10966, 2198, 9373, 3615, 4723, 6880, -3076, -9854, -2844]
1869b844N245j869r54l89j178L515N175J955k32o948j4968m525J1942J0044M971
1884H940P278m443j9877r263J0998J0634M757L955q229j9092o939J1242J4619
1897D580J1971N245j0108j8412j2081l032R974K0981J0043q771j0105o860q702
1910a5277L605K1978J0935j3360j6140o407j709O779J6644R063l906q566r276
1923e637m984N140M571r01L108L004p471n171J0192P698l981k483l884j0221j203
1938a2223J2847P824l917o021n227o01J0361J0500k950q905r364r663Q56J6432
1952e1J2746O98j885o847j3971o005Q326J0301P415L644j1169k0443l464J5789
1966d916J8002R348k353j8766j9319k180Q826J1801J2989L371j1119r355j058
$$ y = [-2844, 2401, 532, -422, -811, -1989, 1526, 6701, 8656, 8424, 1476, -13492, -18017, -6075, 3969, 8940, 16218, 11775, -8102, -17365, -6367, 4267, 9024, 12979, 4750, -14342, -21281, -10039, 4580, 16551, 21796, 11688, -6724, -18805, -21837, -11863, 9118, 19161, 10390, 285, -6575, -15277, -11672, 10306, 21241, 7881, -8259, -14666, -16375, -9596, 7048, 16111, 12205, 3639, -5637, -10621, -5481, -910, -1811, 1297, 4301, -3170, -8341, 1851, 9549, 5568, 3085, -799, -11020, -12223, 624, 8448, 4531, -1490, -6717, -7318, 3043, 13543, 10593, 1688, -7676, -17339, -16483, -51, 12695, 13393, 11508, 4661, -9310, -15315, -6989, 3312, 10727, 14371, 3202, -17241, -20705, -4916, 13086, 22434, 20081, 1315, -18004, -20184, -11358, 443, 13432, 16803, 5684, -3671, -4729]
1979d729j819J922J1981O352r434j0480n324j100R720J7027L819r483j0149p472
1993i169j734J0521P671o213o443M056L007J181M218p48p625k783J515k682L91
2008d837O471K750j248J93n859n014Q921J2004m157j2015p512n408K494J7332
2022D115J5277k486j2216j2158p530M968J1409M565j369M75n509j1630R35J1131
2036b3Q140N789J698j4929k0851l606J3659J5865J1573q16j4798j2379J221N134
2050d323M402O115o39q056l414O24j510M437J1808L062o145o532q357o479P642
2065g365J3533K42o429o54L49O55N458R68r047p521J698M815O808L561n014m638
2081b581L751j66m431M801P878n942r624j289o90r61J2168J6671J29j4222j6079
$$ y = [-4729, -6548, -4626, 7355, 13707, 4273, -6207, -11531, -12631, -2911, 14116, 17935, 8452, -1697, -9169, -10903, -382, 7289, 1076, -5367, -1311, 1696, 2877, 7095, 6347, -1278, -4061, -2546, -5228, -4837, 1634, 4384, 3136, 3329, -2530, -7544, 1377, 13381, 9224, -2791, -10303, -15711, -13217, 4115, 19392, 16906, 4690, -7468, -14998, -10030, 1379, 5944, 4575, 5050, -459, -12089, -11154, -23, 8117, 13906, 15604, 675, -20176, -23782, -10123, 5742, 17315, 16499, 1701, -10678, -9457, -4323, 79, 6194, 5555, -2501, -5915, -5291, -6801, -2364, 9444, 12506, 6361, -171, -8528, -15007, -7365, 6168, 6410, -19, -673, -324, 331, 5789, 6757, -2290, -9811, -8113, -3298, 3510, 7071, 2057, -2581, 1170, 1004, -3427, 1374, 9252, 3310, -6314, -7603, -8293, -9254, 2914, 19585, 19714, 5492, -10587]
2096a0587q747O602J5079Q954J127m580j2718j1328Q140J6482L185k082m85j0171
2110a129j6505j846J4205J3473R146J245j1970j6433n350N611J1923J0012l432
2123H950j2710m560L803L038O290P417m400j0234k033L96m008L410J0376M22n673
2138D84j96J770r69K487P28o741p336o98N688J1876P052o832j0076l045q78j79
2154f865J1565J0446j1344j6534j2O642L193R586J1691k530j6205j5291m033Q752
2168a0939J3995P992J666m519j5139j1829J0197J8300J856o393k129j0084j3783
2181b0809N690K0080J0350k593o124q390p853j498N488Q696N121n370q663J086
2195d789N035J78L597O958o741j4626o08Q595K054K266M418l494p095K603O360
$$ y = [-10587, -19334, -12732, 2347, 11301, 12428, 7848, -4870, -16198, -8058, 8424, 11609, 9527, 9042, -1129, -17634, -19480, -5275, 8198, 17344, 18589, 6619, -9814, -15164, -9553, 2370, 12382, 8950, -3760, -8320, -4517, -1479, 4811, 12228, 7828, -2406, -4439, -4043, -8051, -4641, 5735, 6157, 484, 288, 2058, 1089, 3576, 4304, -2437, -9773, -10471, -4783, 7093, 14145, 7313, -2763, -5808, -6686, -6865, 4700, 15146, 3802, -12732, -12744, -6102, -2909, 6677, 18368, 15838, -367, -15658, -19691, -10939, 3056, 11048, 12714, 8195, -6944, -18773, -8576, 9724, 11580, 5187, 3058, -7026, -20809, -15119, 4961, 15311, 12718, 6594, -1796, -9649, -11147, -5659, 3037, 8158, 2788, -5875, -4789, 246, 424, 4021, 10979, 4238, -10388, -10996, -2401, -347, 1919, 6337, 2843, -4252, -1649, 4711]
2210D711K77k055l503o577l712L521R062J0143K666j2057r905K135K768k178P701
2225B997R663r049j5309J129Q982M272O891P983p168j8549j1100N050J3198J0486
2239I476K332k495n240j2498o148J3605J5025n344j0625J117k711j0807M740J9267
2253I694P328p359p120n701p641j249R029J1269K940j0515r025N819Q656k670
2267C455k275L714m700r647L260Q345k239k083P317J881p508k459M542R10k964
2282d51l055k733j35L226O218Q757J781j3596j3082L564Q350J674M209M044j0224
2297a453j1802O167J1333N39Q15N048n262j5282q682N232J3490J0549K209l172
2311I729q032j3728n926J5566J6639n067j2827k28j416o492O861J7860J912j1383
$$ y = [4711, 4988, 2933, -570, -7147, -10859, -7338, 1724, 11867, 14533, 2476, -7429, -5294, -2526, -4704, 2997, 12660, 3611, -11698, -10569, -1587, 2685, 9576, 17559, 10391, -8158, -19258, -14208, -1010, 9476, 11808, 9313, 4073, -8425, -14573, -968, 14057, 8713, -1912, -795, -3506, -14313, -9573, 9694, 17022, 9663, 2543, -3158, -10799, -12048, -3019, 8250, 11190, 675, -8350, -2531, 6125, 3455, 1180, 4894, 194, -9453, -6193, 2152, -87, -2170, 5147, 7028, -480, -2939, 1603, 2513, -451, -3506, -6239, -6374, -3148, 3070, 11827, 13608, 12, -13070, -9506, -1156, 518, 4727, 8771, -1453, -13255, -7088, 4245, 4784, 5599, 10647, 5385, -9897, -18579, -13347, 143, 10692, 12901, 9729, 1697, -12031, -17957, -2391, 14248, 9181, -3646, -3874, -5290, -11782, -4921, 12939, 14851, 3468]
2325C468n429j590n604k922P115J2543M552q140r443J609M914n81K088M904r272
2340a788j2923O990J5612l22p822K109J038n480P66O224j069o842l243J916L563
2355a271K781K346O263K315j1752j3950R91Q770M622P830O130j3362j7767M487
2369a1567J6513N602n16j980q858j2832k448J0620J2647O068j784m501o413j1336
2383a0785n851J3214J6960k237j2373l243k466m121J0585J8248j910j7342q035
2396i356J532J566K219O357N054j121o493l325M181K353m775k71N939n249j0635
2411a2024O102J5285j16p743r72k320o179L735J1600J26j1321p399K424Q528P445
2426G171K429m15n066j2339q308Q239J0575R11K791N018r974j5184K730J5240
$$ y = [3468, -1961, -3551, -9155, -12077, -4962, 7581, 12133, 3993, -5450, -3841, 1073, 492, 2580, 7484, -1788, -14711, -7721, 7891, 7569, -253, 1856, 2894, -2586, -1820, 4404, 3335, -3507, -6750, -4834, -1271, 1510, 3856, 10119, 12434, 682, -13268, -12277, -3507, 1115, 8945, 15075, 1713, -16054, -11567, 4946, 10548, 10032, 8052, -806, -13638, -16086, -5466, 7181, 13249, 11465, 6964, 551, -10785, -16636, -3422, 13538, 11301, -1072, -4315, -6781, -10902, -317, 17931, 16021, -1321, -9356, -7824, -6258, -4039, 2318, 7372, 6251, -242, -3567, 614, 2967, -1808, -2079, 3860, -1389, -12024, -5922, 9363, 9247, 1504, 532, -1788, -7967, -4232, 7368, 7494, -3827, -11226, -8802, -274, 7171, 9600, 9185, 4119, -8220, -16528, -8289, 2286, 3197, 5988, 11006, 1032, -14152, -11422, 3818]
2440C818N973j602l056j0204j1800J108J4855J4262K484q381r834m609k630j94
2454i810J0286J0188m795r963N84J981m267N616J3223k402j4627o091K420K358
2468e299M327P039K049m688o172j321O374K852p143m261M675N93l769O476R280
2483A1012n108r373K047J403m496K061Q077l67q528m114K813P033N713J511k268
2498G416o431j1800n488J1183J3489J59k371L40p693j0413N387J3498J230n125
2512C381k202n673p102K542J1799R470J731p238j0646n099n17K199R828R362n233
2527F602j0502L04L350k421L614Q787m425j1920k355M517K492K801M787R77l867
2542B741m239k303K023K567k773k141L779n24k849O204Q540n887j0721K55K444
$$ y = [3818, 9791, 8189, 5133, -5071, -16871, -15763, -908, 13354, 15838, 7457, -2377, -6986, -9616, -9810, 476, 10664, 5869, -4094, -3510, -1529, -5796, -180, 13043, 10641, -3986, -10077, -7657, -5299, -972, 6067, 8116, 3428, -2744, -4065, 2309, 5161, -1982, -6243, -1568, -975, -4744, 1732, 11012, 5904, -3469, -1422, -19, -4515, -2454, 5623, 5256, -3272, -7386, -4573, 2460, 8173, 9684, 7416, 985, -10815, -16303, -5120, 8369, 8528, 6157, 6497, -1196, -11609, -6222, 7276, 8506, 3381, 1179, -4494, -11596, -9054, 2745, 12215, 13946, 6708, -3938, -9037, -9554, -7355, 2473, 11835, 6602, -3900, -3596, -246, -2667, 947, 9734, 5309, -6611, -8966, -4449, -1957, 844, 5631, 6608, 2741, -1498, -3801, -1778, 789, -1984, -4125, -346, -870, -3719, 2485, 11025, 5138, -5583, -5328, -2884]
2557b884j783M006O914k340q634k543L938O928M742j185n178n702o947l034R750
2572c952J2211J201l155j264p864j1107M832J4408M318m530n680p369m557P257
2586e251J2291O058k373q788j0169k942L030M764P114O983l933r640j600K892
2600a564m74L988O969n129j1212j967N694M823N283K583m998p086j388K497L680
2615A699J304m417m237L666M319m19L311L909o132r343J21K664L81N153P053l408
2631E624r469k986K966P143P378j004r273q542m799J677J3606J2737k092r875
2645C091n032m024m141O041J0120J705l995l995o438l414P787J1399M079l979
2659I204j0665j1636r13J0097Q771L105L9o103p449J657N029m64n68K016l163
$$ y = [-2884, -4667, -661, 6253, 3913, -4721, -7264, -3326, 3602, 8344, 7159, 1981, -3721, -10668, -13702, -3952, 8259, 9460, 6305, 5041, -2823, -13930, -9098, 5310, 9628, 5098, -582, -7951, -12508, -5251, 7040, 13098, 10725, 1937, -8232, -11174, -8144, -3380, 3734, 10717, 6784, -2856, -4456, -1564, -2038, 1950, 8919, 3790, -7422, -9389, -3695, 1128, 6411, 8994, 3996, -3090, -4478, -1981, 1699, 3003, -1414, -5651, -1985, 2334, 1915, 5226, 9135, 3003, -6340, -6219, -3555, -3174, 1979, 9032, 5624, -3845, -6831, -3865, 3278, 10656, 9652, 379, -8163, -12962, -11285, 2321, 15058, 12966, 3091, -1941, -5965, -10106, -4065, 6055, 7760, 3765, -230, -6668, -10082, -2295, 9104, 13183, 9204, -1461, -13097, -14010, -3913, 4858, 7963, 8002, 1899, -5550, -3893, 1136, 672, 104, 2120, -1043]
2674a043n207K261M160R99L314K251m900o646o25K913L040K557l863o041K497
2689d333O814L626J585j724j0581p974M885Q752J651J756P25m597o030Q66L325
2704a254M070M091j220q685o294j716L163J1516J2165k343j3182q132k185J146
2718h860Q309Q823j430o835l348j792P64O388M795p33k073n049q733k029R113
2733b690Q136K242J21n002p232j029N157K324n63j466l512r33O203L275k558m56
2749B017J007l807l223L250J485j960J035P28j832O44L504K183R24j672q753p235
2765a1705M428Q424M183K868p36q311o841L240N846K772J526k625p087l642J635
2780f025L036P478Q163k139j0728o718k443K70P553J0280M04p232n578k362K260
$$ y = [-1043, -6250, -3989, 171, 1170, 4484, 6735, 1835, -4811, -5436, -2523, 517, 3074, -789, -6830, -4333, 2481, 6107, 7692, 5968, -4613, -12587, -7702, 1050, 2701, 4457, 5182, 585, -5445, -4579, -1254, 2816, 6907, 5687, -2998, -9292, -11008, -7845, 3671, 15836, 13493, 311, -7821, -10006, -8860, -551, 8272, 6842, 7, -3341, -5133, -4369, 2019, 6814, 6081, 4008, -1041, -9774, -11803, -2690, 5446, 7688, 7809, 2807, -4425, -5454, -297, 2027, 1464, -2, -3514, -4447, 1756, 5031, 2473, 2017, 3024, -783, -4006, -756, 729, -1231, -196, 532, -1300, -656, 2848, 5031, 5955, 4283, -4470, -11705, -7277, 1147, 5330, 8198, 7462, -849, -7690, -4450, 1396, 4168, 5694, 3069, -4018, -7660, -6025, -2989, 4489, 12652, 10513, -215, -6933, -9376, -9106, -1553, 8727, 9131, 1899, -3679, -6041, -3781]
2795c781P056L971l834l750l276n738J575R902M903k129p97j699o763k711M969
2810b102L673jj618l076j336N639L501j424K8j860p559k566P943M458k599j165
2826f4M78k754j83N441K807j624m528o337l189M733O673L331L800q11j0394o919
2842i540L981O172K499K375j756q394n386M873P382O243L719o428j1013n107J686
2857h694L932P921P278l248q209l165q07K338P087L313n092n672k442k562L262
2872d760J1089M536n279m682k840l993Q31O324K633k586k684j044J463N471J382
2887E861l580k092r33n037j95Q043L306m392j058J428l061p21O632K844m253o788
2903c996n342Q06Q264P373J936j147n242j0601k728Q963P198j763m18k150o976
$$ y = [-3781, 3275, 7246, 3412, -338, -3614, -9352, -7777, 2125, 7028, 4899, 4102, 2403, -4360, -7071, -2102, 1571, 1570, -48, -3124, -4460, 1179, 4680, 3256, 3284, 1424, -6135, -8701, -758, 3700, 1101, -64, 414, -2340, -2523, 2918, 5725, 4101, -427, -6764, -9953, -5220, 1453, 4784, 8584, 7773, -2621, -9540, -5559, 613, 3112, 5487, 3731, -4663, -10049, -5176, 2206, 8449, 12168, 5740, -5273, -10380, -8694, -4762, 3159, 10437, 7189, -1020, -4185, -4992, -2654, 4433, 7746, 2654, -3018, -5460, -8022, -4760, 6329, 10865, 5586, 904, -1936, -5929, -5098, 1226, 3859, 1273, -1411, -2455, -992, 4479, 5861, 2281, 189, -744, -5781, -5976, 2067, 5373, 981, -77, 1351, -1710, -2431, 4201, 7045, 2792, -3996, -9338, -8532, -268, 7105, 9041, 7894, 2652, -7949, -10677, -1714, 5484, 3721, 3303, 1153, -5823]
2918e823k835P216P100K522L48o093j0268m085L426O918R132M026o984q522j337
2933e259J276K328N869J692p169m440K000Q81J642O148K291m892l120j260l245
2948e258j93N154K592j450j118j229J330M641P94o239l455M91j888L023Q453J061
2964F709q045k868L892N61l44L428L17m678m563j784K162O597N521J026j091n822
2980A018j0720k688J0698P984j476j025k325p534j824Q762O905j480l212l751
2994f68o026j473L024N298O623L424n412p097k069o44J386P329L307o969n498
3009e465K211L465J151M826N87o965l693J619N73l53K525J302l60L01q72o76K715
3026B891M03m952k041P37j489J606R239L198p676n624J254J16J872N326M98p361
$$ y = [-5823, -8658, -1442, 5658, 8180, 8528, 2435, -7833, -11918, -8492, -1574, 7558, 11584, 4600, -3922, -5259, -3983, -1655, 4214, 5906, -1263, -5703, -3703, -2822, -1180, 4968, 7259, 2367, -753, -2013, -5258, -5451, -297, 2295, 845, -273, -1502, -172, 4469, 5263, -976, -4431, -3940, -5828, -2805, 5648, 6709, -1336, -4204, -312, 249, -95, 3333, 3650, -1028, -5591, -7375, -5213, 1384, 6905, 7931, 6840, 1018, -9702, -12390, -1692, 6292, 4816, 3791, 1466, -6068, -7892, 870, 7775, 6295, 3083, -668, -6694, -8167, -5143, 155, 6778, 10202, 4790, -2307, -4376, -5020, -3634, 3695, 7002, 33, -5465, -3254, 211, 1362, 6188, 6775, -190, -3883, -2264, -1691, -2044, 481, 1783, 1423, 1724, 852, 176, 2891, 3294, -1658, -3699, -2962, -4451, -2845, 6394, 9592, 1916, -3708, -2454, -2338, -466, 4860, 5358, -2003]
3042b003n437Q62M931O273L098j872j948m760q655j495R666P419q98q98j649q439
3058e805l464R201Q589j343n413n265n461M87O715O881L384j290p674m923R76
3073d405N37O88N680L232o076n460L737K559M88L857J121p693o303K286M727K518
3089A493J455j331k582L43O35J384K484k111o736k068M251K022J281O090J236
3104G846q223n019K112J359R83N156J503o898o631R04O326P921L207n179o233
3119h66n645m098L109J1161N719m545l240q96n675k078Q689O455l392n119l701
3134d122l074J356P295O592J732m318q561l712K867L283P48L525P44o235k634
3149d514O360K636l020j10J306n325l548L838M313R94j76j525j861M03J450O84
$$ y = [-2003, -7440, -6578, -1647, 4626, 7724, 5852, 3904, -856, -9511, -11006, -1340, 6079, 5181, 4283, 2634, -5805, -9269, -68, 8521, 7178, 1765, -3500, -8961, -8474, -1759, 5122, 8506, 7216, -458, -5381, -4405, -3868, -3180, 2500, 5732, -344, -5804, -2067, 492, 980, 4837, 5958, -1735, -8038, -5752, -1025, 1493, 2948, 1617, -965, -622, 13, 1397, 3881, 1770, -4966, -7034, -2783, -761, 520, 6610, 7846, -377, -5396, -3284, -1925, -942, 4214, 5717, -1181, -7812, -6908, -582, 7339, 10546, 5367, -866, -6511, -10609, -7500, 3661, 9380, 4835, 1595, 699, -4976, -7054, 1635, 8090, 4698, -421, -4122, -7196, -5840, 1455, 8047, 9779, 5461, -3100, -6812, -3945, -662, 86, 3611, 4355, -1880, -4514, 1846, 4482, 1462, 1352, 2658, -2667, -6215, -2377, 1936, 2930, 2754, 1229, -632, -229, 1221, 1905]
3165A905J216k649o689m08N828L310P27M124q49j0352m846N140M943K20J816o34
3181B802n719l237K720N555M418O32n023n697l286k499L641J0800N313o036m981
3196e97r13m034j81Q102M793n396m897j217l40J660N889M148j875l537n797k322
3212f514L053K160J20M089K092n561l543M998K610k978r54N28m611j242N124M232
3228C603j068j296j256j162J041Q91k49M96k089m677O24O552L008j237K162r47
3244D396q586m160M955M151J676K346j000o768l106L586N787L475j9o796n524
3259e587j239J64M770Q640L481o255m828r91l337p61P957N434m186n596j054m47
3275c835K353O178L224k838n629n335r19N044L953j12N90N94l798k094M385J502
$$ y = [1905, 3121, 472, -6217, -6625, -797, 2513, 3240, 7364, 6515, -3837, -8683, -3543, 1400, 1620, 3436, 2802, -2917, -6154, -3434, 2121, 6539, 7171, 2148, -3549, -6835, -9334, -5693, 5107, 10420, 4384, -597, -1510, -5544, -5725, 2377, 7170, 1774, -3123, -4340, -4680, -3020, 2869, 7017, 5142, 1605, -4192, -6514, -3461, -1301, -1181, 2908, 5000, -561, -4104, 894, 3504, 526, -428, 100, -4511, -5753, -629, 3603, 2535, 1239, -17, -1179, -138, 753, 504, 1000, -1089, -5766, -5142, 1410, 4418, 3181, 5343, 4396, -4190, -8350, -3395, 756, 2432, 4778, 3778, -2990, -6096, -2510, 3277, 6752, 6733, -63, -5587, -6826, -6662, -1892, 6748, 10229, 3974, -854, -1845, -5182, -5943, 2014, 7448, 3262, -2334, -3388, -3835, -1482, 4696, 7920, 5082, -547, -5882, -6801, -1757, 2196, 2084, 2674, 3268, -530, -2624, 1761, 3263]
3291C263m485k75J658k930j583M835M252k90k112l481k314J645K621J326o44k466
3307i80n084N08Q427M241j995j798l359o957j572O370M753R33R97j731o090k281
3323e618L306M856L285l28o259o713j209L415O926P769N76q721o834N22L33J647
3339c047N990K614n484l058N31K79J915M347J448l923m508l697K63N296M711l60
3355C317r50j156l491o17N888J245n941l231K636L65J305M601J393l901k635j068
3371b240n22K222K354o25p46j361l420L07P129M876k191l982m967n858Q55Q754
3387E85O005p43k192l459m738O4N248K923N27j344m915m968J759M637M043M337
3403G769K23p477n996J03J482L138N574L45n553k803K491J352J083K186j070m708
$$ y = [3263, -1222, -1497, 161, -2769, -4352, 483, 4735, 4445, 2333, -1148, -3462, -1817, 804, 2130, 1486, -980, -6064, -5556, 2871, 7112, 5117, 3319, -40, -6997, -8569, -2199, 2554, 3487, 4484, 2753, -3337, -5618, -2312, 2544, 5829, 5501, -758, -7471, -8680, -5265, 1661, 9430, 10006, 1285, -5549, -5027, -4694, -3047, 2943, 5557, 73, -2985, -2454, -2175, -260, 4087, 5535, 1612, -2896, -6593, -6330, -1034, 3677, 3317, 2367, 1211, -2280, -2897, 2991, 4236, -1705, -4936, -2300, -1935, -630, 3971, 5364, 1463, -1172, -2240, -2762, -540, 1814, 1189, 443, -918, -4338, -4031, 3098, 7974, 5783, 1801, -3166, -9024, -8169, 585, 6590, 5847, 3655, 196, -4542, -4478, 770, 3693, 4220, 2876, -2039, -7007, -5248, -611, 3432, 7769, 7992, 515, -5481, -5378, -3896, -758, 4816, 5161, -392, -3195, -704, 648, 1731, 3917, 2847, -1861]
3419a861k004O07J091L259K451j304r19L74k593j588L440J302m434j615K250P99
3435g45J843L998R4n019l613K9Q72L068K529k157k302L8o35Q13M953K076l754
3452B088l697j930l347O08P308N031l39k891l913m536J090N368K255p01j460m223
3468c289l365L187N843K450O66j460n777m807Q70K403L114M824K83m842k823J252
3484a471O12J054L073q07m917k342J386J972L255L209k070l108k84j241k92K125
3500A54Q97l186n70L274O98J61K501J35n215k373M8Q35L595K757j283k986j116
3517a674m88J052N249K662m894n796j492l03K683O975M053k104m441m428l193
3532f139K478N231J947o73m83m473m665L490P372K640j026k759o114m463K094
$$ y = [-1861, -3865, -3258, -2167, 1092, 3543, 2239, 1320, 1694, -899, -2487, 953, 2255, -2179, -3794, -1544, -745, 1098, 5096, 5190, 171, -3442, -3413, -2541, 527, 3056, 899, -1403, -1365, -2000, -1187, 3766, 5842, 2088, -1609, -3539, -6886, -6278, 1030, 6061, 5722, 2831, -1082, -5618, -4528, 840, 3095, 2394, 934, -3289, -6654, -3467, 2376, 4826, 5492, 4032, -1745, -6552, -5682, -3279, -165, 4659, 4942, 100, -2723, -1471, -859, 195, 3268, 2461, -2456, -4798, -3412, -1440, 1815, 5024, 2954, -154, -438, -1679, -1971, 154, 1051, -2135, -2705, 569, 1267, 1428, 3929, 4064, -1151, -3524, -3476, -2641, 954, 3711, 2428, -558, -1674, -2162, -1110, 4139, 6801, 1907, -3889, -5381, -5684, -3001, 3974, 8027, 5923, 1482, -2946, -6139, -3661, 1570, 3517, 2844, 2361, -2112, -6777, -3287, 4085, 6725, 5699, 2940, -3174, -7637, -5543]
3547e543M839M041K556j696n328j701K174J56J111K143j350m587l53L379J099
3562I40J288J703j540l664p91k9P56K319P4l663o18L367K086J352J422l424o534
3579d956j588L627K954K937J639k841m273n74R57J778M463J172m982n714o98Q61
3595e238L445P400L340l908o296m320k030M416O296R36k410j342l507k077M550
3610g45N772m22l085j882l051k945K355M753K928Q01j890m183j242K418N02J53
3626B37J125k563l413K207N517K09j411j80j857k688J019K098O16n90q58j735
3642b267J146L411M93qP51l140n863p00M342L512K679J288l591n462j35K832K182
3659A470K109M5m971l768J291K391K908M150J065m226m218k932q28L140O126Q61
$$ y = [-5543, -704, 3337, 5893, 4197, -1131, -2832, -658, -502, 609, 2752, 1402, -3185, -3538, -159, 940, 2228, 3931, 2391, -1273, -2064, -2093, -1337, 982, 1056, -2607, -3225, 142, 2228, 3580, 5002, 1578, -4956, -6544, -2917, 37, 2974, 4613, 1772, -2501, -3075, -2118, -340, 4123, 5295, 313, -5401, -6099, -5238, -1793, 5607, 8947, 5039, -1257, -5577, -7607, -3191, 3105, 4041, 1631, 289, -3218, -5295, -745, 5027, 4605, 1520, -362, -3413, -6358, -4003, 750, 3678, 4479, 2589, -1594, -2836, -418, 84, 237, 1362, -1201, -4614, -2407, 3110, 3319, 1908, 1728, -129, -2817, -1798, 300, 916, 326, -532, -2267, -1121, 2290, 2783, 2775, 3526, 386, -5477, -6177, -1835, 1677, 4356, 5644, 2053, -3409, -3544, -712, 1470, 3579, 3624, -1347, -5115, -3824, -1433, 1475, 5625, 6690, 2464, -1754, -4686, -5514, -2374, 3752, 4613]
3675D613k648j821k038j764L897N202j685l905k002k103j47L483M085O98p71j478
3691A616k753q74J002n7L41K249j287l453J783M551j05k104Q5j639l092J199K992
3708D54P09o01r79j151Q79K934K22j046k26l395m045J813N039J639Q63J318l039
3725A388n535k40L039K231J883J30m116m069J031K986M470L407j616n712l874
3740d597m67K95L388N446Q62l319k019j617j590K891M840q30l438k372j955Q2
3756d400M343M520N02k254l293k976Q34K702L29p55P94K07k021J620L536j224
3772B464k418j29j048k430J562L996N89j234j322j698Q44L206O30q34j592l645
3788c059l397K660O751J922j3o01m541n256J042M701K629M5o83l358l071N56M308
$$ y = [4613, 1965, 144, -1894, -3658, 239, 5441, 3756, -149, -2151, -4254, -4401, -918, 3167, 3865, 3094, 1616, -1137, -2011, -1009, -1066, -725, 1524, 237, -3216, -1433, 3118, 3013, 909, 994, -645, -3737, -2538, 454, 1163, 562, -417, -1568, -689, 2245, 2467, 1421, 1195, -2200, -6245, -4432, 607, 2246, 3109, 4427, 1388, -4147, -4387, -1348, 883, 2766, 2896, -1220, -5289, -4258, -1272, 3198, 6605, 4989, -723, -4597, -5064, -4769, -1381, 4065, 4927, 1608, -411, -2028, -3618, -727, 4113, 3283, -155, -2527, -4482, -4400, -57, 4463, 4965, 2711, -582, -3558, -2724, -22, 307, -448, 346, 553, -1468, 152, 3688, 2464, 46, -83, -1131, -3561, -1999, 1997, 2586, 1352, 30, -1668, -824, 2382, 3012, 2178, 586, -3059, -6456, -3796, 2955, 4877, 4864, 4263, -278, -5534, -4492, 209, 2838, 2883, 2200, -1158, -4229, -3673, 635]
3805F35L937K228k454o710l762Q20J871M895N215j381n519j812J41m51K371L799
3821C823j667m554j044J334J099K903K311j127k218k161k105P97K938N65j639
3836g45O74K32j086K071L410k401m754p13O35J3K797L234j129k536j290k83J323
3853e48K827N35k514j658k931j811M195O294J112k140j459m235m625K114O204
3868A360K335j249j753l016k040K503L698K244m1l135m708j794K356J589L803
3883B152L982j774n286j806J075M0J179L272r66m043p54K158J728J752Q37k196
3899A350j991j339j59Q36K511l55j801J531J298j730R18J651k128l529J68J134
3915a635N90K204L241j603l319j102m2J617K578j20k861j428j435j99L897N406
$$ y = [635, 4572, 6800, 4346, -2364, -6126, -5306, -3435, 1460, 6675, 5294, -225, -2037, -1896, -2347, 24, 3823, 2156, -2398, -3442, -2108, -1009, 1894, 4205, 3078, 860, -1301, -3406, -2609, 329, 894, -745, -71, 161, -925, 1146, 4556, 2155, -2599, -3312, -2677, -2664, 133, 3367, 2238, -298, -1588, -1871, -548, 2279, 2814, 300, -1358, -4289, -6100, -1905, 4389, 5501, 3361, 1902, -2333, -6958, -4844, 1360, 3695, 2446, 693, -2323, -4363, -1860, 1838, 4082, 4041, 906, -3802, -5596, -3240, -1651, 2152, 6134, 4360, -926, -2732, -1657, -1617, -438, 2834, 1868, -2175, -2929, -771, 957, 2709, 3546, 1350, -641, -1980, -2139, -1303, 1208, 853, -948, 583, 1881, 151, 1069, 2720, 592, -2937, -2769, -1635, -1045, 1159, 4400, 2797, -522, -1624, -1666, -49, 2529, 2409, -452, -1880, -3315, -3514, 383, 5789]
3931E789n57l264k114k619l096K323N693J864j357j314k728j904J681L352K264
3946D013m51l550m878n09L585K595K434K449k214n608j015K041k19N16K868q1
3962A976l503m09J695Q93J579O63k055k662j008J31J751K821j53k615P81J377
3978A262j163K44J737k539l935R76L057N18J970K058k207l584p36N9J525K857
3994B099kk491k011p28j80L880N179m38m837k755k075k065L910O106J282k628
4010B246k012k525j140K101L449J222j502k959l731K76L936K902J748J203k920
4025B294n738j103L526R14Q74J239r26l205R65K620Q19j2j038k667j227J119N68
4042i78J320K215q01k321J36J181j42L43J046k637l990J560L813J428J980K78
$$ y = [5789, 5232, 1968, -146, -2765, -5861, -3538, 2155, 4019, 2662, 1348, -1380, -3284, -1603, 1749, 4013, 3562, 12, -4866, -5375, -1790, 805, 3239, 5688, 3474, -2134, -3149, -1108, -1327, -811, 2057, 1976, -1527, -1936, -241, 652, 2231, 2894, 839, -1823, -2831, -2700, -949, 1872, 1719, -896, -115, 1262, 99, 343, 2080, -459, -4394, -3418, -361, 157, 2127, 4185, 1978, -1606, -2342, -2283, -758, 2099, 2097, -394, -2405, -3133, -3313, 567, 5746, 5308, 471, -2284, -4359, -6424, -2514, 3592, 4874, 2246, 234, -2291, -3431, -1330, 2119, 3341, 1839, -1120, -4851, -4575, -639, 2263, 4011, 5214, 2294, -3444, -4547, -1021, -107, 767, 2006, 1080, -2125, -1160, 1460, 2279, 2267, 1229, -1438, -2665, -1546, -978, 342, 2557, 1756, -565, -429, 752, 610, 953, 1999, -638, -4628, -3068, 745, 2173, 4153, 4431]
4058D431l998l815P0K231J978J697j24l138j863K31J101L889L333k232n138k360
4074c707p79l52M334O064m29l925k440j298l32K338L742m42k666k389k074K335
4090b020M194J105j63k98k418m892N97L288J017O6R77n13k490Q01K110jo49j062
4108c51k445k53K383J444N51M50j082k305O14K477q46j110o2j846j384K633L117
4125A985O76P21q20l652l345J351K456J594J686m46l746j653J385K279K742J496
4141D709k882m773j279M96R65M527M190j469m236j631q01j050K465L481k89k197
4157B26j980j300J777L681J056j276k56k953l253J232L419O24k06J193j71k152
4173c39J75J035l00j211k81p56M80J760J436n33M95j063k237J40K492K05j743
$$ y = [4431, 433, -3382, -3312, -1081, 897, 2594, 2470, -668, -2531, -2300, -1199, 2690, 6023, 3791, -1347, -3707, -4486, -4838, -504, 5560, 5131, 1206, -1234, -2532, -2864, -526, 3216, 2774, 108, -2281, -4355, -2020, 2174, 3279, 3116, 2818, 400, -4492, -3895, -607, 410, 476, 1453, 940, -1550, -749, 1361, 1360, 711, -351, -2796, -3049, -666, 778, 1329, 1779, 697, -1608, -994, 1483, 637, -473, -535, -2381, -3765, -1132, 1985, 2661, 3382, 2562, -1090, -4435, -3084, -628, 966, 2652, 2206, -1540, -3193, -1808, 471, 3213, 4709, 1827, -2946, -4225, -3729, -2764, 1763, 5953, 4484, 248, -1383, -2184, -3234, -769, 2712, 2423, 226, -1754, -3054, -1277, 2404, 3460, 2184, 1928, -1025, -4278, -3046, 373, 997, 791, 1984, 1813, -339, -164, 871, 571, -640, -921, -1677, -1197, 563, 1999, 1466, 1961, 898, -1339, -1199, 1293, 1498, -245]
4190b45l91j282j086K637L553L91m30j624m283k164K320K751J464J391l12l714
4206a024k127J156K436J973J615k524m412j737J118K052M053L284k452m246j609
4221b444l12m73L153K564n52k549n30p16J073K517J279j737j118j806k631J722
4237b560L829N28j157K95m64j449P51J969j516j940n66L29J073K809R62j598p83
4254E12q45k514P75L433L96j608n95j283q82K002L946P30j636k581l794j388L677
4271a655K891J295O86j162m039j899K849K572O55r9k001l249o26K200K580K930
4287C928J495l528m176o41N23O58K899K576k516k576J45R75Q70J875l72k502j513
4304a880m38n0J907L117r4j950k60j01j250J259J350j693j908M69M53J278K621
$$ y = [-245, -636, -1918, -3004, -367, 3186, 3577, 3147, 1523, -2760, -4924, -2604, 147, 1611, 3002, 2690, -1024, -3151, -1995, 441, 2414, 4029, 1505, -2907, -4644, -3526, -1474, 2579, 5863, 3411, -835, -2444, -2756, -3229, -76, 2488, 1936, -613, -1143, -1859, -786, 1731, 3010, 1273, 155, -1651, -4282, -2560, 1269, 1797, 640, 935, 471, -978, -227, 1742, 226, -1714, -2280, -1951, -878, 1931, 2893, 1295, 512, -333, -2847, -2072, 1361, 1757, 149, -446, -1729, -2611, -609, 3337, 4067, 2431, -150, -3944, -5332, -1655, 1236, 2531, 3217, 2055, -1984, -3883, -1034, 1538, 2193, 2094, 93, -3156, -3782, -1582, 998, 3928, 5423, 1895, -2281, -2922, -2399, -1741, 1158, 3734, 1218, -1358, -1213, -238, 632, 2507, 2135, -367, -1880, -2318, -2368, -461, 2656, 2562, 612, 352, 251, -999, 260, 1610, -83, -1991, -1522, -1069, 209, 2830]
4321B830N25k612j407o44r72J522K789k8k111j070M10l09K133K774q73k416k308
4338a767k601j19M200L508k99m60j443l811p61L117K426L8j099k074k291J99L123
4355a14K494J368n86k820l817J82J124R74K572J694k521j904M96Q05O4J179L11
4372A501k340j401L33M65J584K129q34j560L5j12q60J010K61j693p25J262J560
4389F15O38J257m59k671j282q9L27J062K574k87k060r66M62M5K425K113j619k891
4407h06j810j668J311M211K637q01j538j237l286o24L483K019n07p6j446k517
4423b655J59L006K133Q34n63l363l377P44J946J110K562P21k219k304R74O07m62
4440a47J049k3j569j006J042M33J041J430k22j878o21p9o44J339J076j964j098
$$ y = [2830, 3355, 743, -664, -1308, -2280, -758, 2031, 2003, -108, -1178, -768, -1077, 1056, 3830, 2957, 541, -1767, -4368, -4487, -287, 3221, 2922, 2462, 1019, -2792, -3553, -436, 1990, 2028, 929, -1145, -3436, -3237, -114, 2380, 3748, 3162, 342, -3475, -3293, -2169, -1195, 1377, 3071, 550, -1354, -858, -53, 11, 1190, 1501, -839, -2240, -1907, -1442, 142, 2271, 1437, -123, -88, -200, -1060, -50, 211, -1482, -2207, -945, 615, 1253, 2510, 2051, -620, -1902, -1991, -1664, -602, 1972, 1685, -375, -1341, -879, -834, 1591, 3704, 2085, -806, -2616, -4284, -2973, 1238, 3875, 3074, 1536, 299, -2987, -3611, -128, 1891, 1384, 1308, -138, -2655, -2496, 510, 2643, 3477, 2914, -449, -3826, -3082, -1136, -26, 2536, 3257, 1038, -1266, -292, 315, -147, 902, 879, -690, -1696, -654, -221, 820, 2250, 2028, 150, -471, -550, -1194, 145, 1221, -743, -1841]
4457a841J656J511N12R19n73l721j836J329J042J260K628o53k706j055K79M40
4473h09K126J568j548l085p96j133J237M596K819j988k223k251k610L28M201K224
4489B656j247j234j257j350Q20K976J124k34j070l060k170J337K360J388J355
4504B394N60k958k405J384J290m90L55j32j912j87K160J552k14J83j292j988N55
4521a145Q43k45K36O75j144j257K221J703Q8L89j244l506j502J671K359J623J460
4538C225j016l363j059J215R87J599J215k372k573m46K66J859L830J448k682l017
4554h84j237j679R26M109K089j347k430l74r99J157L147r1j276j411j826r55K141
4571i40K214L47L83K63k376j634J388R32j206L39L77j127J64K130Q07m14q30j294
$$ y = [-1841, -185, 1326, 1838, 2757, 2184, -1537, -3373, -2044, -1002, 258, 2886, 2233, -473, -1528, -1249, -809, 1317, 2885, 1337, -1748, -2544, -3677, -2440, 2156, 4975, 2987, 764, -1487, -4097, -3769, 432, 2656, 1409, 175, -1082, -2432, -1612, 1364, 2488, 2254, 1184, -1876, -4046, -2709, -349, 1039, 2394, 2954, -4, -2409, -1025, 265, -225, 130, -2, -1914, -2101, 59, 1611, 1397, 1580, 288, -1700, -1145, -302, -547, -311, 364, -780, -2037, 184, 1887, 1975, 2364, 1120, -2386, -3888, -2217, 142, 1765, 3225, 2209, -1154, -2213, -998, -11, 1588, 2803, 431, -2142, -2588, -2322, -463, 3367, 4815, 2133, -884, -2121, -3800, -2874, 1235, 3324, 1977, -453, -827, -1826, -669, 2478, 2387, 1111, -300, -2126, -3081, -940, 1274, 1621, 2004, 2267, -109, -1743, -355, 577, -629, -290, 87, -1040, -876, 1254, 2061, 1647, 817, -477]
4589d77j743R22J910l24j24P4j513J46K262J351j451M3j400k768m64K655K333
4606A432N37O49r83l318p01J253J291J454N28k600k489O55R52J724K920Q48l406
4623G46k824m73k39N81L380J775j738j622o81p30J165K107K83j746p43j337o40
4640b736K262K350k02j54k72j744j877J391J585j038K0O76m37k23J782M48j184
4657F47o34j354p89J196J515l79L31J97j530n11K212J335j546m75p65k420l13
4674c283L401K215N27o5j527l270n02J685J601J011J56k271k255P45J679J080
4690I27K545P7l224l157KO35J324L391J418k661j904l83l18J075J945k42j816
4707c66r41j76k03K076K333o25j188n49j747q58J856J407j005m83R22o16j3J719
$$ y = [-477, -2220, -1298, 612, 288, 164, 238, -1275, -1129, 1133, 2484, 1033, 1076, -324, -3092, -3556, -901, 1432, 1969, 2618, 1635, -1683, -2384, -1131, 160, 1614, 2142, -458, -2947, -2292, -1340, 384, 3304, 4152, 746, -2078, -2551, -2790, -2209, 1171, 2946, 1208, -414, -1095, -1825, -660, 1447, 1730, -16, -759, -2096, -2736, -474, 1876, 1674, 1520, 1248, -496, -2373, -982, 603, -435, -415, 261, -176, -399, 1383, 1831, 647, 13, -1341, -2130, -934, 581, 202, 533, 730, -800, -1311, 901, 2236, 690, 215, -550, -2970, -3283, 118, 2333, 2860, 2795, 1268, -2002, -2504, -819, 782, 1793, 1949, -322, -2577, -1832, -153, 927, 3472, 3549, 325, -2832, -2830, -2195, -871, 2520, 3938, 1277, -627, -1010, -1328, -253, 1692, 1450, -366, -1307, -1483, -1686, 390, 2723, 2098, 910, 361, -1386, -2244, -388, 1019, 14, -469, 453, -163, -176, 1543]
4725A543L33j689j360o20m27K000J630J76q49n66j382l98K715J166j806j248m14
4742a196j940N54L340K263m60p48k360k447m39K664J889J016l78k735j955J655
4758a277J919J159J275o81l678k524R58J864J499K091O24k639k103J05J14R39
4774c55J756m84j731p25M25L17J827J423j426j594j26o50j83J562R21j671j33
4791h47J706l7l72R94n72j970j090O40N86J505J857o48j642r30n18L65K276R97
4809B300k294j534J65q75R89L694J382j826j669j690j656N05K602J643L45o01
4825A480j651j969J255K168N27L41j083k874j655J351K702J026O42k4j960j644
4841a368K45N64L58R15l3j414Q6O13q7Q34J193j102k105J02J02L38J289L67j212
$$ y = [1543, 1876, 187, -1173, -1793, -2220, -220, 1410, 1586, 737, 171, -1211, -1609, 1106, 2272, 466, -782, -1196, -3136, -2582, 758, 3021, 2561, 1813, -547, -2994, -3433, -769, 1120, 2136, 1758, -977, -2932, -1277, 642, 1801, 3076, 2395, -1283, -3807, -2849, -985, 514, 2605, 3229, 590, -1513, -1408, -1294, -355, 1401, 917, -814, -1539, -1114, -797, 1030, 2453, 1027, -567, -693, -1343, -1526, 36, 957, -714, -847, 859, 822, 450, 1444, 872, -1098, -2188, -1548, -962, 543, 2400, 1752, 110, -820, -1338, -973, 1303, 2300, 6, -1528, -1363, -2238, -1249, 2445, 3827, 2001, 332, -1358, -3014, -2509, 93, 1736, 2081, 1480, -171, -2140, -885, 1283, 1810, 2151, 1068, -1806, -3461, -2110, 592, 1618, 2260, 2236, 276, -1368, -1123, -559, -201, 714, 681, -733, -647, -34, -121, 713, 1906, 804, -1301, -1199, -1097, -759, 530, 897, -315]
4860c15o8J316J43p62R09j023k097n27J889L68R57J358p57j193j231m95N67J738
4878G77Q10j785j270j41NQ96L112J130k164k246j136j018O35K715J692l32o70
4895A010k008j112J253J873J51j36l19l003j084K115K508M00R01o26k829j254
4911b160M62J331O50P77l23j782L05J043L8N40O07j407j869K58P39M31J259O80
4929A579j381m36N86J74L1L73o50k239j16J864Q51R23P58j018k057p66K96R38
4947b90J491O21k013j041J18K12J241K824J90k777k526n07k92J519L291Q06r86
4964A881j462j761p27J767J947l36m02o64k199j072K586K828j2k25r71k895r12
4981b629J361J006R01O46o16j259N46P37r9m21Q69j506j568R24J600K16K2K73
$$ y = [-315, -383, 933, 1076, 314, 1223, 200, -1897, -2424, -535, -167, 790, 2148, 1391, 198, -1033, -1528, -961, 777, 1587, -198, -1468, -1609, -1604, -708, 2404, 3534, 1370, -876, -2012, -3030, -2395, 320, 2012, 1680, 1010, -998, -2110, -857, 1016, 1167, 1031, 712, -2291, -3375, -1260, 1248, 1648, 2549, 1923, -906, -2160, -1698, -367, 283, 1060, 737, -1045, -740, 303, 341, 881, 1488, 81, -1788, -1530, -791, -360, 899, 1579, 198, -238, 348, 522, 553, 926, 276, -1963, -2079, -215, 636, 1559, 2317, 1299, -758, -1524, -1228, -290, 1201, 1822, -191, -1232, -1114, -902, 339, 3163, 3353, 576, -1950, -2457, -2749, -1230, 2061, 2867, 1881, 419, -1342, -2069, -302, 1645, 1309, 907, 243, -1956, -3028, -442, 2386, 2374, 2149, 1178, -1717, -2629, -1268, -262, 639, 1285, 669, -590, -44, 693, 594, 173, 1042, -464, -2032, -1108, 492, 708, 730, 1003]
4999A003j519k01R48N84j67l50j035j831P37K475J205J19k2j736k586K2J246J472
5017C64J081Jj776j507O64M31J569K280q79l107j786k8N38J717K989O35k159j343
5035c16j406j89J576J098J18o04p62j094l20K326J823n90p97m41j974q30J864
5052e18Q18J52R9l28n53P53P01j048k65q6o85m77J240J006K26l63N09j190n22
5071e31R92M23n08j82j083j299J213K484M34l3k78k027k163K56J951J234M82J27
5089A492j499j416N32J032Q38J206l99k587j555M59M74K273J953J68k488j469
5105i86n46J0Q52J754J22j054k54n77j50J497J178o46q64p74j292m82J844J427
5123A059l99j19q6j248Q01Q37l11j297N9l87j54J302J525n78n90k73q84m31Q59
$$ y = [1003, -516, -717, 231, 815, 648, 298, -737, -2568, -1831, 644, 1849, 1968, 1946, 210, -2376, -2354, -1108, 364, 1445, 1446, -330, -1837, -1173, -742, 827, 3107, 2228, -879, -2665, -2693, -2155, -438, 2551, 3186, 1027, -316, -1722, -1911, -335, 763, 881, 277, -485, -1579, -1899, 427, 2250, 1660, 863, 422, -1552, -2382, -518, 300, 452, 551, 223, -330, 423, 1124, 76, -189, -275, -960, -1437, -197, 809, 1035, 672, 1181, -9, -531, 461, 884, 376, 194, -889, -2188, -975, 1509, 1943, 1910, 1632, -395, -2558, -2302, -351, 883, 1365, 1492, -7, -1423, -891, 141, 979, 2185, 1786, -801, -2356, -1897, -1423, 850, 2803, 2971, 483, -986, -1532, -1522, -670, 1084, 1206, 152, -102, -679, -829, 668, 1846, 1200, 336, -438, -1730, -2212, -368, 1059, 660, 541, 455, -793, 8, 845, 534, -763, -704, -1091, -1245, 57, 1582, 1004, 414, 141, -743, -1174, -315]
5142c15Q28j99o73m75q19R76K201O68n76o66k094k214J288K227Q79O78k37k017
5160e40j393R10J094P37M33n87k014j122Q19J053J758K095n16k779j883j9L11
5177a643J827J521p21j231n76O2O69J042P57p68j436l50n67J37J645J135n04l38
5195F61j5j350K34J447p16j043k81L86j70K024J140q58j570n43l81K72J297N83
5213A117j046m81l25k86Q80K239L23j419r87j629j537J468K839R08R9j060k134
5230a031r78R80J864N04k24q09k405r2J549J269J097Q17r10k952j140N59R20J384
5248D02J374o94j278n30O75k27J235M33j507j306N38k60N25K112k82r59k19L15
5266C47r63J73L15k84r23M30O24K15J210J018j600j685l71K72N71J799n8j054
$$ y = [-315, 513, 314, -359, -834, -1653, -677, 1524, 2192, 1616, 950, -1144, -3358, -2070, 157, 1036, 1714, 1477, -540, -1933, -1023, 71, 808, 1241, 654, -1360, -2482, -1663, -610, 1148, 3243, 2727, -52, -1935, -1954, -1643, 184, 1705, 984, -247, -823, -761, -92, 950, 1707, 939, -497, -847, -1414, -1277, 368, 1503, 999, 661, 646, -704, -470, 977, 261, -782, -1063, -677, -847, 1177, 2317, 1459, -111, -654, -1035, -763, 534, 1117, 71, -410, -735, -1021, -141, 2098, 2421, 1002, 15, -1614, -3151, -1683, 1156, 2064, 2163, 1103, -1031, -2009, -1029, 835, 1339, 1115, 306, -2099, -2191, -642, 627, 1724, 2541, 1631, -1321, -2461, -1902, -982, 402, 1776, 1082, -196, -726, -51, -278, 957, 1390, -117, -1423, -885, -1145, -620, 1492, 1210, 251, 32, 347, -616, -443, -128, -412, -1335, -905, -281, -66, 1144, 2162, 562, -1123, -1494, -1222, -651, 1148, 1090, 36]
5284C6r13j39K03J280J650m81j786q98j069m02J731K347P61q55j089j632q20J203
5302h73J595N16l86q28j372j19J699R51N14K16j490k228l08J001Q33P71R85k82
5320A195j601m87O16J76P31O3j130o93P21N15P6J014Q0r04m38J92n49j82Q99l79
5340h5p01K43R18M37M49J72j430j207n7J52Q24J545J44j162q97J35K88R94J229
5359A991r81j270j132l86O0J798K300L1j116j364j614m56J423J838K47p49l65
5376B55k007M37K076O54k1m9j323k143n8J412J154M40Q64n79j516l78N85n0J96
5395e1M5o94m05P63K97N35Q33l88j545j11O45l29j32P09l45o18N41J029R5o0P5
5416H89j559j317N15P47Q69J537J97j606j454N09K55R88J182m60k221j216N59
$$ y = [36, -877, -1016, -813, 467, 2117, 1636, -150, -1048, -2117, -2519, -788, 1559, 2320, 1465, 376, -1256, -2076, -873, 722, 1238, 852, 24, -1348, -1467, 232, 1183, 1697, 1913, 423, -1805, -2113, -1112, -279, 492, 1477, 1195, -406, -893, -277, -101, 630, 693, -437, -1130, -409, 106, 182, 1196, 1276, 372, -66, 126, -423, -605, 294, -85, -786, -543, 375, 812, 1261, 1433, 3, -1204, -1261, -1109, -285, 1260, 1404, 242, -655, -520, -232, 762, 1991, 1010, -260, -1392, -1778, -1718, 80, 2380, 2411, 1295, -69, -1683, -2139, -716, 1122, 1369, 620, 255, -1752, -1315, 761, 1415, 1394, 1345, 22, -2121, -2179, -767, 387, 827, 1691, 1112, -404, -782, -197, -247, -51, -6, -700, -1105, -342, -45, 490, 1323, 935, -610, -721, -76, -405, -537, 172, -173, -791, -250, 779, 874, 814, 889, -670, -1987, -1472, -725, 144, 1681, 1878, 272, -1182, -673, -418, 570, 1752, 1292, -929, -2145, -1586]
5433a586N18J962J738m93j575j354j176l96J781K032pj011p05j042o7K112P15
5450A446k42p70j438j265L49K203Q50k54L85n22j443J31N24K60j56m6n33J07M94
5469H0O50J85K49n39j792J37J226j37k6K22j44j075Q59J627k27n25m79j438p95
5488a942M98J613R07Q64m42k191p51Q49K29Q92J221j146j893n36P89O76J909J085
5506B631j313j965j040l4J83J522J582n86r30l49n95K83J272M39o51q42n10q54
5524a757O92K299j47l79k2k17j427k84J332m63J8j54K21k17P65Q51m76j20n44
5543b9j479M66J264j51l5K45k66n98P30J179l03j139l21j110k70J089J430N43
5561A245J17k81j949n87J144L39L73O41k03k183r0M54J321J138R48j597j782r60
$$ y = [-1586, -1068, 894, 2632, 2139, 564, -790, -1966, -2362, -581, 1451, 1444, 433, -272, -1314, -1381, 731, 1446, 1204, 434, -1004, -2269, -1920, 283, 1133, 879, 1264, 742, -701, -570, -46, 214, 58, 12, -521, -414, 80, 730, 915, 1164, 625, -1167, -1030, 196, 59, 33, 255, 111, -964, -105, 1522, 1295, 770, 291, -1147, -1942, -1444, 169, 1076, 1940, 1498, -693, -1444, -595, -366, 526, 1747, 601, -1292, -1828, -1039, -363, 1546, 2631, 1318, -647, -1687, -1721, -1538, -16, 1566, 980, 50, -299, -894, -611, 661, 1100, 449, -393, -903, -1757, -1065, 1234, 1087, 708, 686, 469, -958, -1242, 90, -373, -355, -509, -288, -505, 260, 1111, 635, 515, -29, -1508, -1042, 222, 71, 36, 281, 15, -583, 147, 1326, 1023, -116, -437, -1547, -1817, -728, 702, 1245, 1362, 1081, -868, -1455, -311, 28, 401, 1042, 839, -1344, -1434, -980, 341, 1479, 2427, 830, -952, -1912]
5579a912L48L25J721J546r37n83o09l22j86J021O46o75n85n27p52R39J641M58
5597A557q10k09q44q72K36J477p51J9M75j22J5N73j49k07j24m38o68J51J200K28
5617G37m04l2k93n59N97J327m42q20j026o80k56J326J928O12n75r49j754m38J273
5636d28L67P87N31p67j832n19J692Q78R15L15j629j884n50P07J099J569Q70j238
5654H83j585M2M5l27R88Q47j232l41L00o73R82J185k8p14m43m13r51R37P43j59
5674H6l74K35J66j69J019p9j192n18k92L04L24J455k30n34k6l36n25O21J363l56
5694I42j179p54l89K08J337J916j59q18j798j270L67J339R50J46K36r12j191l69
5712a398J456Q26K27J36j540j409j46J015J277J233M86j501j475K12l3K92P53
$$ y = [-1912, -1564, -1239, 482, 2028, 1091, 508, -101, -423, -609, 412, 1058, 383, -202, -729, -1481, -542, 1099, 1557, 747, 538, -306, -1178, -942, 535, -216, -197, 278, 156, 171, 744, 595, 388, 264, -174, -842, -691, 509, 737, 333, 301, 8, -551, 46, 1373, 931, 111, -915, -1595, -1851, -525, 1403, 2015, 1440, 491, -1263, -1701, -428, -61, 726, 1257, 490, -1342, -1861, -169, 709, 1624, 1939, 310, -1574, -2124, -1417, -318, 1251, 2121, 883, -702, -660, -615, -942, 46, 893, -339, -680, -380, -1053, -71, 1114, 1086, 372, -71, -484, -1435, -498, 245, 86, -288, -53, 113, -56, 963, 884, -308, -826, -1118, -814, -490, 965, 735, 201, 175, -161, -686, -65, 1298, 942, -237, -991, -1380, -1172, 165, 2081, 1922, 1104, -694, -1964, -1597, -258, 692, 838, 1074, 162, -1029, -1398, 58, 884, 1111, 1247, -293, -1702, -1848, -833, 444, 1677, 2163, 662, -813, -601, -634, -342, 411]
5729D11L48j001m13M49J90M26P22l84q22l86k81k15P84J051l78p76K96L15j98
5748A38L09J54j308o23L14M27Q71J081j53j114l17k18k54N19J383p32j098Q9l34
5767h66J88J338J364m84j252j105j374N84J394J198k53j87o10q22j08J566L37
5784I08l33l58q32j039L9J656N79J054Q7j676j406L38N06j03P37M01r07k05Q40
5803B86k32M72n5j63q18r5l4j00N11J094m62m46N43k58R2j84J91j199o38P04P00
5824i1O56J025n34j235n17N5M9R86O40q87r60K01O8K31J384Q45q02j387o48j078
5844a999P95J714R66l82m37q48r44K57J570K73k29m27q18j266Q98J092R24L97
5862A536k11j335j293J21P45L65Q25J77j045m89Q60L44k04K52o34q59K31K91J06
$$ y = [411, 759, -242, -655, -206, -16, 410, 1132, 748, -74, -460, -741, -956, -172, 879, 501, -275, 21, 336, 138, 447, 601, -707, -1330, -1016, -589, 282, 1363, 1210, 96, -221, -439, -693, -174, 1209, 477, -621, -532, -866, -678, 660, 2024, 1540, 288, -817, -2191, -1607, -213, 985, 732, 545, -65, -887, -995, 571, 908, 575, 217, -615, -1654, -1615, 41, 620, 1674, 1761, 85, -1321, -983, -477, -580, 157, 558, -349, -554, 286, 54, 526, 471, 308, -510, -605, -639, -739, -228, 866, 404, -42, 501, 243, 335, 151, 342, -857, -1495, -791, -91, 565, 1590, 1056, -179, -696, -641, -592, 394, 1034, 147, -813, -612, -544, -313, 1071, 1916, 1114, -273, -921, -1999, -1204, 510, 1476, 1094, 657, -191, -1135, -878, 692, 965, 736, 309, -509, -1775, -877, 215, 1139, 1536, 1325, -10, -1303, -1182, -437, -72, 753, 930, -115, -604, 256, 600, 396, 648, 14, -845, -614, -323, -217]
5881b17L51N25j97r21P18p0j76L81k17j299P1N01R41O77N98o55j904o68Q43J54
5901e64Q81J053j018r78k65R02K08R26K72p99j759n02N9N11J920J054q49q00j146
5920h94n36J014J048K35l33r59m49l77Q75J523j32o27K75j303o60N01K81N88O97
5939G67J25r97k49Q13K43k09k28n00j122N64J258j43M3k4m06m90O30N07r48J47
5959b19K08j200N25O84R86J79Q1j368j009m49R07O14Q76M15j154j292N77O22N27
5978E10P30k71j177j241L56L52N00J629N10p47j239p53mJ72J654o3q04m15m6n75
5998i22J203J245q05l10l24p64n61Q04L93pL72M16l67n99N29j35m26J55l30n7
6018d90K93O54L69j36l70m68p76J234P3n95j96p6j64J07J110Q12n85k84o18j204
$$ y = [-217, 134, 659, 462, -459, 259, 189, 13, 394, 177, -1122, -1051, -550, 391, 1068, 1666, 1011, -893, -1561, -718, -564, 317, 1370, 352, -626, -891, 11, 219, 1145, 1417, 618, -1141, -1643, -1584, -1073, 847, 1901, 1052, 252, -894, -1430, -416, 632, 867, 534, -425, -874, -1251, -376, 1147, 1015, 388, 663, -640, -1300, -799, -518, 70, 767, 892, -105, -354, 459, 702, 493, 265, -235, -1357, -793, 465, 322, 365, 341, -65, -555, 75, 582, -366, -219, -11, -1211, -686, -2, 984, 1163, 1244, -124, -1133, -1582, -675, -61, 815, 1230, 76, -1216, -639, -17, 510, 1240, 969, -208, -1449, -1093, -741, -241, 1388, 1898, 1151, -88, -841, -845, -673, 981, 918, 114, -301, -347, -922, 281, 1526, 721, 411, 87, -677, -1238, -434, -41, -48, 324, 740, 373, -226, 303, 168, -258, -103, -433, -490, -197, 457, 826, 690, 320, -148, -924, 310, 383, -212, -408, -484, -648, -541, 569, 1381, 796, 512, -106, -1310]
6038a310q4Q99P17Q42Q2j093j148M90Q27k4M44J24j542p36K18P74P82J095K57
6057A614j254j021k05l80M31J692k05p36J7k19l98P99J015J1j307m89r9j95Q12
6076a17R17l30j66L07l15o06N58l09j89q7K8j60J32J535k20m73m35m83n84R65
6096c2N12m04j35l28k24J01J622K62m10q73l16j390N15J163P37M46q5r27j060
6115h26L36O40M71K55m7j384j056O17J261N71Q45m52j422q60j50K82R41R85k34
6134G73q86k51j3Q4L37J152l49j310r6k63j64J075Q61n43j47P0p33P8P24j37o77
6155d15Q7M30n4L24L76j86p01m74m7k33Q54R14o16o86R3k17K13J463M69j556l31
6176b93q99n97O92J535N79j65l75q17q55L17R28R6M47r2j497m38O45J192R04l4
$$ y = [-1310, -1394, -495, 222, 1064, 1146, 53, -1095, -605, 222, 198, 642, 766, -776, -1512, -1294, -520, 262, 1357, 1614, 360, -661, -866, -1246, -815, 877, 672, -64, -47, -266, -664, 135, 1150, 1161, -146, -635, -734, -929, -117, 800, 470, 304, 611, 296, -310, 248, -61, -250, -337, -309, -469, -337, 1198, 978, 505, 70, -413, -997, -32, 480, 76, -59, -387, -611, -510, 1112, 1374, 964, 91, -225, -1615, -1100, 63, 800, 1246, 1161, 234, -826, -490, 150, 621, 876, 829, -555, -1611, -994, 267, 838, 1683, 1231, -191, -1051, -1201, -919, 22, 1007, 773, -113, -364, -377, -293, 44, 1196, 847, -463, -559, -822, -986, 89, 950, 407, 260, 330, -403, -325, 399, 262, -415, -328, 102, 48, 372, 748, 562, -139, -613, -660, -893, -39, 875, 259, -427, -334, -551, -338, 1125, 1594, 38, -293, -1192, -1789, -1097, 438, 1017, 852, 477, -340, -1195, -878, 50, 146, 593, 501, -996, -1434, -789, 403, 1307, 1273]
6196A273m80j588m57L36L06Q08P33k49o03j54m1l22L11O43l22j158J60M60K06
6215a38M71P04o96k88K59k71l22M41k36o00M42P10k10L22L45n68j204M51P5r9
6235d12M29P10n8o84m8k55K82J147K14j333p68j69j12N72J728L2m68m85q77n11
6255a066K80J094r3J79K85j008r68J097J258lj57m23j149j064R29R75O3Q20o13
6274D36j75n28M17m11J87L22j78p50M59L47n64N58Q54p07p39J47L2j79N07Q0o79
6295e64kR57K72m0L67n46j606K06O33j95P11O80k36o46l36r1O0R40L74j138p68
6316i68l5l7P33J611L33r50r09n19m93N62J137K6j48k17o04o65R58J009j64J61
6336H21o11j343l82P86J361L28M2n95p66J19J06J4Opk69k54O62L06k01J82K67
$$ y = [1273, 793, -795, -1252, -916, -610, 198, 931, 682, 79, -75, -116, -438, -127, 516, 194, -964, -804, -344, -138, 333, 1037, 341, 53, 312, 41, -281, 160, -76, -676, -234, 476, 266, 588, 933, 365, -839, -388, -313, -412, 17, 727, 669, -15, -63, -318, -36, 1111, 1325, -8, -776, -945, -1057, -485, 1243, 1275, 807, 322, -555, -1066, -786, 308, 215, 394, 679, -329, -1297, -200, 1058, 1055, 898, 475, -674, -1738, -809, 166, 229, 1049, 436, 261, -267, 150, -261, -74, 248, 70, -680, -221, 126, -438, 120, 974, 267, -472, -325, -293, -472, 35, 115, -564, -566, 391, 663, 623, 990, 444, -1162, -956, -323, -518, 193, 873, 637, -9, -345, -436, -376, 564, 938, -200, -968, -1003, -1040, -307, 1304, 1637, 687, -222, -741, -1234, -672, 465, 491, 343, 126, -478, -1143, -185, 824, 660, 821, 210, -1133, -1515, -729, 632, 960, 1002, 407, -359, -240, -134, -120, -114, -121, -390, -644, 18, 324, 123, 305, 572]
6357E72m12p87N27l08J60N10k24j10m5Q34k89L05J14j096r84L79Q94L73O6N52
6377A031q79n68k00M28P2O42N1j024j52k49M21M42J772j76j535o08o37Q9N54J047
6397E21K94n32j85o96q4O99R16n13l81m25p74l10J191J063K69m34k74n58n49O80
6417h2o0K07n0m58j64O13O24k37k17Pm45o34L35P26l43L49J3n92K61P64N0l26
6439C41j7j114q93R63Q56O11M1L83j275p88J45O99J22L45j27r57l22N19N46M83
6459E61P83j50j338n34m33L0J027Q63l9l48m60n44n0R29M17l93l62k2q65N04P29
6480C05M38j09j12n57m68j55N87j6K73M6k39J9L52K35l16j99m9p27L2O20N63k34
6502B89J2j61m24L54K18L93o46k15m7p73M37J255J78J63j72j124q53L85Q46J04
$$ y = [572, 160, -627, -100, -408, -248, 262, 38, -72, -117, 717, 428, 733, 847, -249, -1233, -854, 40, 413, 479, 1031, 152, -416, -616, -188, -116, 526, 577, -447, -599, -848, -427, 15, 1787, 1611, 76, -532, -1169, -1080, -526, 521, 815, 283, 98, -598, -682, 17, 933, 420, 39, -386, -1160, -1470, -279, 784, 1053, 619, 345, -213, -762, -82, -142, 65, 15, -443, -607, 6, 630, 393, 176, 183, -262, -896, -561, 165, -178, 171, 184, -408, -147, 617, 667, 341, 324, -790, -1683, -720, 136, 747, 788, 1171, -104, -892, -747, -48, 74, 419, 292, -665, -987, -468, 78, 561, 1344, 1194, -144, -678, -1111, -1081, -54, 809, 770, 422, -38, -582, -632, 297, 714, 321, -41, -63, -928, -424, 305, 743, 634, 522, -35, -503, -658, -71, -87, 186, 232, -7, 12, 364, 599, 283, 84, 35, -692, -660, -40, 523, 289, 301, 140, -284, 70, 288, 681, 35, -180, -227, -1000, -563, 692, 870, 1033, 861, -263, -1116, -731, 115, 219]
6522B19J67J44j215q5L88N09Q85K47o00j169p79k2P67N77J171q2r23o09p1r9Q81
6543C01L48m40n20J00m07J14R93M37l93l69k51p85L6O69N25l47K57l05NK04M22
6564E94k79n17k56k25k52R62P36n29k70j70p9q4O24L75p27qn47k07L20J037M94
6585I92l31l18r76q81N77R50P60N1l47j229m41J319N34K05p9k25j233m98M35L13
6605d22Q82R94l78r50o99k04K96O81O88q42p06J74M49K95P74K6r16o61J68p0K1
6626d00M02Q3nK98O2n89L02N49k89r84j61J12K64J137K29o04m26n58J47L48N33
6647D50m3n73k91k60J91O27R71rl83o85o93m87M57J338L0j93m11o97L0R29L91
6668F89J46k95n20j004m16J127M43P04O1k78q19n57l4j1Q10M61k80o14L75j33
$$ y = [219, 386, 530, -685, -770, -382, 127, 1012, 1259, 659, -510, -1289, -1311, -544, 33, 1204, 1122, 199, -410, -481, -580, 301, 649, 209, -311, -211, -618, -504, 489, 926, 533, 164, -87, -872, -836, -167, 358, 11, 268, -37, -32, 172, 594, 315, -202, -458, -683, -935, 27, 763, 234, -36, -206, -285, -369, 255, 630, -97, -105, -652, -859, -539, 498, 992, 661, 343, -633, -1514, -937, 13, 773, 824, 477, -752, -1193, 126, 660, 865, 786, 561, -672, -1170, -735, -422, 460, 1454, 1076, 126, -573, -777, -481, 200, 888, 46, -660, -486, -37, 258, 1032, 1058, 142, -519, -351, -421, -400, 2, 85, 80, 378, 440, -149, 153, 702, 413, -571, -732, -620, -356, 781, 1010, 406, -20, -578, -431, -83, 450, 407, -166, -457, -717, -526, 101, 1072, 1063, 680, -5, -698, -1185, -728, 610, 640, 447, 36, -661, -631, 298, 689, 835, 540, 20, -984, -1400, -273, 170, 874, 935, 657, -162, -719, -753, -764, 46, 507, 227, -387, -12, -145]
6688a45L67M21R4r26n37J50J30J17N66j5n4r1N43l41m38K19k32m56J45K89J28
6709f6O15J58j061J93k28k84L61P77r4p60q3k70P64O48N23j61r92n09q62k0J276
6730g5P47K20m59j37p21o20J021P38l03q1o17p16M41O45N84Q2J57o69n81k22M1
6751e25%L84N05j61k76J53Q9K8N28l60q45j47M24n5N80l0J21n82M07pJ32o27L57
6774I3m63l96K96O55L42J79L27q26o92k77L12J37P51j37p79O0l1L77M52O93m26
6795F47j121rq57N02R22P87m1o71J93q00m09O41Q40k87m46k20p46N12P65N25J20
6816H47m49l11j203K26L48K20O87QK05r37P47l45J04K42m45m08k13O75j37J75
6836C6N22r6l42n74O05j40j99J10n39M7L85M21J50M92k39p17o46J47J38N48P28
$$ y = [-145, 222, 643, 737, -189, -726, -576, -446, -329, 237, 222, 168, 77, 620, 279, -159, 60, -172, -628, -483, -194, -66, 549, 707, -354, -161, -389, -673, -312, 465, 371, -389, -472, -742, 22, 670, 1193, 1032, 40, -469, -1331, -1351, -75, 672, 892, 433, 296, -425, -1045, -24, 714, 411, 330, -287, -1003, -562, 83, 667, 749, 906, 237, -344, -566, -525, -525, -141, 364, 203, -73, 80, 169, 197, 725, 365, -480, -627, -203, -258, 322, 292, 413, -169, 238, 231, 363, -264, 93, -370, -766, -470, 185, 527, 706, 1033, 207, -485, -762, -450, -313, 438, 301, -478, -418, -449, -72, 380, 1073, 647, -474, -483, -1340, -838, 84, 871, 830, 159, 352, -448, -857, -216, 624, 337, -109, -329, -1075, -563, 202, 727, 847, 398, 87, -1116, -890, -542, -322, 365, 373, 578, -359, 388, 43, 147, 389, -56, -464, -677, -2, -139, 36, 558, 462, 120, -454, 151, 11, -188, -78, -617, -570, -185, 236, 386, 878, 639, -78, -724, -577, -439, 109, 837]
6857H37l71q81k64N04J85O71O26p59j149n30M22J40J222O59o29p12n3l09l24Q68
6877A53O89l11m71n36M8j05J022M20o05j50o37n48O46N49j30K99M63o16p28N18
6897c0O49m95j45k90p9k48Q18J95L5K26m39l96j62Q54l93j66j9m38k27R61N36
6918G47J82o19pj032l38M62N50J31P76m20q99P6K71O41j49L01n33j005k19N78
6938e06J02J064L06l78q29J17m19Q4P49J17m97j0l8m54K24O42N35o63l48k31n65
6959i98K69P55K70K0R7m35j16K77L58n05m63k23K91k01P05L23k72M02m18p20O3
6980e21P45k06l0m8k36K7L32O38L19m79o74o10k61N68O97K00k9k30n40l10M95
7001a53L60P5J06l73p27J44J98M17Q90L17q13p64m46j95Q02K96Q65j016m18M28
$$ y = [837, 466, -415, -679, -175, 10, 681, 1307, 548, -601, -1131, -709, -569, 653, 1312, 683, -29, -82, -391, -715, 153, 842, 531, 60, -476, -428, -533, 489, 909, 304, 154, -483, -1031, -385, 164, 34, 333, 796, 180, -548, -30, 619, 124, -21, -311, -390, -638, 180, 375, 410, 636, 197, -199, -361, 493, 100, -66, -85, -523, -750, 211, 747, 929, 310, 303, -729, -1067, -605, -55, 76, 852, 432, -467, -391, -120, 521, 372, 673, 140, -865, -1084, -506, -404, 660, 966, 588, -241, -124, -543, -459, 290, 407, -90, -100, -138, -592, -368, 274, 809, 146, -202, -433, -998, -729, 26, 296, 316, 413, -22, -138, 139, 497, -8, -471, -694, -403, -604, 101, 424, 152, 554, 136, -584, -521, 224, 18, -12, -60, -296, -269, 63, 701, 1020, 541, -133, -743, -1004, -436, 261, 461, 432, 202, -338, -648, -153, 207, 282, 388, 15, -712, -568, -370, 47, 937, 1254, 441, -323, -769, -964, -162, 134, 999, -17, -435, -7]
7021gj17Q8P20k9o62k43k01o9L45N17L72j74j61l78l65K20J77p9l38J03L03K71
7043B93L25pn70K6j04m68N24K05l3L5J26n19n0J75R03m74l06p29l75J05R38L80
7065D00M65q0r43n93M40P25j84j24L06p17p35K56O67O85L83m4p43r38n4J0N78
7086b40N26N98m16j039M82J62J1K30l62j68l85L5K09L35O72P9q02P40r99k15N48
7107AJ46l54k00M14J72jM62L9o03o28R2J40M44L73r2n32R7m5j99N80N33p08j26
7130Ej54q21N67P21O72n9l73p41m30J60P92K06l27O7n48l96J57N79O26j87j3q37
7152c34p95N96J44P03K73k2o62M7n2J76j37K17K1m81j09L91q5K44M05k80k95j06
7174a41K04n34K97M3k13k15M07M90k6K98Q8j087j06p2J33K75Q34m40o11L13J95
$$ y = [-7, -124, -36, 684, 655, -7, -250, -451, -520, -175, 342, 714, 540, 379, 1, -364, -144, 33, -46, -384, -281, 22, 293, 618, 611, 41, 67, -37, -505, 19, 224, 191, 226, 352, -167, -217, -42, 861, 387, 81, -648, -1023, -918, 20, 400, 865, 785, -158, -751, -311, 414, 230, 106, 412, -305, -1040, -784, -117, 568, 951, 907, 164, -774, -828, -818, -240, 286, 884, 468, -571, -89, 73, 84, 314, -48, -216, -601, -566, -357, -22, 650, 729, -73, 667, -332, -547, 1, 147, -207, -407, 7, 179, 178, 640, 679, 76, -552, -460, -320, 124, 497, 405, -127, -30, -75, -274, 306, 839, 131, 5, -149, -970, -403, 318, 990, 931, 558, -183, -613, -453, 339, 545, 218, 285, -263, -659, -502, 77, 703, 516, 503, -334, -1129, -533, -389, 314, 587, 565, -97, -50, -102, 74, -63, 154, 175, -306, -415, -24, -109, 135, 540, 260, -35, -141, 63, -471, -174, -131, -344, -559, -152, 338, 312, 610, 698, -389, -495, -567, -434, -159, 675, 235, -376, -63, 132]
7195A32m61P93l05l78l86l5j00L44R40J64j80j10r63l77R4J162j55j40K25m89
7215b25l68L89O48J00k79k49l84m31K26L82M94J91o9n35l44K47L37j31N3k65l66
7236e79L78K58J54k11O28k66o45K92m5j53J06L72k90J3L93r0j90L96j98r65mK23
7258d23L80J73N60m72n92N26j00k39O04K2m82o69M05J29L35Q28J32p06l81k80
7278b50q14O57Q35J10k83j77K6o66N72O67m4m34j64p20l39Q87M46L77l3j01q53
7299c01n1l4M71j17j0L58q81J81N40O0J04j51j85m03K33M81l49p6K53q3j51N42
7321D31%m34K98l27n67l42Q77k51N27Q62n72o15p31N61J04J005m91m46o41K13
7341e39J31O05M50M01r82p56J49l60M16P69M04m90k19m35J05L88O25k82p77N0
$$ y = [132, -329, 464, 159, -219, -605, -640, -740, -396, 544, 708, 528, 418, -545, -922, -828, 334, 179, 39, 264, -225, -593, -204, 444, 544, 265, 16, -368, -799, -573, -191, 303, 494, 425, -110, -454, -207, 130, -1, 52, -213, -579, -201, 57, 211, 0, 628, 362, -283, 9, -36, -189, -83, 289, -1, 12, 405, 315, 125, 521, 323, -642, -646, -423, -43, 130, 690, 218, -374, 152, 52, -187, 417, 439, -43, -712, -307, -178, 157, 985, 1117, 411, 30, -250, -1064, -407, 428, 538, 255, 78, 104, -562, 10, 677, 633, 199, 35, -685, -1024, -137, 309, 686, 653, 552, -301, -352, -386, 85, -32, -42, 316, -565, -384, 156, 216, 320, 169, -16, -419, -186, 295, -54, -130, 123, 40, -111, 431, 431, -3, 295, -32, -599, -941, -64, -315, 212, 1074, 502, -113, -844, -283, -179, 826, 335, -111, -752, -539, -408, 197, 647, 1048, 66, -690, -541, -901, -485, 284, 688, 198, -21, -456, -351, 37, 662, 380, -397, -347]
7361c47l12J69M32M74L42m43L8o65l84N02K39n09N31J7j44k20L83L63m91K73l28
7382h0n54K73N17J10K7m9l88j50N28L66m56J13n43p59P19M50L05lK01m64o42m6
7404e25N10K02J64n9n16p31M75L78N54P4K98j178n36L06n3P55O46J20n02m74k47
7425c39k34N91N30k81n82j23M1l39J218K52l00m73O8j08o14L76N68k98J08J72
7445B33k63m5P33n52m40k0J9k71L17L88j18K16M2o38L63M06l2n61J14l72k60M37
7467c04N63N53l28m0n54n09q2R12k39K49K5m50l47L16O00j58M46l35q91m29L83
7488f19L20K08Q32O0p21j55l27k00O95L47m90k48K05l96K79M10M08n63r4j39l84
7509e72M7O04J34m02M37n1j43J72J86k22k91j90n7M1K76N03m0k63J60j59m77O48
$$ y = [-347, -659, -490, -58, 416, 758, 315, 353, -312, -696, -194, 45, -464, 67, 84, -60, -280, 103, 466, -25, 248, -80, -634, -361, 156, 266, 293, 244, -144, -294, 234, 600, 144, 257, -286, -1045, -326, 124, 429, 426, 627, 163, -479, -525, -15, 187, 351, 292, -224, -955, -480, -102, 452, 526, 824, -354, -890, -584, -637, 118, 764, 884, 382, -92, -339, -573, 18, 548, 267, -315, -438, -397, -736, 482, 734, 434, -39, 29, -79, -693, -317, 251, -47, 61, 233, -30, -75, 658, 106, -334, -354, -335, -606, -289, 99, -19, 197, 239, -399, -36, 370, 338, -223, -109, -481, -741, -304, 259, 812, 484, 444, -110, -619, -701, 211, -28, 221, 246, -204, -551, -235, 365, 207, 653, 318, -573, -1002, -619, -299, -91, 741, 801, 80, -75, -402, -602, 93, 440, -50, -298, -93, -489, -210, 200, 608, 45, -49, -188, -572, -525, 79, 213, -189, 248, 197, 54, 226, 412, 190, -101, -291, -348, -307, -31, 472, 432, 169, 329, 170, -307, 341]
7531C41J69m06l89k18J7K61O94J74r0m88q9p14K06O76J13J36j73l84k86J84L79
7552A13K84K39k82q27m41M65N47L78J7Q6r16j37K09n1M8M89m3l19RJ16lK14L95
7575E90o38j35k20K60K4J34k3j31J14j55K68O4N0k46l30J46K59m99L95M57J69
7596E53k21o62l2K32L48N21p36n23J09J8M44N09Q3n56n13n4j71K97R24j91k55
7617A24J02p43K01L03K53j0k0j57o08m20R70N13k35J11J76r66r8K00K26K29L3
7638A84j53l24L33K5j21J47K14o31rK44m00K98J93L06k09k33K08m9K25j29j03
7659A6n58R8O51j5R5K31o28k67K77J2J05Q1J10k11q3Qj89M98L26J2q50j74L5k98
7683g18O03P66O9o87J08k95k35M29L69Om88ol83J41L50J47J86K41k49p08j38M02
$$ y = [341, 510, 104, -285, -503, -486, -225, 469, 643, 553, 65, -24, -738, -532, 144, 257, 393, 220, -164, -450, -266, 113, 397, 636, 354, -473, -914, -449, 98, 476, 493, 579, -337, -474, -265, -316, -268, 221, 178, -141, -132, -16, -19, 195, 590, -48, -183, -403, -143, -119, 15, -8, -139, -25, -180, 88, 152, 202, -44, -374, -228, 31, -468, -73, 384, 553, 332, -330, -362, -130, 218, 739, 3, -520, -411, -393, 51, 560, 643, 87, -426, -480, -651, -354, 570, 379, 124, 226, -517, -316, -13, 240, 230, 210, 53, -555, -975, -5, 508, 273, 384, 560, -406, -504, -304, -78, 151, 184, 31, -293, 40, 65, -56, 91, 305, -326, -335, -91, -491, -193, 0, 306, 97, -136, 72, 23, 248, 119, 16, -542, -444, 207, 192, 287, 518, -110, -377, -100, -88, 17, 98, 208, -3, -86, -78, -267, 231, 557, 569, -281, -455, -420, -718, -115, 651, 720, 33, 141, -154, -389, 40, 409, 415, -73, -79, -462, -321, 29, 176, 362, 603, 354, -354, -492, -90]
7705i0K64J31j23o1k45j1M09l16L3L26m63m74L35K02k77L67L68l98M5j0L03j77
7727A38j42o2n33M54J34J37J79K91n94o07N12O5k9K02J19k57k8l37L92o5O10k96
7749B83l52m64k53L8Q00P10j36p20r7j33l09O18L36J1k3k06n09K66M87K92j89
7770D50k89K7q20N3N95J66l2J04l03q5l2M20L7q8O1m53l22L62P31n29K73j03l47
7793a24l39L35rj17K95l94J21J63K66kK39J69o83l65K93j10K64K16O1o17l3M77
7815A06K3L8M15l91q01j18LN28N06M45m09j51m91m4Q3O9K62r0k58l8J4K84K95
7838B80K56j98k66m05j42j03O93P2j20K25l92j3KK83m3j10j37k71j01O58J70j18
7860B20oj88k75l6L56K56m37J95j88k01j02R85l23L73o9j107p4K62P41J6r9j36
$$ y = [-90, 174, 305, 182, 121, -124, -135, 274, -42, -9, 317, -146, -620, -285, -83, -360, 7, 375, -23, 22, 12, 315, 138, -4, -66, -599, -145, -11, 126, 305, 596, 2, -605, -93, -28, -57, 145, 264, 7, -21, -358, 34, -31, 579, 283, -69, -533, -786, -748, 52, 762, 626, -94, -191, -324, -633, -15, 321, 332, 309, 103, -406, -140, 347, 639, 450, 161, 188, -632, -579, 16, 182, 150, 254, -49, -134, -166, 254, 291, 203, 264, -189, -511, -149, 582, 53, 326, 223, -124, -463, -128, -137, -254, 41, -353, -232, -69, 197, 195, 434, 603, -80, -445, -152, -262, 2, 218, 279, -338, -371, 106, 129, 167, 582, 191, -610, -728, -725, -197, 309, 754, 345, 194, -297, -341, -258, -189, 73, -17, -275, -313, -299, -15, 280, 536, 338, 72, -333, -475, -578, 115, 187, 67, 292, -100, -113, -111, 172, 129, 19, -118, -389, -490, 168, 338, 220, 214, 26, -249, -285, 71, 327, -110, 85, -103, -304, -406, 579, 256, 629, 560, -547, -621, -359, 382, 398, 299, 163]
7882A63k99k11M04j43P0N9p8o0m36J14P41J18R9j66n69k49o0R9N80M12p35J64
7904A7J13l49K62M13l33j46j69m6o3J61M31J84l12J37k51l87K48J58k38P1K09
7925A10j06j84M57L28l73j68Q9l76Q0K76j20L10l73J27k00O81k50J72j55k92m52
7946d19K38R7L57m3nJ74m75n65M51J87L24n5k54n01L27K32k05N54j42P9q70QM13
7969i3j87N96l3J2n03K11j7J68L04l31l09k99K97j54M04J42J65j55j43q6m39J74
7991b76Q2RJ89p2j51Q0K76N99q90l04M51m25j32P02J48l39l45K17mK83M17k27
8013B88m50k32r8J54N84K6o7k0j13k06l39M33K9K75j14k27m94L43O46Q7l13N9
8035B51j42m73K2K14p6N20M06n30l34J28PJ48k67M01l93j22M2J05M68L8L8q62
$$ y = [163, -136, -347, 57, -86, -16, 43, -35, -95, -531, -417, 324, 442, 541, 375, -194, -443, -503, -404, 176, 588, -147, 17, 130, -219, 43, 456, 123, -23, -192, -238, -301, -140, 291, 475, 163, 300, 49, -338, -90, 68, -170, -99, 110, 4, -180, 277, 605, 232, 64, 153, -223, -143, 133, 13, 323, -50, 77, -123, 558, 308, 480, 325, 33, -419, -181, -84, 273, 230, 225, 399, -76, -641, -190, -3, 321, 266, 12, -489, -162, 70, -135, 419, 277, 356, -514, -506, -93, -280, 316, 283, 295, -208, 3, -14, 154, 458, 127, -182, -481, -184, -338, 66, 208, 373, 218, 75, -11, -450, -276, -194, -185, 4, -68, -219, -139, 137, 736, -154, -458, -7, -432, -564, 138, 286, -53, -398, -181, -185, 98, 515, 288, -162, -394, -492, -338, 246, 272, 205, 185, 72, -134, -473, -40, -11, 264, 150, -77, -571, -228, 418, 505, 192, 251, 109, -364, -342, -128, -204, 316, 722, 192, -142, -14, -7, 141, -126, 275, -118, -240, -198, -93, 375, 413, 451, -411]
8057d11K35m8L35q5N48o60O3Q6L9J86KJ92n31j85m3m4K25M28r5m20J13J50O7J5
8081A62L7k22l22k13l6K78M12N82m50l11L12n11l12K85M76P4k86J36j24m8J65
8102H4M04no1n98p48L50N41J53p8J20M0km28N31m00K12K03p67K35k3p8M17R7o7
8126A32o24L14j91j95O01M6j99j39K82j51M70j01l6l10m48M05k13M75K95p0k44
8147I9m10K24J44j5L72m55l67M72k05k79P33K96l08K4l34l64q4N20m5J82k76O7
8169iM7k06O04l59J44q2q6n18K00L41k01K86J94m79J31k7J92l56M91j89l93N4
$$ y = [-411, -176, -224, 111, 26, 574, -86, -23, 63, 102, 288, 290, 482, -49, -234, -277, -321, -96, 332, 237, -183, -70, 80, 147, 162, 199, -23, -345, -558, -594, -316, 96, 678, 228, -83, 229, -282, -594, -309, 167, 241, -45, 91, -33, -81, 84, 488, 483, 422, -176, -924, -574, -33, 120, 42, 162, 202, 200, -228, 303, -97, 115, 318, -449, -214, -237, -315, 102, 199, 132, -492, -178, -369, -564, 37, 83, -116, -255, 27, -124, 346, 245, 209, -101, -549, -144, -357, 118, 413, 343, 99, -311, -87, 57, 42, 414, -41, -408, 64, -141, -420, 313, 609, 301, 325, -9, -373, -457, 63, 18, 200, -76, -9, 38, -168, 436, 77, 221, 139, 53, -465, -265, 76, -125, 161, 355, -124, 7, -20, 172, -184, 307, 118, -275, -221]
8191b21
$$ Imaginary data points
##PAGE= N=2
##DATA TABLE= (X++(I..I)), XYDATA
0@%%%Nj3QqJ6j6K4l2M0m8N6p2Q8j04J23j44J70k02K33k67L08l54M06m65N28n99
29c19O77p61Q55r59J072j196J335j486J648j826K024k244K485k750L046l374L743
46A970m161M635n180N813o561P463q570R965j1792J4294j7948K3811l4718O1696
60D0717k46261m21863N35309M10080j66344k60827J23816J04283j32784j21038
70a34912J03765Q8399k8647j363P1630r5931k12149K6348K94022J18411j51683
81G7890r8097J0373q9796m1048J83076J09769j90114j30990J76324J60238j18864
92D8761j49476N5917J02445n5334r8229M5777J02141k2497o9881L2836L1707o8952
104d4785q27J24757K7912j18909o7930n054k8052P2506J95191L6118j87414r6471
$$ y = [0, 0, 0, 0, 5, -8, 0, -8, 8, -8, 16, -16, 24, -24, 32, -40, 48, -56, 67, -77, 93, -109, 124, -143, 165, -189, 217, -248, 280, -319, 358, -403, 452, -507, 565, -631, 704, -782, 866, -960, 1064, -1180, 1305, -1445, 1601, -1773, 1970, -2191, 2444, -2736, 3077, -3484, 3979, -4591, 5374, -6418, 7876, -10072, 13739, -20979, 40717, -205544, -627407, -92098, 317982, 151638, -109189, 14627, 118910, -13874, -134912, -31147, 57252, 28605, 27242, 98872, 2941, -209208, -182860, 111162, 229573, 77890, -20207, -9834, -99630, -140678, 42398, 152167, -37947, -168937, 7387, 167625, 48761, -100715, -44798, 57647, 2313, -95916, -50139, 52002, 29505, -40376, -7540, 24167, -44785, -45612, 79145, 107057, -11852, -79782, -84836, -112888, -40382, 154809, 190927, 3513, -92958]
116i2958Q6444K817j17056M8970K40680N6479k71781k06443J67280K33677n6774
127I1335j22921R5447O3866j89040j35743J23512J18184j5057M6522P1757j25231
138B2631j91238L9845J88039M2647r9663k8482M3697m8730q3737R2165J66782
149A43956n5551j75508M6342J50412r4493j80179R2142J92732m0272j31422L2309
160a9532P9953l7201m6235M3364J9882p8557n0915Q4393J03197l4752r6851l090
172c6344L8267r874K6340O8661n2634j28075J9725R8897l6336n8555J13037J15204
184A58313r4573j58092j3030O9414K3322J4729O5471K5876j05796j16379M7260
195h3485J29334K0471l5092K9177k5040j45586m4281J42020R0248m0214R579M7437
$$ y = [-92958, -6514, -3697, -120753, -71783, 168897, 225376, -46405, -252848, -85568, 148109, 91335, -31586, 63861, 127727, -61313, -197056, -73544, 44640, 29583, 76105, 147862, 22631, -168607, -128762, 59277, 101924, 2261, -26221, 17476, -31254, -114991, -22826, 143956, 88405, -87103, -40761, 109651, 15158, -165021, -72879, 119853, 79581, -51841, -19532, 60421, 23220, -23015, 20349, 40231, -38326, -89241, -4848, 98349, 63597, -33254, -36344, 1923, -7951, 18389, 87050, 34416, -93659, -73934, 24963, -11373, -69928, 43109, 158313, 63740, -94352, -107382, -37968, -14646, 83, 65554, 91430, -14366, -130745, -83485, 45849, 66320, 31228, 60405, 35365, -110221, -154502, -12482, 77766, 37552, 47131, 94568]
207I4568q7456j34156L1459J35886L5066o1954j9124K6166l9998p3159N4311J45156
219A06765M442j37279l9278O8632k1966o3669P1319R0376n5507o9714M9774M0711
231D4606n3490l2196L8469R864m6321j2058O1750M8171l8100m9397K1964J7617
243A0879m5702Q577R5273J619j21950m3054P2252L2074J91O5914L8414r2961j09409
256h7883j237N6016L9369L7227M1638j1873r5873q8127M2576J18544L5377m3074
268D2680j5393k9059r3231k0800J12958Q3542j7361j0481l901q6276q5793M8703
280g4412J18272L8491n2574n2911q293P562L072L6011N3989k3169q5508q033N9864
293A2361j2790m8626M5769O9954l1599n3220J8348K1590k0162m418R955k7028
$$ y = [94568, 7112, -127044, -95585, 40301, 75367, 13413, -5711, 20455, -19543, -92702, -38391, 106765, 111207, -26072, -65350, 3282, -18684, -82353, -11034, 79342, 23835, -45879, 3895, 44606, -8884, -41080, -2611, 7253, -39068, -51126, 10624, 58795, 20695, -28702, -6738, 10879, -34823, -26246, 69027, 70646, -51304, -94358, -22106, 9968, 10159, 76073, 114487, 21526, -87883, -89120, -33104, 6265, 43492, 85130, 73257, -22616, -110743, -68167, 50377, 85754, 42680, 27287, -1772, -95003, -115803, -2845, 80697, 63336, 52855, 48954, -37322, -123115, -74412, 43860, 82351, 29777, -23134, -31427, -23865, -20793, 15218, 69207, 46038, -39470, -47503, 12361, -429, -49055, -3286, 66668, 35069, -18151, 197, 21787, 1625, -2793, 7162, -19866]
305a9866l3316K7727P8661L9198n7821q8558q600N1553K3515J1359K6971l3423
317A7400q7355o772P4181K7381q445L8441J9608p9093r4107p106O3567P6356M6932
330H0988r166n8126p3039l6080N3013R9149K7147n7495m4801k1964l2218J6754
342e5838Q8445M7556l3810k5930r034n0071m2579L9929P4540K4919k9012m0612
354a1497j6264J1856J3109J6222K7199j4148o5653k1796N4087L0359k2349m564
366c439R787j3278O089L4705j0721n4842j7094K8072J8913K673L791J5603K1346
379D1605j0593n4840l3713K4440L9442L1770K2595l7533q6365j8808P8604O7520
391F4124O550k0738m3951n6190j3456K9806L1927L1915L0002n616l8922m3502
$$ y = [-19866, -53182, -25455, 53206, 92404, 34583, -53975, -62575, -11022, 12493, 23852, 50823, 17400, -69955, -76727, -2546, 24835, 16390, 54831, 74439, -4654, -98761, -105867, -42300, 34056, 80988, 71822, 13696, -59343, -95423, -42410, 56739, 83886, 26391, -18410, -40374, -72592, -55838, 32607, 80163, 46353, 20423, 11389, -38682, -81261, -41332, 33208, 58127, 29115, -11497, -27761, -15905, -2796, 13426, 40625, 26477, -39176, -60972, -6885, 23474, 1125, -3439, 6348, -6930, -841, 33864, 23143, -31699, -48793, -20721, -1808, 865, 4656, 20259, 41605, 31012, -23828, -57541, -33101, 6341, 38111, 60706, 23173, -63192, -82000, -3396, 64124, 70674, 49936, 5985, -50205, -63661, -33855, -1928, 29987, 59989, 54373, 15451, -28051]
403b8051l3551J0845O9803N6541k1526o1996n2178j9698M8888R3527K6602o2473
415B6733m9991q54j692o862J0984J9762K5975K2343j9024m8431j5998K4211K7144
428A4300J8301q762m5691k5534L3880L6466j40m724q580k1641M318L2670o81l8770
442a4588k4170N579K4541L6809J4219k3633j5911K035k0912k7262J2199L2106
454A012K3648J6392j8483o1741l2058M3610O4817L0475j6679o3135o2096j21M3753
467c0606M0169L8020K2139l5698o0582k2140O300J5859M1891M0401j6250n0451
479a0948l4292p249L0859O2129L4952k7440n5097m7472j3972M3027N8164N081
491C7742k4401j831m914k4263L40K2006m02q187N521p896j8309J0806K8530J1028
$$ y = [-28051, -61602, -50757, 19046, 75587, 54061, -7935, -60113, -79811, -30923, 62604, 89206, 26733, -23258, -24112, -25804, -32666, -21682, -1920, 24055, 46398, 27374, -21057, -37055, -12844, 14300, 32601, 23839, -21852, -47386, -13506, 22960, 22820, 18096, 9516, -12125, -7807, 24863, 24182, -14588, -38758, -33179, -8638, 28171, 42390, 18757, 2846, 4881, -16031, -43293, -31094, 1012, 24660, 41052, 22569, -39172, -71230, -27620, 37197, 67672, 50993, -12142, -74238, -74359, -30606, 9563, 47583, 69722, 34024, -26558, -48698, -42398, -26539, 15352, 55753, 39503, -10948, -45240, -52489, -21630, 40499, 75451, 48011, -7086, -54558, -68530, -25503, 32661, 37742, 13341, 11510, 6596, -17667, -17327, 4679, 4277, -3910, 1611, -6285, -24594, -13788, 14742, 25770]
505B5770q920k0932j8762J0575K5308k318j6851q090j3945k461M6781M8107j8026
518D6236m5691k2786j8389p198L8912N1868P231k6592k9574k5499l767K8701M0549
531C4001K5685j2839o2687n7843J1466N2320M0751L4617J1021n9766p7246k811
543f3331M3858K5420J9443J9837k1504n2161k1653K4210M1919K8509n298k9377
555I872k9534k6505m961M3979M8671j0293k8176P805j933l3150K395L9581j048
568A6703l4476k397K1318O117J627R013k07j8169k0873J767L1442J5783k8925
581a277k4547J0269K414j140M1888L8034l9441o2058p068J3185k13K4645M4764
594C9455P880l5466l7601j6802R913L2611L6382J5786l1959p0996l3609N1547
$$ y = [25770, 16850, -4082, -22844, -12269, 13039, 10721, -6130, -14220, -28165, -30626, 16155, 64262, 46236, 545, -22241, -40630, -47828, -8916, 42952, 50183, 23591, -5983, -31482, -35249, -6548, 34001, 59686, 46847, -15840, -73683, -62217, -9897, 30854, 65471, 76492, 16726, -60520, -63331, -19473, 5947, 25390, 45227, 23723, -28438, -50091, -25881, 16038, 44547, 39249, 9872, -19662, -46167, -51128, -7149, 41522, 31229, 3053, 10858, 8925, -24225, -21830, 17751, 16703, -17773, -20170, 1148, 7265, 8892, 17905, 17698, -471, -21344, -19577, 11865, 27648, -1277, -25824, -15555, -13141, -14281, 27607, 65641, 26200, -35858, -42926, -29741, -29954, -5309, 39455, 47335, 11869, -25732, -42534, -32621, -10, 36372, 52158, 20199, -50797, -84406, -32859]
606c2859O4968J0072m160K551m1494n8383P170M6561J4471O361K4017q913n2743
619b2381k7003L1606M4199J2754j7326k0502j8328k6190j708N5848M6455l3984
631B3440m3398K3649K1056l8780j9819L1525Q065k2834J2884L0230j2211k8283
643a4476R788K5804j0427l7733l210M4712K1164l7984k6790K0231P919q301L7945
656B8642M1009m6060p4721j263L5844J1256J8051L7216j269m8337l3154O793J9580
669f413P941J1856K5688k280o0753m9509L4837O6666K2274o37q002n8040o4033
682h0405K3837P2054J5044j9098R864K881l7959k5428K3505L2526J870j2735o18
695E338m955l4624j6188N4407N8663k5754n3780N428J3763k4522L617M3295j1196
$$ y = [-32859, 32109, 42181, 38021, 40572, -922, -59305, -52135, -5574, 8897, 15258, 39275, 30362, -22381, -49384, -17778, 26421, 39175, 21849, 1347, -16981, -43171, -44879, 10969, 57424, 23440, -19958, 3691, 24747, -14033, -33852, -2327, 5738, -17096, -4212, 26018, 13807, -14476, -4688, 21116, 10689, -27044, -30254, 14458, 35622, -2362, -29152, -8921, -1002, -9303, 28642, 69651, 23591, -51130, -52393, -16549, -5293, 12758, 49974, 48705, 368, -32786, -25993, -6413, 1528, 13384, 39072, 36792, -23961, -73470, -38633, 28033, 50307, 49670, 41668, -16372, -80405, -56568, 15486, 30530, 11432, 21296, 24177, -13782, -39210, -15705, 16821, 18691, 5956, 5338, 383, -34241, -50429, 3978, 62641, 36887, -16893, -11465, 2298, -22224, -18607, 24688, 13492]
708A3492n3105J3684O6463Q714n0848k3663J9574O819j9188J589L2617Q301l3323
721h874q819K5952j1314l0303M0167O3400l6669q8191j3522M0520K1558K7012
733B0917M2238j0579p2747m5536K7454M6168R812r099Q188M80m1131l0668L7237
746a7266M9728J752m994M880m8575o9422K3332Q9143K9159l2322j7106p638k6479
759b5808m730L8951K7831k3467l3952M599K0940j0863j5395L5144L6644l3578
771A6316m5721J8702K1027l0288l297M8117m16n5964J213O1100J6341m1115k3112
784a7097N890q005j2154K9385M9648p977o2220j6202M5804J3477k8120J8502L7282
797D8213m0783o6699J5978N2398M699K761L6823l978p2166m8038L3490N6970J4907
$$ y = [13492, -39613, -25929, 40534, 49248, -1600, -25263, -5689, 1130, -18058, -16469, 16148, 24449, -8874, -17693, 8259, -3055, -33358, 6809, 70209, 33540, -54651, -68173, -27653, -6095, 20917, 63155, 52576, -20171, -65707, -38253, 7915, 17727, 8628, 16816, 17296, -23835, -54503, -17266, 32462, 34214, 29220, 34100, -14475, -83897, -60565, 28578, 57737, 25415, 8309, 671, -25808, -30538, 8413, 36244, 12777, -21175, -16576, 4364, -6499, -21894, 13250, 49894, 16316, -29405, -10703, 10324, -19964, -23261, 24856, 24440, -31524, -30311, 30789, 47130, 6015, -17097, -11207, -19212, -31366, -1981, 47667, 39690, -22530, -38732, 7072, 20549, -7571, 10931, 48213, 7430, -59269, -43291, 9107, 13806, 16567, 53390, 49412, -22754, -70792, -37302, 19668, 34575]
810C4575j3901o505j4999l9669o132O2233M5413l4741l7248J0224j2608m3566
822e6924J8464P0546J7085l4377j1165n05k8081j3214L7047L6827j6628m0042
834b0967m495K5658M964j0759J8677K0260l2072l4078K7592K4713l4582j5987
846c1076M1444J4028l5585K213M0617m079m3979j2743J8589K000r046K1447L5619
859C9449j1089n3583j4407M0053J5439j8618J4833K2899m6896n6980L1075O1342
871B3517L455r904J9766j2442o2854k8427M3631M7872J451j3971L324p918l9996
884c2496j2796N4324M5278k8252l6819O296j0747l6183K3871P0924J0892m4468
896I824j4888P057j9278j5217K7648L0992r759k8152N62K1164l270j8018J5175
$$ y = [34575, 20674, 14169, -830, -40499, -46631, 15602, 61015, 26274, -10974, -750, -13358, -56924, -38460, 32086, 49171, 14794, 3629, 3124, -24957, -38171, -1124, 35703, 19075, -20967, -25462, 196, 5160, -5599, 13078, 33338, 1266, -32812, -5220, 19493, -15089, -31076, 10368, 24396, -11189, -8976, 31641, 27562, -16417, -29160, -10571, -8571, -17617, 3830, 39449, 28360, -25223, -39630, 423, 15862, -2756, 12077, 34976, -11920, -68900, -37825, 23517, 26972, 17068, 36834, 24392, -38462, -66889, -23258, 24614, 26065, 12094, 15418, 7500, -32496, -45292, 9032, 54310, 26058, -10761, -4465, -15212, -51395, -27524, 43400, 54292, 9824, -5064, 1993, -17285, -32502, -4854, 26138, 16379, -11773, -11211, 9953, 6683, -11335, 3840]
909C840K6077k4404l7982J9412L0130k0926j7337L1086J1840k9734O49L5412j940
922B6123l9911j7031J4066Q922M804K1914K3203j6997m8691j3903L5030J8859
934A6388j3470R312J8107l6808m6672K5436N1633M080p595J6266j6918o2177k5888
947f8306M4278N3201J1663j6850j6480j9010k4096N143M8459K8750l4774l4449
$$ y = [3840, 29917, 5513, -32469, -13057, 17073, -3853, -21190, 9896, 21736, -7998, -7349, 28063, 26123, -13788, -30819, -16753, -7831, -3027, 18887, 42090, 25093, -23598, -37501, -2471, 16388, 2918, 12230, 30337, -6471, -53143, -27707, 23926, 28006, 20411, 36677, 19759, -42418, -68306, -24028, 29173, 40836, 23986, 7506, -11504, -35600, -30457, 18002, 46752, 11978, -22471]
$$ [...]
8191D4
##END NTUPLES=NMR FID
##END=
