##TITLE=1H_CA-8571
 DMSO, 8 sc, 
 14.3.2019
##JCAMPDX= 6.0         $$ Bruker NMR JCAMP-DX V2.0
##DATA TYPE= NMR FID
##DATA CLASS= NTUPLES
##ORIGIN= UXNMR, Bruker Analytische Messtechnik GmbH
##OWNER= root
$$ XWIN-NMR		Version 3.5
$$ Thu Mar 14 14:01:57 2019 Russian Standard Time (UT+4h)  she@DPX200
##.OBSERVE FREQUENCY= 200.1315
##.OBSERVE NUCLEUS= ^1H
##.DELAY= (6, 6)
##.ACQUISITION MODE= SIMULTANEOUS
##.ACQUISITION SCHEME= undefined
##.AVERAGES= 8
##.DIGITISER RES= 18
##SPECTROMETER/DATA SYSTEM= spect
##.PULSE SEQUENCE= zg30
##.SOLVENT NAME= DMSO
##.SHIFT REFERENCE= (INTERNAL, DMSO, 0, 15.7039)
##AUDIT TRAIL= $$ (NUMBER, WHEN, WHO, WHERE, WHAT)
$$ ##TITLE= Audit trail, XWIN-NMR		Version 3.5
$$ ##JCAMPDX= 5.01
$$ ##ORIGIN= Bruker BioSpin GmbH
$$ ##OWNER= she
$$ F:/spectra/data/she/nmr/H-F/1/audita.txt
$$ ##AUDIT TRAIL=  $$ (NUMBER, WHEN, WHO, WHERE, WHAT)
(   1,<2019-03-14 14:00:23.87 +0400>,<she>,<DPX200>,
      <created by zg, POWCHK disabled, PULCHK disabled
       configuration hash MD5:
       00 E9 B6 7A A2 85 ED C7 34 08 36 98 17 FE 4E 26
       data hash MD5: 16K
       96 7D 6A A1 BE 86 2A 64 C3 01 07 20 B2 C3 28 69>)
$$ ##END=
$$ 
$$ hash MD5
$$ 20 83 5B AF 68 C4 16 C4 8C EA B7 24 4A CA 67 45
##$RELAX= 
##$RELAX= 
##$RELAX= 
##$RELAX= 
##$RELAX= 
##$RELAX= 
$$ Bruker specific parameters
$$ --------------------------
##$DU= <F:/spectra>
##$EXPNO= 1
##$NAME= <H-F>
##$PROCNO= 1
##$TYPE= <nmr>
##$USER= <she>
##$AMP= (0..31)
100 100 100 100 100 100 100 100 100 100 100 100 100 100 100 100 100 100 
100 100 100 100 100 100 100 100 100 100 100 100 100 100 
##$AQSEQ= 0
##$AQ_mod= 1
##$AUNM= <au_zg>
##$AUTOPOS= <>
##$BF1= 200.13
##$BF2= 200.13
##$BF3= 200.13
##$BF4= 200.13
##$BF5= 200.13
##$BF6= 200.13
##$BF7= 200.13
##$BF8= 200.13
##$BYTORDA= 1
##$CFDGTYP= 0
##$CFRGTYP= 5
##$CHEMSTR= <none>
##$CNST= (0..31)
1 1 145 1 1 1 1 1 1 1 1 1 1 1 1 1 1 1 1 1 1 1 1 1 1 1 1 1 1 1 1 1 
##$CPDPRG= <>
##$CPDPRG1= <>
##$CPDPRG2= <>
##$CPDPRG3= <>
##$CPDPRG4= <mlev>
##$CPDPRG5= <mlev>
##$CPDPRG6= <mlev>
##$CPDPRG7= <mlev>
##$CPDPRG8= <mlev>
##$CPDPRGB= <>
##$CPDPRGT= <>
##$D= (0..31)
0 1.2 0 0 0 0 0 0 0 0 0 0.03 0 0 0 0 0 0 0 0 0 0 0 0 0 0 0 0 0 0 0 0 
##$DATE= 1552557623
##$DBL= (0..7)
120 120 120 120 120 120 120 120 
##$DBP= (0..7)
150 150 150 150 150 150 150 150 
##$DBP07= 0
##$DBPNAM0= <>
##$DBPNAM1= <>
##$DBPNAM2= <>
##$DBPNAM3= <>
##$DBPNAM4= <>
##$DBPNAM5= <>
##$DBPNAM6= <>
##$DBPNAM7= <>
##$DBPOAL= (0..7)
0.5 0.5 0.5 0.5 0.5 0.5 0.5 0.5 
##$DBPOFFS= (0..7)
0 0 0 0 0 0 0 0 
##$DE= 6
##$DECBNUC= <off>
##$DECIM= 24
##$DECNUC= <off>
##$DECSTAT= 4
##$DIGMOD= 1
##$DIGTYP= 9
##$DL= (0..7)
0 120 120 120 120 120 120 120 
##$DP= (0..7)
150 150 150 150 150 150 150 150 
##$DP07= 0
##$DPNAME0= <>
##$DPNAME1= <>
##$DPNAME2= <>
##$DPNAME3= <>
##$DPNAME4= <>
##$DPNAME5= <>
##$DPNAME6= <>
##$DPNAME7= <>
##$DPOAL= (0..7)
0.5 0.5 0.5 0.5 0.5 0.5 0.5 0.5 
##$DPOFFS= (0..7)
0 0 0 0 0 0 0 0 
##$DQDMODE= 0
##$DR= 18
##$DS= 0
##$DSLIST= <SSSSSSSSSSSSSSS>
##$DSPFIRM= 0
$$ [...]
##$SUBNAM2= <"">
##$SUBNAM3= <"">
##$SUBNAM4= <"">
##$SUBNAM5= <"">
##$SUBNAM6= <"">
##$SUBNAM7= <"">
##$SUBNAM8= <"">
##$SUBNAM9= <"">
##$SW= 24.9337058887773
##$SWIBOX= (0..15)
0 0 2 0 0 0 0 0 0 0 0 0 0 0 0 0 
##$SW_h= 4990.01996007984
##$TD= 16384
##$TD0= 1
##$TE= 0
##$TE2= 300
##$TE3= 300
##$TEG= 300
##$TL= (0..7)
0 120 120 120 120 120 120 120 
##$TP= (0..7)
150 150 150 150 150 150 150 150 
##$TP07= 0
##$TPNAME0= <>
##$TPNAME1= <>
##$TPNAME2= <>
##$TPNAME3= <>
##$TPNAME4= <>
##$TPNAME5= <>
##$TPNAME6= <>
##$TPNAME7= <>
##$TPOAL= (0..7)
0.5 0.5 0.5 0.5 0.5 0.5 0.5 0.5 
##$TPOFFS= (0..7)
0 0 0 0 0 0 0 0 
##$TUNHIN= 0
##$TUNHOUT= 0
##$TUNXOUT= 0
##$USERA1= <user>
##$USERA2= <user>
##$USERA3= <user>
##$USERA4= <user>
##$USERA5= <user>
##$V9= 5
##$VALIST= <valist>
##$VCLIST= <CCCCCCCCCCCCCCC>
##$VD= 0
##$VDLIST= <DDDDDDDDDDDDDDD>
##$VPLIST= <PPPPPPPPPPPPPPP>
##$VTLIST= <TTTTTTTTTTTTTTT>
##$WBST= 1024
##$WBSW= 4
##$XGAIN= (0..3)
0 0 0 0 
##$XL= 0
##$YL= 0
##$YMAX_a= 151757
##$YMIN_a= -81603
##$ZGOPTNS= <>
##$ZL1= 120
##$ZL2= 120
##$ZL3= 120
##$ZL4= 120
##$ABSF1= 10
##$ABSF2= 0
##$ABSG= 5
##$ABSL= 3
##$ALPHA= 0
##$AQORDER= 0
##$ASSFAC= 0
##$ASSFACI= 0
##$ASSFACX= 0
##$ASSWID= 0
##$AUNMP= <proc_1d>
##$AZFE= 0.1
##$AZFW= 0.1
##$BCFW= 1
##$BC_mod= 2
##$BYTORDP= 1
##$COROFFS= 0
##$CY= 11.3945322036743
##$DATMOD= 1
##$DC= 2
##$DFILT= <>
##$DTYPP= 0
##$F1P= 18.9103706918063
##$F2P= -1.10871071338519
##$FCOR= 0.5
##$FTSIZE= 0
##$FT_mod= 4
##$GAMMA= 1
##$GB= 0.15
##$INTBC= 1
##$INTSCL= 1
##$ISEN= 128
##$LB= 0.24
##$LEV0= 0
##$LPBIN= 0
##$MAXI= 10000
##$MC2= 0
##$MEAN= 0
##$ME_mod= 0
##$MI= 1.114404
##$NCOEF= 0
##$NC_proc= 0
##$NLEV= 6
##$NOISF1= 3.799351
##$NOISF2= 2.8
##$NSP= 1
##$NTH_PI= 0
##$NZP= 0
##$OFFSET= 15.70392
##$PC= 1
##$PHC0= -9385.747
##$PHC1= 23.60026
##$PH_mod= 1
##$PKNL= yes
##$PPARMOD= 0
##$PSCAL= 0
##$PSIGN= 0
##$REVERSE= no
##$SF= 200.130013532006
##$SI= 16384
##$SIGF1= 3
##$SIGF2= 2
##$SINO= 400
##$SIOLD= 16384
##$SREGLST= <1H.CDCl3>
##$SSB= 0
##$STSI= 0
##$STSR= 0
##$SW_p= 3612.71676300578
##$SYMM= 0
##$S_DEV= 0
##$TDeff= 0
##$TDoff= 0
##$TI= <>
##$TILT= no
##$TM1= 0
##$TM2= 0
##$TOPLEV= 0
##$USERP1= <user>
##$USERP2= <user>
##$USERP3= <user>
##$USERP4= <user>
##$USERP5= <user>
##$WDW= 1
##$XDIM= 8192
##$YMAX_p= 0
##$YMIN_p= 0
$$ End of Bruker specific parameters
$$ ---------------------------------
##NTUPLES= NMR FID
##VAR_NAME=  TIME,          FID/REAL,        FID/IMAG
##SYMBOL=    X,             R,               I
##VAR_TYPE=  INDEPENDENT,   DEPENDENT,       DEPENDENT
##VAR_FORM=  AFFN,          ASDF,            ASDF
##VAR_DIM=   8192,          8192,            8192
##UNITS=     SECONDS,       ARBITRARY UNITS, ARBITRARY UNITS
##FACTOR=    0.0002004,     1,               1
##FIRST=     0,             0,               0
##LAST=      1.6414764,     0,               0
##MIN=       0,             -81603,          0
##MAX=       1.6414764,     151757,          0
$$ Real data points
##PAGE= N=1
##DATA TABLE= (X++(R..R)), XYDATA
$$ plain form
0 0 0 0 0 0 0 0 0 8 -8 8 -8 8 -16 16 -16 24 -32 32 -40 48 -56 64 -74 88 -99 113 -129 147 -168 189 -214
31 -214 241 -268 301 -336 374 -416 463 -513 569 -631 698 -771 856 -946 1050 -1168 1299 -1453
49 -1453 1629 -1841 2090 -2398 2784 -3290 3981 -4986 6593 -9576 17000 -74776 -69346 114664
63 114664 72869 -36648 -78045 -29933 -21298 -6968 27393 35812 -25779 -56359 -26072 8006
75 8006 4361 16247 24899 -13758 -62150 -28671 42631 52079 908 -27427 -25570 -16403 14740
88 14740 59686 40469 -39118 -61780 15452 72025 31307 -25057 -14393 17529 16335 8521 19505
101 19505 18835 270 -1977 15025 20497 14246 13096 6617 -7890 1620 34776 38069 -1500 -27637
115 -27637 -9297 19937 34877 35013 6090 -43203 -44080 27254 75352 24943 -46693 -39170 8468
$$ packed form
0@%%%%%%%Qj6J6j6J6k4L2l2M0n6O4p2Q8j04J20j38J62j87K12k42K76l15L57m03
31b14M55n09N69o37P10p90Q79r76J082j200J329j469J627j802J996k218K467k752
49a453L082l470L931m488N182o074P271q967J1579j6169K6576r1776N430J84010
63A14664m1795j09517m1397M8112Q635J4330L4361Q419o1591l0580L0287L4078
75H006l645J1886Q652l8657m8392L3479P1302R448n1171k8335J857R167L1143
88A4740M4946j9217p9587k2662P7232N6573m0718n6364J0664L1922j194p814J0984
101A9505o70j8565k247J7002N472o251j150o479j4507R510L3156L293l9569k6137
115b7637J8340K9234J4940J36k8923m9293q77P1334M8098n0409p1636P523M7638
$$ plain form
128 8468 14499 1931 18811 23635 -22912 -57019 -19883 35086 37896 3761 -27981 -49801 -40539
141 -40539 17586 63011 21366 -59588 -70383 -11147 29059 24734 9740 -17552 -57852 -51730
153 -51730 18056 57845 7925 -50128 -36492 -1732 -6663 -9159 22961 26745 -28089 -60733 -17389
166 -17389 35687 31970 -1694 -22642 -29867 -19246 18816 42750 9206 -37716 -28044 17344 28765
179 28765 6490 -4400 -2427 -6359 -78 22176 22974 -5994 -16229 8941 22296 6789 1418
192 1418 14739 8555 -12417 -2431 30368 30639 -3535 -19397 -2937 16018 24644 25285 5371 -26441
206 -26441 -24396 20108 48134 22170 -17523 -26303 -11615 8354 30738 34009 -2315 -40749 -28823
219 -28823 14616 31149 15643 541 -13360 -32885 -26343 18833 46226 13418 -35897 -42858
$$ packed form
128H468O031j2568J6880M824m6547l4107L7136N4969K810l4135l1742k1820R262
141d0539N8125M5425m1645q0954j0795N9236M0206m325j4994k7292m0300O122
153e1730O9786L9789m9920n8053J3636L4760m931k496L2120L784n4834l2644M3344
166a7389N3076l717l3664k0948p225J0621L8062K3934l3544m6922R672M5388J1421
179B8765k2275j0890J973l932O281K2254P98k8968j0235K5170J3355j5507n371
192A418J3321o184k0972R986L2799K71l4174j5862J6460J8955Q626O41j9914l1812
206b6441K045M4504K8026k5964l9693q780J4688J9969K2384L271l6324l8434J1926
219b8823M3439J6533j5506j5102j3901j9525O542M5176K7393l2808m9315o961
$$ plain form
231 -42858 -14672 12277 27550 21935 -16038 -52849 -35253 19559 38946 6283 -26288 -29595
243 -29595 -20852 -6359 17903 24719 -6619 -38483 -28092 3834 14746 8604 2157 -12503 -30347
256 -30347 -18937 18316 29087 -2399 -26985 -15462 3324 7127 8301 7740 -7429 -19373 -2210
269 -2210 21390 13473 -10852 -11439 5622 10020 4565 6738 5789 -6833 -8898 11003 23606 9856
283 9856 -7185 -7667 -1391 6293 20531 25800 1737 -27035 -17273 20918 37103 16996 -9707
296 -9707 -20796 -13766 9628 34077 28196 -8367 -31161 -14441 14286 23318 16917 5292 -13734
309 -13734 -27613 -12002 22500 33575 8775 -21088 -29542 -16054 10396 32335 22726 -17690
321 -17690 -44136 -22791 18011 31345 10859 -16253 -30090 -22653 3326 24775 15235 -14451
$$ packed form
231d2858K8186K6949J5273n615l7973l6811J7596N4812J9387l2663l2571l307
243b9595Q743J4493K4262O816l1338l1864J0391L1926J0912o142o447j4660j7844
256c0347J1410L7253J0771l1486k4586J1523J8786L803J174n61j5169j1944J7163
269b210K3600p917k4325n87J7061M398n455K173r49j2622k065J9901J2603j3750
283I856j7041m82O276P684J4238N269k4063k8772R762L8191J6185k0107k6703
296i707j1089P030K3394K4449n881l6563k2794J6720K8727R032o401j1625j9026
309a3734j3879J5611L4502J1075k4800k9863q454J3488K6450K1939r609m0416
321a7690k6446K1345M0802J3334k0486k7112j3837P437K5979K1449r540k9686
$$ plain form
333 -14451 -27067 -13800 1028 5511 7869 5009 -11585 -25634 -13315 11958 17431 -212 -16076
346 -16076 -16480 -6733 6238 13272 3392 -14912 -17173 1516 14396 6231 -7574 -9655 -3376 3949
360 3949 9797 7486 -5594 -13391 -2252 13866 13254 647 -5740 -4909 -2827 4428 16850 16858 -2861
375 -2861 -19452 -10409 13384 25810 16725 -4413 -20504 -15173 11253 31869 21404 -8287 -23280
388 -23280 -11533 9667 22045 20311 4115 -16873 -21890 -2615 21784 25906 7900 -14554 -24097
401 -24097 -12798 13599 30836 17153 -16113 -32389 -14457 15142 26158 12028 -11505 -24920
413 -24920 -17037 5721 20870 12700 -8724 -20564 -14121 45 10019 9772 189 -12431 -16929 -7813
427 -7813 6566 12142 3308 -11620 -17620 -7879 8370 12496 -669 -15073 -13177 1923 10580 3690
$$ packed form
333a4451j2616J3267J4828M483K358k860j6594j4049J2319K5273N473j7643j5864
346a6076m04R747J2971P034r880j8304k261J8689J2880q165j3805k081O279P325
360C949N848k311j3080p797J1139J6118o12j2607o387Q31K082P255J2422Qj9719
375b861j6591R043K3793J2426r085k1138j6091N331K6426K0616j0465k9691j4993
388b3280J1747K1200J2378j734j6196k0988n017J9275K4399M122j8006k2454r543
401b4097J1299K6397J7237j3683l3266j6276J7932K9599J1016j4130k3533j3415
413b4920P883K2758J5149q170k1424j1840O443J4166R974k47r583j2620m498R116
427g813J4379N576q834j4928o000R741J6249M126j3165j4404J896J5100Q657o890
$$ plain form
441 3690 -8289 -10830 -2537 5801 5950 -601 -6521 -6799 -1640 5076 7900 3687 -5113 -10292 -4928
456 -4928 7376 14684 8399 -6326 -14987 -7984 9354 20488 13319 -6114 -19135 -11787 9452
469 9452 24464 17598 -5011 -21032 -14089 8565 23768 18136 -1061 -16220 -15567 -39 17946
482 17946 22348 7464 -13389 -20438 -7027 14077 24481 13506 -10401 -24930 -13427 13190
494 13190 25937 12075 -11316 -20620 -10680 6288 16813 12419 -3781 -16888 -13556 1342 11832
507 11832 9663 -225 -9906 -13790 -6024 7781 12476 1219 -12294 -12463 -1999 5784 5638 -359
521 -359 -7789 -9908 -2342 7051 4972 -6067 -10327 -2996 4357 4183 -548 -5277 -7808 -4117 5158
536 5158 8902 576 -9383 -9318 -1212 5816 8635 5688 -4872 -14429 -8745 8932 18037 8220 -8180
$$ packed form
441C690j1979k541Q293Q338J49o551n920k78N159O716K824m213q800n179N364
456d928J2304P308o285j4725q661P003J7338J1134p169j9433j3021P348K1239
469I452J5012o866k2609j6021O943K2654J5203n632j9197j5159O53J5528J7985
482A7946M402j4884k0853p049J3411K1104J0404j0975k3907j4529J1503K6617
494A3190J2747j3862k3391r304R940J6968J0525m394j6200j3107L332J4898J0490
507A1832k169r888r681l884P766J3805M695j1257j3513j69J0464P783j46n997
521c59p430k119P566R393k079j1039m260P331P353j74m731m729k531L691R275
536E158L744q326r959O5Q106P028K819k947j0560r557N684J7677R105r817j6400
$$ plain form
551 -8180 -15603 -9449 6219 19957 16097 -5458 -21310 -12545 9275 20025 13415 -576 -13094
564 -13094 -15764 -1939 18270 21696 3840 -14383 -15622 -3613 10937 19790 13512 -8164 -22695
577 -22695 -10393 14255 21899 7992 -7994 -13790 -9925 3020 17085 14961 -4442 -17403 -9463
590 -9463 5460 10139 7093 2205 -6763 -13459 -5294 10536 12103 -1353 -9866 -6351 -1451 1109
604 1109 5450 5057 -5600 -11986 -1978 9171 3841 -7977 -7501 708 2945 1193 250 -3778 -9321
619 -9321 -4238 8078 8913 -3598 -10570 -5556 -119 2099 6402 7196 -4756 -16208 -8634 9528
633 9528 14769 4326 -7140 -12338 -9657 3228 17394 13605 -7210 -19258 -9190 7919 14487
646 14487 10859 500 -13104 -16482 -180 18945 17540 -719 -13345 -12402 -3430 9281 18921
$$ packed form
551h180p423O154J5668J3738l860k1555j5852Q765K1820J0750o610j3991j2518
564a3094k670J3825K0209L426j7856j8223j239J2009J4550Q853o278k1676j4531
577b2695J2302K4648P644j3907j5986n796L865J2945J4065k124j9403j2961P940
590i463J4923M679l046m888q968o696Q165J5830J567j3456q513L515M900K560
604A109M341l93j0657o386J0008J1149n330j1818M76Q209K237j752r43m028n543
619i321N083J2316Q35j2511o972N014N437K218M303P94j1952j1452P574J8162
633I528N241j0443j1466n198K681J2885J4166l789k0815j2048J0068J7109O568
646A4487l628j0359j3604l378J6302J9125j405j8259j2626R43Q972J2711R640
$$ plain form
659 18921 11653 -9746 -20326 -7146 11934 16780 8850 -2873 -13523 -13063 3676 19132 12429
672 12429 -6533 -12498 -4013 2685 5051 8352 5749 -7002 -12865 -842 11495 7153 -2878 -4547
686 -4547 -3299 -3619 1913 9599 3723 -10087 -9235 4762 8357 -1355 -5746 -799 -204 -2686 1767
701 1767 5305 -3322 -10850 -1828 9694 4676 -6061 -6523 -2094 -2464 650 9225 6273 -10036 -16046
716 -16046 -2337 10775 9180 1846 -4308 -11590 -12452 3144 18980 11848 -9886 -17728 -6755 5115
730 5115 10646 10983 1713 -13567 -15892 889 15921 11917 -916 -8645 -10734 -6009 8005 18443
744 18443 8290 -12020 -16698 -2587 10581 12441 7321 -2751 -13641 -10982 6491 17349 8245
757 8245 -5882 -8915 -4993 -511 6989 12420 3850 -10295 -10028 2776 8306 3526 951 52 -4723
$$ packed form
659A8921p268k1399j0580J3180J9080M846p930j1723j0650M60J6739J5456o703
672A2429j8962n965Q485O698K366L301k603j2751n863J2023J2337m342j0031j669
686d547J248l20N532P686n876j3810Q52J3997L595r712m391M947N95k482M453
701A767L538q627p528R022J1522n018j0737m62M429l70L114Q575k952j6309o010
716a6046J3709J3112j595p334o154p282q62J5596J5836p132k1734p842J0973J1870
730E115N531L37r270j5280k325J6781J5032m004j2833p729k089M725J4014J0438
744A8443j0153k0310m678J4111J3168J860n120j0072j0890K659J7473J0858r104
757H245j4127l033L922M482P500N431q570j4145K67J2804N530m780k575q99m775
$$ plain form
772 -4723 -5648 4037 9808 124 -8782 -2131 6250 2396 -3103 -624 408 -3860 -828 7516 4227
787 4227 -8581 -8875 3304 7600 501 -2441 -700 -4763 -7161 3503 12536 2553 -12378 -10059
801 -10059 2009 5885 4433 3998 -2218 -13780 -10849 8507 17257 3499 -11258 -10908 -4444 1076
815 1076 9480 13366 -52 -17637 -14622 4676 14547 8363 -245 -7154 -12794 -7649 9795 18169
829 18169 4571 -12611 -12327 -1569 5726 9176 8625 -1679 -13671 -9371 6951 13547 4728 -4082
843 -4082 -5777 -5221 -1446 8013 11180 159 -10243 -6153 3812 6039 3612 2056 -1736 -6639 -2803
858 -2803 6752 6998 -2057 -4735 555 1938 -666 929 3010 -1781 -4577 2345 6928 -599 -7535
873 -7535 -2487 4154 3099 866 1716 -2382 -9142 -3912 9503 10421 -2750 -10104 -5138 -41 2295
$$ packed form
772d723r25R685N771r684q906O651Q381l854n499K479J032m268L032Q344l289
787D227j2808k94J2179M296p099k942J741m063k398J0664R033r983j4931K319
801a0059J2068L876j452m35o216j1562K931J9356Q750j3758j4757L50O464N520
815A076Q404L886j3418j7585L015J9298R871o184q608o909n640N145J7444Q374
829A8169j3598j7182K84J0758P295L450n51j0304j1992M300J6322O596q819q810
843d082j695N56L775R459L167j1021j0402M090R965K227k427j556l792m903L836
858b803R555K46r055k678N290J383k604J595K081m791k796O922M583p527o936
873g535N048O641j055k233Q50m098o760N230J3415R18j3171p354M966N097K336
$$ plain form
888 2295 7386 7368 -5437 -15653 -6036 9886 10871 801 -4890 -6995 -8668 -1660 12410 13145 -4583
903 -4583 -16946 -8232 5283 8673 6386 2351 -7232 -14732 -4974 12510 14232 -730 -10685 -8133
917 -8133 -2938 2714 10147 9707 -4162 -14734 -6986 7160 10166 3965 -1231 -5586 -8115 -1711 9696
932 9696 9730 -2154 -8678 -3191 2656 3057 3222 2993 -1994 -5742 -773 5725 3774 -1880 -1824 672 143
949 143 307 3082 1672 -3443 -2835 4023 5095 -1345 -4360 -1075 1512 1911 3732 2452 -4717 -8037
965 -8037 327 9119 5843 -3164 -5981 -3973 -1803 3392 9027 4478 -7821 -11747 -1894 7626 7667
980 7667 2777 -2671 -9214 -9482 2230 13749 8619 -6345 -12194 -6089 1821 7133 8983 2315 -10312
995 -10312 -13081 -482 11138 8998 -744 -6256 -7725 -5516 3336 11567 7070 -6634 -11775 -3839
$$ packed form
888B295N091j8j2805j0216R617J5922R85j0070n691k105j673P008J4070P35j7728
903d583j2363Q714J3515L390k287m035r583p500R758J7484J722j4962r955K552
917h133N195N652P433m40j3869j0572P748J4146L006o201n196m355k529O404J1407
932I696L4j1884o524N487N847M01J65k29m987l748M969O498j951n654N6K496n29
949A43J64K775j410n115O08O858J072o440l015L285K587L99J821j280p169l320
965h037Q364Q792l276r007k817K008K170N195N635m549j2299l926R853R520M1
980G667m890n448o543k68J1712J1519n130j4964n849O105P910N312J850o668j2627
995a0312k769J2599J1620k140r742n512j469K209Q852Q231m497j3704n141P936
$$ plain form
1009 -3839 4999 7159 4965 -346 -7723 -8427 1480 9651 5661 -3226 -5347 -2614 -330 2403 5236
1024 5236 2641 -4228 -5156 982 4205 1294 -688 261 -461 -1756 1042 3525 181 -3837 -687 4503
1040 4503 2801 -1976 -2723 -658 320 2618 4692 1170 -5980 -5927 2419 7404 3968 -1751 -4063 -4733
1056 -4733 -2258 4919 8997 2497 -7603 -8351 -846 5551 6935 4168 -2757 -9867 -7790 4312 11929
1071 11929 5886 -5200 -9773 -6176 1026 8191 9078 80 -10517 -9789 596 8348 7271 1145
1085 1145 -5348 -9171 -5071 5221 10388 3993 -6088 -8669 -3740 2659 6636 5739 -1242 -8250 -6572
1100 -6572 2254 7059 3909 -1507 -3905 -3746 -1088 3511 4848 605 -4010 -2883 795 2081 1196
1115 1196 661 -198 -1786 -677 2222 2100 -1486 -2287 996 2960 1265 -1091 -1709 -1675 274 3539 4162
$$ packed form
1009c839Q838K160k194n311p377p04R907Q171l990q887k121K733K284K733K833
1024E236k595o869r28O138L223k911j982R49p22j295K798K483l344m018L150N190
1040D503j702m777p47K065R78K298K074l522p150N3Q346M985l436n719k312o70
1056d733K475P177M078o500j0100p48P505O397J384k767o925p110K077J2102P617
1071A1929o043j1086m573L597P202P165Q87q998j0597P28J0385P752j077o126
1085A145o493l823M100J0292N167o395j0081k581M929O399L977q97o981p008J678
1100f572Q826M805l150n416k398J59K658M599J337m243m615J127L678J286q85
1115A196n35q59j588J109K899j22l586q01L283J964j695k356o18L4J949L265O23
$$ plain form
1132 4162 -560 -5357 -3630 2285 5409 3542 -496 -4452 -5272 -832 6044 7195 904 -6146 -6623
1147 -6623 -1383 4675 7493 4021 -4177 -9302 -4788 4887 9331 4788 -3615 -8324 -6327 1245 8558
1162 8558 7571 -989 -8660 -7641 133 6788 7348 1686 -5981 -8717 -3141 5414 8158 2813 -4480
1177 -4480 -7347 -4200 2282 6822 4711 -2224 -7046 -4752 1651 5223 3493 -617 -3988 -4165 -455
1192 -455 3580 3628 -42 -2969 -2507 -35 1625 1561 407 -1130 -1443 45 1339 672 -983 -1092 572
1209 572 1845 1007 -743 -2091 -1435 1065 3372 2703 -1065 -4196 -2988 1683 4963 3826 -786 -4682
1225 -4682 -4388 139 5095 5968 932 -5370 -6412 -1207 5297 6940 2298 -4187 -7165 -3593 3754
1240 3754 8149 4855 -3199 -8006 -5195 2303 7491 6034 -841 -7304 -7089 23 7055 7165 355
$$ packed form
1132D162m722m797J727N915L124j867m038l956q20M440O876J151o291p050m77
1147f623N240O058K818l472q198n125M514R675M444m543q403m709J997P572P313
1162H558r87q560p671J019P774O655N60n662p667k736N576Q555K744n345p293
1177d480k867L147O482M540k111o935m822K294O403L572j730m110l371j77L710
1192d55M035M8l670k927M62K472J660o4j154j537l13J488J294o67j655j09J664
1209E72J273q38j750j348O56K500K307o69l768l131J208M671L280j137m612l896
1225d682K94M527M956Q73n036o302j042N205O504J643m642o485k978L572P347
1240C754M395l294q054m807K811P498N188j457o875o463K15P112P032J10o810
$$ plain form
1255 355 -6175 -6927 -1899 4364 6918 2868 -4104 -7179 -3446 2984 5951 3413 -1939 -5363 -4299
1270 -4299 591 4938 3997 -718 -4124 -3459 121 2566 2684 266 -2272 -2460 -185 1742 1396 -301
1286 -301 -1135 -756 164 780 223 -731 -1095 398 1876 962 -1296 -1960 -673 1181 2447 1953 -769 -3719
1304 -3719 -2754 1773 4705 2762 -1452 -4096 -3446 176 4952 5687 211 -5854 -5685 133 5154 5503
1320 5503 2078 -3242 -6703 -4168 4006 8441 4036 -3863 -6740 -3684 1561 5989 6054 1 -7268
1335 -7268 -6751 1228 6890 5067 -381 -4132 -5278 -2322 3754 7082 2557 -4977 -6306 -1452 3024
1350 3024 4062 2994 -748 -5337 -4712 1255 5753 3181 -1678 -3630 -2440 -569 1848 3351 1107
1365 1107 -2774 -2949 167 1865 466 -503 208 -179 -970 -136 445 -638 -1038 770 2129 362 -2040
$$ packed form
1255C55o530p52N028O263K554m050o972l075L733O430K967k538n352l424J064
1270d299M890M347r41m715l406O65L580K445J18k418k538j88K275J927l46j697
1286c01q34L79R20O16n57r54l64J493J478r14k258o64J287J854J266m94k722k950
1304c719R65M527K932j943m214k644O50L622M776P35n476o065J69N818N021L49
1320E503l425n320l461K535Q174M435m405p899k877L056N245M428O5o053p269
1335g268N17P979N662j823n448l751j146K956O076L328m525p534j329M854M476
1350C024J038j068l742m589O25N967M498k572m859j952J190J871K417J503k244
1365A107l881j75L116J698j399r69P11l87p91Q34N81j083m00J808J359j767k402
$$ plain form
1382 -2040 -1859 -474 877 2350 2235 -858 -3990 -2720 1811 4242 2167 -924 -3254 -3467 -140 4609
1398 4609 5054 -448 -5318 -4034 531 3791 4474 2098 -3285 -6741 -2571 4914 7001 2008 -3519
1413 -3519 -5189 -3672 917 6601 6470 -1496 -7716 -5111 1993 5239 4280 1332 -3261 -6453 -2926
1428 -2926 4938 7138 1208 -4410 -3974 -1199 875 3586 4170 -463 -5577 -3742 2544 4116 1078
1443 1078 -1250 -1458 -2151 -1495 2251 3662 -150 -3623 -1505 1512 808 -430 682 565 -1681 -1508
1459 -1508 1115 1400 -1278 -1360 1492 1665 -1098 -1899 -329 127 227 1927 2093 -1508 -4506 -1827 2823
1476 2823 3749 1392 -1263 -3364 -3579 293 5008 4629 -993 -4980 -3632 -36 3229 4776 2298 -3488
1492 -3488 -6212 -1871 4161 5235 1648 -1996 -4298 -3830 995 6253 4721 -2263 -6128 -3339 1566
$$ packed form
1382b040J81J385J351J473j15l093l132J270M531K431k075l091k330k13L327M749
1398D609M45n502m870J284M565L260O83k376n383l456M170P485K087m993n527
1413c519j670J517M589N684j31p966o220K605P104L246r59k948m593l192L527
1428b926P864K200n930n618M36K775K074K711N84m633n114J835O286J572l038
1443A078k328k08o93O56L746J411l812l473K118L017p04j238J112j17k246J73
1459a508K623K85k678q2K852J73k763q01J570M56J00J700J66l601k998K679M650
1476B823R26k357k655k101k15L872M715l79n622l987J348L596L265J547k478n786
1492c488k724M341O032J074l587l644k302M68M825N258j532o984l865K789M905
$$ plain form
1507 1566 4077 4249 1123 -4298 -6162 -896 5513 4980 58 -2901 -3317 -2733 905 5203 4092 -2357
1523 -2357 -5622 -1847 2082 2185 1468 1253 -1318 -3808 -1343 3308 2957 -1157 -2012 290 158 -867
1539 -867 235 1806 -260 -1952 142 1935 -398 -2454 50 2217 459 -1262 -322 -47 -1676 -225
1555 -225 2798 1980 -2386 -3390 -143 2278 1770 1021 -80 -3037 -3699 822 5126 3061 -2132 -3965
1571 -3965 -2255 -34 2808 4522 1623 -4247 -5809 -906 4069 4429 1843 -1846 -4881 -4130 1888
1586 1888 6154 3776 -2155 -4748 -2926 210 3450 4829 1333 -4406 -5261 131 4445 3355 475
1601 475 -1573 -3240 -2655 1472 4950 2424 -2666 -3573 -908 897 1695 2583 931 -2994 -3597 567
1617 567 3424 1188 -1079 -466 -221 -1365 -285 2236 1501 -1408 -1269 1153 688 -1661 -836 1547 1162
$$ packed form
1507A566K511J72l126n421j864N266O409n33m922k959m16N84L638M298j111o449
1523b357l265L775L929J03p17k15k571k490K465M651l51m114q55K302j32j025
1539h67J102J571k066j692K094J793k333k056K504K167j758j721R40K75j629J451
1555b25L023q18m366j004L247K421n08p49j101k957o62M521M304k065n193j833
1571c965J710K221K842J714k899n870j562M903M975L60k586l689l035P51O018
1586A888M266k378n931k593J822L136L240J379l496n739q55N392M314j090k880
1601D75k048j667N85M127L478k526n090r07K665J805P98Q88j652l925o03M164
1617E67K857k236k267O13K45j144J080K521p35k909J39K422m65k349Q25K383l85
$$ plain form
1634 1162 -723 -370 268 -1308 -1714 1602 3361 259 -3204 -2091 281 1012 1601 2338 -263 -4133
1650 -4133 -3332 1936 4444 1762 -1313 -2452 -2726 -1036 2985 4897 755 -4525 -4157 109 3023 3246
1666 3246 2059 -1461 -4874 -3452 2380 5629 2409 -2161 -3817 -2790 -68 3718 4624 390 -4609
1681 -4609 -4149 413 3451 2985 1330 -1491 -3885 -2589 2081 4416 1584 -2058 -2422 -1209 70 1836
1697 1836 2742 507 -2859 -2350 717 1962 628 184 27 -1167 -1335 633 1815 146 -1309 46
1713 46 1167 -523 -1178 148 1179 126 -391 463 -169 -1962 -660 2158 2108 -614 -1872 -1150 -717
1730 -717 379 2402 2426 -1338 -4259 -1727 2211 2987 1411 -550 -2343 -3381 -730 3710 4150 -286
1746 -286 -3804 -3025 -325 1954 3408 2291 -1914 -5015 -2584 2594 4314 1827 -1286 -3209 -3133 -238
$$ packed form
1634A162j885L53O38j576m06L316J759l102l463J113K372P31N89P37k601l870
1650d133Q01N268K508k682l075j139k74J690M021J912m142n280L68M266K914K23
1666C246j187l520l413J422N832L249l220m570j656J027K722L786R06m234m999
1681d609M60M562L038m66j655k821k394J296M670K335k832l642l64J213J279J766
1697A836R06k235l366N09L067J245j334m44j57j194j68J968J182j669j455J355
1713D6J121j690o55J326J031j053n17Q54o32j793J302K818n0k722j258P22M33
1730g17J096K023K4l764k921K532L938P76j576j961j793j038K651M440M40m436
1746b86l518P79K700K279J454j117m205l101K431N178J720k487l113j923P6K895
$$ plain form
1762 -238 3909 4124 -495 -4183 -3013 319 2339 2968 1555 -1761 -3932 -1874 2342 3383 1111 -1421
1778 -1421 -1946 -1858 -217 2354 2591 -189 -2614 -1531 639 1227 779 530 -169 -1337 -756 925 1072
1795 1072 -293 -335 533 214 -908 -454 680 562 -49 500 477 -1168 -1910 155 2135 1215 -516 -1364
1813 -1364 -1294 -1010 885 2841 1584 -1799 -3199 -934 1607 2428 1597 -318 -2860 -3209 237 3579
1829 3579 2996 -467 -2990 -2719 -792 2000 3713 1862 -2462 -4424 -1503 2212 3473 2022 -900
1844 -900 -3361 -3180 489 3830 3125 -618 -3206 -2589 -346 2178 2974 1319 -2067 -3369 -1188 1817
1860 1817 2591 1176 -863 -2049 -1920 205 2378 1995 -551 -1867 -1178 -96 806 1281 770 -651 -1432
1877 -1432 -371 759 427 -83 111 291 -224 -458 12 236 51 454 873 -94 -1421 -1017 679 1409
$$ packed form
1762b38M147K15m619l688J170L332K020O29j413l316k171K058M216J041k272k532
1778a421n25Q8J641K571K37k780k425J083K170N88m48k49o99j168N81J681J47
1795A072j365m2Q68l19j122M54J134j18o11N49k3j645p42K065J980r20j731q48
1813a364P0K84J895J956j257l383j400K265K541Q21q31j915k542l49L446L342
1829C579n83l463k523K71J927K792J713j851m324j962K921L715J261j451k922
1844i00k461J81L669L341p05l743k588O17K243K524P96j655l386j302K181L005
1860A817P74j415k039j186J29K125K173l83k546j316O89J082R02M75n11j421p81
1877a432J061J130l32n10J94J80n15k34M70K24j85M03M19r67j327M04J696P30
$$ plain form
1895 1409 846 -136 -954 -1631 -829 1492 2533 757 -1702 -2378 -946 1059 2418 1931 -557 -3042 -2586
1912 -2586 769 3108 2520 -259 -2504 -2989 -731 2199 3622 1236 -2503 -3515 -1290 1776 3047
1927 3047 2021 -858 -3159 -2780 552 3238 2701 -509 -2775 -2626 -463 2093 2877 911 -2133 -2923
1943 -2923 -868 1559 2222 1227 -866 -2132 -1578 324 2033 1607 -235 -1554 -1335 -32 1184 1194 482
1960 482 -551 -1068 -347 351 570 317 -7 -152 -223 -384 -409 -7 459 688 360 -412 -962 -745 168 1387
1980 1387 1227 -123 -1493 -1649 -275 1287 1814 712 -1073 -2215 -1422 1082 2607 1644 -920 -2558
1996 -2558 -1891 532 2578 2325 -101 -2652 -2717 -259 2435 2767 654 -1944 -2958 -1454 1502 3184
2012 3184 1900 -1313 -3206 -2093 883 2787 2265 -56 -2614 -2665 -431 2320 2826 706 -1972 -2603
$$ packed form
1895A409n63r82q18o77Q02K321J041j776k459o76J432K005J359m87k488k485M56
1912b586L355K339n88k779k245m85K258K930J423k386l739j012K225L066J271
1927C047j026k879k301L79L332K686n37l210k266J49K163K556P84j966l044p90
1943b923K055K427O63r95k093j266N54J902J709m26j842j319K19J303J216J0p12
1960D82j033n17P21O98K19k53l24j45p1j61k5M02M66K29l28p72n50K17R13J219
1980A387j60j350j370j56J374J562N27j102j785j142P93K504J525r63k564j638
1996b558O67K423K046k53k426k551o5K458K694L32k113k598j014J504K956J682
2012C184j284l213j893J113K976J904n22k321k558n1K234K751N06k120k678o31
$$ plain form
2028 -2603 -853 1212 2076 1253 -586 -1779 -1447 386 1729 1373 -239 -1134 -1031 -229 672 994 516
2045 516 -611 -1037 -294 517 534 45 -67 161 -84 -490 -238 347 211 224 262 -90 -926 -887 607 1493 876
2066 876 -605 -1212 -959 -84 1139 1878 861 -1699 -2523 -677 1577 2067 976 -675 -2152 -2244 27
2083 27 2834 2616 -492 -2676 -2203 -65 1818 2485 1086 -1602 -2969 -1512 1871 2713 1231 -1016
2099 -1016 -2300 -1641 265 2449 2405 -260 -2707 -2092 212 2137 2038 431 -1495 -2387 -948 1525 2231
2116 2231 926 -1016 -1841 -1160 388 1387 1251 -14 -1129 -1238 -405 728 1022 696 -507 -986 -525
2133 -525 109 341 218 235 85 -180 -608 -183 99 45 647 795 -270 -1295 -831 847 1368 521 -313 -666
2153 -666 -1039 -597 1193 1894 195 -1676 -1477 13 993 1210 1359 -197 -2384 -1896 994 2866 1561
$$ packed form
2028b603J750K065Q64q23j839j193L32J833J343l56j612q95J03Q02R01L22m78
2045E16j127m26P43Q11J7m89j12K28k45m06K52N85j36J3L8l52q36L9J494Q86o17
2066H76j481o07K53Q75J223P39j017k560q24J846K254M90j091j651j477r2K271
2083B7K807k18l108k184M73K138J883O67j399k688j367J457L383Q42j482k247
2099a016j284O59J906K184m4k665k447O15K304J925r9j607j926q92J439K473P06
2116B231j305j942q25O81J548R99j36j265j115j09Q33J133K94l26j203m79M61
2133e25O34K32j23J7j50k65m28M25K82n4O02J48j065j025M64J678N21q47q34l53
2153f66l73M42J790P01j699j871J99J490R80K17J49j556k187M88K890J872j305
$$ plain form
2170 1561 -886 -1983 -1725 -500 1685 2930 808 -2547 -3082 -266 1875 1988 983 -457 -2303 -2361
2186 -2361 205 2855 2192 -559 -2132 -1595 -145 1270 1988 998 -1398 -2431 -656 1514 1727 346
2202 346 -696 -1021 -986 228 1550 1005 -397 -1153 -741 -147 376 806 685 -437 -1151 -539 385 630 275
2221 275 24 -109 -518 -356 -22 144 330 611 421 -644 -1223 -438 979 1239 462 -180 -1108 -1418 2
2240 2 1752 1747 -178 -1432 -1179 -481 585 1610 1615 -509 -2337 -1607 893 2011 1208 -186 -1373 -1934
2258 -1934 -714 2051 2679 167 -2281 -1863 26 1274 1596 1275 -502 -2427 -1844 1059 2606 1112
2274 1112 -650 -1440 -1618 -756 1507 2645 715 -2194 -2253 7 1359 1142 642 -96 -1555 -1404 344
2291 344 1595 860 -477 -587 -349 -527 -14 995 858 -464 -1020 -244 349 97 123 414 -17 -624 -228
$$ packed form
2170A561k447j097K58J225K185J245k122l355n35K816K141J13j005j440j846n8
2186b361K566K650o63k751j573N37J450J415P18r90k396j033J775K170K13j381
2202C46j042l25L5J214J322n45j402p56M12N94N23M30j21j122p14O12R24K45l55
2221B75k51j33m09J62L34J66J86K81j90j065n79P85J417K60p77o42r28l10J420
2240BJ750nj925j254K53O98J066J025Nk124j828P30K500J118q03j394j187n61
2258a934J220K765O28k512k448M18J889J248L22l21j777j925N83K903J547j494
2274A112j762p90j78Q62K263J138j930k909n9K260J352k17n00p38j459J51J748
2291C44J251p35j337j10K38j78N13J009j37j322n56P76N93k52K6K91m31o07L96
$$ plain form
2310 -228 168 40 -189 487 567 -408 -1144 -254 684 874 495 -258 -1062 -1148 332 1631 1134 -390 -1230 -954
2330 -954 -301 693 1586 1260 -850 -2110 -996 772 1678 1361 180 -1731 -2243 -257 2313 2234 -120
2347 -120 -1732 -1507 -435 975 1891 1269 -829 -2207 -1105 969 1587 965 60 -1082 -1848 -709 1750
2364 1750 2156 114 -1817 -1486 -278 717 1392 1111 -662 -1860 -842 890 1238 140 -121 -93 -648
2381 -648 -733 412 1168 434 -596 -663 -335 -344 150 897 443 -631 -783 2 131 -296 6 690 372 -796
2401 -796 -851 -214 477 666 732 16 -1385 -1173 286 1650 942 -370 -978 -937 -375 678 1590 893 -925
2420 -925 -1673 -712 540 1376 1251 120 -1743 -1974 117 2104 1694 -278 -1528 -1761 -536 1165 1980
2437 1980 915 -1213 -1850 -636 907 1198 1036 201 -1248 -1784 -283 1672 1545 130 -1329 -1289 -588
$$ packed form
2310b28L96j28k29O76Q0r75p36Q90R38J90l79p53q04q6J480J299m97j524q40K76
2330i54O53R94Q93l26k110j260J114J768R06l17j181j911n12J986K570p9k354
2347a20j612K25J072J410R16o22k098j378J102K074O18o22r05j142p66J139K459
2364A750M06k042j931L31J208R95O75k81j773j198J018J732L48j098k61K8n55
2381f48q5J145P56p34j030o7L28rM94P47m54j074j52P85J29m27L02O84l18j168
2401g96n5O37O91J89O6p16j401K12J459J364p08j312o08M1N62J053R12o97j818
2420i25p48R61J252Q36j25j131j863k31K091J987m10j972j250k33J225J701Q15
2437A980j065k128o37J214J543K91j62q35j449n36J501J955j27j415j459M0P01
$$ plain form
2454 -588 736 1771 1056 -987 -1626 -396 693 680 325 157 -434 -900 -444 507 737 205 -132 -211 -504
2473 -504 -445 465 982 138 -642 -392 206 -144 -163 355 590 -111 -542 -561 -212 109 744 1096 -251 -1428
2493 -1428 -1040 504 1337 736 -327 -918 -1048 -402 1069 1321 329 -805 -1060 -554 360 1095 1487 115
2511 115 -1645 -1753 111 1764 1526 -80 -1359 -1693 -601 1182 2007 621 -1249 -1437 -528 546 1056
2528 1056 1167 -14 -1203 -1413 28 1278 1293 288 -761 -1272 -732 642 1667 759 -933 -1316 -297
2545 -297 497 618 355 70 -591 -715 -87 447 314 82 160 -198 -649 -443 540 920 182 -348 -267 -328 -181
2566 -181 197 461 160 -183 -315 -228 -475 20 838 851 -359 -1372 -731 588 1130 769 -58 -992 -1109 -72
2586 -72 1060 1207 34 -755 -933 -539 120 1071 1224 -74 -1425 -1366 207 1401 1347 239 -1150 -1635
$$ packed form
2454e88J324J035p15k043o39J230J089j3l55j68n91m66M56R51K30n32l37p9k93
2473e04N9R10N17q44p80K50N98l50j9N18K35p01m31j9L49L21O35L52j347j177
2493a428L88J544Q33o01j063n91j30O46J471K52r92j134k55N06R14P35L92j372
2511A15j760j08J864J653k38j606j279l34J092J783Q25j386j870j88R09J074N10
2528A056J11j181j189k10J441J250J5j005j049n11N40J374J025r08j692l83J019
2545b97P94J21k63k85o61j24O28N34j33k32P8l58m51K06R83L80p38n30Q1o1J47
2566a81L78K64l01l43j32Q7k47M95Q18J3j210j013O41J319N42l61q27r34j17J037
2586g2J132J47j173p89j78L94O59R51J53j298j351N9J573J194n4j108j389m85
$$ plain form
2604 -1635 -440 1276 1684 360 -1056 -1300 -559 556 1083 778 -165 -1217 -902 5 720 1056 490 -450
2622 -450 -1268 -851 693 1503 589 -700 -998 -494 240 790 587 -187 -682 -511 164 215 132 354 264 -398
2642 -398 -534 -254 357 560 347 -63 -423 -463 -93 505 445 -65 -347 -79 -250 -415 67 859 754 -332
2662 -332 -1011 -663 332 901 890 41 -1137 -1100 110 1137 955 50 -745 -829 -573 325 1026 951 -132 -1308
2682 -1308 -1161 -72 1058 1428 379 -1061 -1570 -481 1130 1468 401 -949 -1233 -412 641 1011 725
2699 725 -119 -958 -868 119 786 773 320 -486 -1007 -554 448 1237 699 -426 -1194 -590 493 1017 469 -152
2719 -152 -479 -286 -48 108 478 216 -42 -266 -443 -183 35 474 430 -81 -564 -475 83 429 248 41 -114
2740 -114 -208 -397 -235 285 598 420 -91 -726 -663 25 867 999 -13 -1083 -893 131 922 736 83 -575
$$ packed form
2604a635J195J716M08j324j416k44P41J115N27l05r43j052L15R07P15L36n66r40
2622d50q18M17J544Q10r14j289k98N04P34N50k03p74m95J71O75N1q3K22r0o62
2642c98j36K80O11K03k13m10l60m0L70N98o0n10k82K68j71j65M82P92j05j086
2662c32o79L48R95N69j1q49j178L7J210J027j82r05p95q4K56Q98P01p5j083j176
2682a308J47J089J130L70j049j440n09J089J611L38j067j350k84Q21J053L70k86
2699G25q44q39R0R87O67j3m53q06n21M53J002P89n38j125p68O04J083N24n48o21
2719a52l27J93K38J56L70k62k58k24j77K60K18M39m4n11m83Q9N58L46j81k07j55
2740a14r4j89J62N20L13j78n11o35O3O88Q42J32j012j070J90J024P91j86o53o58
$$ plain form
2760 -575 -1022 -406 456 1000 657 -267 -816 -783 60 836 1207 275 -977 -1454 -352 1098 1358 204 -1016
2779 -1016 -1130 -565 674 1079 880 -411 -978 -743 2 696 713 312 -210 -866 -809 299 1099 620 -563
2798 -563 -807 -581 249 584 514 -40 -597 -516 205 452 197 -38 -79 52 -164 -399 10 635 419 -277 -400
2819 -400 -224 164 314 359 202 -291 -459 -99 110 279 373 342 -22 -831 -822 278 983 862 -149 -918 -773
2840 -773 -84 804 978 215 -829 -1042 -267 507 784 477 -86 -632 -856 -59 825 969 204 -797 -1155
2859 -1155 -265 847 933 301 -691 -1121 -495 692 1063 460 -581 -816 -546 214 633 673 274 -402 -1018
2878 -1018 -540 496 924 557 -242 -811 -613 -142 644 827 -83 -710 -530 123 256 129 207 175 -63 -493
2898 -493 -350 169 301 168 -11 -122 -485 -296 360 583 129 -352 -328 -66 -142 53 427 388 -189 -638 -438
$$ packed form
2760e75m47O16Q62N44l43r24n49L3Q43P76L71r32j252m77J102J450K60j154j220
2779a016j14N65J239M05j99j291n67K35P45O94J7m01n22o56N7J108Q00m79j183
2798e63k44K26Q30L35p0n54n57Q1P21K47k55k35m1J31k16k35M09O25k16o96j23
2819d00J76L88J50M5j57m93j68L60K09J69R4l1l64q09RJ100P05j21j011p69J45
2840g73O89Q88J74p63j044k13P75P74K77l07n63n46k24P97Q84J44p65j001l58
2859a155Q90J112Q6o32r92m30O26J187L71o03j041k35K70P60M19M0l99o76o16
2878a018M78J036M28l67p99n69J98M71P86J83r10o27J80O53J33j27P8l2k38m30
2898d93J43N19J32j33j79j11l63J89O56K23m54m81K4K62p6J95L74l9n77m49K00
$$ plain form
2919 -438 172 586 398 71 -670 -819 -82 896 767 -83 -821 -799 -53 481 813 579 -281 -952 -712 252
2939 252 816 658 273 -607 -1088 -485 650 1110 505 -666 -1139 -509 458 942 609 -257 -903 -476 54
2958 54 540 492 177 -402 -594 -335 326 627 401 -62 -592 -501 28 790 576 -260 -638 -476 60 272 233
2979 233 198 -24 -440 -376 -12 173 224 278 53 -281 -645 -143 589 594 66 -331 -303 -169 -122 229 601 219 -472
3002 -472 -552 -243 151 425 676 264 -738 -905 34 794 656 23 -511 -535 -418 335 817 507 -371 -789
3022 -789 -301 187 488 550 276 -523 -925 -279 760 927 250 -467 -824 -478 332 960 601 -290 -934 -528
3042 -528 241 573 457 180 -435 -630 -543 264 522 471 -95 -411 -435 -117 646 539 16 -476 -383 -96 259
3063 259 303 109 -47 -126 -254 101 113 22 272 135 -292 -523 -76 304 323 78 -194 -292 -401 32 378 456
$$ packed form
2919d38O10M14j88l27p41j49P37R78j29q50p38K2P46N34L32k34q60o71K40R64
2939B52N64j58l85q80m81O03J135M60o05j171m73O30R67M84l33q66o46M27N30
2958E4M86m8l15n79j92K59O61L01k26m63n30R1N29P62k14q36l78J62N36K12l9
2979B33l5k22m16O4L64J85N1N4k25l34l64N02P32Nn28l97K8J34M7L51L72l82o91
3002d72q0L09L94K74K51m12j002j67R39P60j38o33n34k4J17P53M82l10q78m18
3022g89M88M88L01O2k74p99m02O46J039J67o77p17l57L46Q10O28l59q91o44M06
3042e28P69L32j16k77o15j95Q7Q07K58n1n66l16k4L18P63j07n23m92R3K87L55
3063B59M4j94j56p9j28L55J2r1K50j37m27k31M47L80J9k45k72r8j09M33L46P8
$$ plain form
3085 456 44 -359 -292 -238 -7 428 519 79 -647 -650 113 630 442 91 -410 -797 -473 617 879 167 -475
3106 -475 -665 -291 43 450 609 212 -734 -871 -137 584 812 337 -298 -747 -601 396 845 738 -410 -735
3126 -735 -457 66 454 458 88 -367 -496 -195 277 586 247 15 -335 -517 -72 428 493 -34 -371 -215 -155
3147 -155 158 272 285 -122 -377 -189 21 105 233 389 200 -265 -440 58 276 179 136 -56 -289 -416 -57
3168 -57 429 292 6 -272 -325 -296 61 503 593 -152 -661 -479 146 434 551 219 -398 -857 -264 463 630
3189 630 100 -282 -558 -294 -14 494 539 -36 -671 -552 -142 478 471 422 -251 -825 -412 340 763 399 -219
3210 -219 -505 -380 -94 416 613 172 -441 -444 -55 211 348 240 13 -424 -514 -30 438 394 -6 -186 -425
3231 -425 -173 -4 367 216 8 -333 -191 -17 -44 234 388 114 -281 -280 -113 27 226 194 -181 -467 -323
$$ packed form
3085D56m12m03O7N4K31M35R1m40p26lP63N17j88l51n01l87L24J090K62p12o42
3106d75j90L74L34M07J59l97r46j37P34P21K28m75o35m49J46R97M49j07j148l25
3126g35K78N23L88Ml70m55j29L01M72L09l39k32l50j82M45N00O5n27l37J56O0
3147a55L13J14J3m07k55J88K10Q4J28J56j89m65j75M98K18r7m3j92k33j27L59
3168e7M86j37k86k78n3K9L57M42R0p45n09J82O25K88J17l32o17m59N93P27J67
3189F30n30l82k76K64K80N08M5n75o35J19M10O20pm9o73n74M13P52M23l64o18
3210b19k86J25K86N10J97m41o13lL89K66J37j08k27m37r0M84M68m4m00j80k39
3231d25K52J69L71j51k08l41J42J74k7K78J54k74l95JJ67J40J99l2l75k86J44
$$ plain form
3252 -323 89 414 360 169 -88 -414 -189 162 496 331 -99 -460 -318 -40 267 517 236 -459 -584 -337
3272 -337 519 572 301 -131 -477 -411 32 564 472 -95 -532 -521 -80 248 513 361 -293 -594 -476 286 662
3293 662 290 -113 -340 -450 -130 435 460 123 -297 -389 -104 197 356 357 -26 -453 -280 89 245 289 150 -56
3315 -56 -361 -212 239 338 240 -86 -183 -162 -111 170 224 150 -94 -190 -189 -27 122 197 253 -73 -277 -263 103 361 310
3340 310 121 -66 -307 -274 211 378 207 -183 -407 -356 -14 384 396 136 -410 -640 -193 363 580 257 -186
3361 -186 -559 -371 68 578 464 46 -389 -390 -117 342 477 294 -369 -509 -129 138 527 382 50 -463 -418
3382 -418 -80 329 528 83 -303 -324 -222 189 260 342 -117 -412 -322 -14 159 187 176 -174 -312 -182 71 167
3404 167 170 -41 -47 -228 -119 16 262 240 -123 -262 -121 -47 114 245 218 -171 -305 -205 30 293 273 24 -103
$$ packed form
3252c23M12L25n4j91k57l26K25L51L34j65m30l61J42K78L07K50k81o95j25K47
3272c37Q56N3k71m32l46O6M43N32r2n67m37J1M41L28K65j52o54l01J18P62L76
3293F62l72m03k27j10L20N65K5l37m20r2K85L01J59Jl83m27J73L69J56M4j39k06
3315e6l05J49M51R9r8l26r7K1N1K81N4p4k44r6JJ62J49P5N6l26k04J4L66K58n1
3340C10j89j87k41L3M85J67j71l90k24N1L42L98J2k60n46k30M47N56K17l23m43
3361a86l73J88M39N10j14m18m35jK73M59J35j83o63j40L80K67L89j45l32n13M5
3382d18L38M09J99m45l86k1J02M11P1Q2m59k95R0L08J73K8j1l50j38J30K53R6
3404A67Lk11oj81J09J35K46k2l63j39J41P4J61J31k7l89j34J00K35K63k0k49j27
$$ plain form
3427 -103 -270 -229 252 395 290 -132 -355 -321 50 256 429 81 -320 -384 -252 281 505 341 -108 -330 -402
3448 -402 60 439 409 158 -376 -475 -155 397 380 219 -118 -411 -277 287 458 252 -165 -381 -352 -84 256
3469 256 358 1 -175 -385 -160 191 360 201 -204 -263 -191 6 175 339 131 -93 -277 -183 3 163 148
3490 148 73 -225 -358 -169 135 126 110 -53 -97 -93 20 -65 259 267 28 -382 -77 26 213 146 97 23 -382 -114
3514 -114 230 270 96 -78 -222 -174 -18 233 418 162 -279 -403 -64 133 339 212 -79 -472 -426 158 436
3535 436 411 -91 -307 -416 -23 250 425 170 -318 -424 -302 119 353 207 -137 -262 -328 -55 209 360 193
3556 193 -135 -165 -79 222 188 183 -31 -178 -324 -16 254 327 83 -130 -100 35 -28 120 130 39 -86 -218 18
3579 18 130 188 108 -77 -148 -232 -93 64 190 145 -83 -249 -164 23 213 177 16 -75 -404 -122 -18 409 251
$$ packed form
3427a03j67M1M81J43j05m22k23L4L71K06J73l48m01o4J32N33K24j64m49k22p2
3448d02M62L79l0k51n34r9L20N52j7j61l37k93J34N64J71k06m17k16K9K68L40
3469B56J02l57j76k10K25L51J69j59m05n9P2J97J69J64k08k24j84R4J86J60j5
3490A48p5k98j33J89L04rj6j63m4MJ13q5L24Qk39m10L05J03J87o7m9p4m05K68
3514a14L44M0j74j74j44M8J56K51J85k56m41j24L39J97K06j27k91l93M6N84K78
3535D36k5n02k16j09L93K73J75k55m88j06J22M21K34j46l44j25o6K73K64J51j67
3556A93l28l0Q6L01l4nk14j47j46L08K70P3k44k13L0J35o3J48J0r1j25j32K36
3579A8J12N8q0j85p1q4J39J57J26m5k28j66Q5J87J90l6j61r1l29K82J04M27j58
$$ plain form
3602 251 -40 -271 -301 3 310 381 -11 -372 -375 -209 8 367 170 9 -326 -265 145 432 252 22 -173 -289
3624 -289 -153 203 447 152 -158 -333 -12 216 358 176 -11 -240 -309 -90 351 249 -60 -237 -182 -127 -75
3645 -75 108 243 -103 -321 -224 119 162 161 134 -37 -103 -192 41 268 213 0 -117 -92 -58 -25 140 238 13 -98
3669 -98 -134 14 -96 136 47 -19 -129 -151 -92 174 84 114 -147 -158 -155 110 139 209 10 -349 -218 23 413 138
3693 138 -54 -262 -300 -153 120 324 116 -222 -343 -205 -32 264 348 70 -215 -219 -69 143 345 96 -113
3714 -113 -171 -258 75 191 240 -141 -329 -363 -58 200 200 37 -164 -164 -86 3 267 247 -98 -219 -186 18 2 256
3738 256 115 -89 -220 -207 55 158 17 20 89 -216 -172 85 154 13 38 4 -209 -22 89 128 -6 35 -255
3761 -255 -22 125 247 137 77 -93 -308 -246 131 286 88 -134 -181 -261 39 156 173 -47 -209 -117 -105 130
$$ packed form
3602B51k91k31l0L04L07P1l92l61lJ66K17L59j97j61l35O1M10K87j80k30j95j16
3624b89J36L56K44k95l10j75L21K28J42j82j87k29o9K19M41j02l09j77N5N5N2
3645g5J83J35l46k18R7L43M3jk7j71o6q9K33K27n5k13j17K5L4L3J65R8k25j11
3669i8l6J48j10K32q9o6j10k2N9K66r0L0k61j1LK65K9P0j99l59J31K41L90k75
3693A38j92k08l8J47K73K04k08l38j21J38J73K96Q4k78k85mJ50K12K02k49k09
3714a13n8q7L33J16M9l81j88l4L05K58%j63k01%P8Q9K64k0l45j21L3K04j6K54
3738B56j41k04j31J3K62J03j41LO9l05M4K57O9j41K5l4k13J87J11L9j34M1k90
3761b55K33J47J22j10o0j70k15O2L77J55j98k22m7q0L00J17J7k20j62R2J2K35
$$ plain form
3783 130 237 131 -94 -284 -245 -14 280 299 37 -110 -239 -120 314 312 143 -135 -200 -22 89 122 216 45
3805 45 -57 -226 -100 165 98 -24 -182 -166 -215 133 223 159 -53 -265 -55 -50 123 195 49 -132 -250 -131 -17
3828 -17 98 -29 118 -88 -89 -143 90 177 111 -45 -157 -17 -6 40 126 81 12 -188 -95 46 197 137 105 -153 -153
3853 -153 -9 117 229 141 -141 -226 -141 -16 164 288 43 -33 -240 -89 43 215 100 1 -293 -100 71 189
3875 189 190 0 -130 -236 1 269 308 135 -40 -253 -274 24 230 97 0 -231 -222 7 159 227 -12 -93 -379
3898 -379 -177 143 156 95 -38 -119 -85 -130 65 170 133 -83 -178 18 54 200 153 57 -44 -163 -91 66 127 168
3922 168 22 -99 -116 -168 80 183 41 -53 -83 -80 -41 141 56 71 -90 -122 -23 203 126 155 -21 -107 -279 19 188
3947 188 11 -14 -55 -201 -122 66 249 121 -133 -274 -107 -65 87 175 187 -154 -271 -67 131 169 105 -75 -50
$$ packed form
3783A30J07j06k25j90L9K31K94J9k62j47j29J19M34kj69k78o5J78J11L3R4j71
3805D5j02j69J26K65o7j22j58J6m9L48R0o4k12k12K10NJ73P2j46j81j18J19J14
3828a7J15j27J47k06jn4K33Q7o6j56j12J40J1M6Q6m5o9k00R3J41J51o0l2k58%
3853a53J44J26J12q8k82q5Q5J25J80J24k45p6k07J51J32J72j15r9k94J93J71J18
3875A89Jj90j30j06K37K68L9j73j75k13k1K98K06j33r7k31RK29J52O8k39q1k86
3898c79K02L20J3o1j33q1L4m5J95J05l7k16r5J96L6J46m7r6j01j19P2J57O1M1
3922A68j46j21j7n2K48J03j42r4l0LL9J82q5J5j61l2R9K26p7K9j76q6j72K98J69
3947A88j77k5m1j46P9J88J83j28k54j41J67M2J52Q8J2l41j17K04J98L8o4j80K5
$$ plain form
3970 -50 35 124 231 105 -13 -115 -232 -58 148 95 20 -99 -206 -149 -19 90 67 -48 -102 -122 -29 23 112 46
3994 46 -44 -156 -147 -8 114 54 67 -86 -41 61 43 76 125 50 -164 -176 -80 96 151 51 -37 -209 -100 -52 95
4019 95 170 10 -69 -120 -199 -31 185 353 86 -134 -42 -65 67 230 165 -123 -103 -89 70 294 190 -140 -280
4042 -280 -94 0 -20 298 123 -174 -169 -108 91 197 74 -76 -181 -2 -74 189 143 106 -92 -182 -42 -75 101
4065 101 83 20 -239 -239 156 177 118 -102 -159 -7 -61 -117 101 -100 -109 -107 -194 55 91 54 145 -68 -107 8 -99 102
4091 102 -79 -22 -160 -191 -105 -13 53 176 97 -39 -65 -23 106 128 12 13 -96 -168 6 156 194 19 -194 -162 -118
4116 -118 84 147 102 -34 -198 16 197 188 100 49 -116 -164 40 149 301 -27 -18 -226 -71 17 193 206 -9 -191
4140 -191 -178 108 65 241 3 -105 -251 -63 206 140 203 -149 -156 -35 123 141 86 71 50 -149 -85 24 141 -8
$$ packed form
3970e0Q5Q9J07j26j18j02j17J74K06n3p5j19j07N7J30J09k3j15n4k0R3N2Q9o6
3994D6r0j12RJ39J22o0J3j53M5J02j8L3M9p5k14j2R6J76N5j00q8j72J09M8J47
4019I5P5j60p9n1p9J68K16J68k67k20R2k3J32J63o5k88K0J4J59K24j04l30j40
4042b80J86R4k0L18j75k97NO1J99J06j23j50j05J79p2K63m6l7j98r0J40l3J76
4065A01j8o3k59%L95K1n9k20n7J52n4n6K18k01rKq7K49L6l7R1k13l9J15j07K01
4091A02j81N7j38l1Q6R2O6J23p9j36k6M2J29K2j16Jj09p2J74J50L8j75k13L2M4
4116a18K02O3m5j36j64K14J81rq8n1j65m8K04J09J52l28Rk08J55Q8J76J3k15j82
4140a91J3K86m3J76k38j08j46J88K69o6O3l52pJ21J58J8n5j5k1j99O4J09J17j49
$$ plain form
4164 -8 -170 -173 -43 -90 65 123 -20 -66 -90 -106 -111 107 44 11 -38 -242 -10 14 178 64 15 -167 -121 41 46 89 -20
4191 -20 -29 -4 -183 -25 154 100 1 -169 -286 -217 14 192 129 -204 -176 -145 60 167 59 91 -85 -206 67 116
4215 116 40 -21 -145 -143 -170 57 165 102 -80 -165 -161 -156 -44 201 58 -93 -162 -94 20 116 112 -101 -198 -137 152 209
4241 209 153 150 -29 -132 -44 15 39 85 41 -169 -54 71 16 145 15 -14 -15 26 -27 138 69 183 -58 -207 -47
4266 -47 3 125 -15 78 43 -49 -59 155 106 95 -38 -192 -25 26 109 183 58 -76 -60 -15 114 159 25 -5 -7 -183
4292 -183 88 234 73 -31 -230 -196 -4 96 77 63 -37 -152 -193 123 212 151 -56 -159 -146 -124 44 262 -28
4315 -28 -111 -54 -66 61 95 86 31 -21 -82 -83 16 26 165 -169 -117 -101 1 -10 49 -19 5 -192 -61 120 31 57 3 -68
4343 -68 -90 3 -45 87 -56 -136 -205 -84 -81 37 112 19 -51 -131 -29 132 143 24 -57 -195 -6 51 52 204 10 -59
$$ packed form
4164hj62lJ30m7J55N8j43m6k4j6nK18o3l3m9k04K32K4J64j14m9j82M6J62NM3j09
4191b0rK5j79J58J79n4r9j70j17O9K31J78o3l33K8L1K05J07j08L2j76j21K73M9
4215A16p6o1j24Kk7K27J08o3j82q5MNJ12K45j43j51o9O8J14R6mk13r7O1K89N7
4241B09n6lj79j03Q8N9K4M6m4k10J15J25n5J29j30k9jM1n3J65o9J14k41j49J60
4266d7N0J22j40R3l5r2j0K14m9j1j33j54J67N1Q3P4j25j34J6M5J29M5j34l0kj76
4292a83K71J46j61j04j99L4J92J00j9j4j00j15m1L16Q9o1k07j03J3K2J68K18k90
4315b8q3N7j2J27L4rn5n2o1jR9J0J39l34N2J6J02j1N9o8K4j97J31J81q9K6n4p1
4343f8k2R3m8J32j43q0o9J21LJ18P5r3p0q0J02J61J1j19q1j38J89N7JJ52j94o9
$$ plain form
4369 -59 -62 -24 50 55 165 76 2 -164 -15 48 41 -112 -114 -49 17 -18 83 36 -18 -212 -130 32 127 52 64 -128 -121 24
4397 24 42 86 19 -59 -110 24 -2 82 134 -7 -118 -82 -52 42 46 88 -83 -6 -32 -64 83 52 -37 -154 4 -130 72
4424 72 101 171 26 -111 -3 -68 148 47 122 18 78 135 155 35 -45 59 -116 -169 16 47 47 52 -111 -35 -14 21
4450 21 174 82 24 -50 -86 -68 40 116 154 2 -232 -28 46 148 168 75 -66 40 39 66 224 19 23 -47 -154 -120
4476 -120 48 178 -19 -63 -138 -10 116 58 43 -66 -37 -75 -7 169 174 17 -56 -29 6 94 38 70 -35 -153 -20
4501 -20 25 76 130 -37 -87 -109 9 52 42 208 -73 -43 -105 -105 -93 64 73 1 -206 -86 -88 112 109 109 -35 -65 -142 -104
4529 -104 155 87 -66 -29 -82 -88 133 93 -44 -28 -81 -179 -2 68 60 -53 -54 -111 111 44 40 107 63 -121 40 120 28
4556 28 53 -52 -152 -106 -36 145 156 -67 -69 -149 -92 90 131 118 -70 -171 -130 52 58 9 -114 -118 -119 -118 51 76 48 -38
$$ packed form
4369e9lL8P4NJ10q9p4j66J49O3pj53kO5O6l5J01m7n4j94Q2J62R5p5J2j92PJ45
4397B4J8M4o7p8n1J34k6Q4N2j41j11L6L0R4MM2j71P7k6l2J47l1q9j17J58j34K02
4424G2K9P0j45j37J08o5K16j01P5j04O0N7K0j20q0J04j75n3J85L1%Nj63P6K1L5
4450B1J53r2n8p4l6J8J08P6L8j52k34K04P4J02K0r3j41J06jK7J58k05Mp0j07L4
4476a20J68J30j97m4p5J28J26n8j5j09K9l8O8J76Nj57p3K7L5Q8n6L2j05j18J33
4501b0M5N1N4j67n0k2J18M3j0J66k81L0o2%J2J57Rp2k07J20kK00l%j44l0p7L8
4529a04K59o8j53L7n3oK21m0j37J6n3r8J77P0qj13jn7K22o7mO7m4j84J61Q0r2
4556B8K5j05j00M6P0J81J1k23kq0N7J82M1j3j88j01M1J82Om9j23mjJJ69K5k8q6
$$ plain form
4584 -38 -176 -56 -42 70 105 -33 -21 -139 -115 -11 -61 60 78 4 16 -125 76 26 102 51 -95 -3 34 86 104
4609 104 51 -71 -38 -20 26 167 71 34 14 -37 81 47 147 105 -106 -116 -40 54 137 -56 71 -119 -78 -128 174
4634 174 44 29 31 -104 9 0 -21 -9 47 4 -154 -167 66 133 43 -73 -79 -54 53 99 27 68 -132 -123 88 140 55
4661 55 -113 -79 -64 -24 84 201 1 -5 -168 -158 55 -25 13 106 -134 7 36 -14 76 74 -48 -62 -49 87 47 40 -27
4688 -27 49 -108 6 66 26 169 -44 -31 -76 41 63 63 23 -41 -92 -94 -48 -35 50 32 84 -226 -99 -64 30 88 -17
4715 -17 -118 -184 48 106 217 114 -25 -153 -135 76 82 174 -3 -89 -158 112 33 100 126 23 6 -22 -70 95 103 150
4741 150 -69 -2 86 109 129 -45 -11 -165 -136 107 116 149 81 -137 -130 46 -28 108 158 -31 -77 -213 79 55 53 87
4767 87 -76 -127 -7 20 31 -38 -13 -50 -118 -74 138 151 93 -79 -90 -22 2 35 86 11 -6 -90 4 -121 139 4 4
$$ packed form
4584c8j38J20J4J12L5j38J2j18K4J04n0J21J8p4J2j41K01n0P6n1j46R2L7N2J8
4609A04n3j22L3J8M6J41r6l7k0n1J18l4J00m2k11j0P6R4Q3j93J27j90M1n0L02
4634A74j30j5Kj35J13rk1J2N6m3j58j3K33O7r0j16oK5J07M6p2M1k00RK11N2q5
4661E5j68L4J5M0J08J17k00oj63J0K13q0L8R3k40J41K9n0R0kj22j4J3J36m0po7
4688b7P6j57J14O0m0J43k13J3m5J17K2%m0o4n1kM6J3Q5j8N2l10J27L5R4N8j05
4715a7j01o6K32N8J11j03j39j28J8K11OR2j77q6o9K70p9O7K6j03j7k8m8J65QM7
4741A50k19O7Q8K3K0j74L4j54K9K43RL3o8k18PJ76p4J36N0j89m6j36K92k4kL4
4767H7j63n1J20K7J1o9K5l7o8M4K12J3n8j72j1O8K4L3N1p5j7q4R4j25K60j35%
$$ plain form
4794 4 -112 -103 -50 108 51 18 24 -132 43 98 75 -5 -43 -166 6 -91 145 131 -6 -33 -167 -38 4 96 6 -35 -188
4821 -188 -109 115 177 63 51 -101 -52 30 83 115 99 20 -57 -90 -39 34 -3 21 -76 20 60 114 195 -23 49 -34 -76 -2
4849 -2 126 202 -92 -119 -37 2 -34 13 201 31 -215 -3 95 98 35 35 -18 -127 -43 70 55 -11 47 -42 -124 -61 -53 -27
4877 -27 -63 -81 -182 -72 -30 108 92 -56 -14 -97 42 106 81 25 -135 -58 3 45 124 29 50 -78 -178 137 119 149
4903 149 53 -27 -70 -26 117 135 103 32 -8 -221 52 47 173 79 -70 -121 36 27 193 134 -41 75 -63 28 112 21
4929 21 30 52 -46 -56 87 -24 18 89 -75 14 -97 45 121 80 51 -11 -16 74 107 6 113 -38 -43 -85 -68 206 86
4956 86 33 -9 9 44 28 63 17 -125 -108 -105 -23 59 169 10 -18 3 -108 39 96 109 -135 -52 -106 -69 101 126 45
4983 45 -64 -100 -50 154 135 67 113 -93 13 30 60 196 -4 -182 -131 -49 -29 127 -28 39 -47 -163 38 134 54
$$ packed form
4794Dj16RN3J58n7l3Oj56J75N5k3q0l8j23J72r7K36j4j37k7j34J29M2R2r0m1j53
4821a88P9K24O2j14j2j52M9Q2N3L2j6p9p7l3N1P3l7K4r7R6M0N4Q1k18P2q3m2P4
4849bJ28P6k94k7Q2L9l6M7J88j70k46K12R8Lo3%n3j09Q4J13j5o6N8q9q2O3QK6
4877b7l6j8j01J10M2J38j6j48M2q3J39O4k5n6j60P7O1M2P9r5K1j28j00L15j8L0
4903A49r6q0m3M4J43J8l2p1m0k13K73nJ26r4j49n1J57rJ66n9j75J16j38R1Q4r1
4929B1RK2r8j0J43j11M2P1j64Q9j11J42P6m1k9o2nR0L3j01J07j51nm2J7K74j20
4956H6n3m2J8L5j6L5m6j42J7LQ2Q2J10j59k8K1j11J47N7J3k44Q3n4L7J70K5q1
4983D5j09l6N0K04j9o8M6k06J06J7L0J36k00j78N1Q2K0J56j55O7q6j16K01R6q0
$$ plain form
5008 54 13 -25 -27 14 76 164 0 -97 -43 141 55 56 54 5 37 -163 -136 -34 -53 63 84 20 -85 1 -78 81 142 66
5036 66 -70 38 171 42 14 42 17 -108 21 42 168 64 -81 12 -57 15 35 67 24 -21 -78 -122 200 209 -20
5061 -20 -78 -212 -55 -2 111 187 -101 -127 -162 -58 -123 179 79 -81 -101 -14 -76 171 168 -8 19 -153 -39 -3 134
5086 134 -23 -20 -141 -52 -9 59 2 17 -40 -91 -134 -46 164 45 66 -38 -53 24 43 88 -36 -57 -138 -60 131 -15
5112 -15 57 56 -58 -18 -56 -61 213 -42 -137 -4 -72 -54 40 56 12 -27 -49 3 71 -56 80 131 47 -53 -11 -22 144
5139 144 27 -103 -121 31 56 49 -3 -58 -126 -81 101 135 117 -7 -86 -125 98 146 91 53 35 -71 -67 -26 101 163 70
5166 70 -142 -60 -132 104 158 118 48 -70 -95 4 -43 -35 -51 -20 -6 -107 -28 182 -43 93 -27 -150 -11 34 -21 -136
5192 -136 -75 -29 -56 72 114 15 7 100 -238 95 0 81 38 -38 -2 -86 -98 49 198 -4 -9 -115 66 -9 -4 -65 36
$$ packed form
5008E4m1l8kM1O2Q8j64r7N4J84q6Jkm9L2k00K7J02j9J16K1o4j05Q6p9J59O1p6
5036F6j36J08J33j29k8K8k5j25J29K1J26j04j45R3o9P2K0L2m3m5n7m4L22Rk29
5061b0n8j34J57N3J13P6k88k6l5J04o5L02j00j60k0Q7o2K47lj76K7j72J14L6J37
5086A34j57Lj21Q9M3O8n7J5n7n1m3Q8K10j19K1j04j5P7J9M5j24k1q1P8J91j46
5112a5P2jj14M0l8nK74k55r5J33o8J8R4J6m4l9k2N2O8j27J36N1q4j00M2j1J66
5139A44j17j30j8J52K5pn2n5o8M5J82L4j8j24p9l9K23M8n5l8j8j06MM1J27O2r3
5166G0k12Q2p2K36N4m0p0j18k5R9m7Qj6L1J4j01P9K10k25J36j20j23J39M5n5j15
5192a36O1M6k7J28M2r9qR3l38L33r5Q1m3p6L6q4j2J47J49k02nj06J81p5No1J01
$$ plain form
5219 36 -198 -92 -76 61 39 76 -25 -73 -102 86 147 25 -49 -85 -20 133 112 173 119 -34 69 -38 28 130 13
5244 13 156 -1 -253 -64 115 135 126 -20 -167 -79 -29 125 43 229 -65 -15 19 21 -46 -33 106 -45 -6 -48 94
5269 94 132 43 -89 -46 -6 37 105 74 -79 -210 -30 61 -32 -35 -42 -22 -47 -34 62 51 -4 -10 -46 -136 23 136 41 -112
5297 -112 -77 -21 0 -15 161 139 26 -92 -101 -3 28 -26 131 27 -113 -158 -69 128 67 -22 -88 -241 -117 164 51
5322 51 82 -73 -116 -81 57 135 105 -44 -33 -15 100 60 155 165 -143 -163 -173 83 143 -8 0 -173 -185 43 110 182
5348 182 2 -110 7 -75 81 122 124 16 -28 -113 -25 5 190 -34 -54 -77 15 -103 94 -63 -6 3 -126 -76 11
5373 11 -46 3 -78 -19 -25 -156 191 92 -39 -16 -163 7 34 -17 52 -15 -52 5 -37 31 45 -5 41 -71 87 40 89
5400 89 143 51 -176 -213 -61 99 93 -3 -4 -123 44 83 -25 -26 -5 -90 -53 -93 149 168 63 -138 -90 -59 62 67 129
$$ packed form
5219C6k34J06J6J37k2L7j01m8k9J88O1j22p4l6O5J53k1O1n4j53J03j07O6J02j17
5244A3J43j57k52J89J79K0rj46j47Q8N0J54q2J86k94N0L4Ko7J3J39j51L9m2J42
5269I4L8q9j32M3M0M3O8l1j53j31J80R1r3lpK0k5J3R6j1n5ol6r0J59J13r5j53
5297a12L5N6K1j5J76k2j13j18rR8L1n4J57j04j40m5Q9J97o1q9o6j53J24K81j13
5322E1L1j55m3L5J38P8l0j49J1J8J15m0R5J0l08k0j0K56O0j51Qj73j2K28O7P2
5348A82j80j12J17q2J56M1Kj08m4q5Q8L0J85k24k0k3R2j18J97j57N7Rj29N0Q7
5373A1n7M9q1N9oj31L47r9j31K3j47J70K7n1O9o7l7N7m2O8J4n0M6j12J58m7M9
5400H9N4r2k27l7J52J60or6jj19J67L9j08jK1q5L7m0K42J9j05k01M8L1J21NO2
$$ plain form
5427 129 -71 -67 -7 -62 73 90 16 -38 -127 -26 74 -5 -18 62 38 -26 35 33 203 58 24 -155 -127 16 108 -13
5453 -13 43 -136 -162 -56 -95 97 65 136 -84 -77 -134 19 157 122 -147 -129 56 57 144 35 -19 1 -13 -17 86 136 96
5480 96 -65 -141 -78 -33 57 89 41 -105 -142 31 100 135 22 -110 -78 -35 122 184 -24 -49 -20 -44 142 -96 79
5505 79 -39 -34 -126 -41 -160 174 82 -62 -194 -132 -31 16 175 81 -78 -43 -146 -51 104 33 -154 -66 -44 -58 4
5530 4 128 -22 63 -148 -67 -19 109 159 -9 -24 -36 112 43 -25 40 -71 -36 16 -19 95 81 30 -46 -245 29 32
5556 32 176 139 -15 -77 -142 -127 121 -57 89 -66 26 34 -48 127 119 -6 -128 -184 -26 133 90 85 -107 -145 -142 48
5582 48 -21 34 -49 -120 11 22 49 100 -29 -103 -2 5 172 129 88 -200 -34 -106 -8 137 52 -44 -66 -129 -39 -30 153
5609 153 124 -68 -36 -43 -127 139 71 1 13 -111 -99 67 79 57 27 -84 -95 -12 -108 -10 87 -18 -57 -100 21 69 141
$$ packed form
5427A29k00MO0n5J35J7p4n4q9J01J00p9j3Q0k4o4O1kJ70j45l4j79K8J43R2j21
5453a3N6j79k6J06l9J92l2P1k20Pn7J53J38l5k69J8J85JQ7j09n4K0j4mJ03N0m0
5480I6j61p6O3M5R0L2m8j46l7J73O9L5j13j32L2M3J57O2k08k5K9k4J86k38J75
5505G9j18Nr2Q5j19L34r2j44j32O2J01M7J59r4j59L5j03R5J55p1j87Q8K2j4O2
5530DJ24j50Q5k11Q1M8J28N0j68j5j2J48o9o8O5j11L5N2l5J14j4n1p6j99K74L
5556C2J44l7j54o2o5J5K48j78J46j55R2Qq2J75qj25j22n6J58J59m3nj92l8LJ90
5582D8o9N5q3p1J31J1K7N1j29p4J01PJ67m3m1k88J66p2R8J45q5r6k2o3R0RJ83
5609A53k9j92L2pq4K66o8p0J2j24J2J66J2k2l0j11j1Q3r6R8R7j05l9m3J21M8P2
$$ plain form
5636 141 79 -27 -107 6 22 50 80 -60 -156 -103 2 78 -14 134 -78 -42 -32 137 156 -33 -15 -32 -37 -80 -52 181
5662 181 -9 14 -50 -47 36 111 190 53 21 -30 1 -14 151 40 -81 23 -88 11 -64 125 68 -119 24 52 142
5687 142 104 13 -157 -56 44 -35 -42 25 -15 -26 80 -174 36 11 112 0 -188 -91 83 156 -17 -20 -54 -126 -112
5712 -112 162 90 -72 29 1 75 88 55 134 123 -43 -80 -80 57 83 41 -22 -95 -71 -37 125 124 77 -6 5 -91 9
5739 9 7 107 18 -108 -98 90 59 53 67 -117 -124 58 -147 -7 -23 32 -189 -299 -166 -13 126 40 -42 -54 29 10
5765 10 135 119 86 -166 -73 -154 9 123 86 7 -53 -13 -2 28 6 -102 -41 -139 -145 -22 28 -6 32 -73 -139 -12 57
5792 57 75 58 -98 -34 118 75 96 47 -18 -139 -86 -77 109 32 58 -50 -188 -38 19 135 107 -48 -89 -47 -71 107
5818 107 107 31 59 -122 -105 -14 128 103 -6 -157 -180 69 131 162 146 -48 -18 -43 68 55 -71 -64 -84 -17 -34 161
$$ packed form
5636A41o2j06q0J13J6K8L0j40r6N3J05P6r2J48k12L6J0J69J9j89J8j7nm3K8K33
5662A81j90K3o4LQ3P5P9j37l2n1L1j5J65j11j21J04j11R9p5J89n7j87J43K8R0
5687A42l8r1j70J01J00p9pO7m0j1J06k54K10k5J01j12j88R7J74P3j73ll4p2J4
5712a12K74p2j62J01k8P4J3l3P9j1j66l7%J37K6m2o3p3K4L4J62jm7q3J1r6J00
5739IkJ00q9j26J0J88l1oJ4j84pJ82k05J40j6N5k21j10J33J53J39q6q2j2Q3j9
5765A0J25j6l3k52R3q1J63J14l7p9o0M0J1L0k2j08O1r8oJ23N0l4L8j05o6J27O9
5792E7J8j7j56O4J52m3K1m9o5j21N3RJ86p7K6j08j38J50N7J16k8j55m1M2k4J78
5818A07%p6K8j81J7R1J42k5j09j51k3K49O2L1j6j94L0k5J11j3j26Pk0O7j7J95
$$ plain form
5844 161 63 46 -19 -150 -48 61 55 135 -40 40 -77 -29 75 107 36 -24 65 -11 23 30 167 125 -159 -112 -134 19
5870 19 168 -17 -127 -91 -45 59 2 93 10 -1 -23 -30 68 66 18 74 -142 9 66 129 -72 -34 -117 -88 -97 -24 176 136
5898 136 28 -152 -90 -3 55 55 91 45 -142 -29 24 37 7 -82 -50 -203 -38 -4 43 20 -58 -115 -75 75 78 111 -131
5925 -131 -165 -186 152 48 93 -17 -146 -41 48 7 151 79 3 44 -82 32 90 50 -72 -58 -81 -99 1 97 0
5950 0 1 -14 -56 -37 54 155 52 -3 -33 -74 121 61 43 -30 -106 -114 -99 -1 183 -34 -13 -149 -81 53 87 76 -32 -97
5978 -97 -107 -55 96 57 -94 3 32 -184 61 82 75 144 -147 -41 -49 19 192 87 -108 -112 -87 -21 131 -85 70 -80
6004 -80 -143 -87 40 62 48 -52 -157 -25 -5 18 154 27 -119 -91 -54 43 -3 121 -58 -120 -115 90 79 47 17 -73
6030 -73 -166 -40 -134 84 108 -34 -19 -8 67 14 97 -19 -59 -125 -71 -115 34 13 77 -72 -128 -110 -51 218 80 63
$$ packed form
5844A61r8j7o5j31J02J09oQ0j75Q0j17M8J04L2p1o0Q9p6L4PJ37m2k84M7k2J53
5870A9J49j85j10L6M6J04n7R1q3j1k2pR8km8N6k16J51N7O3k01L8q3K9rP3K00m0
5898A36j08j80O2Q7N8%L6m6j87J13N3J3l0q9L2j53J65L4M7k3p8n7M0J50LL3k42
5925a31l4k1L38j04M5j10j29J05Q9m1J44p2p6M1j26J14N8m0j22J4k3j8J00R6r7
5950@Jj5m2J9R1J01j03n5l0m1J95o0j8p3p6qJ5R8J84k17K1j36O8J34L4j1j08o5
5978i7j0N2J51l9j51R7K9k16K45K1pO9k91J06qO8J73j05j95mK5O6J52k16J55j50
6004h0o3N6J27K2j4j00j05J32K0K3J36j27j46K8L7R7m6J24j79o2NK05j1l2l0r0
6030g3r3J26r4K18K4j42J5J1P5n3Q3j16m0o6N4m4J49k1O4j49n6J8N9K69j38j7
$$ plain form
6056 63 -174 -132 -12 15 192 12 -51 -135 -67 127 116 -23 -57 -73 -95 1 139 121 126 -50 -98 -63 -14 122 -5 47
6082 47 -183 -46 -126 3 14 60 8 -72 -15 30 114 41 -53 -112 -59 -17 7 93 70 85 -84 38 -46 147 -8 -30 -181
6109 -181 -58 108 47 166 5 -15 -143 -32 56 60 -24 -8 -74 -18 -122 104 -53 90 3 -142 -122 -52 134 94
6133 94 -30 -111 -64 14 91 -10 101 -44 -62 -85 -20 51 79 -4 -133 -32 13 42 107 43 -92 -80 2 -107 150 81
6159 81 -2 -95 -142 -90 9 87 27 -74 -99 32 52 31 18 -10 -160 -232 -57 95 137 9 -11 -129 -44 -74 37 6
6185 6 3 -140 -86 -41 34 24 -13 -26 -49 -65 67 111 33 63 -21 -55 -47 -79 161 151 18 -1 -30 126 133 96 114 30 -61 -123
6215 -123 -55 83 113 -42 -83 -60 -123 68 137 142 34 -40 -86 14 160 -38 -44 -48 -95 166 68 175 73 -57 -135 17
6241 17 71 38 98 16 -121 -62 -132 50 62 62 48 -8 28 -108 121 136 10 -81 -66 -96 -61 12 60 -54 -40 66 -8
$$ packed form
6056F3k37M2J20K7J77j80o3q4O8J94j1j39l4j6k2R6J38j8Nj76m8L5M9J36j27N2
6082D7k30J37q0J29J1M6n2q0N7M5Q4p3r4n9N3M2K4Q6k3J5j69J22q4J93j55k2j51
6109a81J23J66o1J19j61k0j28J11Q8Mq4J6o6N6j04K26j57J43q7j45K0P0J86m0
6133I4j24q1M7P8P7j01J11j45j8k3O5P1K8q3j29J01M5K9O5o4j35J2Q2j09K57o9
6159H1q3r3m7N2R9P8o0j01k5J31K0k1j3k8j50p2J75J52M2j28k0j18Q5l0J11l1
6185Flj43N4M5P5j0l7j3k3j6J32M4p8L0q4l4Ql2K40j0j33j9k9J56Pl7J8q4r1o2
6215a23O8J38L0j55m1K3o3J91O9Nj08p4m6J00J46j98omm7K61r8J07j02j30p8J52
6241A7N4l3O0q2j37N9p0J82J2%j4n6L6j36K29J5j26r1J5l0L5P3M8j14J4J06p4
$$ plain form
6268 -8 93 178 52 -120 -104 -35 121 71 37 82 -89 -134 -28 -15 78 8 0 -42 -13 94 -24 93 -4 18 -130 24
6294 24 94 144 168 -97 -198 -66 71 50 139 64 -56 -106 -28 63 89 -57 -65 -50 12 97 43 198 25 -70 -87 15
6320 15 28 91 23 103 -111 -77 0 150 146 67 -18 -200 -12 100 97 134 58 -33 -130 -40 73 97 56 23 -39 23 -14 122
6348 122 23 -31 -114 -14 -2 26 6 -108 -103 37 93 -5 70 -81 -49 -150 6 -58 19 27 0 -79 -78 -114 82 12 28 48
6376 48 -104 -43 -15 11 -73 59 -119 -37 -86 -61 115 99 -63 -86 -44 -92 63 38 59 7 -7 74 -44 67 123 -12
6402 -12 11 -66 -142 93 121 -21 -75 -143 -82 -66 86 119 -14 -100 12 -82 85 4 13 -20 -143 -168 28 25 129 14
6428 14 -1 -199 55 45 90 -10 23 -132 -119 -1 -22 -64 112 -50 -147 -73 84 125 32 25 52 -79 -61 -13 32 -59
6454 -59 -61 -126 -32 162 173 43 -25 55 -31 -71 24 29 -55 86 -11 -25 2 60 114 -78 -72 -145 -90 -29 64 -13 -3 -112 -50
$$ packed form
6268hJ01Q5j26j72J6O9J56n0l4M5j71m5J06J3R3p0qm2K9J07j18J17r7K2j48J54
6294B4P0N0K4k65j01J32J37k1Q9p5j20n0P8R1K6j46qJ5O2Q5n4J55j73r5j7J02
6320A5J3O3o8Q0k14L4P7J50mp9q5j82J88J12lL7p6r1r7R0J13K4m1l3o2O2l7J36
6348A22r9n4q3J00J2K8k0j14NJ40N6r8P5j51L2j01J56o4P7Qk7p9Jl6J96p0J6K0
6376D8j52O1K8K6q4J32j78Q2m9K5J76j6j62k3M2m8J55k5K1n2j4Q1j18J11N6j35
6402a2K3p7p6K35K8j42n4o8O1J6J52L3j33q6J12r4J67q1Rl3j23k5J96lJ04j15
6428A4j5j98K54j0M5j00L3j55J3J18k1m2J76j62r7P4J57M1r3pK7j31J8M8M5r1
6454e9ko5R4J94J1j30o8Q0q6m0R5Nq4J41r7j4K7N8N4j92Op3N5O1R3p7J0j09O2
$$ plain form
6483 -50 -38 110 -3 -102 -106 -102 -152 67 167 95 45 -77 27 -38 39 126 93 -48 -43 -2 82 123 92 -10 -129 -25 -21
6510 -21 122 188 180 -37 -19 -96 56 32 145 0 -125 -90 41 124 54 2 4 -90 -77 112 -53 85 -107 -95 -146 -76
6536 -76 27 36 -27 -80 -169 -14 34 15 155 56 -74 -129 35 -2 74 49 50 13 -22 106 143 87 61 3 -8 -33 34 67
6564 67 185 -198 -12 -108 111 79 -21 6 -65 -29 -94 13 192 43 41 -152 -59 -9 86 43 -57 -37 -98 2 -60
6589 -60 62 60 77 -92 -160 45 107 95 1 -47 -53 -40 31 54 -102 -65 -152 -88 115 51 -16 80 9 5 -33 -13 34 58 33
6618 33 -119 -6 177 68 144 87 -6 -91 -38 77 39 38 96 23 -1 -35 21 62 -17 -14 28 -112 -52 -158 81 -49 66
6645 66 -219 115 216 107 24 -30 -14 31 -81 121 140 -12 20 -114 -47 54 -44 198 -38 -46 -131 -1 -77 142
6669 142 -60 1 -78 -164 54 113 139 -80 -74 -54 -47 100 63 151 -71 -182 -40 -40 35 7 49 -47 -63 4 83 -18 3
$$ packed form
6483e0J2J48j13r9mMn0K19J00p2n0j22J04o5P7Q7l3j41NM1Q4M1l1j02j19J04M
6510b1J43O6qk17J8p7J52k4J13j45j25L5J31Q3p0n2Kr4J3J89j65J38j92J2n1P0
6536g6J03Ro3n3q9J55M8j9J40r9j30n5J64l7P6k5Jl7l5J28L7n6k6n8j1k5O7L3
6564F7J18l83J86r6K19l2j00K7p1L6o5J07J79j49kj93R3N0R5m3j00K0o1J00o2
6589f0J22kJ7j69o8K05O2j2r4m8oJ3P1K3j56L7q7O4K03o4o7R6p1ml8K0M7K4k5
6618C3j52J13J83j09P6n7r3q5N3J15l8jN8p3k4l4N6M1p9LM2j40O0j06K39j30J15
6645F6k85L34J01j09q3n4J6M5j12K02J9j52L2j34O7J01r8K42k36qq5J30p6K19
6669A42k02O1p9q6K18N9K6k19OK0PJ47l7Q8k22j11J42%P5k8M2r6j6O7P9j01K1
$$ plain form
6696 3 -10 -104 -7 194 116 107 -72 -108 -9 -84 157 82 -73 -22 -54 -25 70 126 19 -9 -18 -35 -54 17 186 67 -107 -87
6724 -87 -49 76 50 144 -11 52 -86 12 99 39 18 -35 -23 7 108 40 226 28 -87 -148 26 67 106 69 -24 31
6750 31 -143 4 114 -69 165 24 -82 -70 107 66 40 0 -64 -38 20 87 -3 -64 -32 -101 91 20 19 -22 111 -32
6776 -32 44 43 151 -5 -39 -9 -157 -38 -54 132 -13 56 -47 -57 -105 78 62 87 -89 -155 -59 -1 -38 34 -143 -46
6802 -46 -116 -16 -43 195 92 -29 -7 37 84 105 67 41 50 -6 -45 14 3 27 22 53 -151 -19 131 191 32 -13 -103
6829 -103 -102 83 49 178 -85 -155 -118 60 130 117 37 -43 -63 -85 21 86 -18 -47 -16 17 71 68 -9 -48 -82 -102 43
6856 43 42 12 112 -129 -68 -88 17 3 40 -14 23 -72 -64 42 16 109 63 2 -25 -41 27 -23 -59 -56 -9 19 -10 35 127 -6
6886 -6 -114 -55 -74 133 178 157 -43 -68 95 110 63 96 52 -133 41 6 -27 -60 -51 -66 -55 -56 -119 115 22 -29 -18 -45
$$ packed form
6696Cj3r4R7K01p8rj79l6R9p5K41p5j55N1l2K9R5N6j07k8rj7j9P1J69j19j74K0
6724h7L8J25k6R4j55O3j38R8Q7o0k1n3J2L0J01o8J86j98j15o1J74M1L9l7r3N5
6750C1j74J47J10j83K34j41j06J2J77m1k6m0o4K6N8O7r0o1L2o9J92p1jm1J33j43
6776c2P6jJ08j56l4L0j48J19j6J86j45O9j03j0m8J83j6K5j76o6R6N8l7P2j77R7
6802d6p0J00k7K38j03j21K2M4M7K1l8k6Rn6l9N9j1K4nL1k04J32J50O0j59m5r0
6829a03JJ85l4J29k63p0L7J78P0j3q0q0k0k2J06O5j04k9L1L3N4lp7l9l4k0J45
6856D3jl0J00k41O1k0J05j4L7n4L7r5QJ06k6R3m6o1k7j6O8n0l6LM7K8k9M5R2j33
6886fj08N9j9K07M5k1k00k5J63J5m7L3m4j85J74l5l3l3Rj5J1jo3K34r3n1J1k7
$$ plain form
6914 -45 -61 165 105 203 -148 44 -68 15 76 -25 107 -27 -37 -23 92 53 98 -12 -60 -65 -22 191 -4 32 -70
6939 -70 -98 46 53 77 8 -26 16 -5 -81 -23 56 -52 -57 -65 31 3 77 81 31 22 -10 -69 78 -2 119 -56 -145 -53 -18 46
6969 46 37 -39 -86 -57 -9 3 69 28 -137 51 -86 -1 129 70 56 -30 -51 24 -44 -47 77 91 -95 -94 -25 13 -107 30
6997 30 -68 15 -41 58 -14 -112 40 -134 -37 -115 125 -16 30 -177 -33 -119 -15 -28 69 -58 -95 -25 -13 44 86 -74
7023 -74 8 -138 -40 7 156 -130 -31 -165 -8 84 76 40 -99 95 -171 -19 46 90 71 -90 -88 -17 -4 127 -46
7048 -46 48 -94 -125 51 51 30 -5 -84 -82 -111 -31 100 108 97 -36 -90 -104 125 -20 10 -32 -82 9 -48 67 134 -20 -40
7076 -40 -152 -129 -63 67 130 51 -89 -78 -37 -11 55 -74 40 -92 -98 -68 78 127 -51 -52 -114 -69 -13 66 58 36 -120
7103 -120 -179 -127 31 18 -35 -25 -124 -135 18 80 191 -73 -102 -42 -57 13 61 5 12 -60 12 82 106 -10 101 -20 -70
$$ packed form
6914d5j6K26o0R8l51J92j12Q3O1j01J32j34j0J4J15l9M5j10m8nM3K13j95L6j02
6939g0k8J44PK4o9l4M2k1p6N8P9j08nqR6k8P4Mn0rl2n9J47q0J21j75q9R2L5O4
6969D6rp6m7K9M8J2O6m1j65J88j37Q5J30n9j4q6k1P5o8lJ24J4j86JO9L8j20J37
6997C0r8Q3n6R9p2r8J52j74R7p8K40j41M6k07J44q6J04j3R7j27l7P0J2N7M2j60
7023g4Q2j46R8M7J49k86R9j34J57R2ql6j39J94k66J52O5M4j9j61KP1J3J31j73
7048d6R4j42l1J76%k1l5p9Kk9Q0J31Qj1j33n4j4K29j45L0m2n0R1n7J15O7j54k0
7076d0j12K3O6J30O3p9j40J1M1K6O6j29J14j32oL0J46M9j78jo2M5N6P9qk2j56
7103a20n9N2J58j3n3J0r9j1J53O2J11k64k9O0j5P0M8n6Pp2P2P0K4j16J11j21n0
$$ plain form
7130 -70 -50 50 185 65 95 -170 -121 -17 20 42 -9 6 -89 -48 -14 21 11 59 -92 -20 -11 33 34 -75 -113 -200 -51
7157 -51 -34 -16 -53 21 -145 11 12 -90 52 70 -34 52 -172 -54 45 16 -27 -61 -140 138 86 105 -3 -7 -35 57 115
7184 115 139 48 77 -67 -26 103 114 24 155 -46 57 -39 -49 24 2 37 -33 -199 23 228 -24 -66 -18 -71 56
7209 56 84 98 34 -4 -39 -77 68 12 30 -14 47 -17 -65 42 106 4 -94 -95 -78 -5 -50 175 193 -109 -12 -37 -1 150
7237 150 98 -49 -4 -10 -99 35 4 -125 -57 -147 -70 35 9 22 59 20 -53 -57 0 -1 -23 29 4 -36 99 29 74 -31
7265 -31 -77 -156 -16 144 36 -48 -78 -164 -84 -18 3 8 -91 16 -29 -31 -59 17 71 -16 -56 -41 115 -25 -91 -24 2 -148
7293 -148 105 -46 37 -13 -100 -123 -57 57 107 100 -55 46 24 -146 39 96 93 5 -13 -112 -62 50 -4 -21 25 -101
7319 -101 -63 49 221 175 2 -66 -37 -28 103 180 58 -40 -74 -154 -47 78 16 -106 -97 13 -23 -25 52 41 -144 -35
$$ packed form
7130g0K0J00J35j20L0k65M9J04L7K2n1J5r5M1L4L5j0M8j51P2RM4Jj09l8q7J49
7157e1J7J8l7P4j66J56Jj02J42J8j04Q6k24J18R9k9m3l4p9K78n2J9j08mk8R2N8
7184A15K4r1K9j44M1J29J1r0J31k01J03r6j0P3k2L5p0j66K22K05k52m2M8n3J27
7209E6K8J4o4l8l5l8J45n6J8m4O1o4m8J07O4j02r8jJ7P3m5K25J8l02R7k5L6J51
7237A50n2j47M5oq9J34l1j29O8r0P7J05k6J3L7l9p3mN7jk2N2k5m0J35p0M5j05
7265c1m6p9J40J60j08q4l0q6Q0O6K1Nr9J07m5kk8P6N4q7m0J5J56j40o6O7K6j50
7293a48K53j51Q3n0q7k3O6J14N0pj55J01k2j70J85N7lq8j8r9N0J12n4j7M6j26
7319a01L8J12J72m6j73o8K9RJ31P7j22r8l4q0J07J25o2j22RJ10l6kP7j1j85J09
$$ plain form
7345 -35 -124 7 -13 -39 -30 -75 -68 -69 95 -51 127 31 -124 -24 6 25 53 27 78 -1 -100 49 114 133 -34 -141 -25
7372 -25 134 68 -66 -62 106 -46 19 -12 102 98 0 -126 34 -32 66 80 -34 -118 -110 -4 51 63 29 110 -117 -21 38
7399 38 35 -1 72 -69 -25 -40 -42 15 6 -76 -103 82 -4 103 -5 -42 19 -6 -33 0 115 12 13 -13 -69 13 106 -65 -125
7428 -125 51 -44 -60 -1 -31 36 96 15 82 -45 -2 49 54 -104 -68 -57 -11 50 4 -7 -43 -143 -39 80 73 139 -38
7455 -38 -142 -20 29 36 -126 47 -13 -126 -51 43 95 136 -76 -29 -149 59 68 -12 -27 -10 -38 -37 -9 91 105 -5 -91
7482 -91 -74 32 94 -84 48 34 19 -45 141 95 153 96 9 -111 29 17 105 123 -61 35 8 -13 128 -85 -51 -47
7508 -47 -57 -77 -80 1 67 18 -22 -57 14 -47 12 -111 -90 -115 -27 -96 18 43 26 -207 -3 -82 36 30 -76 -51 -76 -29
7536 -29 82 77 97 -20 -146 -54 29 96 120 24 -89 -66 -21 99 87 -125 50 -11 -104 3 84 27 89 -91 -45 -18
$$ packed form
7345c5q9J31k0k6Rm5PjJ64j46J78r6j55J00L0J9K8k6N1p9r9J49O5J9j67j07J16
7372b5J59o6j34MJ68j52O5l1J14mr8j26J60o6R8J4j14q4QJ06N5J2l4Q1k27R6N9
7399C8ll6P3j41M4j5kN7rq2k7J85q6J07j08l7O1k5k7L3J15j03Jk6n6Q2R3j71o0
7428a25J76r5j6N9l0O7O0q1O7j27M3N1Nj58L6J1M6O1m6j1l6j00J04J19pO6j77
7455c8j04J22M9Pj62J73o0j13P5R4N2M1k12M7j20K08Rq0j5J7k8JK8J00J4j10q6
7482i1J7J06O2j78J32j4j5o4J86m6N8n7q7j20J40j2Q8J8j84R6k7k1J41k13L4M
7508d7j0k0lQ1O6m9m0l5P1o1N9j23K1k5Q8o9J14K5j7k33K04p9J18oj06K5k5M7
7536b9J11nK0j17j26R2Q3O7K4r6j13K3M5J20j2k12J75o1r3J07Q1n7O2j80M6K7
$$ plain form
7562 -18 -29 86 27 -77 -7 -81 -11 -2 12 26 -98 -58 -64 -29 46 -29 -34 47 -92 3 67 5 58 -65 -44 88 -24 113
7590 113 10 144 -137 -100 71 77 65 -49 51 -74 -30 -4 59 65 -17 -7 -64 23 161 129 -47 -57 -77 -65 5 37
7616 37 148 -44 -2 -74 -76 86 31 41 42 -173 -24 77 -21 103 27 -109 -45 31 49 -52 37 -102 -148 14 6 22
7642 22 24 42 68 2 -6 27 12 93 -12 -151 -134 35 -40 83 81 128 -46 -74 102 69 -23 -14 3 -39 43 -28 -67 20 -55
7671 -55 -21 -55 -35 117 -19 -94 -103 -54 -47 76 24 105 -117 -8 -31 -44 -28 17 -13 -19 -5 -98 25 116 62 32 -104 -149
7699 -149 34 -42 -103 24 107 -177 -67 54 134 38 -109 14 -55 -22 55 -38 -17 -70 -24 -115 56 -6 -38 -3 34 -35
7725 -35 -6 -56 102 25 -42 -72 84 84 170 11 -47 -42 -16 -35 5 63 39 0 53 23 -4 138 73 -8 -40 -97 17 49 98
7754 98 -6 -36 -27 -39 -39 39 -26 -48 10 -88 -19 81 77 -34 -131 -131 -166 -88 62 139 68 -100 55 -41 -27 20 -23 -115 -5
$$ packed form
7562a8j1J15n9j04P0p4P0RJ4J4j24M0oL5P5p5nQ1j39R5O4o2N3j23K1J32j12J37
7590A13j03J34k81L7J71Oj2j14J00j25M4K6O3Oq2J0n7Q7J38l2j76j0k0J2P0L2
7616C7J11j92M2p2kJ62n5J0Jk15J49J01r8J24p6j36O4P6J8j01Q9j39m6J62qJ6
7642B2KJ8K6o6qL3j5Q1j05j39J7J69p5J23kM7j74k8J76l3r2RJ7m2Q2p1l9Q7p5
7671e5L4l4K0J52j36p5rM9PJ23n2Q1k22J09k3j3J6M5l0oJ4r3J23R1n4l0j36m5
7699a49J83p6o1J27Q3k84J10J21Q0r6j47J23o9L3P7r3K1n3M6r1J71o2l2L5L7o9
7725c5K9n0J58p7o7l0J56%Q6j59n8NK6j9M0N8k4l9N3l0k7J42o5q1l2n7J14L2M9
7754I8j04l0Rj2%P8o5k2N8r8O9J00mj11r7%l5P8J50P7p1j68J55r6J4M7m3r2J10
$$ plain form
7783 -5 -55 54 -10 38 -64 -19 -156 -49 76 43 -103 36 -103 -37 79 70 28 54 31 -58 -14 -130 -14 -49 106
7808 106 -25 -61 -30 77 -154 -154 8 -151 99 67 78 4 17 -33 -84 -97 122 6 -98 -70 -78 -106 59 -61 56
7833 56 -56 -52 -15 97 65 -10 141 28 -103 -9 49 -18 59 -95 16 13 42 103 26 30 -36 13 -72 114 4 60 -5
7860 -5 -33 -69 89 104 39 -57 -103 -137 -103 -103 58 40 86 -79 -94 14 -102 -3 -68 -4 5 -100 150 71 80 -15 -128 -35
7888 -35 -103 4 -1 58 -60 42 -138 65 50 40 -14 -22 -16 -54 3 -68 26 33 -50 61 9 56 37 -1 -64 -20 110 -14
7916 -14 -46 63 -26 23 -14 132 38 -4 59 -83 -45 32 17 113 31 -79 -67 -127 5 -10 72 -38 -117 102 13 98 81
7943 81 -25 -36 -67 -134 -6 81 98 100 -40 -105 113 66 90 72 46 10 52 20 -20 29 -20 25 -53 -125 -78 93 107 21
7971 21 -36 -67 -39 134 118 1 -34 -1 78 53 -32 -23 52 -123 -43 -65 28 95 34 82 -29 -97 -72 -34 -63 40 -26 -29 19
$$ packed form
7783en0J09o4M8j02M5j37J07J25l3j46J39j39O6J16rm2K6k3q9M4j16J16l5J55
7808A06j31l6L1J07k31%J62j59K50l2J1p4J3n0n1j3K19j16j04K8qk8J65j20J17
7833E6j12ML7J12l2p5J51j13j31R4N8o7P7j54J11lK9O1p7Mo6M9q5J86j10N6o5
7860ek8l6J58J5o5r6m6l4L4%J61j8M6j65j5J08j16R9o5O4Rj05K50p9Rr5j13R3
7888c5o8J07nN9j18J02j80K03j5j0n4qOl8N7p1R4Pq3J11n2M7j9l8o3M4J30j24
7916a4l2J09q9M9l7J46r4m2O3j42L8P7j5R6q2j10J2o0J32j5Q2j10p9K19q9Q5j7
7943H1j06j1l1o7J28Q7J7Kj40o5K18m7K4j8k6l6M2l2m0M9m9M5p8p2M7J71J4q6
7971B1n7l1K8J73j6j17l5L3P9k5q5RP5j75Q0k2R3O7o1M8j11o8K5L8k9J03o6lM8
$$ plain form
8000 19 -72 49 10 -46 -149 -88 -49 113 4 -48 75 90 142 68 -28 40 -77 1 -72 -72 -21 -1 -22 5 -15 -1 -108
8027 -108 39 145 13 -58 -61 25 92 55 50 46 -53 -90 37 51 -17 53 46 -20 -67 12 71 7 -113 -92 -93 -56 -119 44 -70
8056 -70 -77 -82 15 -79 -16 -64 129 12 -55 0 -5 55 -36 -8 -76 -78 -9 135 -46 -53 -41 7 -45 24 11 -77 14 -97 -89 -1 -2
8087 -2 7 18 17 -15 -72 58 18 10 -26 101 -103 -42 218 119 116 -43 -104 -48 69 -2 56 1 -63 -60 3 13 6 27 71 78 120
8118 120 -111 -8 58 -62 -74 -108 99 -7 -33 -68 -138 -99 -82 -20 24 -69 -33 -176 60 -34 114 11 -72 -96 19
8143 19 12 32 85 22 -29 51 -28 -54 121 19 12 -4 88 33 57 100 -62 -67 -48 18 42 102 146 72 -17 -26 9 80 -34 -47
8173 -47 -116 -6 -100 -13 71 17 -4 -26 -25 -46 -15 55 -30 -23 2 -45 -91 28
$$ packed form
8000A9r1J21l9n6j03O1L9J62j09n2J23J5N2p4r6O8j17P8p3%N1K0k1K7k0J4j07
8027a08J47J06j32p1lQ6O7l7nmr9l7J27J4o8P0po6m7P9N9o4j20K1jL7o3J63j14
8056g0pnR7r4O3m8J93j17o7N5nO0r1K8o8kO9J44j81pJ2M8n2O9j3q8R1j11QQ8j
8087bRJ1jl2n7J30m0ql6J27k04O1K60r9lj59o1N6J17p1N8n5o4LO3J0pK1M4PM2
8118A20k31J03O6j20j2l4K07j06k6l5p0L9J7O2M4r3L6j43K36r4J48j03q3k4J15
8143A9pK0N3o3n1Q0p9k6J75j02pj6R2n5K4M3j62nJ9O6K4O0M4p4q9rL5P1j14j3
8173d7o9J10r4Q7Q4n4k1k2Jk1L1P0q5PK5m7m6J19
8191B8
$$ Imaginary data points
##PAGE= N=2
##DATA TABLE= (X++(I..I)), XYDATA
$$ plain form
0 0 0 0 0 0 0 0 0 0 0 0 0 0 0 0 0 -1 5 -8 8 -8 8 -8 8 -10 15 -16 16 -18 21 -24 26 -29 34 -37 41 -45 51 -55 60 -68
40 -68 76 -84 92 -102 113 -126 140 -157 178 -202 231 -267 315 -377 463 -594 801 -1176 1999 -4539
60 -4539 27998 151757 79107 -69419 -81603 699 33399 26248 39273 31671 -23267 -43289
72 -43289 6609 45772 31819 19086 19444 -9327 -36549 5552 69831 56765 -10363 -33789 -6911
85 -6911 17518 36604 53305 22034 -44898 -45609 37596 80316 19020 -42568 -19613 25407 21861
98 21861 2781 7201 7955 -8403 -9198 9417 13050 27 -5166 -6544 -12819 -3478 20132 14455
112 14455 -25460 -41046 -9396 21449 19733 409 -26592 -51784 -33352 32028 56705 -9472
124 -9472 -74880 -46853 17372 22119 -6862 -4695 -937 -35498 -52392 -4613 44122 25547 -24772
$$ packed form
0@%%%%%%%%%%%%%%%jOj3J6j6J6j6J6j8K5l1L2l4L9m5N0n5O3p1P8q6R6j06J15j28
40f8J44j60J76j94K15k39K66k97L35l80M33m98N82o92Q40j057J395j977L175o538
60d539L2537J23759p2650j48526j2184Q2302L2700p151J3025p602n4938k0022
72d3289M9898L9163j3953j2733L58k8771k7222M2101O4279j3066o7128k3426K6878
85f911K4429J9086J6701l1271o6932p11Q3205M2720o1296o1588K2955M5020l546
98B1861j9080M420P54j6358p95J8615L633j3023n193j378o275R341K3610n677
112A4455l9915j5586L1650L0845j716j9324k7001k5192J8432O5380K4677o6177
124i472o5408K8027O4225M747k8981K167L758l4561j6894M7779M8735j8575n0319
$$ plain form
137 -24772 -46757 -38624 -10991 34785 52300 -4000 -72837 -55667 21932 54010 22040 -11649
149 -11649 -28553 -40449 -17175 44345 62410 -2317 -56471 -25174 25525 22082 5951 22409
161 22409 21038 -25423 -41687 12693 59620 35577 -12520 -24875 -10664 9545 36010 41737
173 41737 1956 -36374 -13836 35771 38408 3300 -10894 -188 4336 8182 21764 17324 -10225
186 -10225 -16284 11539 24123 3597 -7252 5397 4197 -12280 -2924 23917 17054 -19062 -27956
199 -27956 -1096 18765 14554 2288 -15572 -32444 -18653 23113 36060 -3274 -41825 -33673
211 -33673 -2754 15831 20458 8183 -26206 -48523 -21019 24853 29178 -2953 -23881 -26058 -25974
224 -25974 -10435 25656 35102 -8859 -51544 -37609 6484 28799 22304 1340 -29868 -45477
$$ packed form
137b4772k1985Q133K7633M5776J7515n6300o8837J7170P7599L2078l1970l3689
149a1649j6904j1896K3274O1520J8065o4727n4154L1297N0699l443j6131J6458
161B2409j371m6461j6264N4380M6927k4043m8097j2355J4211K0209K6465N727
173D1737l9781l8330K2538M9607K637l5108j4194J0706M524L846J3582m440k7549
186a0225o059K7823J2584k0526j0849J2649j200j6477R356K6841o863l6116q894
199b7956K6860J9861m211j2266j7860j6872J3791M1766J2947l9334l8551Q152
211c3673L0919J8585M627j2275l4389k2317K7504M5872M325l2131k0928k177Q4
224b5974J5539L6091R446m3961m2685J3935M4093K2315o495k0964l1208j5609
$$ plain form
236 -45477 -12786 38551 40549 -7067 -37491 -23268 954 14871 24459 18188 -13731 -34512 -10927
249 -10927 25164 27868 7624 -4447 -10742 -15129 1575 31812 30685 -6525 -26083 -4019 20278
262 20278 18447 9136 4969 -4684 -9887 7890 26524 13380 -11943 -8968 12331 15840 4389
275 4389 2062 2993 -4432 -3865 13327 20075 1476 -15267 -8798 4619 10469 14027 10236 -11886
289 -11886 -29240 -9753 26424 29773 -2924 -28430 -24455 -4480 16298 25408 7260 -27427 -36950
302 -36950 -7646 22098 19540 -668 -15009 -23485 -22772 -1438 25475 21934 -12027 -35842 -26964
315 -26964 -714 20685 24730 2520 -32841 -41257 -5928 32183 28874 -5389 -29726 -27050 -6192
328 -6192 17950 26227 5909 -22825 -25409 -1775 15399 12754 5494 -550 -11837 -16268 703
$$ packed form
236d5477L2691N1337J998m7616l0424J4223K4222J3917R588o271l1919k0781K3585
249a0927L6091K704k0244j2071o295m387J6704L0237j127l7210j9558K2064K4297
262B0278j831r311m167r653n203J7777J8634j3144k5323K975K1299L509j1451
275D389k327R31p425N67J7192O748j8599j6743O469J3417N850L558l791k2122
289a1886j7354J9487L6177L349l2697k5506L975J9975K0778R110j8148l4687r523
302c6950K9304K9744k558k0208j4341q476P13K1334K6913l541l3961k3815Q878
315b6964K6250K1399M045k2210l5361q416L5329L8111l309l4263k4337K676K0858
328f192K4142Q277k0318k8734k584K3634J7174k645p260o044j1287m431J6971
$$ plain form
341 703 22649 19086 -4513 -17017 -7799 7086 15677 14294 1146 -12833 -8492 11842 20345 6221
355 6221 -8441 -5789 5214 11071 10781 4928 -5531 -8090 5139 18108 11699 -4356 -8517 -1416
369 -1416 4407 8855 13591 7738 -10561 -18644 -2270 20186 21756 2356 -17500 -21530 -5671 18799
383 18799 26722 4919 -23867 -26938 -3710 17742 19141 5193 -13002 -24328 -17101 6635 23579
396 23579 14399 -10649 -26848 -21697 -1077 19979 22534 -1274 -30029 -31212 -2074 24624 21393
409 21393 -3773 -24369 -24473 -5836 15581 20195 2563 -18671 -21514 -5726 10308 13505 5280
422 5280 -6694 -14396 -10954 2326 13479 11538 -1888 -13504 -11744 2591 15248 12368 -3742
435 -3742 -14171 -5961 10365 14455 2984 -8268 -6272 4689 11026 6928 -1514 -5081 -1583 5255
$$ packed form
341G03K1946l563k3599j2504R218J4885Q591j383j3148j3979M341K0334Q503j4124
355F221j4662K652J1003N857k90n853j0459k559J3229J2969o409j6055m161P101
369a416N823M448M736n853j8299q083J6374K2456J570j9400j9856m030J5859K4470
383A8799P923k1803k8786l071K3228K1452J399j3948j8195j1326P227K3736J6944
396B3579r180k5048j6199N151K0620K1056K555k3808k8755j183K9138K6698l231
409B1393k5166k0596j04J8637K1417M614j7632k1234k843J5788J6034L197q225
422E280j1974p702L442J3280J1153j941j3426j1616J760J4335J2657k880j6110
435c742j0429Q210J6326M090j1471j1252J996J0961O337m098q442l567L498O838
$$ plain form
449 5255 9277 7628 965 -5728 -5781 2839 12701 13083 1945 -10551 -11613 1121 16041 17936 3388
464 3388 -14479 -17666 -1758 17887 22010 5213 -16737 -22102 -4927 17348 22284 5817 -14697
477 -14697 -20927 -9249 9097 19476 12439 -7530 -22538 -17623 2673 19221 17211 -2187 -22212
490 -22212 -23979 -3307 20180 20928 -2050 -23080 -21328 -2232 13782 14932 2239 -13795 -19029
503 -19029 -7839 8782 13467 3979 -8246 -13292 -9423 1226 11427 9812 -4431 -14777 -8703
516 -8703 4838 9931 4431 -3528 -7927 -5494 3086 9486 4328 -6459 -7739 2142 8840 4834 -1812
531 -1812 -4540 -2887 2258 8645 8421 -1588 -9069 -4185 6209 10444 7404 801 -7026 -9821 152
546 152 15262 16497 704 -13851 -12775 753 14489 18455 6270 -14115 -20521 -3092 18459
$$ packed form
449E255M022j649o663o693n3Q620R862L82j1138j2496j062J2734J4920J895j4548
464C388j7867l187J5908J9645M123j6797k1950n365J7175K2275M936j6467k0514
477a4697o230J1678J8346J0379p037j9969j5008M915K0296J6548k010j9398k0025
490b2212j767K0672K3487P48k2978k1030J752J9096J6014J150j2693j6034n234
503a9029J1190J6621M685r488j2225n046L869J0649J0201j615j4243j0346O074
516h703J3541N093n500p959m399K433Q580O400n158j0787j280R881O698m006o646
531a812k728J653N145O387k24j0009p481M884J0394M235l040o603p827k795R973
546A52J5110J235j5793j4555J076J3528J3736L966j2185k0385o406J7429K1551
$$ plain form
559 18459 19928 3640 -11592 -15856 -8486 7685 20323 13684 -8269 -21097 -11990 5803 15932
572 15932 13836 529 -17448 -21344 -1908 20245 18106 -3734 -18177 -14488 -2477 9060 14815
585 14815 5644 -13400 -19773 -4813 11248 10651 654 -6036 -10125 -10218 100 12464 8704 -7317
599 -7317 -13469 -4652 3380 3834 3651 1160 -7173 -9754 1377 10783 2778 -9253 -6300 4253 5611
614 5611 587 -1718 -3142 -4893 642 10031 7353 -6027 -10515 -1073 6532 6033 5099 2774 -6438
629 -6438 -12071 -561 15614 14249 -1832 -11821 -9159 -103 10836 16740 6302 -13254 -17807 -424
643 -424 16469 15314 2977 -8072 -13823 -8643 8706 21056 10988 -10508 -17791 -7104 6188
656 6188 13777 13517 1026 -16773 -18418 1372 18639 14424 -1323 -12072 -13904 -6035 9813 18074
$$ packed form
559A8459J469j6288j5232m264P370J6171J2638o639k1953j2828R107J7793J0129
572A5932k096j3307j7977l896J9436K2153k139k1840j4443L689J2011J1537N755
585A4815r171j9044o373J4960J6061n97r997o690m089r3J0318J2364l760j6021
599g317o152Q817Q032M54j83k491q333k581J1131R406q005j2031K953J0553J358
614E611n024k305j424j751N535R389k678j3380m488R442P605m99r34k325r212
629f438n633J1510J6175j365j6081r989K662R056J0939N904j0438j9556m553J7383
643d24J6893j155j2337j1049n751N180J7349J2350j0068k1496p283J0687J3292
656F188P589k60j2491j7799j645J9790J7267m215j5747j0749j832P869J5848Q261
$$ plain form
670 18074 4680 -14651 -15221 -321 7771 5391 3157 -840 -9934 -11103 2656 12627 4032 -8235
684 -8235 -7683 -1893 -247 2550 6365 -10 -11344 -7984 6866 8841 -3442 -8009 -742 2134 -1165
699 -1165 867 3363 -3557 -8615 823 10645 3315 -8509 -6621 1648 2645 2772 6506 2115 -10896
714 -10896 -11730 4782 15673 7447 -4556 -8095 -7897 -3348 9946 18372 5149 -15758 -16243 1680
728 1680 13808 11793 4349 -5322 -13845 -9085 9135 18879 7504 -8629 -11923 -5697 2623 12061
742 12061 14349 227 -16859 -13818 5459 16115 9852 -1356 -9287 -12314 -4288 11791 16352
755 16352 1507 -12976 -10684 -445 5065 7623 7106 -2447 -13197 -8270 6515 9860 984 -4230
769 -4230 -3035 -4108 -3591 4490 7771 -2571 -10068 -1794 6936 1944 -5338 -2567 990 -1937 -767
$$ packed form
670A8074j3394j9331n70J4900Q092k380k234l997r094j169J3759R971q595j2267
684h235N52N790J646K797L815o375j1334L360J4850J975j2283m567P267K876l299
699a165K032K496o920n058R438R822p330j1824J888Q269R97J27L734m391j3011
714a0896q34J6512J0891q226j2003l539J98M549J3294Q426j3223k0907m85J7923
728A680J2128k015p444r671q523M760J8220R744j1375j6133l294O226Q320R438
742A2061K288j4122j7086L041J9277J0656o263j1208p931l027Q026J6079M561
755A6352j4845j4483K292J0239N510K558n17r553j0750M927J4785L345q876n214
769d230J195j073N17Q081L281j0342p497Q274Q730m992p282K771L557k927J170
$$ plain form
784 -767 5137 1763 -9172 -7427 5987 8711 -1589 -6026 -1893 -1861 -2979 4812 10124 -1138 -13818
799 -13818 -7146 7663 9197 2139 -1345 -4899 -9948 -3700 13068 15609 -2518 -15707 -8616 3671
813 3671 8226 9517 7057 -5996 -17310 -7644 13090 17432 3497 -7881 -9598 -7220 988 13954
827 13954 15007 -2397 -16944 -9780 6111 11234 7719 2025 -6475 -12391 -3828 11844 13470 -316
841 -316 -9601 -6479 -821 3460 8227 6993 -4601 -11973 -3906 7522 7119 484 -2257 -3740 -5207
856 -5207 -525 7324 5112 -4718 -6582 575 2923 -858 -685 1439 -1865 -4068 1748 5195 -2155
871 -2155 -7971 -1420 5867 3063 -2045 -1789 -2872 -6162 -460 10086 7284 -7301 -11985 -2189 5317
886 5317 4867 4510 1846 -8209 -12818 -169 14054 9834 -4613 -9379 -5553 -2145 4060 12269 7894
$$ packed form
784g67N904l374j0935J745J3414K724j0300m437M133L2j118P791N312j1262j2680
799a3818O672J4809J534p058l484l554n049O248J6768K541j8127j3189P091J2287
813C671M555J291k460j3053j1314R666K0734M342j3935j1378j717K378Q208J2966
827A3954J053j7404j4547P164J5891N123l515n694q500n916Q563J5672J626j3786
841c16r285L122N658M281M767j234j1594p372Q067J1428m03o635k741j483j467
856e207M682P849k212r830j864P157K348l781J73K124l304k203N816L447p350
871b155n816O551P287k804n108K56j083l290N702J0546k802j4585m684R796P506
886E317m50l57k664j0055m609J2649J4223m220j4447m766L826L408O205Q209m375
$$ plain form
901 7894 -9694 -16572 -2358 12436 10471 1523 -3836 -8552 -9259 2309 15934 11329 -6834 -13969
915 -13969 -4787 4463 7571 8514 3893 -8252 -13448 -1510 12646 10543 -738 -6299 -5943 -3721
929 -3721 3019 10560 6656 -6105 -10059 -949 6202 4201 1018 -140 -3179 -4917 740 6303 2522
944 2522 -3908 -3061 958 960 -165 1422 441 -3645 -2335 3655 3734 -3073 -5253 -316 2971 1715 996
961 996 -644 -5128 -5746 2930 9038 2654 -7216 -7338 -1106 2557 4660 5809 -304 -10104 -9351 3182
977 3182 10853 5786 -2878 -6875 -7610 -3570 7106 13021 3316 -11326 -12214 -456 8381 8395 4377
992 4377 -3411 -11366 -8569 5781 14161 5879 -6432 -9204 -4447 840 7259 10062 1962 -10273
1006 -10273 -10571 1562 9899 7220 538 -4429 -7256 -4158 5555 10439 3009 -6665 -6275 24 3152
$$ packed form
901G894j7588o878J4214J4794j965q948n359m716p07J1568J3625m605j8163p135
915a3969R182R250L108R43m621j2145n196J1938J4156k103j1281n561L56K222
929c721O740P541l904j2761l954R110P151k001l183j158l039j738N657N563l781
944B522o430Q47M019Kj125J587r81m086J310N990P9o807k180M937L287j256p19
961I96j640m484o18Q676O108o384r870j22O232L663K103J149o113r800P53J2533
977C182P671n067q664l997p35M040J0676N915r705j4642q88J1758Q837J4m018
992D377p788p955K797J4350Q380q282j2311k772M757N287O419K803q100j2235
1006a0273k98J2133Q337k679o682m967k827L098R713M884p430r674L90O299L128
$$ plain form
1021 3152 3540 3683 300 -5145 -4249 2690 5359 770 -2263 -677 136 -941 964 2859 -475 -3719
1037 -3719 -272 4319 1701 -3623 -3109 590 1907 1983 2084 -1317 -6139 -3809 4478 7305 728 -5476
1053 -5476 -5343 -2120 1544 5748 5740 -2101 -9869 -6606 3413 8137 4612 -1195 -6363 -8565 -2701 8223
1069 8223 10935 837 -10009 -9502 -977 6254 8549 4429 -5011 -11307 -5780 6110 10721 4315
1083 4315 -4075 -7776 -6099 462 8478 8992 -447 -9452 -7465 1192 6787 6641 2064 -4595 -7964
1098 -7964 -2858 6014 7985 1469 -4480 -4556 -1400 2025 4466 3517 -1348 -4844 -1742 2679 3065 641
1114 641 -365 -620 -1279 -115 2334 1724 -1766 -2053 1410 2827 217 -2105 -1646 -128 1458 2930
1130 2930 2034 -2529 -5361 -1638 4472 5285 760 -3719 -4864 -2716 2232 6455 4391 -3322 -7834
$$ packed form
1021C152L88J43l383n445Q96O939K669m589l033J586Q13j077J905J895l334l244
1037c719L447M591k618n324N14L699J317P6J01l401m822K330Q287K827o577o204
1053e476J33L223L664M204qp841p768L263J0019M724l525n807n168k202N864J0924
1069H223K712j0098j0846N07Q525P231K295m120r440o296N527J1890M611o406
1083D315q390l701J677O561Q016N14r439r005J987Q657N595j46m577o659l369
1098g964N106Q872J971o516n949p6L156L425K441r49m865l496L102M421L86k424
1114F41j006k55o59J164K449o10l490k87L463J417k610k322M59J518J586J472
1130B930q96m563k832L723O110Q13m525m479j145K148M948M223k064p713m512
$$ plain form
1145 -7834 -4598 2595 6791 5146 -784 -7208 -7953 -582 7967 8095 -155 -7747 -8048 -1971 5667 8651
1161 8651 3543 -5810 -9780 -4104 4967 8527 4267 -3137 -8087 -6052 1481 8141 6733 -1360 -7333
1176 -7333 -6182 167 5918 6564 1538 -5280 -6747 -1270 4942 5827 1382 -3291 -4386 -1997 2308
1191 2308 4546 2670 -1769 -3697 -1475 1773 2637 1256 -411 -1315 -973 616 1640 681 -988 -738
1207 -738 1055 1598 154 -1413 -1684 -79 2058 2738 791 -2688 -3821 -939 3529 4700 1157 -3625
1223 -3625 -4943 -2024 3036 5596 3348 -2834 -6704 -4211 2426 6894 4701 -1917 -6745 -5753 448
1238 448 6459 6735 522 -6880 -7756 -1115 6002 7244 2022 -5186 -8027 -3863 4098 8267 4003 -4062
1254 -4062 -7937 -4549 2329 6672 5278 -926 -6532 -6170 102 5981 5633 408 -4531 -5387 -1573 3519
$$ packed form
1145g834L236P193M196j645n930o424p45P371Q549J28q250p592l01O077P638K984
1161H651n108r353l970N676R071L560m260p404m950K035P533O660j408q093n973
1176g333J151O349N751O46n026o818j467N477O212Q85m445m673j095K389M305
1191B308K238j876m439j928K222L248Q64j381j667r04L42J589J024r59j669K50
1207g38J793N43j444j567k71J605K137O80j947l479j133K882M468J171l543m782
1223c625j318K919N060K560k248o182l870K493O637M468k193o618m828R92O201
1238D48O011K76o213p402q76O641P117J242n222p208k841M164P961M169m264q065
1254d062l875L388O878M343j394o204n606L62O272N879l48n225m939q56L814N092
$$ plain form
1270 3519 5292 2060 -3088 -4823 -1632 2444 3553 1667 -1217 -2816 -1721 1123 2561 1266 -917
1285 -917 -1295 -102 632 911 296 -544 -576 712 1698 319 -1554 -1493 588 1939 1833 368 -1897 -3161
1303 -3161 -765 3397 4345 545 -3713 -4025 -963 2862 5107 2980 -2897 -6612 -3399 3587 6358
1318 6358 3384 -1954 -5530 -5242 -295 6466 7179 -102 -7222 -6527 -341 4835 5868 2549 -3816 -7874
1334 -7874 -4045 4741 7735 2387 -4223 -5732 -3295 967 5349 5365 -889 -6965 -5303 1616 5411
1349 5411 3658 -26 -3357 -5028 -2151 3794 5888 1258 -4238 -4150 -726 1579 2754 2407 -465 -3451
1365 -3451 -2531 1429 2593 491 -871 -65 10 -648 -68 720 -49 -562 933 1726 -278 -2274 -1260
1382 -1260 875 1842 1692 833 -1860 -3586 -826 3582 3907 273 -2942 -3333 -1273 2133 4831 3079
$$ packed form
1270C519J773l232n148j735L191M076J109j886k884j599J095K844J438j295k183
1285i17l78J193P34K79o15q40l2J288R86j379j873O1K081J351j06j465k265j264
1303c161K396M162R48l800m258l12L062L825K245k127n877l715L213O986K771
1318F358k974n338l576K88M947O761P13p281p120O95O186N176J033l319o365m058
1334g874L829Q786K994n348o610j509K437M262M382J6o254o076J662O919L795
1349E411j753l684l331j671K877N945K094m630n496Q8L424K305J175l47k872k986
1365c451R20L960J164k102j362Q06P5o58N80P88p69n13J495P93k004j996J014
1382a260K135R67j50q59k693j726K760M408L25l634l215l91K060L406K698j752
$$ plain form
1398 3079 -2977 -5849 -2143 3309 4871 2560 -1156 -4744 -4933 630 6725 5605 -1598 -6155 -4494
1413 -4494 -141 4103 6191 2884 -4945 -8269 -2312 5518 6294 1677 -2529 -4818 -4690 292 6617
1428 6617 5690 -2089 -6686 -3458 1450 2995 3021 1715 -2679 -5536 -1857 4420 4446 -536 -3077 -1825
1444 -1825 -818 276 2498 2806 -1413 -4018 -922 2689 1337 -738 -99 253 -1268 -1076 1507 1446
1460 1446 -1133 -1266 1332 1373 -1396 -2019 506 1325 552 1050 774 -2205 -3521 138 4273 3277 -925
1477 -925 -3022 -2937 -1180 2347 5186 2527 -3626 -5540 -1648 2929 4435 2879 -790 -4940 -4796 964
1493 964 6080 4196 -1338 -4325 -3642 -957 3316 5688 2162 -4913 -6338 -729 4510 4519 1648 -2106
1509 -2106 -5136 -4173 2069 6666 3472 -2966 -4763 -2461 155 2792 4505 1764 -4229 -5578 -193
$$ packed form
1398C079o056k872L706N452J562k311l716l588j89N563O095j120p203m557J661
1413d494M353M244K088l307p829l324N957P830P76m617m206k289J28M982O325
1428F617r27p779m597L228M908J545K6j306m394k857L679O277K6m982k541J252
1444a825J007J094K222L08m219k605L096L611j352k075O39L52j521J92K583o1
1460A446k579j33K598M1k769o23K525Q19p73M98k76k979j316L659M135r96m202
1477i25k097Q5J757L527K839k659o153j914L892M577J506j556l669m150J44N760
1493I64N116j884n534k987O83K685M273K372l526p075j425N609N239Rk871l754
1509b106l030R63O242M597l194o438j797K302K616K637J713k741n993j349N385
$$ plain form
1524 -193 4081 2501 -115 -774 -1824 -2835 27 3852 2314 -2301 -2732 429 1006 -374 144 1404
1540 1404 -263 -1965 161 1798 -331 -2114 434 2472 322 -1802 -547 579 -481 196 2425
1555 2425 976 -2978 -3065 1319 3357 1229 -625 -1344 -2430 -1757 2428 4988 1239 -4020 -4116 -153
1571 -153 2508 3459 2680 -922 -5007 -4231 1815 5646 3226 -1324 -3898 -3928 -1061 3997 6018 1203
1587 1203 -4810 -5184 -725 3024 3961 2737 -1339 -5422 -3719 2617 5453 2160 -2201 -3100 -2436 -573
1603 -573 2950 4386 399 -4302 -3489 569 2511 1765 1023 -646 -3148 -2480 1984 3876 564 -2371
1619 -2371 -1023 152 -511 59 1935 981 -1912 -1576 1100 960 -1442 -663 1844 1117 -1353 -1038 379
1636 379 -475 -842 1732 2687 -849 -3477 -1403 1941 2002 922 645 -1353 -3781 -1637 3521 4362 217
$$ packed form
1524a93M274j580k616o59j050j011K862L825j538m615m31L161N77j380N18J260
1540A404j667j702K126J637k129j783K548K038k150k124J255J126j060O77K229
1555B425j449l954q7M384K038k128j854p19j086O73M185K560l749n259r6L963
1571a53K661R51p79l602m085P76O046L831k420m550k574l0K867N058K021m815
1587A203o013l74M459L749R37j224m076m083J703O336K836l293m361q99O64J863
1603e73L523J436l987m701Q13M058J942p46p42j669k502O68M464J892l312k935
1619b371J348J175o63N70J876r54k893L36K676j40k402P79K507p27k470L15J417
1636C79q54l67K574R55l536k628K074L344O1j080k77j998k428K144N158Q41m145
$$ plain form
1653 217 -3217 -2807 -815 1203 3472 3372 -1397 -5319 -2981 2548 4244 2144 -499 -2930 -4002 -1094
1669 -1094 4260 5194 62 -4498 -3893 -552 2408 4031 2681 -2015 -5229 -2603 2837 4437 1767
1684 1767 -1271 -2914 -3157 -640 3554 4039 -241 -3598 -2564 268 1580 1947 1642 -803 -3312 -1747
1700 -1747 1823 2489 135 -964 -545 -882 -665 1049 1715 -250 -1700 -138 1133 -352 -1231 415
1716 415 1462 24 -897 -23 -190 -1259 -109 2213 1411 -1423 -2322 -428 905 1121 1875 830 -2305
1733 -2305 -3553 -271 3598 2863 -327 -2022 -2435 -1622 1252 4125 2677 -2359 -4568 -1746 1934 3152
1749 3152 2409 131 -3346 -4140 -128 4393 4039 -326 -3367 -3121 -1141 2089 4204 2455 -2613 -4774
1765 -4774 -1557 2410 3460 1742 -467 -2810 -3053 -48 3606 3094 -617 -2782 -1928 -243 1188 2429
$$ packed form
1653B17l434M10J992K018K269j00m769l922K338N529J696k100k643k431j072K908
1669a094N354R34n132m560O05L341K960J623j350m696l214K626N440J600k670
1684A767l038j643k43K517M194M85m280l357J034K832J312L67l05k445k509J565
1700a747L570O66k354j099M19l37K17J714O66j965j450J562J271j485q79J646
1716D15J047j438r21Q74j67j069J150K322q02k834q99J894J333K16P54j045l135
1733b305j248L282L869p35l190j695m13Q13K874K873j448n036k209K822L680J218
1749C152p43k278l477p94M012M521l54m365l041K46J980L230K115j749n068k161
1765d774L217L967J050j718k209k343k43L005L654n12l711k165Q54J685J431J241
$$ plain form
1781 2429 1581 -1563 -3071 -840 1779 1702 236 -409 -775 -1270 -467 1442 1099 -560 -864 299 166
1798 166 -806 -397 723 615 -468 -46 22 -958 -1147 756 2065 568 -1620 -1442 -494 142 1335 2065
1816 2065 188 -2750 -2725 494 2670 2040 -10 -1852 -2615 -1608 2021 3947 1553 -2476 -3577 -1442
1832 -1442 1341 2952 2677 -284 -3520 -3599 430 3787 3025 -113 -2681 -3161 -1267 2386 4029 1662
1848 1662 -2506 -3710 -1269 1743 2939 1798 -542 -3044 -2540 429 3018 2139 -292 -2085 -2099 -742
1864 -742 1403 2522 903 -1666 -2222 -472 975 1286 763 -158 -1107 -1208 89 1317 483 -336 -236
1881 -236 98 -343 -479 133 511 102 213 280 -381 -1254 -390 1267 1462 261 -919 -1181 -959 185 1779
1900 1779 1815 -373 -2454 -1870 402 1996 2007 592 -1750 -2954 -1100 2224 3403 1006 -2026 -3062
$$ packed form
1781B429q48l144j508K231K619p7j466o45l66m95Q03J909l43j659l04J163j33
1798A66r72M09J120j08j083M22O8r80j89J903J309j497k188J78R48O36J193P30
1816B065j877k938K5L219K176o30k050j842p63J007L629J926k394m029j101K135
1832a442K783J611k75k961l236p9M029L357p62l138k568m80J894L653J643k367
1848A662m168j204K441L012J196j141k340k502N04K969K589q79k431j793j4J357
1864g42K145J119j619k569n56J750J447L11n23r21r49j01J297J228q34q19J00
1881b36L34m41j36O12L78m09J11O7o61q73Q64J657J95j201j180k62K22J144J594
1900A779L6k188k081N84K272J594J1j415k342j204J854L324J179k397l032j036
$$ plain form
1916 -3062 -1569 1042 3083 2529 -714 -3584 -2717 732 3282 2578 44 -2313 -3146 -1110 2248 3558
1932 3558 1209 -2178 -3136 -1311 1363 2816 2088 -747 -3066 -2113 621 2707 2023 -102 -1800 -2123
1948 -2123 -421 1470 2179 849 -1294 -1737 -818 807 1431 844 -270 -1123 -935 24 779 771 134 -265
1966 -265 -347 -307 -190 37 182 496 420 -161 -814 -955 -11 779 1258 513 -949 -1680 -904 776 1824 1197
1986 1197 -494 -1693 -1717 5 1891 2294 231 -2154 -2537 -627 1870 2615 1081 -1561 -2852 -1535
2002 -1535 1470 3133 1842 -1048 -2803 -2147 349 2671 2688 184 -2656 -2966 -490 2272 3022 957
2018 957 -1851 -3010 -1605 1185 2932 1945 -1006 -2730 -1898 582 2248 1907 13 -1661 -1863 -466
2034 -466 1368 1766 677 -839 -1359 -616 522 1044 872 -200 -953 -821 96 854 567 -142 -294 -50
$$ packed form
1916c062J493K611K041n54l243k870Q67L449K550p04k534k357q33K036L358J310
1932C558k349l387r58J825K674J453p28k835k319R53K734K086o84k125j698l23
1948b123J702J891P09j330k143m43R19J625O24n87j114q53J88R59P55qo37l99
1966b65q2M0J17K27J45L14p6n81o53j41R44P90M79p45j462p31P76J680J048o27
1986A197j691j199k4J722J886M03k063k385l83J910K497P45j534k642j291J317
2002a535L005J663j291k890j755O56K496K322J7k504k840l10K476K762P50k065
2018I57k808j159J405K790J747r87k951j724Q32K480J666l41j894j674k02J397
2034d66J834L98j089j516n20P43J138N22j72j072p53J32R17P58k87p09j52K44
$$ plain form
2052 -50 8 -340 -93 500 425 -166 -176 -316 -686 -358 891 1319 191 -1326 -1359 -158 779 1274 1148 -276
2072 -276 -2149 -1840 458 2312 1697 -372 -1664 -1939 -953 1319 2872 1409 -1833 -3004 -1041 1525
2088 1525 2450 1567 -470 -2481 -2444 186 2871 2455 -400 -2473 -2082 -377 1485 2529 1059 -1745
2104 -1745 -2865 -1222 1499 2568 1111 -966 -2193 -1456 369 2255 1913 -204 -1820 -1646 -77 1329
2120 1329 1693 599 -817 -1579 -804 453 1138 1024 117 -898 -934 -144 576 525 161 -39 12 -540 -408
2139 -408 61 167 221 369 393 -412 -1169 -318 1321 1340 -155 -1031 -793 -378 241 1301 1247 -521 -2053 -1156
2159 -1156 1060 1387 894 37 -1138 -2009 -917 1861 2778 422 -2271 -2148 -553 1133 2151 1838 -639
2176 -639 -3163 -2242 1281 2939 1550 -555 -1623 -1930 -999 1500 3031 983 -1981 -2648 -718 1136
$$ packed form
2052e0N8l48K47N93p5n91j0j40l70L28J249M28j128j517l3J201R37M95j26j424
2072b76j873L09K298J854o15k069j292k75R86K272J553j463l242j171J963K566
2088A525R25q83k037k011L7K630K685m16k855k073L91J705J862J044j470k804
2104a745j120J643K721J069j457k077j227P37J825J886l42k117j616J74J569J406
2120A329L64j094j416p62P75J257O85j14r07j015l6P90P20n1l64k00N1n52J32
2139d08M69J06N4J48K4q05p57Q51J639J9j495q76K38M15O19J060n4j768j532Q97
2159a156K216L27m93q57j175q71J092K778R17k356k693J23J595J686J018l13k477
2176f39k524R21L523J658j389k105j068l07R31K499J531k048k964o67J930J854
$$ plain form
2192 1136 1825 1484 -30 -2019 -2021 398 2361 1261 -657 -1414 -1035 -322 691 1471 582 -1075 -1280 -178
2210 -178 529 746 573 165 -737 -1023 27 848 622 45 -309 -376 -323 -25 455 368 265 238 -53 -693 -966
2231 -966 274 1298 984 -253 -846 -1107 -576 727 1806 1133 -1040 -1843 -641 541 1034 1307 495
2248 495 -1296 -2184 -625 1955 2199 298 -1435 -1720 -1063 601 2398 1772 -1108 -2915 -1136 1378
2264 1378 1980 1133 -79 -1500 -2129 -635 2153 2388 63 -1834 -1599 -629 450 1955 1978 -400 -2867
2281 -2867 -1792 965 1999 859 -324 -866 -1326 -763 927 1705 280 -1128 -945 -145 39 372 895
2298 895 507 -859 -1069 67 636 273 184 110 -225 -628 -90 478 256 -109 206 286 -664 -931 29 1127
2318 1127 864 -81 -789 -946 -399 848 1457 563 -1128 -1496 -413 628 1163 1200 68 -1564 -1898 -23
$$ packed form
2192A136O89l41j514j989kK419J963j100j918p57L79P13J013P80q89j657k05J102
2210a78P07K17j73m08r02k86J050Q21k26n77l54o7N3K98M80q7j03k7k91o40k73
2231i66J240J024l14j237n93k61N31J303J079o73k173q03J202J182M93K73q12
2248D95j791q88J559K580K44j901j733k85O57J664J797o26k880j807J779K514
2264A378O02q47j212j421o29J494K788K35k325j897K35R70J079J505K3k378k467
2281b867J075K757J034j140j183n42m60N63J690P78j425j408J83Q00J84L33N23
2298H95l88j366k10J136N69l63q9p4l35m03N38N68k22l65L15Q0r50k67R60J098
2318A127k63r45p08j57N47J247O09q94j691l68J083J041N35L7j132j632l34J875
$$ plain form
2336 -23 1694 1700 413 -1091 -2019 -1286 958 2779 1422 -1242 -2425 -1082 787 1532 1431 187 -1618
2353 -1618 -2078 -162 1908 1709 111 -1023 -1308 -1092 344 2041 1559 -891 -2244 -974 722 1196
2369 1196 900 210 -1236 -1656 -219 1598 1308 -317 -680 -437 -411 -281 623 1163 87 -1043 -696 93
2387 93 206 290 677 121 -848 -653 295 510 -130 3 479 76 -890 -726 267 783 546 32 -548 -1180 -655
2408 -655 1022 1502 305 -1093 -1221 -298 367 996 1031 -14 -1297 -1523 179 1267 1268 420 -721 -1848
2426 -1848 -1267 1055 2258 1008 -1334 -1947 -834 564 1640 1494 -240 -1920 -1651 396 1626 1189
2442 1189 264 -708 -1398 -1106 661 1905 1188 -903 -1804 -838 357 1228 1302 111 -1510 -1405 201 1310
2460 1310 694 -45 -381 -402 -637 -108 723 667 -179 -431 -362 -342 -171 518 798 -113 -938 -549 266 152 21
$$ packed form
2336b3J717Oj287j504r28P33K244J821j357k664j183J343J869P45j01j244j805
2353a618m60J916K070j99j598j134k85K16J436J697m82k450j353J270J696M74
2369A196k96o90j446m20J437J817k90j625l63K43K6J30R04N40j076j130L47P89
2387I3J13Q4L87n56r69J95R48K15o40J33M76m03r66J64R93N16k37n14n80o32N25
2408f55J677M80j197j398j28R23O65O29L5j045j283k26J702J088Jq48j141j127
2426a848N81K322J203j250k342o13J113J398J076j46j734j680K69K047J230m37
2442A189r25r72o90K92J767J244p17k091r01R66J195Q71P4j191j621J05J606J109
2460A310o16p39l36k1k35N29Q31n6q46k52O9K0J71O89K80r11q25L89Q15j14j31
$$ plain form
2481 21 304 389 -340 -786 -240 222 344 585 425 -611 -1342 -449 1150 1360 8 -908 -1031 -617 405
2500 405 1190 1183 -352 -1397 -1003 192 892 1067 635 -641 -1724 -989 1097 2107 875 -1077 -1666 -1050
2518 -1050 444 1707 1384 -361 -1821 -1244 440 1102 1010 302 -484 -1316 -871 660 1586 836 -552 -1222
2536 -1222 -953 57 1163 1430 62 -1311 -1230 249 996 724 137 -284 -594 -462 241 687 315 -120
2554 -120 -219 -224 -563 -84 783 617 -156 -650 -369 125 83 307 474 62 -441 -261 -48 53 203 683 551
2575 551 -808 -1223 -241 1076 1109 82 -770 -1089 -732 451 1332 633 -656 -1099 -690 245 804 977 490
2594 490 -771 -1396 -703 895 1576 728 -705 -1516 -1078 382 1622 1180 -553 -1527 -1104 212 1101 912
2612 912 48 -865 -1160 -467 817 1216 648 -311 -964 -1139 -171 1198 1177 22 -1162 -975 15 828 871
$$ packed form
2481B1K83Q5p29m46N46M62J22K41j60j036p31Q93J599K10j352r16j23M14J022
2500D05P85pj535j045L94J195P00J75m32j276j083P35K086J010j232j952n89O16
2518a050J494J263l23j745j460N77J684O62r2p08p86q32M45J531R26p50j388o70
2536a222K69J010J106K67j368j373Q1J479P47k72n87m21l10J32P03M46l72m35
2554a20r9nl39M79Q67j66p73m94K81M94m2K24J67m12n03J80K13J01J50M80j32
2575E51j359m15R82J317L3j027q52l19L57J183Q81o99j289m43M09R35N59J73m87
2594D90j261o25O93J598O81q48j433q11M38J460J240m42j733r74M23J316Q89j89
2612I12q64r13k95O93J284L99n68r59o53j75R68J369k1j155j184J87R90Q13M3
$$ plain form
2631 871 203 -623 -856 -171 394 443 1 135 70 -322 -513 5 723 512 -112 -364 -425 -189 219 583 264
2652 264 -218 -307 -17 -41 -74 229 648 100 -663 -803 -139 711 1023 347 -611 -1083 -586 710 1296 531 -660
2673 -660 -1050 -416 187 740 997 369 -802 -1332 -513 721 1253 744 -425 -1323 -1075 298 1569 1119
2691 1119 -403 -1444 -923 174 1024 893 80 -743 -793 -347 536 929 628 -151 -948 -813 -8 936 960
2710 960 107 -971 -991 -108 792 938 0 -640 -635 -107 266 429 227 150 -169 -392 -188 -12 457 390 200
2731 200 -316 -638 -249 441 522 222 -240 -210 -340 -312 117 448 457 61 -436 -579 -270 360 900 463 -732
2752 -732 -1321 -518 775 1042 272 -541 -766 -541 102 851 793 59 -760 -866 -268 582 1026 559 -400 -1238
$$ packed form
2631H71o68q26k33O85N65M9m42J34o5l92j91N18P18k11o24k52o1K36M08L64l19
2652B64m82q9K90k4l3L03M19n48p63j40O64Q50L12o76r58m72M97J296N86p65j191
2673f60l90O34O03N53K57o28j171n30Q19J234N32n09j169q98K48J373J271m50
2691A119j522j041N21J097Q50j31q13q23n0M46Q83L93l01p79p97J35Q05R44K4
2710I60q53j078k0Q83R00J46r38o40NN28L73J63k02p7l19k23K04J76M69o7j90
2731B00n16l22L89O90Q1l00m62L0j30K8M29L31Rl96m97j43L09O30N40m37j195
2752g32n89Q03J293K67p70q13k25K25O43P49n8p34q19j06N98Q50M44m67r59q38
$$ [...]
8191A22
##END NTUPLES=NMR FID
##END=
