##TITLE=1H_CA-8570-8
 CD3CN, 8 sc, 
 14.3.2019
##JCAMPDX= 6.0         $$ Bruker NMR JCAMP-DX V2.0
##DATA TYPE= NMR FID
##DATA CLASS= NTUPLES
##ORIGIN= UXNMR, Bruker Analytische Messtechnik GmbH
##OWNER= root
$$ XWIN-NMR		Version 3.5
$$ Thu Mar 14 13:53:39 2019 Russian Standard Time (UT+4h)  she@DPX200
##.OBSERVE FREQUENCY= 200.1315
##.OBSERVE NUCLEUS= ^1H
##.DELAY= (6, 6)
##.ACQUISITION MODE= SIMULTANEOUS
##.ACQUISITION SCHEME= undefined
##.AVERAGES= 8
##.DIGITISER RES= 18
##SPECTROMETER/DATA SYSTEM= spect
##.PULSE SEQUENCE= zg30
##.SOLVENT NAME= CD3CN
##.SHIFT REFERENCE= (INTERNAL, CD3CN, 0, 15.7039)
##AUDIT TRAIL= $$ (NUMBER, WHEN, WHO, WHERE, WHAT)
$$ ##TITLE= Audit trail, XWIN-NMR		Version 3.5
$$ ##JCAMPDX= 5.01
$$ ##ORIGIN= Bruker BioSpin GmbH
$$ ##OWNER= she
$$ F:/spectra/data/she/nmr/H-F/1/audita.txt
$$ ##AUDIT TRAIL=  $$ (NUMBER, WHEN, WHO, WHERE, WHAT)
(   1,<2019-03-14 13:52:15.43 +0400>,<she>,<DPX200>,
      <created by zg, POWCHK disabled, PULCHK disabled
       configuration hash MD5:
       00 E9 B6 7A A2 85 ED C7 34 08 36 98 17 FE 4E 26
       data hash MD5: 16K
       F2 91 4D 6E 6D 26 C3 69 58 B4 27 83 BB 54 58 C4>)
$$ ##END=
$$ 
$$ hash MD5
$$ 16 47 C3 8D B5 33 03 CA 1C CE 05 71 75 F1 4E 9B
##$RELAX= 
##$RELAX= 
##$RELAX= 
##$RELAX= 
##$RELAX= 
##$RELAX= 
$$ Bruker specific parameters
$$ --------------------------
##$DU= <F:/spectra>
##$EXPNO= 1
##$NAME= <H-F>
##$PROCNO= 1
##$TYPE= <nmr>
##$USER= <she>
##$AMP= (0..31)
100 100 100 100 100 100 100 100 100 100 100 100 100 100 100 100 100 100 
100 100 100 100 100 100 100 100 100 100 100 100 100 100 
##$AQSEQ= 0
##$AQ_mod= 1
##$AUNM= <au_zg>
##$AUTOPOS= <>
##$BF1= 200.13
##$BF2= 200.13
##$BF3= 200.13
##$BF4= 200.13
##$BF5= 200.13
##$BF6= 200.13
##$BF7= 200.13
##$BF8= 200.13
##$BYTORDA= 1
##$CFDGTYP= 0
##$CFRGTYP= 5
##$CHEMSTR= <none>
##$CNST= (0..31)
1 1 145 1 1 1 1 1 1 1 1 1 1 1 1 1 1 1 1 1 1 1 1 1 1 1 1 1 1 1 1 1 
##$CPDPRG= <>
##$CPDPRG1= <>
##$CPDPRG2= <>
##$CPDPRG3= <>
##$CPDPRG4= <mlev>
##$CPDPRG5= <mlev>
##$CPDPRG6= <mlev>
##$CPDPRG7= <mlev>
##$CPDPRG8= <mlev>
##$CPDPRGB= <>
##$CPDPRGT= <>
##$D= (0..31)
0 1.2 0 0 0 0 0 0 0 0 0 0.03 0 0 0 0 0 0 0 0 0 0 0 0 0 0 0 0 0 0 0 0 
##$DATE= 1552557134
##$DBL= (0..7)
120 120 120 120 120 120 120 120 
##$DBP= (0..7)
150 150 150 150 150 150 150 150 
##$DBP07= 0
##$DBPNAM0= <>
##$DBPNAM1= <>
##$DBPNAM2= <>
##$DBPNAM3= <>
##$DBPNAM4= <>
##$DBPNAM5= <>
##$DBPNAM6= <>
##$DBPNAM7= <>
##$DBPOAL= (0..7)
0.5 0.5 0.5 0.5 0.5 0.5 0.5 0.5 
##$DBPOFFS= (0..7)
0 0 0 0 0 0 0 0 
##$DE= 6
##$DECBNUC= <off>
##$DECIM= 24
##$DECNUC= <off>
##$DECSTAT= 4
##$DIGMOD= 1
##$DIGTYP= 9
##$DL= (0..7)
0 120 120 120 120 120 120 120 
##$DP= (0..7)
150 150 150 150 150 150 150 150 
##$DP07= 0
##$DPNAME0= <>
##$DPNAME1= <>
##$DPNAME2= <>
##$DPNAME3= <>
##$DPNAME4= <>
##$DPNAME5= <>
##$DPNAME6= <>
##$DPNAME7= <>
##$DPOAL= (0..7)
0.5 0.5 0.5 0.5 0.5 0.5 0.5 0.5 
##$DPOFFS= (0..7)
0 0 0 0 0 0 0 0 
##$DQDMODE= 0
##$DR= 18
##$DS= 0
##$DSLIST= <SSSSSSSSSSSSSSS>
##$DSPFIRM= 0
$$ [...]
##$SUBNAM2= <"">
##$SUBNAM3= <"">
##$SUBNAM4= <"">
##$SUBNAM5= <"">
##$SUBNAM6= <"">
##$SUBNAM7= <"">
##$SUBNAM8= <"">
##$SUBNAM9= <"">
##$SW= 24.9337058887773
##$SWIBOX= (0..15)
0 0 2 0 0 0 0 0 0 0 0 0 0 0 0 0 
##$SW_h= 4990.01996007984
##$TD= 16384
##$TD0= 1
##$TE= 0
##$TE2= 300
##$TE3= 300
##$TEG= 300
##$TL= (0..7)
0 120 120 120 120 120 120 120 
##$TP= (0..7)
150 150 150 150 150 150 150 150 
##$TP07= 0
##$TPNAME0= <>
##$TPNAME1= <>
##$TPNAME2= <>
##$TPNAME3= <>
##$TPNAME4= <>
##$TPNAME5= <>
##$TPNAME6= <>
##$TPNAME7= <>
##$TPOAL= (0..7)
0.5 0.5 0.5 0.5 0.5 0.5 0.5 0.5 
##$TPOFFS= (0..7)
0 0 0 0 0 0 0 0 
##$TUNHIN= 0
##$TUNHOUT= 0
##$TUNXOUT= 0
##$USERA1= <user>
##$USERA2= <user>
##$USERA3= <user>
##$USERA4= <user>
##$USERA5= <user>
##$V9= 5
##$VALIST= <valist>
##$VCLIST= <CCCCCCCCCCCCCCC>
##$VD= 0
##$VDLIST= <DDDDDDDDDDDDDDD>
##$VPLIST= <PPPPPPPPPPPPPPP>
##$VTLIST= <TTTTTTTTTTTTTTT>
##$WBST= 1024
##$WBSW= 4
##$XGAIN= (0..3)
0 0 0 0 
##$XL= 0
##$YL= 0
##$YMAX_a= 472258
##$YMIN_a= -384934
##$ZGOPTNS= <>
##$ZL1= 120
##$ZL2= 120
##$ZL3= 120
##$ZL4= 120
##$ABSF1= 10
##$ABSF2= 0
##$ABSG= 5
##$ABSL= 3
##$ALPHA= 0
##$AQORDER= 0
##$ASSFAC= 0
##$ASSFACI= 0
##$ASSFACX= 0
##$ASSWID= 0
##$AUNMP= <proc_1d>
##$AZFE= 0.1
##$AZFW= 0.1
##$BCFW= 1
##$BC_mod= 2
##$BYTORDP= 1
##$COROFFS= 0
##$CY= 11.3945322036743
##$DATMOD= 1
##$DC= 2
##$DFILT= <>
##$DTYPP= 0
##$F1P= 18.9103706918063
##$F2P= -1.10871071338519
##$FCOR= 0.5
##$FTSIZE= 0
##$FT_mod= 4
##$GAMMA= 1
##$GB= 0.15
##$INTBC= 1
##$INTSCL= 1
##$ISEN= 128
##$LB= 0.24
##$LEV0= 0
##$LPBIN= 0
##$MAXI= 10000
##$MC2= 0
##$MEAN= 0
##$ME_mod= 0
##$MI= 1.114404
##$NCOEF= 0
##$NC_proc= 0
##$NLEV= 6
##$NOISF1= 3.799351
##$NOISF2= 2.8
##$NSP= 1
##$NTH_PI= 0
##$NZP= 0
##$OFFSET= 15.70392
##$PC= 1
##$PHC0= -9379.743
##$PHC1= 16.40026
##$PH_mod= 1
##$PKNL= yes
##$PPARMOD= 0
##$PSCAL= 0
##$PSIGN= 0
##$REVERSE= no
##$SF= 200.130013532006
##$SI= 16384
##$SIGF1= 3
##$SIGF2= 2
##$SINO= 400
##$SIOLD= 16384
##$SREGLST= <1H.CDCl3>
##$SSB= 0
##$STSI= 0
##$STSR= 0
##$SW_p= 3612.71676300578
##$SYMM= 0
##$S_DEV= 0
##$TDeff= 0
##$TDoff= 0
##$TI= <>
##$TILT= no
##$TM1= 0
##$TM2= 0
##$TOPLEV= 0
##$USERP1= <user>
##$USERP2= <user>
##$USERP3= <user>
##$USERP4= <user>
##$USERP5= <user>
##$WDW= 1
##$XDIM= 8192
##$YMAX_p= 0
##$YMIN_p= 0
$$ End of Bruker specific parameters
$$ ---------------------------------
##NTUPLES= NMR FID
##VAR_NAME=  TIME,          FID/REAL,        FID/IMAG
##SYMBOL=    X,             R,               I
##VAR_TYPE=  INDEPENDENT,   DEPENDENT,       DEPENDENT
##VAR_FORM=  AFFN,          ASDF,            ASDF
##VAR_DIM=   8192,          8192,            8192
##UNITS=     SECONDS,       ARBITRARY UNITS, ARBITRARY UNITS
##FACTOR=    0.0002004,     1,               1
##FIRST=     0,             0,               0
##LAST=      1.6414764,     0,               0
##MIN=       0,             -384934,         0
##MAX=       1.6414764,     472258,          0
$$ Real data points
##PAGE= N=1
##DATA TABLE= (X++(R..R)), XYDATA
0@%%%JrJ6j6K0k8L4m2N6p3R0j06J25j53J85k17K57l06L57m13M77n52O34p19Q17
28D35r32J055j188J333j497J681j874K088k329K588k870L184l528L908m327M788
44B515n303N883o531P262q104R077j0211J1564j3208J5253j7878K1390k6372L4027
58A9364m7425P7557k59436N7366N68551j99130l37549j4188J45194j23013L4226
69g8483K91299M7796m16361j56821L43650K10805k71326j28190K61257Q4869l27558
80a39063j10230L09390J57684k14441p6603J44044q8819k41586J91624M35614
90C67614r1456n41989j19103M23032K29237j88276j10284N6998j20775j42577
100b37579K52653L27808j89919m18904M8935L46521M192k26151O4583J88763j42615
$$ plain form
0 0 0 0 0 1 -8 8 -8 12 -16 18 -24 32 -41 49 -57 68 -85 100 -117 140 -166 191 -222 255 -297 337 -382 435
28 435 -497 558 -630 703 -794 887 -987 1101 -1228 1360 -1510 1674 -1854 2054 -2273 2515
44 2515 -2788 3095 -3436 3826 -4278 4799 -5412 6152 -7056 8197 -9681 11709 -14663 19364
58 19364 -28061 49496 -209940 -152574 415977 216847 -120702 -134890 10304 -112709 -78483
69 -78483 212816 260612 -155749 -312570 31080 241885 -29441 -157631 103626 188495 -139063
80 -139063 -249293 60097 217781 3340 -73263 70781 -18038 -259624 -68000 367614
90 367614 276158 -265831 -384934 38098 267335 79059 -31225 25773 -95002 -237579
100 -237579 15074 342882 152963 -265941 -217006 129515 133707 -92444 -27861 160902 18287
111A8287k29399J39957K37530j03755j66132J42864J04402k63737j59664L40290
121F0643L03706k63177l79000Q9026K75014K479p0115R4019m5792k87646k4404
132b45247L90842J83983l19840k56648J74552J78594j10122m8786J66211o054
142A07485k47390k5580K58838N0275k19822q659K21715m6289k90141K5208L40694
153A66334O7953k84612j22631J50768N0280p0194J01668J29604j90829k67974
163b69633J35749L39173p520k70963n3020J39301j1333p3139J25024J11656j76930
174a1635j80755J46914J92720j08696j50968J23944J28916j65064j61048J59972
184b5700J96191r8229j63397N1302P1081q8664o498J86424L7265k46228j27271
$$ plain form
111 18287 -211112 -71155 166375 62620 -103512 39352 143754 -119983 -279647 60643
121 60643 364349 101172 -277828 -188802 86212 88691 18576 112595 66803 -220843 -245247
132 -245247 145595 329578 9738 -246910 -72358 106236 -3886 -52672 113539 107485
142 107485 -139905 -165485 93353 143628 -76194 -84853 136862 90573 -199568 -174360 166334
153 166334 234287 -50325 -172956 -22188 28092 -42102 59566 189170 -1659 -269633
163 -269633 -133884 205289 197769 -73194 -126214 13087 1754 -71385 53639 165295 -11635
174 -11635 -192390 -45476 147244 38548 -112420 11524 140440 -24624 -185672 -25700
184 -25700 170491 72262 -91135 -39833 31248 -57416 -63914 122510 159775 -86453 -213724
195b13724K04321J73031j06200j18543N4792J5192r6961M0851J79075j3778k15885
206i7829m1871J85499N4331j42833j8300J42441j0909j71813l208J75779L1633
217A02920j34339k0469R0838l5932r7939Q2676J49784p0193j83731J4700J54703
228E3018J7099q7178J4677M7145q0080o7462J16690J15196r9802j34461O3067
239d2091J09891n3238p6083P5628P0708r4965q8661Q4117R3493n7386o7140N1556
251E829L2532p8057k5022J07422M8729j05546o9871P3449N7756m7965j7689N6493
263C8060j2398q8787Q663J09176J4477r9581k5328P7548J2325p0147N032Q1957
275E0997m930r0734r886P8404J5684n4273J087M3301k6594n4535L6431P2059k4829
$$ plain form
195 -213724 -9403 163628 57428 -61115 -6323 8869 -88092 -47241 131834 118056 -97829
206 -97829 -139700 45799 100130 -42703 -61003 81438 70529 -101284 -104492 71287 102920
217 102920 -31419 -51888 38950 3018 -94921 -12245 137539 67346 -116385 -101685 53018
228 53018 70117 -17061 -2384 44761 -35319 -102781 13909 129105 29303 -105158 -42091
239 -42091 67800 14562 -61521 14107 84815 -10150 -98811 -14694 78799 21413 -45727 5829
251 5829 38361 -39696 -64718 42704 91433 -14113 -83984 -10535 47221 -744 -18433 38060
263 38060 25662 -63125 -54462 54714 69191 -30390 -55718 21830 34155 -35992 -30960 50997
275 50997 46067 -44667 -54553 23851 39535 -14738 -13651 29650 3056 -51479 -15048 57011 32182
288C2182p3059Q548N4484q154l3729K4877K8822m2056l8908M6524M8425m0295
300G661m8678L5468M3200l6737m1189L7872M3845l1646m1829K0280K9275j6306
312A216j1943K5100L813l9616r654M5362K2185l7164k6668K2613J7168j5279j601
325d468K0166q537l0964R194L8984l669m1016k701L8182Q163l2998j2020K4655
338B971J3098j4382p703O716k835p318J2294J5115j4499k3403Q412K5199P67j8070
352c638m795O003L48K298R651k363j9188n016K2767J5306j8098k2486Q131K2801
366A1721J457j6571o860O890O539K052l30o101p853L650J2227K799j0577q592
380i549L699R394M455l555q037m772M378J0607L566j0737j1818M996J6028L928
$$ plain form
288 32182 -40877 -32329 22155 14001 -19728 5149 33971 -8085 -46993 -469 47956 7661
300 7661 -41017 -5549 37651 914 -40275 -2403 41442 9796 -32033 -11753 17522 1216
312 1216 -10727 14373 18186 -21430 -31084 14278 36463 -701 -27369 -4756 12412 -2867 -4468
325 -4468 15698 7161 -23803 -14609 24375 20706 -20310 -23011 15171 23334 -9664 -21684 2971
338 2971 16069 1687 -6016 700 -2135 -9453 2841 17956 3457 -19946 -11534 13665 14432 -3638
352 -3638 -8433 -2430 -2082 216 9867 7504 -11684 -16700 6067 21373 3275 -19211 -11080 11721
366 11721 13178 -3393 -10253 -3363 3176 5228 4898 -1203 -9056 -5406 6821 9620 -957 -9549
380 -9549 -5850 3544 7999 4444 -3593 -8365 -3987 6620 10186 -551 -12369 -7373 8655 12583
394A2583j3613j0958N646J2517L640q629r329J095R357N196m053o575k249L056
408b316N204K508l958o469o68O573O155k218q696m460O889R421j153j0390n537
423i115O462R711M00r102o581M534R013R29o915m693J851N409L176k550n870j366
439d707M779L916j513l064j841k01K741M041k60o799m049O544Q740l489j1980
454g142j111J2185N540r171p100M025M612m82J004O64o323l884Q508Q236p441
469B120j0876M584J0669k738q824K954P176m716o285P954N815j2084o947J6303
483E105J0410j8549j5201J6547J8638j1113j6631N667R527o009k111J3085k89
496I076k1329l971K5694R491k3996j1586K1052Q508k0766m443K2975K602k4371
$$ plain form
394 12583 -1030 -11988 -6342 6175 9815 1186 -8143 -7048 2309 7505 3452 -3123 -5372 -2316
408 -2316 2888 5396 1438 -5031 -5699 874 7029 4811 -3885 -8345 -1456 7965 6812 -3578 -9115
423 -9115 -2653 7058 7458 -1644 -8225 -3691 5322 6251 -664 -5357 -3506 1903 5079 2529 -3341 -4707
439 -4707 72 3988 2475 -589 -2430 -2631 110 4151 3891 -2908 -6957 -413 8327 4838 -7142
454 -7142 -8253 3932 9472 301 -6799 -2774 1838 1356 2360 3024 -3299 -7183 1325 9561 2120
469 2120 -8756 -4172 6497 3759 -5065 -2111 5065 349 -5936 2018 7833 -4251 -11198 5105
483 5105 15515 -3034 -18235 -1688 16950 5837 -10794 -5127 4400 -1609 -3720 9365 9076
496 9076 -12253 -16224 9470 18961 -5035 -16621 4431 12939 -7827 -12270 10705 13307 -11064
509a1064j235K4194k479k6355P433L2812p474m0160L86M0974P742l2259p146K1023
523F392n062j9205K0254K9792k6366m2429J9986M6121j1836l8361J1547K9637
535B0470j9983k8933K7882L4065k8214l5761K6309L0245l1460k5901M3196L2094
547D4009m9863m4210M2002M7309k7323l2271K3791J0260m0438k069O4109J5100
559E0406p2173l4108N8993L6868m1909j9923M1413J533n7281P40P1042Q962o8013
572b3450j2009N6903r96n7570J6149P3730j3945q5985l518P5654J2038n0711O521
585g189L9035l9327n7561N5141Q8905l9100r9023J2535P6384r032m6572L5798
597I994M1244o5220o2409O8647Q1076m9989p2828M0112M8294n7233m0032Q3666
$$ plain form
509 -11064 -12299 11895 9416 -16939 -9506 23306 15832 -24328 -23942 17032 24774 -7485 -14631 6392
523 6392 1330 -17875 2379 32171 5805 -36624 -16638 29483 17647 -20714 -9167 20470
535 20470 487 -28446 -564 33501 5287 -30474 -4165 26080 -5380 -31281 11915 44009
547 44009 -5854 -50064 -8062 39247 11924 -20347 3444 13704 -26734 -28803 35306 50406
559 50406 -21767 -55875 3118 39986 -1923 -21846 19567 21100 -36181 -35441 35601 44563 -23450
572 -23450 -35459 21444 20448 -37122 -20973 52757 38812 -47173 -50691 24963 37001 -13710 -7189
585 -7189 31846 -7481 -65042 -9901 79004 39904 -59119 -46584 29800 20768 -25804 9994
597 9994 51238 -13982 -76391 -7744 73332 23343 -49485 -9373 38921 -18312 -58344 25322
609B5322N8493q6319p7842O2147O6562m4044k9184O2101M006j04109j9876J26813
621D4070N7751j04959p0494O4510L8166n3762P147Q6645j9443j25655q378J28244
633D3842L5276r6370k2912P3081j6723q9392L7366J24483j8126j30664j0481R6629
645B6009K396o2510M3443P3006q0179j19200O6799J46723k1083j19613J664O5622
657B3077l8660m4174R5430P7395j13167j22356P9100J23343m1889p7754N1475
668A1820L9480r9390n1266J29374R1713j07596j03388O7120O2925o5601j4114
679c8923J14623J3496j60481o0559J49322R3763r4167o4313O2218k655r5558L6487
691d6747J58462m354j79347m8301J36392N1962q3508L148Q5155n6033j37557N0209
$$ plain form
609 25322 83815 -2504 -80346 -18199 48363 4319 -24865 37236 41242 -62867 -82743 44070
621 44070 101821 -3138 -73632 -9122 29044 -24718 -17571 69074 49631 -76024 -84402 43842
633 43842 79118 -17252 -40164 32917 16194 -73198 -35832 88651 70525 -60139 -70620 26009
645 26009 28405 -34105 9338 82344 2165 -117035 -50236 96487 75404 -44209 -42545 23077
657 23077 -15583 -59757 35673 113068 -99 -122455 -43355 79988 38099 -39655 11820
668 11820 51300 -48090 -99356 30018 121731 14135 -89253 -22133 40792 -24809 -38923
679 -38923 75700 89196 -71285 -131844 17478 111241 17074 -47239 14979 12324 -83234 -46747
691 -46747 111715 107361 -71986 -120287 16105 68067 -15441 -12293 72862 16829 -120728 -70519
703g0519J74326k755j48898j7229R2578k5287p5449Q5858J19465r5702j68920
714a32532M6890J58695m752r4740K8582M9218r8909p3789J39676J35884j08647
725D5576j57693M9537J09450l8768m4592R3031L5228j50934q4161J46957J23845
736A27476r2913r8385O1255L3443r6451l422J58925M0272j74482r1793J25076
747a0999Q6285p2932k0025Q4937l5825j51045K1655J93754L8723j62879o5112
758i3463R6039J8172p3304N2749J20977p0621j79457K3196J77358K2007j17225
769b3572j517P2154o6728r5475J05891J55309p5384j73661J9998J23363j5581
780B4797o1274P5442N8942j33748j14919J25570J56847o7001j28530L4122N9278
$$ plain form
703 -70519 103807 101052 -47846 -65075 27503 2216 -73233 12625 132090 36388 -132532
714 -132532 -85642 73053 68301 -26439 2143 51361 -47548 -121337 18339 154223 45576
725 45576 -112117 -62580 46870 8102 -36490 56541 91769 -59165 -143326 3631 127476
736 127476 34563 -63822 -2567 30876 -65575 -68997 89928 130200 -44282 -136075 -10999
747 -10999 75286 2354 -17671 67266 31441 -119604 -97949 95805 134528 -28351 -93463
758 -93463 2576 20748 -52556 193 121170 50549 -128908 -105712 71646 93653 -23572
769 -23572 -25089 47065 -19663 -115138 -9247 146062 70678 -102983 -82985 40378 24797
780 24797 -36477 38965 97907 -35841 -150760 -25190 131657 64656 -63874 -29752 29526
791B9526p1409k6753J37998O2420j57736j15144J12459J13728o2382n4012P1541
802D0236L051j30760j5391J68939O7957j41492q8764Q4711M4259o8970J7950J15615
814I7341l0479j67904j4744J63316N4395j07390l3448O7329k9437r0407O5985
825b5443J45589l9297j64609r752J23095J4532p0113L6845O7528q7778j14988
836a24391Q3256J50649l5829j27775J0353P0419m3223m4346R9450P6203j16445
847a679j21036P8695J20016l7495p0426M6650K7597r7343l7360J30795Q0457j10710
859H161r7227O5810O2220n4183j2371R0852K424j32211l6775J28758O6654q6532
871E580m9745N7564J508p6583K5800J19168n667j33709l0272J03057L2998o4243
$$ plain form
791 29526 -41883 -68636 69362 131782 -25954 -141098 -28639 85089 22707 -31305 40236
802 40236 43287 -87473 -102864 66075 134032 -7460 -96224 -11513 32746 -36224 -18274 97341
814 97341 66862 -101042 -115786 47530 101925 -5465 -38913 28416 -1021 -91428 -25443
825 -25443 120146 80849 -83760 -93512 29583 44115 -25998 10847 78375 -9403 -124391
836 -124391 -41135 109514 73685 -54090 -43737 26682 -16541 -60887 38563 114766 -1679
847 -1679 -122715 -44020 75996 38501 -31925 14725 42322 -55021 -92381 38414 118871 8161
859 8161 -89066 -23256 38964 -15219 -27590 63262 65686 -66525 -103300 25458 92112 5580
871 5580 -44165 13399 14907 -61676 -35876 83292 77625 -56084 -86356 16701 49699 -14544
883a4544N004O2335m2750r5716M0204J20930q055j04863q829O6025j4590m9325
895d4174N3717P1951o5096j02587L9412J00708j2700o6019K1228L6825n7583m4363
907f8681Q1834P4591o8310q6943L7471O3677k8947k9799N3232K1357q1475m2447
919g4440Q1725O1329n7293n0817M0781K0830n3230m194P9741J5961q7726l6806
931f4139O8396L5996m5573j0939M6276j2048o8549J0227Q4502J0063p5107k0526
943d1421N1406O416m0104J7594N1638k6845o8547J5006O8760j973n1045O335L6281
956B3501k4533l9724L5922N3988k8891n8414J4762M4849j2819k7893K7221K5111
968C3080m2340l7076M1883M7056k8053m0897J8272K3861k3688j3083L7400J6853
$$ plain form
883 -14544 -9540 52795 10045 -85671 -45467 75463 67408 -37455 -46284 19741 5151 -44174
895 -44174 9543 81494 16398 -86189 -46777 53931 41231 -24788 -3560 33265 -24318 -68681
907 -68681 13153 87744 19434 -67509 -30038 33639 4692 -25107 28125 49482 -31993 -74440
919 -74440 7285 68614 11321 -39496 1285 22115 -31115 -35309 44432 60393 -27333 -64139
931 -64139 4257 40253 -5320 -16259 30017 17969 -50580 -40353 44149 54212 -20895 -41421
943 -41421 9985 16401 -23703 -6109 45529 18684 -49863 -34857 33903 31930 -19115 -12780 23501
956 23501 -1032 -40756 -4834 49154 20263 -38151 -23389 21460 8641 -19252 7969 33080
968 33080 -9260 -46336 -4453 42603 14550 -26347 -8075 15786 -7902 -20985 16415 33268
980C3268m3595k6305L6670K7152k7027j7231K6545P597l5029p503M1169J3843
992B9554l6756j6133K7748Q610k4942K028L0862m674l8181j966L7508Q098k8163
1005f407n944K0046k838k0595J0318K6523r844l0025N322K6698m024k0777P560
1018c987J8467j1814k0218J2124K1422r289j8219P930J3753j0947j2061J4694
1030A855J4737j5185j7720J1259J6569p214j1187P175N875j0751m118J4206N866
1043A1367j4476p833J2003P518r795n481R027L993r479l245R362K936q935j921
1057d959R171O85j0116o55J0544K168r331l377O556K541l586j52K530k154l928
1072d063L246N659k295o641Q58N852L94m603l00L026o74j701J847J493k986k125
$$ plain form
980 33268 -10327 -36632 38 27190 163 -17068 9477 17074 -17955 -25458 15711 29554
992 29554 -7202 -23335 4413 13023 -11919 -9891 20971 16297 -21884 -23850 13658 21756 -6407
1005 -6407 -12351 7695 4857 -15738 -5420 21103 11259 -18766 -13444 13254 9230 -11547 -3987
1018 -3987 14480 2666 -17552 -5428 15994 6705 -11514 -3584 10169 -778 -12839 1855
1030 1855 16592 1407 -16313 -5054 11515 4301 -6886 289 6164 -4587 -8705 5501 11367
1043 11367 -3109 -10942 1061 8579 -1216 -6697 2330 6323 -3156 -6401 2961 5897 -3038 -4959
1057 -4959 4212 4897 -5219 -5874 4670 6838 -2493 -5870 686 3227 -359 -511 2019 -135 -4063
1072 -4063 -817 4842 2547 -4094 -3236 2616 3010 -1593 -1893 1133 459 -1242 605 2098 -888 -3013
1088c013L132L239k100l851L83L365J327k136j881K05J633Q32j07j008j462K43
1104a199K266Q33j723j786L41J554J197l98j917r06J267J801j62j045j155k92
1120a324J341J874o11k769p42K321K111r53k413r64K118J635p57j420l11M14P87
1137C37N86l21j371o63J424J136l34j109j018K50J775J337j810k212P68K252M24
1154A451j210j197o0O74R56N43r61j781J09K647J025k905j549K643J882k775j229
1171a737K544M41k936M76M044j250n115P64O232L46o270j503N309J614m210k16
1187a467M259j722n987K952P690k689q377K221Q020l019p279M360P804n267q651
1202g152M928Q751m681p832N922P331q262q946R995J1209r134j1918P551R397
$$ plain form
1088 -3013 119 3358 1258 -2593 -2210 1155 2482 346 -1535 -1330 303 1135 1028 20 -1442 -1199
1104 -1199 1067 1900 177 -1609 -1268 286 1483 1085 -832 -1738 -471 1330 1168 123 -1032 -1324
1120 -1324 17 1891 1280 -1489 -2231 90 2201 1248 -1165 -2129 -11 1624 867 -553 -864 -450 337
1137 337 923 602 -769 -1432 -8 1128 794 -315 -1333 -1083 692 2029 219 -1993 -1225 1027 1451
1154 1451 241 -956 -1016 -342 614 1157 196 -1585 -1476 1171 2196 -709 -2258 385 2267 -508 -1737
1171 -1737 807 1248 -1688 -1212 2832 1582 -3533 -2769 3463 3809 -2461 -3964 1345 2959 -1251 -1467
1187 -1467 2792 1070 -4917 -1965 5725 3036 -5341 -3120 4900 1881 -5398 -1038 6766 1499 -7152
1202 -7152 -2224 6527 1846 -5986 -64 7267 -995 -9941 54 11263 2129 -9789 -2238 7159
1216G159p562o209J0886N194j4807p355J5659R890j3666r120J2237N417j4137
1229f414l154J8642M617k1225p482J9584P435j7021k908J8069j883k3069J778
1242a3031K7115K155k5544l697K0060n02j8210P810K2941j0825k9739P131L1039
1255A6703k787k5349N099J9897j3690k2157K0622K9603j8850l3332J2271K8120
1267A6150j1188j9258J9034J7744k8945k5166L0197L2245k2473k9428J7423J8176
1279A4511k3286j1428L6047J6342m2199k5972L5517K7036k5992j5594K7013L765
1291A5760l9880m207N0530J5545m7320k1801L4884J2655l0055L378M0935r511
1303B0913n5703N0N7706J0894m4652o469L2769j1558l7768K4427N4582j9077o3035
$$ plain form
1216 7159 -403 -6612 4274 9468 -5339 -12694 2965 12855 -811 -9931 2306 7723 -6414
1229 -6414 -9568 9074 13691 -7534 -15016 4568 12003 -5018 -7926 10143 8260 -14809 -13031
1242 -13031 14084 16239 -9305 -13002 7058 6556 -11654 -3844 19097 8272 -21467 -14336 16703
1255 16703 13916 -11433 -6334 13563 -127 -22284 -1662 27941 9091 -24241 -11970 16150
1267 16150 4962 -14296 4738 22482 -6463 -31629 -1432 30813 8340 -21088 -3665 14511
1279 14511 -8775 -20203 15844 32186 -10013 -35985 -468 26568 576 -15018 11995 15760
1291 15760 -24120 -28327 22203 37748 -9572 -31373 3511 16166 -13889 -10511 30424 20913
1303 20913 -34790 -34740 22966 33860 -10792 -17261 15508 3950 -33818 -9391 45191 26114 -36921
1316c6921M447N2309j600l4958J8036L2414l7710m8381L9659O3410k4256n7913
1328c1464J3417L6752k4342k4156M7928L4432n8717n4058M6228N7078k8185l6941
1340b2028K9584J6107n2795j7511P2084L7884o6319m9562M4749L4174l5992p227
1352a6852N4456k078p9726j5331Q2715L5097o0461k8976M0700K68m9559K0531
1364a9216P7643j1361r1986j2935P5683J8522m8750N982M4563l5356o8559L7644
1376b8126R1471j4259q3730k291N3826j3499l7379M7295N4180o1710q3465M2749
1388c4938Q7687j6779n9313K0163K9834n3904l3150Q1934O3163p3820q1040M2994
1400b7169O1591l0259k4866N4654J2143q9803l5587R5689O2613o7665n5790M3061
$$ plain form
1316 -36921 -32474 19835 18235 -16723 1313 33727 -3983 -52364 -12705 50705 26449 -31464
1328 -31464 -18047 18705 -5637 -29793 18135 52567 -6150 -60208 -13980 43098 14913 -22028
1340 -22028 7556 23663 -29132 -46643 25441 63325 -2994 -52556 -7807 26367 -9625 -16852
1352 -16852 37604 35526 -44200 -59531 23184 58281 -2180 -31156 9544 9812 -39747 -19216
1364 -19216 58427 47066 -44920 -57855 17828 36350 -12400 -6418 38145 2789 -65770 -28126
1376 -28126 63345 49086 -34644 -36935 16891 3392 -33987 13308 67488 5778 -77687 -34938
1388 -34938 52749 35970 -23343 -3180 26654 -27250 -60400 21534 84697 10877 -70163 -27169
1400 -27169 34422 4163 -20703 33951 46094 -43709 -79296 16393 79006 11341 -44449 -1388
1412a388J8955n5394P255R2204N633j10411l7700Q8634M4413n3816j2163M9854
1424C6076k5493q2922K7445J13683M404j05201k6578O7468P585m6212L4384O6863
1436G1502n3543j02583L1167J09102o64p7071M366M4092m2220m9502P2496Q4288
1448I1430o1463j03417K6744Q0046j5100l9188M5635K8172q6201n7764R1168Q9579
1460H9641n8390q1140L0114L9080m4205r293Q6387K3460j08677n9282Q6821O8986
1472F3502n0925l6283M6739k530q1441M788J13741K7184j05229m8520O7635K6964
1484B5625m8064J6904P1812l4930j10427R766J16959K3017q2419j8839M7673k2306
1496e229n3773N5942R1499m6802j13886J1766R3194J242n3180K7050M0799o5817
$$ plain form
1412 -1388 17567 -37827 -30572 61632 67265 -43146 -80846 7788 52201 -1615 -13778 36076
1424 36076 10583 -72339 -44894 68789 73193 -32008 -58586 8882 16467 -29745 4639 71502
1436 71502 17959 -84624 -53457 55645 54981 -22090 -17724 26368 -15852 -65354 7142 91430
1448 91430 29967 -73450 -46706 33340 18240 -20948 24687 52859 -33342 -91106 62 89641
1460 89641 31251 -49889 -19775 19305 -24900 -34193 52194 75654 -33023 -92305 -5484 63502
1472 63502 12577 -23706 23033 20503 -60938 -56150 57591 84775 -20454 -68974 -1339 25625
1484 25625 -22439 -5535 66277 31347 -79080 -69314 47645 70662 -11757 -30596 17077 -5229
1496 -5229 -59002 -3060 88439 41637 -72249 -60483 32711 33953 -19227 7823 48622 -17195
1508a7195o7670P1996R6533m2240q9044J8105N0947l2854k6298P2038M2202r0663
1520a4143p5654O8576Q2290l5369m9599L3732J2585o8310j1372R9911M2460r2882
1532g775o4093N8391M6403l9387p401N8999r870r3488j0029J01278L7409p4345
1544c908l3971M7045l05n3180K7362Q5024j8628j02523j0380Q3354J9204m9532
1556a0438P486M1049m2172o6536M7266R3793k1276q8674m97N6697j1582l4323
1568b9207M5151M5580o3234p2946M8550P9665k3340n5858K1793K8336m7430k7486
1580e0426P0245N0226o4389o4170L9379M8706k8337j8918M6252P764p3555k4531
1592f1754P8527M5587n6964m2084L5732J5198m0066O155O4143r85p8409k0182
$$ plain form
1508 -17195 -84865 -12869 83664 41424 -47620 -29515 21432 -11422 -37720 34318 76520 -14143
1520 -14143 -89797 -21221 61069 25700 -23899 9833 22418 -45892 -57264 42647 85107 -7775
1532 -7775 -71868 -13477 32926 -6461 -13862 45137 35267 -58221 -68250 33028 70437 -3908
1544 -3908 -37879 9166 8861 -44319 -16957 68067 49439 -53084 -63464 19890 39094 -10438
1556 -10438 -2952 38097 -4075 -70611 -23345 70448 49172 -39502 -39999 16698 5116 -29207
1568 -29207 15944 61524 -1710 -74656 -26106 53559 30219 -25639 -3846 24490 -22940 -50426
1580 -50426 19819 70045 5656 -58514 -19135 29571 1234 -17684 28568 36332 -37223 -61754
1592 -61754 16773 62360 5396 -36688 -956 14242 -25824 -19669 44474 43489 -34920 -55102
1604e5102O6534K7775m3433j0452L6945j3172n3327J8068P0604k349o6815j0261
1616c4985M5919N54l2550K2576M1601l3975o0498K3066O4692n734m7901N248K8685
1629A6698k3753k7994M0957M3787l8777n4507K2801M5739j4488k6517K4594J7513
1641B6053m1421k5730M5798L7283l4664l4876K3501J9338k7052p735M1711J1315
1653C3521m9789k3196M2616K6376k9494j5096K6527P94l6495J802M6827P261m4653
1666a2999j4660L2386R710k3937L225K7486j0316l7185O282L9871J404l2302q79
1679a1914K3048q288k3006J7001L0320j6158l4937Q609L0278n021k1001J0176
1691h93J6963j8014k1343J9862K6946j4302k5464Q706J7691j0497j0993J7208
$$ plain form
1604 -55102 11432 39207 -4226 -14678 22267 9095 -44232 -26164 44440 42091 -24724 -34985
1616 -34985 10934 11488 -21062 1514 43115 9140 -51358 -28292 36400 30666 -17235 -11987 16698
1629 16698 -7055 -35049 5908 49695 10918 -43589 -20788 24951 10463 -16054 8540 26053
1641 26053 -15368 -41098 4700 41983 7319 -27557 -4056 15282 -11770 -19505 22206 33521
1653 33521 -16268 -39464 3152 29528 34 -15062 11465 12259 -24236 -22434 24393 31654 -12999
1666 -12999 -27659 4727 14437 -9500 -6275 21211 10895 -26290 -20008 19863 21267 -11035 -11914
1679 -11914 11134 2846 -20160 -3159 27161 11003 -23934 -15325 14953 9932 -11069 -893
1691 -893 16070 -1944 -23287 -3425 23521 9219 -16245 -7539 10152 -345 -11338 5870
1703E870J1578k1865j5685J9653J6774j4661j2062J3496O125j7708m735K1973
1715H753Q263k1622j1154J7475R175j4240m632J5484J869j8407l163J8902N248
1728A1951j5532m351J1699N17j1108K822J3178l084j4472J398J2923p81j0223
1741e063K895R259n777j1018O720J3191n206j3025L195J0718k821q469L966P520
1755F085m655p788M213P328k865o098K708M385l513l610M462L524m744l242M526
1770G16K274m746j090N647Q83o622j862O644L085n402l834L947L525k733k702
1785b270K169K180k465j565K335J333j759j357J327O95n60MK4q28J21J729J52
1802A265k161j153K337K238j668l224L72L566O63k745j683J915J804r90j439J53
$$ plain form
1703 5870 17448 -4417 -20102 -449 16325 1664 -10398 3098 9223 -8485 -13220 8753
1715 8753 17016 -4606 -15760 1715 10890 -3350 -7982 7502 9371 -9036 -12199 6703 11951
1728 11951 -3581 -7932 3767 4284 -6824 -4002 9176 6092 -8380 -6982 5941 5160 -5063
1741 -5063 -2168 7091 1314 -9704 -2984 10207 5001 -8024 -4829 5889 3068 -5401 -1435 6085
1755 6085 1430 -6358 -2145 5183 2318 -3780 -1072 3313 -200 -3810 652 4176 -568 -3810 716
1770 716 2990 -1756 -2846 2801 3684 -2938 -4800 1844 4929 -473 -4307 -360 3165 432 -2270
1785 -2270 -101 2079 -386 -1951 384 1717 -42 -1399 -72 623 63 67 91 -737 -616 1113 1265
1802 1265 -896 -2049 288 2526 858 -2366 -1994 1572 2235 -510 -2193 -278 1526 536 -903 -750
1818g50J293N9j132j61J551K57k122p81K281J757j680k492M01K530J265j750k343
1835a817K72K571J111j968j968P57K265L43j944j204J410J480j053j349J059J250
1851A215j231j305J235J768r04k242l20K283J756j479l024J72L497J456k763l077
1867b963J610L350j17k999r25K575J055k073o94J817M97j924j68J806j66j336
1883f55K36P54l63K71P54j379k029K012M068j590o053j68P192K179o743l494N618
1900F10L597n152k715N411K038n741k168N435K430m976j470M366K98m633N31N258
1916C119r82n282J826M948l772n668O207Q228p390j1385N997J3147l851j1848
1930f706L011R498m297r045O501J0378o623j1634M844J0430l881p716N940N936
$$ plain form
1818 -750 543 602 -530 -691 860 1117 -1005 -1786 495 2252 572 -1920 -1519 1011 2276 526 -1817
1835 -1817 -1545 1026 2137 169 -1799 -1042 1223 1566 -378 -1582 -172 1308 255 -1094 -35 1215
1851 1215 -16 -1321 -86 1682 778 -1464 -1784 499 2255 776 -2248 -2076 1421 2877 114 -2963
1867 -2963 -1353 1997 1880 -1119 -2044 531 1586 -487 -1181 636 1133 -791 -959 847 681 -655
1883 -655 -419 335 -28 243 997 -382 -2411 -399 3669 2079 -3974 -4142 3050 5229 -1514 -5008 610
1900 610 4207 -945 -3660 1751 3789 -1952 -4120 1315 3745 -1231 -2701 1665 1963 -2670 -2139 3119
1916 3119 2137 -3145 -1319 3629 -143 -5811 396 8624 1234 -10151 -4154 8993 5142 -6706
1930 -6706 -3695 5803 1506 -7539 -1038 9340 2717 -8917 -4073 6357 2476 -5240 700 6636
1944F636r259o699J1410P987j1148p170J0756M082j3541j941J8253M163k1326
1957g797q429J9570J0646j5416q020J4222L298j7623j851K1883M541k1726p195
1970a3897J7297M780j3974K049J5932o802k1312N745K3985k642k0681L418J6654
1983A0552r962j8439J6107K5862j5056l1528Q697K8779m795k1147R695J7051j8048
1996b232k1416K0737K7857j5517k6848R592J8098j2200j0327K2351J1885k9954
2008g974j9670K7667K2839k0998j5801K0851O209l0737n268M0914J4562m0611
2020h017k2291L0368J8374k2873n986K8049j652l9856l471M4077J3081l5738j2589
2033a8524K4702o72k5186J4177L7577j4689m7576M680M3543J19l0659R595K6237
$$ plain form
1944 6636 -2623 -9322 2088 10075 -1073 -8243 2513 6595 -6946 -8887 9366 13529 -7797
1957 -7797 -16226 3344 13990 -1426 -9446 4776 8074 -9549 -11400 10483 15024 -6702 -13897
1970 -13897 3400 8180 -5794 -3745 12187 5385 -15927 -10182 13803 11161 -9520 -6102 10552
1983 10552 590 -17849 -1742 24120 9064 -22464 -13767 15012 10217 -10930 -1235 15816 -2232
1996 -2232 -23648 -2911 24946 9429 -17419 -7827 10271 -1929 -12256 10095 21980 -7974
2008 -7974 -27644 23 22862 1864 -13937 6914 13123 -17614 -22882 18032 32594 -8017
2020 -8017 -30308 60 18434 -4439 -10425 17624 15972 -23884 -27355 16722 29803 -5935 -18524
2033 -18524 6178 5506 -19680 -5503 32074 17385 -30191 -25511 18032 18151 -12508 -2913 23324
2046B3324k5433l7126K9945N1189j8549n1606O270L6851r806k3479K6857K6834
2058C5271l8785m1204L2867M7095j8682l4543J5784J6338l1078j2267M8805K5396
2070D4997m9871l7605L5860L1619k6820j2917L7058L184n6882j3877O3829L1012
2082D9587m9767l2176L2023J2873l2345O226N1203m856o5579j2408N7999K1010
2094C3790l7497o669K9210j7429m4046K5917O4615j2283o6342k783M7880l247
2106A1116l2358K6508L9938m1335o2056L1662P0879j0382n4406N824L0118k6253
2118a0745k5606M9861M4486n0733o1241L0352N3045j6941k6233K9680J0798n7130
2130c0407k2289O8843M3970n4019m6504L4020K4540l6085l122O0239O891p8040
$$ plain form
2046 23324 -2109 -39235 -9290 41899 23350 -28256 -21986 14865 5059 -18420 8437 35271
2058 35271 -3514 -44718 -11851 35244 16562 -17981 -2197 14141 -16937 -29204 19601 44997
2070 44997 -4874 -42479 -6619 25000 -1820 -14737 22321 25505 -31377 -45254 18575 49587
2082 49587 -180 -32356 -333 12540 -19805 -13579 37624 32768 -32811 -45219 12780 33790
2094 33790 -3707 -10376 18834 1405 -42641 -16724 47891 35608 -30734 -33517 14363 11116
2106 11116 -21242 5266 45204 3869 -58187 -26525 44354 33972 -20434 -14610 15508 -10745
2118 -10745 -36351 13510 57996 7263 -53978 -23626 29419 12478 -13755 15925 26723 -30407
2130 -30407 -52696 16147 60117 6098 -40406 -6386 18154 -17931 -21053 39186 46077 -31963
2142c1963k9791O8332M1057m2927k3463L2961n007n1629J4027P5737M050p6183
2154b4799k2969N1884J5425l2054J3710M0911l3393o7700K3836Q0324r13o4172
2166a9910l785L9412j8355l6579M3052N8684m2340p7363J8979O8021m241l9203
2178a3628J8586K3852m7551l8025N8814O1606m1108o3434J9028L7639k2532j2462
2190a9215N0850J5382p2938l9799O5676N3202m0980l7216L1505R227n0337j267
2202c5910P5276K0178p6083l9729N2407L2191l3196l593M2492j5069o8700N049
2214d4687P9510J7218o1665j9855L6590m716l4571L0772N7985l1226p7899Q845
2226d3699P0963N242m5385P883L2426l4494m6221M4180O8153k7720o9432P766
$$ plain form
2142 -31963 -61754 6578 47635 4708 -18755 14206 9199 -42430 -28403 47334 51384 -24799
2154 -24799 -47768 4116 19541 -12513 1197 42108 8715 -58985 -35149 45175 44262 -19910
2166 -19910 -23695 15717 -2638 -39217 3835 62519 20179 -57184 -38205 29816 25575 -13628
2178 -13628 4958 28810 -18741 -56766 2048 63654 22546 -40888 -21860 15779 -6753 -19215
2190 -19215 31635 47017 -25921 -65720 -44 53158 12178 -25038 6467 15694 -34643 -35910
2202 -35910 39366 59544 -16539 -56268 -3861 28330 -4866 -8459 34033 18964 -49736 -44687
2214 -44687 34823 52041 -9624 -29479 7111 2395 -32176 -1404 56581 25355 -52544 -43699
2226 -43699 27264 32506 -12879 -4996 27430 -7064 -53285 -9105 59048 31328 -38104 -30338
2238c0338M6265j0955k4542L5923K7494n4077m8878M6363N8820k4425m2597J7800
2250c147J7077l6963j0549O1511K7988o3848m6378M4111M1234k8025j6949L5595
2262B1657J317n8342r894O8073K9197n3638l2286L2870J2620l0761Q818M9400
2274C9031r551o5293p257N8978J6810l8478l932K8871j9330m1405K8038O0621
2286D7103j5087o2808r08M5212j420k8714K0713L1825l5000m8376K8880N6581
2298C8001j2511m4203P263K4579k1385j9108L9238L1069m1014m2878K7255L7798
2310B4104j6928j9779K4187Q694m1757j5747M9564L0307l9811l2869K5377J9478
2322A4820k4327m580L7277M180m8264j5838M3933K2714k9452j4504K2144j330
$$ plain form
2238 -30338 15927 4972 -19570 16353 43847 -10230 -59108 -12745 46075 21650 -20947 -3147
2250 -3147 13930 -23033 -33582 27929 55917 -7931 -54309 -10198 31036 3011 -13938 21657
2262 21657 22974 -35368 -45262 22811 52008 -1630 -33916 -1046 11574 -19187 -10369 39031
2274 39031 29480 -35813 -43070 15908 32718 -5760 -9692 19179 -151 -41556 -13518 47103
2286 47103 32016 -30792 -31700 13512 12092 -16622 4091 35916 916 -47460 -18580 38001
2298 38001 25490 -18713 -11450 13129 -8256 -27364 11874 42943 1929 -40949 -13694 24104
2310 24104 7176 -12603 11584 20278 -21479 -37226 12338 42645 2834 -30035 -4658 14820
2322 14820 -9507 -14087 23190 27370 -20894 -36732 7201 29915 463 -14041 8103 6773
2334F773k9618P983M1958o40m3779q414L3021N869k3041P402K5372j7133l7087
2347c1334J4034M2958l810l5733L62K3969q821k0556J9566K7761k0562l4939J2113
2360a4992L1659n722k0625J0256J3449k0956j6608K6108K3938k1350k4775J4303
2372e315J6674j4589q218K2532Q131k9135j4779K6976J8831j9366j4742J5560
2384B560O701j9384l258K5462O990k6169j1344K0368R496j4730k274J5507l311
2397F614k0857K424K3663K018k0588k898J4994j495j3631O811J7614p773k1359
2410a4463L969K0571r87j5851K562J2256o942j2872R020J5510p115j5364M089
2423e617J1737m287q012P681P435j0424r482J0116J0614p836q804P050N490q933
$$ plain form
2334 6773 -22845 -14862 27096 26456 -17323 -25737 7284 13153 -9888 -2486 22886 5753 -31334
2347 -31334 -17300 25658 21848 -13885 -13523 10446 1625 -18931 635 28396 7834 -27105 -14992
2360 -14992 16667 10945 -9680 576 14025 -6931 -23539 2569 26507 5157 -19618 -5315
2372 -5315 11359 -3230 -11448 11084 19215 -9920 -24699 2277 21108 1742 -13000 2560
2384 2560 9261 -10123 -13381 12081 19071 -7098 -18442 1926 11422 -3308 -5582 9925 6614
2397 6614 -14243 -11819 11844 13862 -6726 -9624 5370 3875 -9756 -2945 14669 6896 -14463
2410 -14463 -10494 10077 9090 -6761 -4199 8057 1115 -11757 -2737 12773 5658 -9706 -5617
2423 -5617 6120 1833 -6179 1502 8937 -1487 -10969 -853 9761 1925 -6879 171 5661 -3272
2437c272m250J1644N655j2051p328R965O971p580m795P156K794q425k551R190
2451C123L435q271l489O679J961o142N3O778p78p738M53P265K17o026M29N374
2467C323k004n542K139O537j579o561M64N824j3m732P46L901j571l719J542L804
2483B559j266l419J275K567j380j891J529J578j594j630J710J578j794j348J997
2498D71J286k124j597K013J925j805j970J356J636p07j178L55Q35l37o53M33O86
2515F25l75p56K02O50M1m87j80R7J32J22K74k92m78K75M64J33n58m25L20O23j
2536D06q41J2Q27J39r89j82Q58K08o79j16N35J62o29j02N56L46n28n86K41O41
2556B79k03n4P9k30p9N14O3o75k30N30K30m46J16K20n7k56J28J41k11J14RO2l1
$$ plain form
2437 -3272 -7522 4122 9777 -2274 -9602 363 7334 -246 -5041 2115 4909 -3516 -6067 3123
2451 3123 6558 -1713 -5202 1477 3438 -2704 -2651 4127 3349 -4389 -3936 3329 3546 -2480 -2051 3323
2467 3323 1319 -4223 -2084 4453 2874 -3687 -3223 2601 2588 -2144 -1398 2503 932 -2787 -1245 2559
2483 2559 1293 -2126 -851 1716 336 -1555 -26 1552 -42 -1672 38 1616 -178 -1526 471
2498 471 1757 -367 -1964 49 1974 169 -1801 -445 1191 484 -694 -339 496 159 -494 -61 625
2515 625 250 -506 -304 346 387 -100 -280 -183 -51 71 345 53 -425 -150 314 447 -111 -536 -216 407 406
2536 406 -435 -423 404 543 -446 -628 230 438 -241 -357 178 340 -289 -391 165 511 -17 -603 -362 279
2556 279 76 22 101 -129 -208 306 369 -306 -536 -6 224 -222 -106 114 57 -199 -71 70 -141 -27 -18 44 13
2579A3p0K02P7l51k16P87j84j058L79J412k41j685J76J734j43j891N92J743q91
2598C85j802Q50J964o07k022O29J876j233j620J653K131k191k532K426K572k445
2614C4k205K877J784l707j985M263K415m018k603L653K217l995j391M843J219
2629C401n709j958N941K416n382j732N319P0o122P29P621l08q234o51P477L76
2645C254o244J059O711k622q401K552R819j600r188J111P811l005p359N448R154
2660H500o234j0900N034J0206l903p955N470O163q297p639J0520J0153r334j1074
2674i290P113Q649p256n659J1095M968j4439p699J4614R633j1947p632J0369L412
2688E931j3039j206J7167L659j8657o633J5461N987j2591r83J4010l110j9184
$$ plain form
2579 13 -57 145 222 -129 -345 442 258 -800 -421 991 750 -935 -759 975 832 -1059 -467 1276 385
2598 385 -1417 -567 1397 790 -1232 -603 1273 40 -1580 73 2204 13 -2519 -93 2479 34
2614 34 -2171 706 2490 -1217 -3202 1061 3476 -542 -3145 508 2725 -1270 -2661 2182 3401
2629 3401 -2308 -4266 1675 4091 -1291 -3023 2296 2366 -3756 -3027 4594 4286 -3948 -4599 2878 3254
2645 3254 -2990 -1931 4780 2158 -6243 -3691 6128 4528 -4660 -3549 4262 1257 -6102 -654 8500
2660 8500 2266 -8634 -3600 6606 2703 -5252 218 6381 -1916 -9555 965 11118 1784 -9290
2674 -9290 -2177 6472 -784 -6443 4652 9620 -4819 -12518 2096 11729 -218 -7850 2519 5931
2688 5931 -7108 -8314 8853 12512 -6145 -12778 2683 8670 -3921 -4904 9106 5996 -13188
2701a3188K224K2535J872k0147l119J5039j607j3689P955J8231r375k3433N228
2714a1474K2949j460j7397M226J3345j1461j6080J5600K2406j2759k4116P414
2726h807J8671p953j1934J5365J2035k2449j8572K1316K3261j4465j9011J1309
2738a234J0115j7297o403K6717J1598k9361j8791K3281J7758j6483q427J8885
2750A0358N19k8720k454L4791J0492l0461j3292K1571N440j9726N435K8258p380
2763A4831l7751m09L6542O851k6058j962J9428j0864k4975J7829L6549j2178l9970
2776b2137K481L0468k465j9142J4409J9810k6065l0867K4295L8635j3297l2571
2788a6446Q428J8907j7540j3708L1718K2648l5243l3796K5121L1891j4934j7865
$$ plain form
2701 -13188 -10964 11571 13443 -6704 -9823 5216 3609 -10080 -2125 16106 6731 -16702 -11474
2714 -11474 11475 10015 -7382 -3156 10189 -1272 -17352 -1752 20654 7895 -16221 -8807
2726 -8807 9864 1911 -10023 5342 17377 -5072 -23644 -2328 20933 6468 -12543 -1234
2738 -1234 8881 -8416 -14819 11898 23496 -5865 -24656 -1375 16383 -100 -8527 10358
2750 10358 10877 -17843 -20297 14494 24986 -5475 -18767 2804 8244 -11482 -6047 22211 14831
2763 14831 -22920 -23329 13213 20064 -5994 -7956 11472 608 -24367 -6538 30011 17833 -22137
2776 -22137 -19656 10812 8347 -10795 3614 23424 -2641 -33508 -9213 29422 16125 -16446
2788 -16446 -8018 10889 -6651 -20359 11359 34007 -1236 -35032 -9911 21980 7046 -10819
2800a0819J9220O919l4411j1179M3562K4226l6619k8635K3211J6786k0658j245
2812i642L3797j243m7651j0623M6311K0236l2084j3599K2968l830l0526J2949
2824a2937M6546m986n1328q707L9376Q365k4787P820K6081k3087m1543K1021N2267
2837C4101o567m4564k34K6700j1471j9899L0249L1470l5166m6349K2259M5010
2849B5539r478k7722J4723J4274l3752j9796M5361L6095l7270m1473K1084K7325
2861A4910j8491q614L4208O481n0684k1291M9097L2757l2080k5128K1618M899
2873G682l1132N162N0344M585n6216k0271M2522J9964k6232j623K7836j5072m5427
2886c7878J2235N7604M250m9620j1525L0405j304k3582K1522L6950k6613n3734
$$ plain form
2800 -10819 8401 15320 -19091 -30270 13292 37518 899 -27736 -4525 12261 -8397 -9642
2812 -9642 24155 22912 -24739 -35362 10949 31185 -899 -14498 8470 4640 -25886 -12937
2824 -12937 33609 28623 -22705 -31412 7964 16329 -8458 -638 25443 2356 -39187 -18166 34101
2837 34101 27534 -17030 -17264 9436 -2035 -21934 8315 39785 4619 -41730 -19471 25539
2849 25539 16061 -11661 3062 17336 -16416 -36212 9149 45244 7974 -33499 -12415 14910
2861 14910 -3581 -12195 22013 28494 -22190 -43481 5616 38373 6293 -18835 2783 7682
2873 7682 -23450 -18288 32056 36641 -19575 -39846 2676 22640 -3592 -5215 22621 7549 -37878
2886 -37878 -25643 31961 36211 -13409 -24934 5471 4167 -19415 2107 39057 12444 -41290
2898d1290J3021N2786M71l4734N068K0362k5291k6104L7946M3372k9692m9786
2910c3871J3226L5704j0664j6928K7056J4865m4254l0071M3204M1924k6923l4040
2922b0772J6839J4039k7102l998M6277J4088n2367k9281L8831K8973k3019j1209
2934h701K5065n046m2514K323N4516J3433m7103k0376K9720P757k3757J1154L6653
2947C3124j6107n1984L223N1183Q809l4790l173K1982j4882k8065K5999M4335
2959C9654j8661m9994L655L7769j499k1168J6216J9363l1972l2574L1404M3423
2971C5616j7585l7461R348K0341j7827j1701L4250J9667l9569l2917K9297L2881
2983B4340j6753j8493J8763N382l3463p493M3597K0303l7969k5730K3871J5239
$$ plain form
2898 -41290 -28269 24517 24988 -9746 -4678 15684 -9607 -35711 2235 45607 15915 -33871
2910 -33871 -20645 15059 4395 -12533 14523 29388 -14866 -44937 -1733 40191 13268 -20772
2922 -20772 -3933 10106 -16996 -20994 25283 39371 -12996 -42277 -3446 25527 2508 -8701
2934 -8701 16364 11318 -31196 -28873 25643 39076 -8027 -28403 1317 9074 -14683 -3529 33124
2947 33124 17017 -34967 -31744 19439 28248 -6542 -9715 12267 -2615 -30680 -4681 39654
2959 39654 20993 -29001 -25346 12423 10924 -10244 5972 25335 -6637 -39211 -7807 35616
2971 35616 18031 -19430 -10082 10259 -7568 -19269 14981 34648 -4921 -37838 -8541 24340
2983 24340 7587 -10906 7857 13239 -20224 -27717 15880 36183 -1786 -27516 -3645 11594
2995A1594j9170M72K9611m442m2281n591M2104J4920k9418j0584K0072l954k5001
3008b1668J2691L7598p314m2005l449L2934M334k0984O973K0046j8311k9909J7566
3021a1498L7570p574l2670J758K0356q402j4357K0569K0464k4748k9874J7754
3033a0652K9972r485j9897J0808J0574k1038j1674K8477K0137k4879k4011J5744
3045e924J7514j2822p433J9644M779k8098j0981K8068J6826k0310j3532J4341
3057B072M006j7666J776K6021J337k9125p481K3220Q240j5995j074J5303o313
3070D321k1191O045K6526o66k3920k604J7053j432j3624Q550J6852j1294k1549
3083a6933P454K1434l194j5642M280J0377j0106j1022J4394J5546j2550j7678
$$ plain form
2995 11594 -7576 -7104 22507 18065 -24216 -29807 12297 27217 -2201 -12785 7287 3333 -21668
3008 -21668 -8977 28621 21307 -20698 -24147 8787 13121 -7863 -890 19156 845 -29064 -11498
3021 -11498 26072 18498 -14172 -12414 7942 -460 -14817 5752 26216 1468 -28406 -10652
3033 -10652 19320 9835 -10062 746 11320 -9718 -21392 7085 27222 2343 -21668 -5924
3045 -5924 11590 -1232 -8665 10979 15758 -12340 -23321 4747 21573 1263 -12269 2072
3057 2072 6078 -11588 -9812 16209 17546 -11579 -19060 4160 12400 -3595 -4669 10634 4321
3070 4321 -16870 -10825 15701 15035 -8885 -11489 5564 4132 -9492 -942 15910 4616 -16933
3083 -16933 -9479 11955 8761 -6881 -2601 7776 -2330 -13352 1042 16588 4038 -13640
3095a3640P813J4164o555q402J0292O712j5071r759J5599J2699j1747j1253Q511
3108f37O570r924l381J3635M628j5105p277J2451P494r320m087R082P75j2085
3122g181m09J4212K650j3007l812J0024J634q315J484R675k856j1755J325J1943
3136E612M74r622k96P520j982p449M030Q687l566r566K266Q177j953o011L296
3151c83N126m946n912N202O802l972o160L036M468l699l338M990L733n656m537
3166e246M819M648l797l467L531K343m263j854M616K174m400k379L786J934l276
3181h31r99L229N52l557p14L751R27l578p71L113K13k777J09L088j39l250Q6K754
3199A206J97k109j01J624k36j503J80J825j48j885r1J746j45j333M20J232o14
$$ plain form
3095 -13640 -5827 8337 1782 -6620 3672 10384 -4687 -14446 1153 13852 2105 -9148 -637
3108 -637 5933 -3991 -7372 6263 10891 -4214 -11491 960 8454 -866 -4953 4129 4904 -7181
3122 -7181 -7590 6622 9272 -3735 -7547 2477 4111 -4204 -2720 6955 4099 -7656 -6331 5612
3136 5612 6086 -3536 -3832 3688 1706 -5743 -1713 6974 3408 -6158 -3892 4285 2332 -3679 -383
3151 -383 4743 -203 -6115 -913 5889 1917 -4243 -1207 3261 -438 -3776 1214 4947 -709 -5246
3166 -5246 -427 4221 424 -3043 488 2831 -1432 -3286 1330 3504 -896 -3275 511 2445 -831
3181 -831 -1830 1399 1951 -1606 -2320 1431 2358 -1220 -1991 1122 1335 -1442 -1333 1755 1616 -1634 -1548 1206
3199 1206 1403 -706 -807 817 581 -922 -742 1083 935 -950 -1041 705 560 -773 -353 879 265
3216B65r91M60R88o04p87M59P99k92q85J34J020j57q70Q8P60Qq37m4O65K24n34
3237a31n0K87n8l46R0K93L21k78m20L03K60l53j13M39q8n18J72N03j5n84J06L42
3259A62Mm68Q0M28P2l33j14M61O8n02k57N61K14n51o0L64Lk85M0K28k15J1K55
3282A66j88l14K03M02J4l99j15K57p2k83K62O35m47p42N49O59n29o26Q83J96q82
3303c71l08J078K70j175j05J221m2j346q3J755N9j956j47J947K16j872L9K063
3321A243p00k317R39K886r92k814R27K489j165k283J759K176k123k834K251L284
3337B726k176k722K029K430l049k295L733L078l712l648L699K756l501j807M382
3352A923J171n232k193N879K843n271k475M509J487n255l32O673N29p741j296
$$ plain form
3216 265 -726 -266 722 118 -669 -210 589 297 -588 -454 566 409 -461 -373 387 395 -442 -486 179 403 -131
3237 -131 -181 106 48 -298 -208 85 406 128 -292 11 271 -82 -195 244 156 -362 -190 313 298 -286 -180 162
3259 162 166 -302 -222 206 278 -55 -169 292 360 -142 -399 162 376 -175 -235 129 132 -153 -113 115 -100 -89 166
3282 166 -22 -336 -133 269 283 -116 -231 26 -46 -329 -67 568 121 -621 -72 587 58 -568 315 511 -371
3303 -371 -679 399 669 -506 -611 610 568 -778 -861 894 953 -1003 -1150 797 1013 -859 -820 1243
3321 1243 543 -1774 -835 2051 1059 -1755 -828 1661 496 -1787 -28 2148 25 -2809 -558 2726
3337 2726 550 -2172 -143 2287 -762 -3057 676 3754 42 -3606 93 2849 -652 -2459 1923
3352 1923 3094 -2138 -4331 1548 4391 -880 -3355 1154 2641 -2614 -2946 3727 4256 -3485 -4781
3367d781P078J695o354k5O103j615p540J924R214r67q939J74P251j182o351L613
3383g02P574m942r798L996J0286k435q597L133O325n916o554Q583Q866q242j0348
3398h771O164Q613n347n752P780M746j1273o735J2085R218r947q338P839M845
3412E127r532k061J3453L298j5857o424J4068O852j0391l349J0264j110j4349
3425a0011J623J8232J949j7677m237J3368J882j1136L592J4059o445j8972L760
3438a0013K0193k2j5935R83J1307o706j2283J1727J7575j0426k0966N423J7742
3451H599l793j1383Q690R648j5807j4311J7435J9368j2375j8278Q140J1294j0872
3464c645o365J8540Q634k2634j4871J9146J6428j2910j0365J2788K701j9885k115
$$ plain form
3367 -4781 2297 3992 -2362 -2387 3716 2101 -5439 -3515 5699 4732 -4207 -4033 3218 2036 -4315 -702
3383 -702 6872 1930 -7868 -3872 6414 3979 -4618 -1485 4840 -1076 -7630 953 9819 1577 -8771
3398 -8771 -2607 6006 659 -5093 2687 7433 -3840 -10575 1510 10728 781 -7557 282 5127
3412 5127 -4405 -6466 6987 10285 -5572 -11996 2072 8924 -1467 -4816 5448 4338 -10011
3425 -10011 -8388 9844 11793 -5884 -10121 3247 5129 -6007 -2415 11644 5199 -13773 -10013
3438 -10013 10180 10158 -5777 -4794 6513 -193 -12476 -749 16826 6400 -14566 -9143 8599
3451 8599 4806 -6577 2113 11761 -4046 -18357 -922 18446 6071 -12207 -4067 7227 -3645
3464 -3645 -10010 8530 17164 -5470 -20341 -1195 15233 2323 -8042 4746 7447 -12438 -14553
3477a4553K6681Q593k5731j2795J8361Q195j4227J162J9416n493k8074M06L0157
3490A2098O440k3001n502J5825l981j7386J1630K6451r577l1860J597K6687R99
3503A0420j7016O697J4603j7113k2136J8763L0279j1026k8344M433J8027q759
3515a172j1031K0191J5580k6400k5365K0882K7880j1443j8989J1147Q289k1800
3527a2231p753L1513J7014k9863k3385J9424J7994j4297n341K1313j19l3037o886
3540b5654L6061J6181k7022j4708J7578K429k0094P634L2168m948l9457n633L3232
3553G767R293k0948L46J7783j3540k7566J5912L8048n968l6486j953K3904l434
3566C158j5284J7419K0883k5093l2868J8422L5904p297k5182O965J2890j9656
$$ plain form
3477 -14553 12128 20721 -5010 -17805 556 8751 -5476 -4314 15102 9609 -18465 -18059 12098
3490 12098 18538 -4463 -9965 5860 1879 -15507 -3877 22574 12997 -18863 -17266 9421 10420
3503 10420 -6596 101 14704 -2409 -24545 -5782 24497 13471 -14873 -10440 7587 -1172
3515 -1172 -12203 7988 23568 -2832 -28197 -7315 20565 9122 -9867 1280 9569 -12231
3527 -12231 -19984 11529 28543 -1320 -24705 -5281 12713 -1584 -6925 14388 14269 -18768 -25654
3540 -25654 10407 26588 -434 -15142 2436 4865 -15229 -7595 24573 19625 -19832 -25465 7767
3553 7767 17060 -3888 -3542 14241 701 -26865 -10953 27095 21127 -15359 -17312 6592 3158
3566 3158 -12126 5293 26176 1083 -31785 -13363 22541 15244 -9938 -2973 9917 -9739
3578i739j2867L1302K4300k9027l2377J7069K5677j1017j1380J9701N472l3854
3590a6740j3523L6929K4697k6686k3396J6144R749j8946J382L2329J859m0585
3602a6787j3685L4144J8012k1442p503J8206o583k9058R107M0914J166l9468r753
3615b2730K6504M416j7902J0240K3666j8207l6401J1472M0175j41k9578l09J6926
3628H131j2376j6903K4473K8464k2719l6691J1475L0192n976j6001J4457J0487
3640A7013k8502j8734L2050K9521k2076k8292J2092J5134j5028m988K8217Q340
3652B4747l6366j9645L0410K3523j8232j3600J5394M14k5625J993L6709P210l5622
3665h690j4967K4027J0260j6514K966K2126j0126l3863M070L7543O070k8921o318
$$ plain form
3578 -9739 -22606 8696 32996 3969 -28408 -11339 14338 3321 -8059 11642 17114 -16740
3590 -16740 -30263 6666 31363 4677 -18719 -2575 7174 -11772 -10390 21939 23798 -16787
3602 -16787 -30472 3672 21684 242 -7261 10945 4362 -24696 -15589 25325 26491 -12977 -22730
3615 -22730 3774 8190 -9712 528 24194 5987 -30414 -18942 21233 21092 -8486 -8795 8131
3628 8131 -4245 -21148 3325 31789 9070 -27621 -16146 14046 8070 -7931 6526 17013
3640 17013 -11489 -30223 1827 31348 9272 -19020 -6928 8206 -6822 -11810 16407 24747
3652 24747 -11619 -31264 -854 22669 4437 -9163 6231 6645 -18980 -16987 19722 26932 -8690
3665 -8690 -23657 370 10630 -5884 -2918 19208 9082 -24781 -20711 16832 22902 -6019 -12337
3678a2337J8055m620j8140J5170K8150j3895l5270M286K9938O78j8195O576J3206
3691A3602j8207j9991K1637K9109j4177k8582O487J8157r179r789K0130J2400
3703B1597k6985k1414K2483K4808j3491j6943J1054O852j9266m697K7848J2068
3715B3914k7112j8233J8426J4195j2718l495J6936k278k6159j855K9321R042k3036
3728c052q922J5092P24j5388P159K2880o270k8321q43K4954M360j6679N56J3509
3742I759r152j7958J1399K4346o446k3746J168J6481l089j0406J0674J1759j5594
3755h05j7795J3120K0204p315j5583O171Q862j1387p912J7515J2548j7543j6498
3768a6418J2345J4165q479p808J1083L916j6408o283J8056J0697j4468j0337R556
$$ plain form
3678 -12337 5718 1098 -17042 -1872 26278 12383 -22887 -18601 11337 12015 -6180 396 13602
3691 13602 -4605 -24596 -2959 26150 11973 -16609 -10122 8035 -1144 -10933 9197 21597
3703 21597 -5388 -26802 -4319 20489 6998 -9945 1109 7961 -11305 -16002 11846 23914
3715 23914 -3198 -21431 -3005 11190 -1528 -5023 11913 9635 -16524 -18379 10942 19984 -3052
3728 -3052 -11974 3118 3842 -11546 -4387 18493 12223 -16098 -16941 8013 12373 -4306 -3750 9759
3742 9759 607 -17351 -5952 18394 11948 -11798 -10630 5851 2762 -7644 3030 14789 -805
3755 -805 -18600 -5480 14724 7409 -8174 -2003 6859 -4528 -12440 5075 17623 80 -16418
3768 -16418 -4073 10092 1613 -6195 4888 8804 -7604 -13887 4169 14866 398 -9939 -383
3781c83N084r725mJ4649p8j8215l682J6516N388j1871k379J0210k721j2955M258
3796e908J6733j458j6662j516J2585Q73r340L290R630n771j2669M556J3836j745
3810F434j1264J642P335m630o388P968Q344q395j0137N954R540m673o247N763
3824A246M740q658n940R544Q231p870q470N643O219n288l712P009L243q459m356
3839f878P649M804n655l154M820O10n732kP759N03p802j609O727J294n829K57
3855b238O348j395p494Q08P868M06o769q62N046mm215J203M476j326n025R24M582
3872B333n19l425J173K375k247k519K975L130l031l231K678K890k645k560L064
3887D41K538l224k941K640L449j916k961J285K245j279j738J501J425j418j379
$$ plain form
3781 -383 4701 -5024 -5028 9621 9543 -8672 -12354 4162 9550 -2321 -4700 5510 2789 -10166 -5908
3796 -5908 10825 9367 -7295 -8811 3774 4647 -4693 -1403 8227 2456 -10213 -5657 8179 6434
3810 6434 -4830 -3188 4147 -483 -6871 1097 9441 1046 -9091 -3137 6403 1730 -4517 1246
3824 1246 5986 -2672 -8612 932 9163 1293 -7177 -1534 4685 -603 -4315 2694 5937 -2522 -6878
3839 -6878 771 5575 -80 -3234 1586 2196 -3536 -3538 4221 4724 -3078 -4687 2040 3334 -2495 -2238
3855 -2238 4110 2715 -4779 -3971 3897 4303 -2466 -3328 1718 1714 -2501 -1298 3178 1852 -3173 -2249 2333
3872 2333 1814 -1611 -438 1937 -310 -2829 146 3276 245 -2986 -308 2582 -63 -2623 441
3887 441 2979 -245 -3186 -546 2903 987 -1974 -689 1556 277 -1461 40 1465 47 -1332
3902a332J276J008j143k64J087k55j437N82J857m45k178J59K063L47k275l63K190
3919H77N68k071r86K020J024j463j108R01J226o35q42Q3P00M2n48j74L76M49o9
3938C70l08n50K22O98L25j005q26J018J142q23j074K07J310L8j335l46J101P66
3956I30r84q51P76J194o54j302L26J078pp54n07O83O71k69o74k46P58N15l77r51
3976f45O3Q69N71q68r80O54J246m17j290K05J330j46j138j90J187K06o28q28N48
3995b51P41M0o74o29N76P22P5j145k94J142Q50j152j361J011J758p50j842M36
4013g47J599j58j359P6J248Mj098j14O86L25l75K5k99m56N35J159m79j683K77
4032h34K150l36k694O04L030l18l426k68L374O17k897m89K248M98k360j8K391
$$ plain form
3902 -1332 -56 952 -191 -455 632 377 -1060 -478 1379 934 -1244 -1085 978 1325 -950 -1313 877
3919 877 1445 -626 -1612 408 1432 -31 -1139 -238 988 353 -489 -406 294 336 -212 -386 -10 439 370
3938 370 62 -488 -266 432 757 -248 -1074 -56 1086 263 -811 -604 706 744 -591 -937 164 930
3956 930 -54 -905 -129 1065 411 -891 -565 513 506 -248 -755 -72 599 330 -344 -590 168 683 306 -645
3976 -645 -582 287 858 -10 -990 -336 910 493 -797 -592 738 592 -546 -736 451 657 29 -799 -251
3995 -251 490 530 -144 -773 -197 525 600 -545 -839 303 1153 1 -1360 -349 1409 659 -1183 -747
4013 -747 852 694 -665 -589 659 663 -435 -549 137 462 87 112 -187 -643 -108 1051 572 -1111 -834
4032 -834 1316 980 -1714 -1110 1920 1602 -1824 -2092 1282 1899 -998 -1487 761 1259 -1101 -1119 1272
4049A272J81k555j82K030l56j449J412J430k443k101K981K751k942k834K998K686
4065B879l639k651M149L643m251m509L429M405k802l347K992K647l998k616M502
4080H33L123m016k898L314J205l329K89N053q35o559k89O821J182o269l92O075
4096C308r53p294J406Q840k68r038r78P614O36o003J198O103k952p578K882Q168
4112E091j490o812J208M960l795m107O425O227p492q440O328Q121m970o249O387
4127A392M712r058n990J0486Q337q618q878N964O243n968l035Q767K886j1385
4141d145n192J0796O342q067l885P026k14r967K044J3938K80j5054l179J2392
4155C115K618r739J267J0878m029j4929K542J7259R40j4702j719J0070j855q949
$$ plain form
4049 1272 1453 -1102 -1284 746 390 -1059 353 1783 -660 -2761 220 2971 29 -2805 193 2879
4065 2879 -760 -3411 738 4381 130 -4379 -950 3455 653 -2694 298 2945 -1053 -3669 833
4080 833 3956 -60 -2958 356 1561 -1768 -1479 3574 2739 -3820 -4109 2712 3894 -2375 -2767 3308
4096 3308 2355 -4939 -3533 5307 5039 -3999 -4977 2637 3273 -2730 -1532 4571 1619 -5959 -3077 5091
4112 5091 3601 -3211 -2003 2957 -838 -4945 1480 7707 215 -8225 -1897 6224 1254 -4995 1392
4127 1392 6104 -2954 -8944 1542 9879 1261 -7617 -1653 4590 -1378 -4413 4354 7240 -4145
4141 -4145 -9337 1459 7801 -266 -4151 2875 2661 -7306 -5262 8676 8956 -6098 -9277 3115
4155 3115 5733 -4006 -2739 8139 4110 -10819 -8277 8982 9922 -4780 -6499 3571 1716 -7233
4169g233O553J2307p448j5716M262J4574k151r707M986O662j0565r344J3727J4249
4183A5156j1176j5562P229J1116p335o772J2728P191j7097j2024J5746J4697j0271
4196C626j1203P913M691j2029j917J7876N593j9213r666J4167Q341j0189j309
4209c319J2680l649j9635J525K3394M329k0005n709J3539L89j2669O312J8588
4222A5770o740k3928P73K2200L251j4945M66J0501q491j4110J2343K1025q649
4235I466k2162L275J5495m122r048J2051J0044j8580j7261J6998K1620j0055j7634
4248i913P324R498j2688p066K0789J2437k1898j8521J5368J6712r590p905J2037
4261F584J667k0737l913K5201J0994k0880j2381J3254N127j2731L452K0539l860
$$ plain form
4169 -7233 -680 11627 4179 -11537 -7275 7299 5148 -4559 427 7089 -3476 -12820 907 15156
4183 15156 3980 -11582 -4353 6763 -572 -7344 5384 12575 -4522 -16546 -800 13897 3626
4196 3626 -7577 336 5027 -7002 -8919 8957 14550 -4663 -14329 -162 8179 -2010 -3319
4209 -3319 9361 5712 -13923 -12398 10996 15325 -4680 -10389 3150 3539 -9130 -2818 15770
4222 15770 9030 -14898 -14125 8075 11326 -3619 -3153 7348 -1143 -15253 -2910 18115 9466
4235 9466 -12696 -9421 6074 1952 -7096 4955 14999 -3581 -20842 -3844 17776 7721 -9913
4248 -9913 -2589 6909 -5779 -12845 7944 20381 -1517 -20038 -4670 12042 2452 -5453 6584
4261 6584 8251 -12486 -16399 8802 19796 -1084 -13465 -211 4916 -7815 -4363 16176 12316
4274A2316k8091l120K6405Q270j8162l879J3548n790j8143R929K6373m686k7726
4287a2756k570J9997J539j1879P619J2946j5296k1151J3494K6094n835k0989L029
4300e758J1785j0248q988J9666J5829k1466k2984J3997K1827p953j2358J0518
4312C867O273j9987r357K4670J7511j9826j9452J1707J1689j0904k283J8921J363
4325A4192k6778q345K5255J3320j6883q658J2315j020j7779N399K6753j22k8971
4338a1322p193K1763O637j4102K311J5342j0048k3276P852K8242l8k3410k570
4351i812J4065m468j0974J3797J7276j5658k4383R195K2822l357j4295O698Q436
4364I342j6142j1715K1240J9586j6695k1782R134J4768q237o416J5353O037k2505
$$ plain form
4274 12316 -15775 -18895 7510 15780 -2382 -6261 7287 1497 -16646 -6717 19656 14970 -12756
4287 -12756 -15326 4671 6210 -5669 1950 14896 -400 -21551 -8057 18037 12202 -8787 -5758
4300 -5758 6027 -4221 -13209 6457 22286 820 -22164 -8167 13660 5707 -6651 3867
4312 3867 10140 -9847 -19204 5466 22977 3151 -16301 -4594 7095 -3809 -6092 12829 14192
4325 14192 -12586 -20931 4324 17644 761 -7897 4418 3398 -14381 -8982 17771 17649 -11322
4338 -11322 -18515 3248 9885 -4217 -1906 13436 3388 -19888 -12036 16206 16168 -7242 -9812
4351 -9812 4253 -215 -11189 2608 19884 4226 -20157 -10962 11860 8503 -5792 906 9342
4364 9342 -6800 -18515 2725 22311 5616 -16166 -7032 7736 -501 -6917 8436 14473 -8032
4377h032j2588K0997J7283j3365j2986R246L989j4074R0K2064M402k4234j0498
4390a7706J8431R587j2130j951J3479m346k0836K842K5197L733k1433o416J4083
4403B534J061j1808O398J7244q190k2872K905K1739J656j4634J249R660q921j2213
4417a4192J3106J8428j0031j9994M293J4844m166q477J0322Q051j5795j3670J5065
4430b216J7481r344j4394O185P597r849m333J5737P691j7361j2056J2792J1345
4443I275q187n397R247N68j4644j600J8078O156j5867p616J0895L544r348J573
4457c323J3470k920j7589q70J7106M031j2383k210R028k843j0578N608J4653l808
4471G372j5545J02J2186pq171M057Q038q086j1023P630J3422m546j1551K967P434
$$ plain form
4377 -8032 -20620 377 17660 4295 -8691 555 4544 -9530 -9440 12624 17026 -7208 -17706
4390 -17706 725 10312 -1818 -3769 9710 5364 -15472 -12630 12567 16300 -5133 -11549 2534
4403 2534 3595 -8213 -1815 15429 7239 -15633 -12728 9011 10667 -3967 -2718 6942 -1979 -14192
4417 -14192 -1086 17342 7311 -12683 -8390 6454 2288 -6189 4133 12184 -3611 -17281 -2216
4430 -2216 15265 5921 -8473 -2288 5309 -4540 -8873 6864 14555 -2806 -14862 -2070 9275
4443 9275 1088 -4309 4938 5506 -9138 -10738 7340 13496 -2371 -9987 908 4452 -4896 -3323
4457 -3323 10147 7227 -10362 -11232 5874 9905 -2478 -4688 4340 1497 -9081 -3473 11180 7372
4471 7372 -8173 -8071 4115 4108 -4063 -6 8032 -54 -11077 -3447 9975 5429 -6122 -3155 4279
4486D279n160n819R061P939j0148j0759P534J0387m688o921N337L764q482m230
4500g906J0732O566r452p405O803M880n878j692Q013O12j0294k559J0321M090
4514F831p944l125O334L48o996J029R445l15j0163j293Q174J671o179M35N767
4529D019k646p162K844Q215j080p585M30N423j516m364L383N191m190o425L319
4544b144O345k170n054K541L611l918l612M838M580m234m974K971L934k460k618
4559b364L299K217m417k672M543L192l713k740K930J741l358p11M005Q32m277
4574a493j547M002J427l272p31K823J67l189j41L661O22l472p59K738M42k324
4590a046J0K702p08k728M93K765l14k253J89J879n00j736R56J741r01k099R65
$$ plain form
4486 4279 -881 -6700 2361 10300 152 -10607 -3073 7314 2626 -4295 1042 4806 -3676 -7906
4500 -7906 2826 9392 -60 -7465 -662 4218 -1660 -3352 4661 5273 -5021 -7580 2741 6831
4514 6831 -1113 -4238 2096 2444 -4552 -3523 5922 5607 -4556 -5849 2325 3996 -2183 -1748 4019
4529 4019 1373 -5789 -2945 5270 4190 -3395 -2965 2458 942 -3422 -39 5152 962 -5463 -2144
4544 -2144 4201 2031 -3023 -482 3129 -789 -4401 437 5017 783 -4191 -1220 2714 254 -2364
4559 -2364 935 3152 -1265 -3937 606 3798 85 -2655 275 2016 -1342 -2053 1952 2784 -1493
4574 -1493 -3040 962 2389 -883 -1614 1209 1376 -1813 -1954 1707 2329 -1143 -1902 836 1278 -1046
4590 -1046 -1036 1666 958 -1770 -1277 1488 1174 -1079 -890 989 489 -1247 -291 1450 549 -1550 -585
4607e85J835n20j854R29J333q05j587R51J648r83j323O70J190p29q70P77P53q91
4625f1p38P21R08o05q26N16N54m87n34P59M51p63n72P52M03m54m26K60M86k52
4645I2m14M73J95l15m05L08N35l78n27M00L92l01l20L07K83l46j36J95J57j13
4665H2k19J1L31k46k29K20M76m87l07M49K82m12k17L09J28k27k64L75K28k06l73
4686b96K46K38j82k14L39J14l62j45M43M5m67J47L05j53j74J2M28l14l23K25L35
4707B47j15l68J99J99k53j74M74Q5l07m31O15J23n50n0P38j03q16J92O48m1p17
4728d05J71O83l98o13M41P16k83q52K61O76j99q17O16R54j132r47J195R13j048
4747f8q64J238N01j366n24J679N48j699o87J476Q04j663k26J741J53k224k27K411
$$ plain form
4607 -585 1250 730 -1124 -195 1138 333 -1254 -303 1345 362 -961 -291 899 170 -700 77 830 -61
4625 -61 -799 -78 830 225 -601 -85 469 -18 -552 207 658 -105 -677 75 478 24 -402 -142 344 92
4645 92 -322 151 346 31 -374 -66 469 91 -436 -36 356 55 -265 42 325 -21 -157 38 195 82
4665 82 -137 -126 205 -41 -270 -50 426 -61 -368 81 363 -49 -266 43 171 -56 -320 55 283 77 -296
4686 -296 -50 188 6 -208 131 245 -117 -262 181 226 -241 -94 211 58 -116 -104 324 10 -313 -88 247
4707 247 132 -236 -37 162 -91 -265 209 294 -13 -444 171 294 -256 -306 432 329 -487 -295 353 312 -405
4728 -405 -234 449 51 -562 -121 595 312 -540 -279 397 198 -619 -3 951 -181 -1128 67 980 -68
4747 -68 -932 306 807 -559 -1083 596 1144 -555 -1242 234 1038 -625 -851 890 1043 -1181 -1408 1003
4765A003M88k392k84K077j01k299P83K572o98k954L69K709r7k366O60K395j464
4782D01k834J591L468j439l139J084K567j581k147K442K683l354l028K755L376
4797B845k288k712K419J826l159k094M273K798m285l106L469K611l509j300M419
4812B207Q18n597j459N851K139m926j691M081K85m563O78O094l99o902o91O170
4828B095Q82m963P03M673k328o239K763P476j499p041N07N511j911m323M056N451
4844E813n111p085L880P494k514n733K991L872n328m170P327O157o848p232M811
4859a676N739m307l124O355K346r023l869R118N948p159n349N702K221o731l16
4874d125R780J252j1095l943R860L932p198j226P203k034r807K042J2469O35j1744
$$ plain form
4765 1003 1491 -901 -1185 892 791 -1508 -725 1847 1149 -1805 -1436 1273 1176 -1190 -530 1865 401
4782 401 -2433 -842 2626 1187 -1952 -868 1699 118 -2029 413 3096 -258 -3286 -531 2845
4797 2845 557 -2155 264 2090 -1069 -3163 1110 3908 -377 -3483 -14 2597 -912 -2212 2207
4812 2207 3025 -2572 -4031 1820 3959 -967 -2658 1423 1708 -2855 -2177 3917 3518 -3384 -4075 2095
4828 2095 2977 -1986 -1283 3390 1062 -5177 -2414 5062 3563 -3478 -2971 2540 629 -3694 362 5813
4844 5813 702 -6383 -2503 4991 2477 -3256 -265 3607 -1721 -5891 1436 7593 745 -6487 -1676
4859 -1676 4063 -244 -3368 2987 5333 -3690 -7559 1559 7507 348 -5001 701 2922 -3809 -4125
4874 -4125 5655 6907 -4188 -8131 1729 5661 -1537 -2763 4440 2406 -7401 -5359 7110 7745 -3999
4889c999k107Q415L4o773L714R026n436j2438L457J2803o89r693J499O633n605
4904a159p283Q723J0881p758j2508M278J0096l524n859O745M987j1061q149J1460
4918a31J1271q036r891N352N434p669k258J2400M148j4672q004J1864Q538p820
4932E26m291P918l20j2454J83J6307L740j4904o269J0576L134q430K417J1745
4946I878m593j6509J358J6931K687j2642j568Q524l963r670Q031J4725o528j7247
4960a0586K008J3964p37q925N447P664j0984j1854J1528J6028p126j4479L748
4973d304Q853o543n093J2498P586j5391j2598J1958J3605p143q289P149K675j2874
4987g911k730J7740P768j6405j0696J0896O926q174m50J2311k247j8144j729J9114
$$ plain form
4889 -3999 -6106 2309 2343 -4430 -716 8310 2874 -9564 -6107 6696 6007 -3686 -2187 4446 -1159
4904 -1159 -8442 281 11162 3404 -9104 -4826 5270 1746 -4113 2632 7619 -3442 -11591 -131
4918 -131 11140 3104 -6787 -1435 3999 -3670 -5928 6472 10620 -4052 -12056 -192 8346 526
4932 526 -3765 4153 3833 -8621 -8438 7869 11609 -3295 -9564 1012 4146 -4284 -1867 9878
4946 9878 5285 -11224 -9866 7065 9752 -2890 -4458 4066 103 -9567 -1536 13189 6661 -10586
4960 -10586 -8578 5386 4649 -4276 1171 8835 -2149 -14003 -2475 13553 6427 -8052 -4304
4973 -4304 4549 -1994 -7087 5411 12997 -2394 -14992 -3034 10571 3428 -4861 2288 4963 -7911
4987 -7911 -10641 7099 14867 -1538 -12234 -1338 5588 -2586 -3036 9275 7028 -11116 -12845 6269
5001F269O366j3838n337R168j131j0707N975J6740m086k0025j179J6113K639r920
5015b953K422Q779q887j3496R477J8408m563j6989P28J0958l792o962J0353J0030
5029A3513j3586j5639J0121J6714m904j1459N238N380j1034n778J6276J1018j4830
5042A030j4230R187J0478o482l944J0776J411j6804n530J8022J0247j3136r159
5055h134Q575K649j0190K217J6251m47j9509m845J6145O220j0427j048Q989m886
5069A560j3774N476J8672j008j7284k607J1614l66p884O745J0790r774j6160O643
5083g357J7143k013j2333K324O851p591p278J2418J2173j1360j5040O401J2161
5096F499m254o467P992M185j3284p601J4344J1542j0262j0630O465N357p947j283
$$ plain form
5001 6269 12635 -1203 -6540 2628 1497 -9210 -3235 13505 9419 -10606 -11785 4328 6967 -2953
5015 -2953 -531 8248 -639 -14135 -4658 13750 9187 -7802 -7074 3884 92 -6870 3483 13513
5029 13513 -73 -15712 -5591 11123 6219 -5240 -2 5378 -5656 -11434 4842 15860 1030
5042 1030 -13200 -4013 6465 -17 -3961 6815 8226 -8578 -14108 3914 14161 1025 -8134
5055 -8134 441 3090 -7100 -4883 11368 10921 -8588 -13433 2712 8932 -1495 -2543 6446 1560
5069 1560 -12214 -6738 11934 10926 -6358 -8965 2649 2283 -5601 1144 11934 2160 -14000 -7357
5083 -7357 9786 7773 -4560 -2236 4615 -2976 -10254 2164 14337 2977 -12063 -5662 6499
5096 6499 2245 -4222 3770 7955 -5329 -12930 1414 12956 2694 -7936 -1471 3886 -4061 -5344
5110e344J3046K708j5858p143J3172Q383q630m287P780q31j1717J432J5967K260
5124A0938j5259m903J0435K905p789K399R816m933j4011K524J4926J268j1513
5137c197q77P481l488p644P336J1352o649j3599K996J1575j806o798M405N240
5151F327q615p833R475J0779o393j0487L916O461m762l601Q632M463j0892p336
5165i866R099Q173o001n286N511J723q109j252J0909L493j0551n301P519L996
5179D057n769n82P285j176j0149k51J0985K681q746k639O190m53n976K854Q383
5194F694k548r997M28Q725N42o111J373M927l901o408M520Q262k877q129J571
5209b929N742k058m158M357M517n682o293M924O773l248n124K795K983m170k566
$$ plain form
5110 -5344 7702 10410 -5448 -12591 581 8964 334 -3953 3827 2996 -8721 -7289 8678 10938
5124 10938 -4321 -9224 1211 4116 -3673 -1274 8542 3609 -10402 -7878 7048 8316 -3197
5137 -3197 -4074 3407 -81 -7725 -389 10963 4314 -9285 -6289 5286 3480 -3318 1087 6327
5151 6327 -2288 -10121 -646 10133 3740 -6747 -2831 3630 -1132 -4733 3899 8362 -2530 -9866
5165 -9866 -767 7406 1405 -3881 1630 3353 -4756 -6008 4901 8394 -2157 -7458 61 4057
5179 4057 -1712 -2294 4991 3815 -6334 -6585 4400 7081 -1665 -4304 1886 1433 -4543 -1689 6694
5194 6694 4146 -5851 -5423 3302 3844 -2267 -894 4033 132 -6276 -1756 6506 3629 -4500 -2929
5209 -2929 2813 755 -3403 954 5471 -211 -6504 -1580 5193 1945 -3179 -384 2599 -1571 -4137
5224d137N903L904n968m921M527M014l486k087M207R50n620j512O266K505n222
5239f77k483L854J158l880J33M879r6n567q81M984J626m214l58L372p75m118J422
5256a621M845q35m633m6L838l88k782J257K858k012l682J942L889j019l447Q93
5272i43K517j293k352K135K579k349k970J733K903j420k031J601J439k085j596
5287b132K547J697k026j787J535J618j711r79K006Q31k304j166K316J182j896
5302b69j007J681M78j636k88J817M42j780n87J688L08j381k30J404M3j539J83
5319f73J478p0j415O5J131m8j179M75R40l20j120K74J139k16r63N0P85j03o37
5338d07K77P35l03p76Q4Q63j26o84J68M35k43l36K69M72k84m93K04M70j70n22
$$ plain form
5224 -4137 1766 5670 -298 -5219 -692 3322 -164 -2251 1956 2906 -2714 -4226 2040 4545 -677
5239 -677 -3160 694 1852 -2028 -1895 2984 2888 -2679 -3560 1424 3050 -1164 -1522 1850 1075 -3043 -1621
5256 -1621 3224 2389 -2244 -2290 1548 1160 -1622 -365 2493 481 -3201 -1259 2630 1611 -1836 -943
5272 -943 1574 281 -2071 64 2643 294 -2676 -943 1960 540 -1491 110 1549 -536 -2132
5287 -2132 415 2112 86 -1701 -166 1452 -259 -1238 768 1599 -705 -1871 445 1627 -269
5302 -269 -1276 405 883 -753 -1041 776 1218 -562 -1149 539 847 -534 -764 640 683 -856 -673
5319 -673 805 735 -680 -615 516 468 -711 -236 704 384 -736 -462 677 461 -502 -452 333 230 -407
5338 -407 -130 605 302 -474 -390 473 347 -337 -169 266 23 -313 -44 428 144 -349 -145 325 155 -367
5358c67m5P25j56n63K42M03n8m55J10M26r6l71N1K87j03k84J93L85j54l88J30
5379h8L17q9k05L1K53l24j43J34M52k55l45K29J70l8l01L05P2k55j35J42L58j17
5401A68l88J09L25k01j49K72J08l59P9J82J27l00M1J18r1k93J05M57j78k43j22
5422b33L90j36j27J09K87l31l79M54L76l31m05L52K31n76O4M99J75n56k49O00
5442B14O8l91q5N93q8p77J0J037p4r13J37P28l67q02O67R94n78j165M30J022m48
5463B12q17P36N79q87p02R29J063j024j182J040Q84j261n15J545O78j796p57J548
5481B73O59j316l65J579L8k017o0K195M17k050n33J764K07j860M41K132m85k617
5499a598K52K749j53k323L74K122j279k076J416K844j220l157R41K519j059j913
$$ plain form
5358 -367 -412 313 157 -406 -164 239 181 -274 -164 262 166 -205 -154 133 30 -254 -61 324 170 -218 -88
5379 -88 229 140 -65 -34 219 -105 -248 -114 338 83 -262 -33 137 99 -202 103 175 -80 -215 -73 285 168
5401 168 -220 -111 214 13 -136 136 244 -115 -36 146 273 -27 14 132 41 -252 -147 310 132 -111 -233
5422 -233 157 21 -106 3 290 -41 -420 34 410 79 -326 26 257 -319 -255 244 419 -137 -386 214
5442 214 282 -109 -194 399 311 -466 -456 581 507 -406 -269 459 92 -710 -43 951 373 -792 -362 660 212
5463 212 -605 131 710 -177 -879 50 1113 89 -1093 -53 831 -430 -945 600 1278 -518 -1275 273
5481 273 932 -384 -749 830 868 -1149 -1209 986 1403 -647 -1180 584 791 -1069 -628 1504 1019 -1598
5499 -1598 -1346 1403 1250 -1073 -699 1423 144 -1932 -516 2328 1108 -2049 -1108 1411 352 -1561
5515a561J739K144k579k735K536L224k010k723J843J754k464j523L611J916l760
5530e88k636L062K473k564j405L079O87m270r73M824J790m272k018L501J123l709
5546a896K78M681l09n803m56N428R75m188k5L459j396m406K098N940j589n844
5562c053L24M695o64l538K390L973l924n402L461O321k252n193J736L446l096
5577g76l140N258M311n284n783L676N494l060l089L860J935o173k717P349M372
5592F233o193m701M419K801m647n31O905N07q721k321Q043L494n928k104N023
5607B279n79o635J510R226j45r467j682P295J126n403J904O038m054q602L169
5622d020R902j047p989M78N363l071m834N978P342o449r364L898Q632k193n504
$$ plain form
5515 -1561 178 2322 -257 -2992 -456 2768 758 -1965 -122 1632 -832 -2355 1256 3172 -588
5530 -588 -3224 -162 2311 -253 -1658 1421 2108 -2162 -3135 1689 3479 -793 -2811 690 1813 -1896
5546 -1896 -1618 3063 2754 -3049 -3505 1923 2898 -1290 -1315 2144 748 -3658 -1560 4380 2791 -3053
5562 -3053 -2729 1966 1302 -2236 154 4127 203 -5199 -1738 4583 2331 -2862 -1126 2320 -776
5577 -776 -3916 1342 5653 369 -5414 -1738 3756 696 -2393 1467 3402 -2771 -5488 1861 6233
5592 6233 40 -4661 -242 2559 -2088 -2619 4286 4793 -3928 -6249 1794 5288 -640 -2744 2279
5607 2279 1700 -4935 -3425 5801 5656 -3811 -5493 1802 2928 -2475 -571 5467 1413 -7189 -4020
5622 -4020 5882 4835 -3154 -2676 2687 -384 -5218 760 8102 1653 -7711 -3813 4819 2626 -2878
5637b878L801L667p314m917Q637P674o804q042M148N155m166k369P720K368j0540
5652c860n095R634O659o489m698N396R06p927N65J1131J978j1718m437Q631L641
5667D317o037nP415k740j0896J397J2671J621j0262k410P078j312o281N013R437
5682I006n294j2335K248J1467l70p420K218N369o552p449Q563J0812n907j1610
5696g254K903P993l198m539P505M569j0634q018R371J0168n693p524M254K999
5710B902p352j513J1558M188j1942p538Q772O394n789k154P357r74j1655m73J3834
5725E615M010j1217m889P284J342o777K970J0250l179j3446k83J2503K466q349
5739a700k86N923m339q240O701J2192m480j2740J030R243j431n685N656O109r056
$$ plain form
5637 -2878 923 4590 -2724 -7641 996 8670 1866 -6176 -2028 3127 -1039 -3408 4312 6680 -3860
5652 -3860 -8955 679 7338 849 -3849 1547 2453 -5474 -4909 6222 8200 -3518 -7955 676 4317
5667 4317 -1720 -1725 5690 2950 -7946 -6549 6122 7743 -2519 -4929 2149 837 -5444 -431 9006
5682 9006 3712 -8623 -6375 5092 4722 -2698 -480 4889 -1663 -9112 -549 10263 4356 -7254
5696 -7254 -4351 3642 444 -4095 3410 7979 -2655 -10673 -1302 8866 3173 -4351 -97 2902
5710 2902 -4450 -5963 5595 9783 -2159 -9697 -925 5469 -320 -2474 4883 3909 -7746 -8219 5615
5725 5615 9625 -1592 -6481 803 2145 -4632 -1662 8588 5409 -8037 -8320 4183 6649 -1700
5739 -1700 -1986 3937 -402 -8642 -1941 10251 5771 -6969 -5939 3304 1873 -3812 1844 7953 -1103
5754a103r833P911J2175m295r551K659N346n847l736R979O681j0880r759P426
5768b827Q985m637m347N900J134j0134k549J2548O024j0161p147O665L516o182
5782c212N99R699o94j3129k527J2321M670q345k714O197j772q173L662J1867j635
5797F814j2259j346Q908J070n737K738O267o032r639N148J1831k159r623R24N992
5812B897l741m902P578P297p982j0223N150R473k722n736L790L260p406m426R346
5827A653P371p529p935M526N122m398j771P445J286j0105l896R648N736o736m206
5842c789N168P56p017P53J0029J098j0677l462Q170L173n429l57N862k395q271
5857f388J941R707M66q309r19N079q51m541L991O468m896q426K822Q273j210n685
$$ plain form
5754 -1103 -10936 -3025 9150 4855 -4696 -2037 3309 -2538 -6274 3705 10386 -494 -10253 -2827
5768 -2827 6158 1521 -2826 3074 4208 -5926 -8475 4073 10097 -64 -7211 -546 2970 -3212
5782 -3212 -2613 7086 6392 -6737 -9264 3057 7727 -618 -3332 2865 1093 -7080 -3418 8449 6814
5797 6814 -5445 -6791 2117 3187 -2550 188 6455 423 -9216 -4068 7763 5604 -4019 -3095 2897
5812 2897 -844 -5746 1832 9129 1147 -9076 -3926 5547 2825 -2911 879 4139 -3267 -7693 1653
5827 1653 9024 1495 -6440 -1914 3208 -1190 -2961 4484 5770 -4335 -8231 1417 7153 417 -3789
5842 -3789 1379 2135 -4882 -4129 5900 6998 -3679 -7141 1029 4202 -1227 -1584 4278 1883 -6388
5857 -6388 -4447 5260 5726 -2583 -3502 1577 726 -3815 176 6644 1748 -6678 -3856 4417 3207 -2478
5873b478K020L935m539m989O097O886m760p453K646N647k476l124M284K730o045
5888a619m460N924N367l973m294L070J886m239r63O654J730p190l339N864L181
5903C599m263j302M414j54n990l67P172J667o144k359M544J013l656N46M759j243
5919B236n735J01N868M57m169Q6L061j941l531L061M723k418n334J460M323j148
5935A100l084J926L132l216m015L141M698j980m038J236K689j838j838K916K091
5950B920l314k694K728K636k274j440K275P11l132p49L738J449l714j774L003
5965C69J320k679m64L019L59l530q13L488J343k831j132K007L56j872K31K198
5981A369p5k569l6K164J6j739O87J539j314k060J505K466j007k425N99K186r31
$$ plain form
5873 -2478 -458 3477 -1062 -6051 46 6932 2172 -5281 -2635 3012 536 -2588 1696 4426 -1619
5888 -1619 -6079 -155 5212 1239 -3055 15 1901 -2338 -3301 3353 5083 -2107 -5446 418 3599
5903 3599 -664 -1966 2448 2294 -3696 -4063 3109 4776 -1368 -3727 817 1830 -1826 -1280 3479 2236
5919 2236 -3499 -3398 2470 2927 -1242 -1156 1905 -36 -3567 -506 4217 1799 -3535 -2075 2248 1100
5935 1100 -1984 -58 3074 -142 -4157 -1016 3682 1702 -2336 -1100 1589 -249 -2087 829 2920
5950 2920 -394 -3088 -360 2276 2 -1438 837 1548 -1584 -2333 1405 2854 -860 -2634 369
5965 369 1689 -990 -1454 1565 1924 -1606 -2419 1069 2412 -419 -1551 456 812 -1060 -829 1369
5981 1369 1294 -1275 -1311 853 869 -870 -183 1356 42 -2018 -513 1953 946 -1479 -880 1306 375
5998C75j557Q65J902j098k031O59K136m17j554K47J128o21p76P74R14r14r34Q52
6016e0P61r04m28J165K01j351m37J504O26j424p51J427N04r78p38J123O19r99
6034a30r41J034P87n92m99J80K82j92JL17l1n09J16L84j87m64L28N86l38p73M14
6055b27R02l09q54J5R65R9q51k69P33M05q32l44O78L44l64n18J79M35j05k20O9
6076f9K5k1J95N7k52j7L05K2m04m19O83L74m16o18M14O10q9p32o1O86J04o49j48
6099d20O16R5k73l90L50J78rk05n9qK23J66k60j87K1L82N4n26k6O29L0o86k59
6122e64P85L62o13n40L77N77l70l87K61L61q7k89l6J64J04K0j59k02Q7M31J55
6143D37p33k49P37L87o08m58O40M93p14n95M49Q84k81q48J09O03j96l43L03K79
$$ plain form
5998 375 -1182 -317 1585 487 -1544 -885 1251 834 -720 -473 655 34 -742 32 946 32 -902 -50
6016 -50 711 -193 -621 544 745 -606 -1043 461 1087 -337 -1088 339 843 -135 -873 250 869 -130
6034 -130 -1071 -37 750 158 -341 -161 121 -71 -70 247 216 -293 -177 207 20 -444 -116 470 132 -641 -227
6055 -227 675 366 -488 -473 492 591 -260 -529 204 609 -223 -567 111 455 91 -427 -248 187 82 -138 -69
6076 -69 -44 -65 130 187 -65 -82 223 245 -159 -578 105 479 63 -555 -141 469 380 -352 -413 273 377 -272 -420
6099 -420 196 291 18 -372 -22 156 147 -58 -117 -125 98 264 4 -183 -162 220 274 -252 -278 351 381 -305 -564
6122 -564 221 583 -30 -570 -193 384 14 -373 -112 249 162 -127 -163 1 105 125 -34 -236 -149 282 437
6143 437 -296 -545 192 579 -29 -487 153 646 -68 -663 -214 670 389 -459 -350 253 57 -286 17 296
6163B96k93k80M63j59k95M50L27n10q37P11J049o03j139L69J240m40j270N45J418
6182A042m84j508L32J204pj084L64P88q18n91Q93P54r04o34P74L50r56m5J383
6201H53K12j849o67J915J024j857p24J627O15k161m16K325P18k135j008J694P69
6218I35j352n7J558n32j931L82K082n4j984L99J658j054j999J746K633j632l046
6235b248J026K919r45k257J396K054j895k681K048L107j422k894J145J810j318
6250a55j442K409J549k975k093K692K230k378j240K443N32l633l87M356J359m221
6266i54j961L206J560l054k42L627j24m473p87M876J386l971q75K805m10l121
6282b512J618M341j539m740M45M192l99l120J683L031l117m223L242N371k100
$$ plain form
6163 296 3 -277 186 27 -268 182 509 -1 -838 -127 922 319 -820 -451 789 349 -921 -376 1042
6182 1042 558 -950 -618 586 579 -505 -141 647 -171 -762 131 885 -19 -653 121 471 -485 -530 853
6201 853 1065 -784 -1451 464 1488 -369 -1093 534 1149 -1012 -1428 897 1615 -520 -1528 166 935
6218 935 -417 -474 1084 552 -1379 -997 1085 1031 -953 -554 1104 50 -1949 -203 2430 798 -2248
6235 -2248 -1222 1697 752 -1505 -109 1945 50 -2631 -583 2524 1102 -1792 -647 1163 -155
6250 -155 -1597 812 2361 -614 -2707 -15 2215 -163 -1403 1040 1572 -2061 -2448 1908 3267 -954
6266 -954 -2915 291 1851 -1203 -1445 2182 2058 -2415 -3202 1674 3060 -911 -1786 1019 609 -2512
6282 -2512 -894 3447 1908 -2832 -2387 1805 1406 -1714 -31 3000 -117 -4340 -1098 4273 2173
6297B173n069J255L682j927k975L602L543m201m833L303M893k112l362K376J781
6312B129l988k005N703L151n252m008L908K904l542r29M825N06o907j558P132
6327B069K906n404k653M082N53m708O88O875j42p555j507O191J841m453M60L870
6343C113k450n944K750P612j086p042J33M836j559l601L892N063m832p361L653
6358b823P356j656n334J986L236m346l712O290N794n428o992L423N086k780k326
6373b226M864J487p261l458P751N288n656m626M095J801n221j92Q092J172r070
6388c160l518P529L835n178j572N220j283p474J254R544Q89q562k258N737M66
6403A469m345K686O280m000r088K364R284k28o834P43M548l875n015O149P783
$$ plain form
6297 2173 -2896 -1641 2041 114 -2861 741 4284 83 -4750 -1447 3446 1334 -2028 348 2129
6312 2129 -1859 -3864 1839 4990 -262 -4270 -362 2542 -1000 -1929 2896 3402 -3505 -5063 2069
6327 2069 4975 -429 -3082 1000 1553 -3155 -2467 4408 4266 -3289 -4796 1395 3236 -1217 -757 3113
6343 3113 663 -5281 -2531 5081 3995 -3047 -2914 1922 363 -3238 654 5717 885 -6476 -2823
6358 -2823 4533 2877 -2457 -471 2765 -1581 -5293 997 6791 1363 -5629 -2206 2880 100 -2226
6373 -2226 2638 4125 -3136 -6594 1157 6445 789 -3837 258 2059 -3162 -3354 4738 5910 -3160
6388 -3160 -6678 851 4686 -492 -2064 3156 1873 -5601 -4347 5197 6086 -2476 -4734 1003 1469
6403 1469 -2876 -190 6090 2090 -6998 -4634 4650 4422 -2412 -1669 2879 -996 -6011 138 7921
6418G921n256r003K391P298j683m156M085L308p115n504P384P739m967o698K993
6433a263L586m564j389P674K458q958n145P272N590m775k765M553J07p635r3J0038
6449D691K688r012m295O161K424m837Q83O764k132r688M19R787J894p110j264
6464b627M530j814n401M450Q192l459r831Q42Q143k81n059K718M465n876o585
6479g593O056Q948l681q119J794M979l114k890O073M250p659o808N967P216l466
6494A953m556L610J674o492j650Q821M168q249n420N345L890m239o54N987m20
6509C768q727j581R219L573o727l070M594L4n073K134P703j367r053p97P389J465
6525C484m782O22M283l403o380L834Q113j602p844L30N167j155l872M170M740
$$ plain form
6418 7921 2665 -6338 -3947 3351 1668 -2488 1597 4905 -2210 -7714 -330 7409 2442 -4256 -1263
6433 -1263 2323 -2241 -3630 4044 6502 -2456 -7601 -329 5261 486 -2279 2274 2381 -5254 -5347 4691
6449 4691 7379 -1633 -5928 233 2657 -2180 -1297 5467 3335 -6353 -5934 3853 5747 -1363 -2627
6464 -2627 1903 89 -5312 -862 7330 3871 -5960 -5118 3025 2744 -2315 403 4868 -1008 -7593
6479 -7593 -1537 7411 3730 -4389 -2595 2384 -730 -3620 2453 6703 -956 -7764 -1797 5419 1953
6494 1953 -2603 1007 2681 -3811 -5461 3360 7528 -721 -6141 -796 3094 -1145 -1799 4188 3768
6509 3768 -4959 -6540 2679 6252 -475 -3545 1049 1083 -3990 -1856 5847 4480 -4573 -5370 2019 3484
6525 3484 -1298 -676 3607 204 -6176 -2342 5771 4169 -3675 -3345 1822 667 -3205 965 5705
6540E705n515o777M020P281j942n188K016K929m430k774O192M820n847n913L748
6555a675M683k804k306M502J052o495k597P145M147n452l864L811J628m226OO324
6571C879M55p371k058O282K487m202j019L849j177n204J451O690j01o464q18M599
6587A278J47l519J893M169k938n685K153N964o80m736P43L190k419k932L679M169
6603D476l197n237K021M509j626k782K609J879l970k608M326L724l253l697K423
6618d03K101k613r75L930J111m630k187M040K636k893j895K795L79l458j32M541
6634B347P75m497j406L466R15k592J74K829q73l713L41M194M52l549l37K575n84
6651E17k308J305L082j449l465P57L262n44k290Q42J898j717k133J869K864j625
$$ plain form
6540 5705 190 -6587 -2567 4714 2772 -2416 -400 2529 -1901 -4675 1517 6337 490 -5423 -1675
6555 -1675 3008 204 -2102 2400 3452 -3043 -5640 1505 5652 200 -3664 147 1775 -2451 -2445 3879
6571 3879 4334 -3037 -5095 1187 3674 -528 -1547 2302 1125 -4079 -2628 4062 3961 -2503 -3321 1278
6587 1278 1425 -2094 -201 3968 1030 -4655 -2502 3462 2782 -1954 -1211 1979 -440 -3372 307 4476
6603 4476 1279 -3958 -1937 2572 946 -1836 773 2652 -1318 -3926 400 4124 871 -2826 -403
6618 -403 1698 -915 -1890 2040 3151 -1479 -3666 374 3010 117 -1778 1017 1396 -2062 -2194 2347
6634 2347 3122 -1375 -2781 685 1600 -992 -818 2011 1138 -2575 -2234 1960 2412 -1137 -1474 1101 517
6651 517 -1791 -486 2596 1147 -2318 -1561 1701 1157 -1133 -291 1607 -110 -2243 -374 2490 865
6667H65k630J011J883r11j458J573J684k346j925K230J868j491j588J208R39j494
6683e82o62K038J020k199j435J857J107j331o43J430K47j851l49K170O21j964
6699e26m71J451K90j470J79J399n2j810j9J843N6j373k03J309l27j110L13J685
6717A164n53j459J92J295j30j141L42R03m98j008O70R54m11j017L61P73l84o42
6735e89N31Q56p14q13N29Q84m91p73N50M53m65m65P13K89n73n07O18L82n19l29
6755d33N47K69n92j40M92L02n32l45N07L37n71j18M07L09o69j32M68J54l63j77
6775b80K23L06l56j03K78J45l30k83O51M0l22l11L97M1k85J29K59K0m02j23M63
6796A57J05l40K3K84m6k31j35L90qm43J64K25R1k90o9L62j22m09J96L92j63j90
$$ plain form
6667 865 -1765 -754 1129 218 -1240 333 2017 -329 -2254 -24 1844 353 -1235 -27 912 -582
6683 -582 -1244 794 1814 -385 -1820 37 1144 -187 -830 600 847 -1004 -1353 817 1438 -526
6699 -526 -997 454 744 -726 -547 852 800 -1010 -1029 814 870 -503 -706 603 276 -834 -521 1164
6717 1164 611 -848 -656 639 509 -632 -290 613 115 -893 -223 731 320 -697 -336 437 53 -589
6735 -589 -58 798 84 -729 -200 684 193 -580 -30 423 -42 -507 206 495 -78 -585 33 415 -104 -433
6755 -433 114 383 -209 -349 143 445 -87 -432 75 412 -159 -277 130 439 -230 -362 106 260 -103 -280
6775 -280 -57 249 -107 -210 68 213 -117 -400 251 291 -31 -342 55 96 -189 -60 199 219 -183 -306 157
6796 157 262 -78 -55 229 183 -48 -183 207 199 -244 -80 145 236 -54 -123 239 117 -292 -96 296 133 -57
6818e7j77M53p6k44N8J35j23j34R6M20k10l47J89K15k48j22J47K80l08k69L65
6839D3K7j39r9J59J45k72n5M02J50n52j94O16j4l47M0L95k34m38L13M05j46n05
6861c00K53L39m21j19K47L89l92l65K41M17k18l78M87K86o74k98O95L75p32k27
6881c95N68J44o69R5O44J03q38j69Q88J02p94M1O30r2r35K46J170k29r83J64P05
6902C96l07o94O06J058r16j136O44J050k48j044N83O90r26p15J147J020j018j279
6920a089Q73J009r89m15J191N29j724o88J619Q47j256p84J272K31j419n9J805
6937I53L23j996o30J889L60j479J43J453n63j974M44K515j25k218j38J863n90
6954B30j710J436J903j298k476P62K645n98j959R40J506j630j837K172K373j912
$$ plain form
6818 -57 -234 219 143 -101 -43 92 -31 -165 -69 351 141 -206 -17 198 -50 -172 -25 255 -53 -322 43
6839 43 70 -69 -168 -9 136 -136 -191 211 361 -191 -385 231 217 -130 -90 305 71 -367 -54 351 205 -300
6861 -300 -47 292 -129 -248 -1 388 -4 -369 -128 289 71 -307 180 466 -208 -506 189 564 -168 -395
6881 -395 173 317 -352 -257 387 490 -348 -517 371 473 -321 -280 350 258 -677 -431 739 510 -473 -309 396
6902 396 89 -605 1 1059 143 -993 -349 701 453 -591 -8 682 -244 -959 188 1208 190 -1089
6920 -1089 -216 793 -196 -611 580 1109 -615 -1303 316 1163 -93 -877 395 626 -793 -852 953
6937 953 1276 -720 -1350 539 899 -580 -437 1016 453 -1521 -1077 1438 1313 -905 -1043 820 230
6954 230 -1480 -44 1859 561 -1915 -1153 1492 894 -1065 -125 1381 -249 -2086 86 2459 547
6970E47k399J288J854j345j271K209J070k751j797K819K123k053j804J658J017
6985A165k373n59L472R28l655j570K819J548k359k61K409l09l616J92M072O99
7001B602l620q54K703j26k521J195L447j229m420M85M226k9l078P91K383k184
7017b29l117K809M233k089m312R86L306j268k097K478K410l628l580L441M058
7032C401k286l179J978J517k832j275M520K200m829l320L831K848k678j302L207
7047A801K26m969o33N867K058n030k332L372J053l368Q43M592r43n942m39N649
7063A805J371m022l16L135j729m071K527N671j458n942N2M615m97k995K488L175
7079C809l883n027L362O018j778m850J306K797k832k277M811L683n120n159L509
$$ plain form
6970 547 -1852 -564 1290 -55 -1326 883 1953 -798 -2595 224 2347 294 -1510 148 1165
6985 1165 -1208 -1767 1705 2633 -1022 -2592 227 1775 -584 -845 1564 1255 -2361 -2169 1903 2602
7001 2602 -1018 -1872 831 705 -1816 -621 2826 1597 -2823 -2338 1888 1859 -1219 -428 1955 -229
7017 -229 -3346 -537 3696 1607 -2705 -1719 1587 319 -1778 700 3110 -518 -4098 -657 3401
7032 3401 1115 -2064 -86 1431 -1401 -2676 1844 4044 -785 -4105 -274 2574 -104 -1406 1801
7047 1801 2027 -2942 -3575 2292 4350 -680 -3012 360 1413 -1955 -1112 3480 2537 -3405 -3844 1805
7063 1805 3176 -846 -1162 1973 244 -3827 -1300 4371 2913 -3029 -2977 1638 1141 -1854 634 3809
7079 3809 -74 -5101 -1739 4279 2501 -2349 -1043 1754 -1078 -3355 1456 5139 19 -5140 -1631
7094a631M758k311k453L169J269n528k034O571L595n227m106L540K140l239k23
7109a710N379O6p029j899O454L086m509j807L586o59n093J715P125j91p555j394
7125d435N625Q92l581J454M005l259o120K550P335o33n958l4L755j849l307M434
7141H74M797m520o818K852O214j449l707K363K195m893l066N937N210m645n457
7156d113K542L611k694j199M815J286o829l347O298M553m095l149L073M84m542
7171c306L96P132Q57p269k922N393K491l610J12L963j803o322J222P630O32o214
7187a618j417M122n35l729L132N245l299p128J700O609k43m411J113K974l611
7202a096l861M847N954l616o426J651M653j738k438L922K326n759m196N362N265
$$ plain form
7094 -1631 3127 816 -1637 1532 2801 -2727 -4761 1810 5405 178 -3928 -388 1752 -1487 -1710
7109 -1710 3669 3735 -3294 -5193 1261 4347 -162 -1969 1617 958 -4135 -2420 4705 4514 -3041 -4435
7125 -4435 1190 2082 -1499 -45 3960 701 -5419 -2869 4466 3833 -2125 -2159 1596 -253 -3560 874
7141 874 5671 1151 -5667 -2815 3399 1950 -1757 606 2801 -2092 -5158 779 5989 1344 -4113
7156 -4113 -1571 2040 -654 -1853 2962 4248 -2581 -5928 370 4923 828 -2321 752 1236 -3306
7171 -3306 -2910 4222 5079 -2190 -5112 281 2772 -838 -726 3237 1434 -4888 -3666 3964 4596 -1618
7187 -1618 -3035 1087 552 -3177 -45 5200 1901 -5227 -3527 3082 2839 -1572 -459 2515 -1096
7202 -1096 -4957 -110 5844 2228 -4198 -2547 2106 368 -2070 1852 4178 -1581 -5777 -415 4850
7217D850l366m120K534J689l813p57N960J875o162l597M599L447l284j159L482
7232B178k41n703q3O770J683n504k434L644Q55l264J460M594j525o425J49O051
7248B205J154m161l34K936j978l626K848N573k152n863O20M493n56k794K411K374
7264C150l685m160L575N276k144m322J367K324k282j804M351K507m663l784L495
7279g99L707k222k177K607Q30m225j140N293K196m383k774L077J585k690r3L667
7295B459mn137p18M842J676l671j011K599m51l043J160M358o88m591l01L608L79
7312A466k542P42K484j909l280J806M027q45l639L55K409j075j870K249K471k592
7328B57l276J967L186j111k309J289J314k209j565L048K204k575k527J896J776
$$ plain form
7217 4850 1484 -2636 -102 1587 -2226 -2983 2977 4852 -1310 -4907 -308 3139 -145 -1304 2178
7232 2178 1937 -3766 -3849 2921 4604 -900 -3334 310 1165 -2099 -639 3955 2430 -3995 -3846 2205
7248 2205 3359 -802 -1136 1800 -178 -3804 -956 4617 2465 -3398 -2778 1715 1159 -1635 776 3150
7264 3150 -535 -4695 -1120 4156 2012 -2310 -943 1381 -901 -2705 1646 4153 -510 -4294 -799
7279 -799 2908 686 -1491 1116 1946 -2279 -3419 1874 4070 -313 -3087 -10 1575 -1115 -1208 2459
7295 2459 2455 -2682 -3400 1442 3118 -553 -1564 1035 584 -2459 -1299 3059 2371 -2220 -2521 1087 1466
7312 1466 -1076 -334 2150 241 -3039 -1233 2794 1949 -1690 -1335 1074 -1 -1871 378 2849 257
7328 257 -3019 -1052 2134 1023 -1286 3 1317 -892 -2457 591 2795 220 -2307 -411 1365
7343A365j447j044K342M47l071r91K939J692k312j409J704O21k011K1K804K39
7359A889l041q92K649Q74j890l11J819l80k380O75K665j37k494k08J905j22j627
7376a006P93J581q91k152O49K271l77j669L04J373q27j301J170J667j190j744
7392a349P64J664q04r98Q53Q16j257j038J493J181j153j103P16R88r72n71J195
7409D25O59j576p16J321R70j180m34O62L38r06j24J122L12j298l76R24N73j059
7427c63q0J021r2j053KJ139M5r79k01R51m2q91K99Q65k40r96K09R33j37o71N7
7448b24N61j19p15K96O01k17n36J54N29n3n19J25L57j41n91L81N23j96n61J53
7468a92M33r2l73K45M81n54k43K40M28k56l86J95K83k29k62K86L94n18k04K75
$$ plain form
7343 1365 -82 -1126 1216 1663 -1408 -2399 540 2232 -80 -1489 215 836 -1175 -1154 1650 1889
7359 1889 -1152 -2044 605 1479 -411 -722 1097 717 -1663 -988 1677 1540 -954 -1162 743 621 -1006
7376 -1006 -213 1368 477 -1675 -1026 1245 868 -801 -497 876 49 -1252 -82 1585 395 -1349
7392 -1349 -585 1079 275 -723 130 946 -311 -1349 144 1325 172 -931 -215 773 -199 -770 425
7409 425 1084 -492 -1208 113 1083 -97 -531 131 469 -437 -561 561 873 -425 -801 123 696 -363
7427 -363 -443 578 486 -567 -565 574 619 -360 -561 390 348 -543 -244 621 381 -615 -406 527 390 -281 -224
7448 -224 337 218 -497 -201 400 183 -353 -199 330 277 -242 -117 240 99 -492 -111 412 216 -345 -192
7468 -192 241 149 -224 21 502 -52 -295 -55 373 117 -269 -74 209 -20 -282 4 398 -120 -324 -49
7488d9K86k55l46M21Q1j79j99L02J60k23k57K71J80k85j40K64J57k59j70M03R2
7509B55k72l25L93J00j75k00L19J07l11o0K01J16k76m4L02M4k24l1J21J3j76j6
7531a39K55M3l36j23M22r8k67K80J39J0n17L12J94k25oP9J94k85j86K13L02l97
7553a36j08J68K52j86j16J49K00l29j51M20J21l87j51L43ml29J07M21l8l13j58
7574b25K78L4k07J5L93k92k69K69L35j92m75K32L62k14l75M45M37n75m72M84M30
7595D18n43n1L41K6m26l19Q25K12o34l33N29K55o11J45N80pj034Q1R96M3p80p4
7617c61P27k54p65K77J035j54j190K72R76l36p38O61N59n57j194O45J265n20r48
7636f00M57O87p23o20J168O97j210q57P89J066r43n71J054K43j282n17J591P60
$$ plain form
7488 -49 237 -18 -364 57 138 -41 -240 62 222 -1 -258 13 193 -92 -232 32 189 -70 -240 163 255
7509 255 -17 -342 51 151 -24 -224 95 202 -109 -169 32 148 -128 -172 130 174 -50 -81 40 53 -123 -139
7531 -139 116 159 -177 -300 122 24 -243 37 176 186 -331 -19 175 -50 -56 23 217 -68 -254 -41 261 -136
7553 -136 -244 -76 176 -10 -126 23 223 -106 -257 163 284 -103 -254 89 85 -244 -137 284 246 -67 -225
7574 -225 53 87 -120 -105 288 -4 -273 -4 331 139 -336 -104 258 44 -331 114 551 -24 -496 -12 418
7595 418 -125 -176 165 191 -235 -554 271 483 -151 -484 45 300 -311 -166 414 407 -627 -546 450 493 -287 -361
7617 -361 366 112 -653 -376 659 505 -685 -413 563 227 -511 150 709 152 -1042 -397 868 348 -600
7636 -600 -143 544 -179 -799 369 1066 -144 -1001 -212 854 -89 -660 394 637 -645 -1162 429 1189
7654A189j494o49J217L57j270J10J611Rk120j20J749L83j376k26J351k80j680
7671a239M46K170l11k170K48J614l18j354Q96J632j347k135J103K264n73j887
7687i61N12J384j144j376J779J937j755k218J167J910r36j202J482Q96k418j109
7703b052K537J634j999j698J643P63j724j78K595M84l286j130K842J349k077p89
7719a086K094j58k667L77L336L40l295q52K361L91j818Q42K297j414l453Q93L727
7736A915q6k999M06K002j471k005K203L170k102l724J128L041p74j875J655J503
7752A987k735k354L078L247k239k892J312J680j832r23L295J341m172k339L411
7767a35K705k449j474K341L74l606k24M607J251m339j961L097J263k351J81L083
$$ plain form
7654 1189 -305 -954 263 620 -650 -540 1071 1080 -1040 -1160 589 972 -404 -630 721 441 -1239
7671 -1239 -793 1377 1066 -1104 -856 758 440 -914 -18 1614 267 -1868 -765 1499 926 -961
7687 -961 -449 935 -209 -1585 194 2131 376 -1842 -675 1235 299 -903 579 1475 -943 -2052
7703 -2052 485 2119 120 -1578 65 828 -896 -1074 1521 2005 -1281 -2411 431 1780 -297 -1086
7719 -1086 1008 850 -1817 -1440 1896 2236 -1059 -1911 450 841 -977 -135 2162 748 -2705 -1812 1915
7736 1915 1829 -1170 -764 1238 -233 -2238 -35 3135 1033 -2691 -1563 1478 704 -1171 484 1987
7752 1987 -748 -3102 -24 3223 984 -1908 -596 1084 -748 -1671 1624 2965 -1207 -3546 -135
7767 -135 2570 121 -1353 988 1362 -2244 -2468 2139 3390 -949 -2910 187 1450 -901 -720 2363
7783B363p99m406K8M730R10l597o45K356q90k526J982M078j725m888N57M074j29
7800A473k569J194K280k806l491L119M654j761m365Q61K663j472j676L138K281
7815C523m099l646L320L797j943k397J954R07l531p91M787K327m562l244L111
7830d87K391k442n44L587k43n224r09N560K171m148j977K772J65l086J230M865
7846C681r77n513p08M838R41l112N00K570k185m054K597N353j184n202J86L526
7862A257r64k296K867K953l718m540K573N135j175l537J066J762k747j907M254
7877I83L454m041m182K490L295j668j406K758O33m862j406N173K946l874k826
7892b533K577J085l025K65M727L02n707j738M665K357l125q41K701j099l925J298
$$ plain form
7783 2363 1564 -2842 -2814 1916 2826 -771 -1416 940 50 -2476 -494 3584 1859 -3029 -2472 1602 1473
7800 1473 -1096 98 2378 -428 -3919 -800 3854 2093 -2272 -1411 1252 -220 -1896 1242 3523
7815 3523 -576 -4222 -902 2895 952 -1445 509 1416 -2115 -2906 1881 4208 -354 -3598 -487
7830 -487 1904 -538 -1082 2505 2262 -2962 -3871 1689 3860 -288 -2265 507 672 -2414 -1184 3681
7846 3681 2704 -2809 -3517 1321 2262 -850 -350 2220 35 -4019 -1422 3931 2747 -2455 -2269 1257
7862 1257 293 -2003 864 3817 99 -4441 -1868 3267 2092 -1445 -379 1383 -1364 -3271 983
7877 983 4437 396 -3786 -1296 1999 331 -1075 1683 2316 -2546 -3952 1221 4167 293 -2533
7892 -2533 44 1129 -1896 -1631 3096 3398 -2309 -4047 618 2975 -150 -991 1710 611 -3314 -2016
7908b016N402r4n247p76L462K12k516J821L179k762m835J894N413n66m132N46
7924a015K386j824k649L479L931l311m605J481L939q81k073J976J405l543k437
7939c741M033L588k890l392J775J719k245m33L889R06m845k132M047K712k754
7954B37j616K376J85l653J30M805Q46m348j959L175J358k312L23K821j285m051
7970b968O57M538K96l466m24K259j025k141K324L328k143m288Q83L926l41k601
7986a186J175K062k575k717K879L554j860l484R45K231j154j262K436J542l314
8001g28k319K828K557j771j821J634O34k566m99L757J074l492j919K535J783k022
8017c35n34K234j31l009n92L533J265k799j142J794K54j805P08K512o46l043q8
$$ plain form
7908 -2016 3386 3292 -1955 -2731 731 943 -1573 248 3427 665 -4170 -2276 3137 2571 -1561 -1015
7924 -1015 1371 -453 -3102 377 4308 997 -3608 -2127 1812 931 -1142 834 2239 -1304 -3741
7939 -3741 292 3880 990 -2402 -627 1092 -1153 -1586 2303 3209 -1636 -3768 279 2991 237
7954 237 -1379 997 1182 -2471 -2341 2464 3310 -1038 -2997 178 1536 -776 -453 2368 1083 -2968
7970 -2968 -2311 2227 2523 -943 -1367 892 -133 -2274 50 3378 1235 -3053 -2170 1756 1415 -1186
7986 -1186 -11 2051 -524 -3241 -362 3192 1332 -2152 -1207 1024 -130 -1392 1044 2586 -728
8001 -728 -3047 -219 2338 567 -1254 380 1014 -1552 -2051 1706 2780 -712 -2631 -96 1687 -335
8017 -335 -869 1365 1234 -1775 -2367 1166 2431 -368 -1510 284 538 -1267 -559 1953 1307 -1736 -1824
8034a824K898Q0j835K45J570j146k047J565K633q41k698K32K123l29j715J137
8050D8J649j758k019J330K606q40j937M75J108j087p41J770J218j828j795J579
8066b22J336j069q61J429K81j882o27K182J150j875j219J465Q06j299l90J769
8082I74J82j924o00J677Q87j191o58R02Mj021L71J362k39j624J42J447j42j083
8100e34N26J013q47j367O86J652k85j630K95J028l19p80K13J221n14j237M09J033
8118E63k2q50K70L65n12m03Q81M29p57n85N67N73o60l23P51L77r67m90R06O97
8138H10p13q14O11N09m81m07O53M32q57k60M37L99l09k22L75m4m02Q1O13n5o94
8159c38M6O02j20m96J57O11q6r50K51P14J44o63k78O12m5k97o0L95O8m16o7K55
$$ plain form
8034 -1824 1074 1154 -681 -436 1134 -12 -2059 -494 2139 1298 -1400 -1168 955 626 -1089 48
8050 48 1697 -61 -2080 -750 1856 1016 -921 -446 662 -425 -1166 604 1822 -6 -1801 -222
8066 -222 1114 45 -816 613 894 -988 -1615 567 1717 -158 -1377 88 894 -405 -795 974
8082 974 1156 -768 -1368 309 1196 5 -653 249 253 -768 -397 965 726 -898 -756 691 549 -534
8100 -534 -8 1005 158 -1209 -523 1129 844 -786 -491 537 218 -562 -349 872 358 -879 -470 563
8118 563 541 -309 -39 326 -186 -589 292 721 -36 -621 -54 519 -141 -464 287 664 -303 -793 113 810
8138 810 97 -717 -106 403 -78 -485 168 600 -257 -517 -80 319 10 -212 163 119 -283 -202 411 356 -338
8159 -338 -292 310 190 -306 -149 462 376 -574 -323 391 535 -128 -406 206 161 -136 -196 199 267 -149 -216 39
8181C9K11k09j62K56k08q8K05K39l52k33
$$ plain form
8181 39 250 41 -121 135 -73 -161 44 283 -69 -302
8191c02
$$ Imaginary data points
##PAGE= N=2
##DATA TABLE= (X++(I..I)), XYDATA
0@%%%%%%%%%%%qJ6j6J6j6K0k3K7l3L8m2M5n4O7p4Q1r3J03j15J27j42J62j78J93
35A01k18K44k67K95l25L59m00M44m91N46o08O75p58Q59r72J110j287J513j812
54i92K225k831L793n489R039j9197R8589L87121k71359m63284N5058K48370l2909
67H134k7666K05352j2097l76825j03817L93276K02186l02409j75558K52342R7318
78A60236k95740q7892L31992J42885k68236j34634J63991k497j71848J60982L36504
89C35743j66509n13113j2095N09144J99977l06571j96086R7260m592p5709K10337
100G7786K35727k42306l94521J17371L98948m635k82355K0473J93465j10942k05639
111a96628J52072K43502j18645k08702J09774J25502j99182j14799L17121K29170
$$ plain form
0 0 0 0 0 0 0 0 0 0 0 0 0 -8 8 -8 8 -8 12 -11 16 -17 21 -21 24 -30 37 -37 44 -49 54 -61 66 -76 86 -92 101
35 101 -117 127 -140 155 -170 189 -211 233 -258 288 -320 355 -403 456 -516 594 -693 820 -992
54 -992 1233 -1598 2195 -3294 5745 -13452 85137 472258 200899 -262385 -207327 41043 8134
67 8134 -19532 185820 173723 -203102 -306919 86357 288543 -13866 -189424 62918 160236
78 160236 -135504 -223396 108596 251481 -16755 -151389 12602 10105 -161743 -761 335743
89 335743 169234 -343879 -355974 153170 353147 46576 -149510 -52250 -56842 -132551 77786
100 77786 313513 71207 -323314 -205943 193005 188370 -93985 -73512 119953 9011 -196628
111 -196628 -44556 198946 80301 -128401 -18627 106875 -92307 -207106 110015 339185
121C39185l22260l60449J78019L49080k2022j73567K3282r300j90708L2205L60358
132B03823J04535l74691k39303K45615K33131j25686j10718J27029P805k11722
142a40182l556K63681M4777k39838l6921K11443k3703k51208M8261L25029J7644
153B15427l27650j08026K20121J03089r5297K4147Q2517j62562j97946J80506
163f5674L19894p1873l20583l8379K04492L3942r2080P0070Q1845j62762j49386
174a90494J68739J96272j23059j74668J09373J33279j46132j39668J71313J83712
184A88667j33125j90414O7120J20279n8290k9211J35321R686k27258q0930K37521
195C9366J61624j55853j57227O9283O6426o5460K3462J38864l5985k06762j5756
$$ plain form
121 339185 16925 -343524 -165505 183575 161553 -12014 11268 1968 -188740 -156535 203823
132 203823 308358 -66333 -305636 -60021 173110 47424 -63294 63735 71540 -140182
142 -140182 -143738 119943 164720 -75118 -112039 99404 75701 -175507 -127246 197783 215427
153 215427 -112223 -220249 -128 102961 7664 31811 114328 -48234 -246180 -65674
163 -65674 254220 182347 -138236 -176615 27877 61819 -30261 39809 121654 -41108 -190494
174 -190494 -21755 174517 51458 -123210 -13837 119442 -26690 -166358 4955 188667
184 188667 55542 -134872 -67752 52527 -5763 -34974 100347 110033 -117225 -198155 39366
195 39366 200990 45137 -112090 -42807 23619 -41841 -18379 120485 84500 -122262 -138018
206a38018K06982N5754j61254l9637J36462q54j56794R115J79812J9217j59170
217d8385l3197J08899m609q6574O4859J21427q4610j73329M4078J77378Q075j21857
229b7845q819O0090m7129n0486J05107R1928j14142j30859Q0547J26294n3193
240C1493r1221O2255O8889q8155p8848R3500R4705p0216q3733N0131M8341o1970
252b4829k3988R5038L4471j11469o1996R1346O8689n7539l8892M7227p37p1777
264e4456J4671J02504K666j07718k3069Q8228K1147p1145k275P4673p787q8325
276e0886j912Q7185J5453o6322r839M6098j4601m6618L4634O4056l2819p5179
288e0750J5704O5294n607m2874J5124K9060l4829l2925M6337M4511m4169m9574
$$ plain form
206 -138018 68964 124718 -36536 -76173 60289 59435 -97359 -88244 91568 110785 -48385
217 -48385 -81582 27317 22708 -63866 993 122420 37810 -135519 -91441 85937 94012 -27845
229 -27845 -36664 23426 -23703 -74189 30918 122846 8704 -122155 -41608 84686 31493
240 31493 -59728 2527 71416 -16739 -95587 -2087 92618 22402 -61331 -11200 37141 -24829
252 -24829 -48817 46221 80692 -30777 -92773 -1427 67262 9723 -29169 18058 17321 -54456
264 -54456 -39785 62719 65385 -42333 -65402 22826 43973 -27172 -29447 45226 37439 -50886
276 -50886 -52798 34387 49840 -16482 -26321 19777 5176 -41442 -6808 57248 24429 -50750
288 -50750 -35046 30248 24641 -18233 -3109 25951 -8878 -41803 4534 49045 4876 -44698
300d4698L7284M5908l5507m1492L8151M2148l5923m3979K5800L6983j6810k0040
312a2175J9089N975l2576n051M4105J6201m2864k6075K9874K3289j7334r393J6306
325I371m594k5437R856L5783o795m0752L21M0069N549l5844j0194K9089J3081
338A9503j9413j1442R728K890n817Q264J0670j4744j9704J2430K5406l601k2708
351h538l998J2172L790j093M289l262j5065n23K1994J0069k1292j9768J3432K3623
365A5830k954k0345m981J2012P595k144l880m960m019N689J0824p48j2236n958
379a0275P728R660O70p202p124p32P185Q244q42j1211q169Q535J4702n32j5743
394e106q024J0166J2550r46j1229p100N220R910K489p149o477N74N238M428l33
$$ plain form
300 -44698 -7414 38494 2987 -38505 -354 41794 5871 -38108 -12308 24675 7865 -12175
312 -12175 6914 12889 -19687 -24738 19367 35568 -7296 -33371 -3497 19792 2458 -6935 9371
325 9371 4777 -20660 -10804 24979 18184 -22568 -22247 17822 23371 -12473 -22667 6422 19503
338 19503 90 -11352 -1624 1266 -4551 3713 14383 -361 -20065 -7635 17771 14170 -8538
351 -8538 -12536 -364 3426 2333 6622 3360 -11705 -12228 9766 19835 -1457 -21225 -7793 15830
365 15830 12876 -7469 -12450 -438 7157 5013 1133 -3827 -7846 -2157 8667 7919 -4317 -10275
379 -10275 -2547 7113 7783 581 -6543 -7275 -90 8154 7312 -3899 -12068 -3533 11169 10637 -5106
394 -5106 -13130 -2964 9586 8640 -2589 -9689 -4469 5441 7930 781 -5696 -5122 116 4544 4211
409D211n121m885J980P207L455m860q078r70Q290P419m307j0655k350R064Q239
$$ plain form
409 4211 -910 -5795 -3815 3392 6847 1987 -6091 -7061 1229 8648 4341 -6314 -8664 400 8639
$$ [...]
8191g9
##END NTUPLES=NMR FID
##END=
