##TITLE=1H_CA-8570-7
 DMSO, 8 sc, 
 12.3.2019
##JCAMPDX= 6.0         $$ Bruker NMR JCAMP-DX V2.0
##DATA TYPE= NMR FID
##DATA CLASS= NTUPLES
##ORIGIN= UXNMR, Bruker Analytische Messtechnik GmbH
##OWNER= root
$$ XWIN-NMR		Version 3.5
$$ Tue Mar 12 16:52:35 2019 Russian Standard Time (UT+4h)  she@DPX200
##.OBSERVE FREQUENCY= 200.1316
##.OBSERVE NUCLEUS= ^1H
##.DELAY= (6, 6)
##.ACQUISITION MODE= SIMULTANEOUS
##.ACQUISITION SCHEME= undefined
##.AVERAGES= 8
##.DIGITISER RES= 18
##SPECTROMETER/DATA SYSTEM= spect
##.PULSE SEQUENCE= zg30
##.SOLVENT NAME= CDCl3
##.SHIFT REFERENCE= (INTERNAL, CDCl3, 0, 15.7039)
##AUDIT TRAIL= $$ (NUMBER, WHEN, WHO, WHERE, WHAT)
$$ ##TITLE= Audit trail, XWIN-NMR		Version 3.5
$$ ##JCAMPDX= 5.01
$$ ##ORIGIN= Bruker BioSpin GmbH
$$ ##OWNER= she
$$ F:/spectra/data/she/nmr/H-F/1/audita.txt
$$ ##AUDIT TRAIL=  $$ (NUMBER, WHEN, WHO, WHERE, WHAT)
(   1,<2019-03-12 16:51:39.59 +0400>,<she>,<DPX200>,
      <created by zg, POWCHK disabled, PULCHK disabled
       configuration hash MD5:
       00 E9 B6 7A A2 85 ED C7 34 08 36 98 17 FE 4E 26
       data hash MD5: 16K
       41 97 4E A8 2D 83 0C 07 CA 9F 83 70 22 74 A5 E3>)
$$ ##END=
$$ 
$$ hash MD5
$$ 8A 05 39 FF AD 86 9F 5C D2 45 72 D1 34 AB 63 DA
##$RELAX= 
##$RELAX= 
##$RELAX= 
##$RELAX= 
##$RELAX= 
##$RELAX= 
$$ Bruker specific parameters
$$ --------------------------
##$DU= <F:/spectra>
##$EXPNO= 1
##$NAME= <H-F>
##$PROCNO= 1
##$TYPE= <nmr>
##$USER= <she>
##$AMP= (0..31)
100 100 100 100 100 100 100 100 100 100 100 100 100 100 100 100 100 100 
100 100 100 100 100 100 100 100 100 100 100 100 100 100 
##$AQSEQ= 0
##$AQ_mod= 1
##$AUNM= <au_zg>
##$AUTOPOS= <>
##$BF1= 200.13
##$BF2= 200.13
##$BF3= 200.13
##$BF4= 200.13
##$BF5= 200.13
##$BF6= 200.13
##$BF7= 200.13
##$BF8= 200.13
##$BYTORDA= 1
##$CFDGTYP= 0
##$CFRGTYP= 5
##$CHEMSTR= <none>
##$CNST= (0..31)
1 1 145 1 1 1 1 1 1 1 1 1 1 1 1 1 1 1 1 1 1 1 1 1 1 1 1 1 1 1 1 1 
##$CPDPRG= <>
##$CPDPRG1= <>
##$CPDPRG2= <>
##$CPDPRG3= <>
##$CPDPRG4= <mlev>
##$CPDPRG5= <mlev>
##$CPDPRG6= <mlev>
##$CPDPRG7= <mlev>
##$CPDPRG8= <mlev>
##$CPDPRGB= <>
##$CPDPRGT= <>
##$D= (0..31)
0 1.2 0 0 0 0 0 0 0 0 0 0.03 0 0 0 0 0 0 0 0 0 0 0 0 0 0 0 0 0 0 0 0 
##$DATE= 1552395098
##$DBL= (0..7)
120 120 120 120 120 120 120 120 
##$DBP= (0..7)
150 150 150 150 150 150 150 150 
##$DBP07= 0
##$DBPNAM0= <>
##$DBPNAM1= <>
##$DBPNAM2= <>
##$DBPNAM3= <>
##$DBPNAM4= <>
##$DBPNAM5= <>
##$DBPNAM6= <>
##$DBPNAM7= <>
##$DBPOAL= (0..7)
0.5 0.5 0.5 0.5 0.5 0.5 0.5 0.5 
##$DBPOFFS= (0..7)
0 0 0 0 0 0 0 0 
##$DE= 6
##$DECBNUC= <off>
##$DECIM= 24
##$DECNUC= <off>
##$DECSTAT= 4
##$DIGMOD= 1
##$DIGTYP= 9
##$DL= (0..7)
0 120 120 120 120 120 120 120 
##$DP= (0..7)
150 150 150 150 150 150 150 150 
##$DP07= 0
##$DPNAME0= <>
##$DPNAME1= <>
##$DPNAME2= <>
##$DPNAME3= <>
##$DPNAME4= <>
##$DPNAME5= <>
##$DPNAME6= <>
##$DPNAME7= <>
##$DPOAL= (0..7)
0.5 0.5 0.5 0.5 0.5 0.5 0.5 0.5 
##$DPOFFS= (0..7)
0 0 0 0 0 0 0 0 
##$DQDMODE= 0
##$DR= 18
##$DS= 0
##$DSLIST= <SSSSSSSSSSSSSSS>
##$DSPFIRM= 0
$$ [...]
##$SUBNAM2= <"">
##$SUBNAM3= <"">
##$SUBNAM4= <"">
##$SUBNAM5= <"">
##$SUBNAM6= <"">
##$SUBNAM7= <"">
##$SUBNAM8= <"">
##$SUBNAM9= <"">
##$SW= 24.9336934301222
##$SWIBOX= (0..15)
0 0 2 0 0 0 0 0 0 0 0 0 0 0 0 0 
##$SW_h= 4990.01996007984
##$TD= 16384
##$TD0= 1
##$TE= 0
##$TE2= 300
##$TE3= 300
##$TEG= 300
##$TL= (0..7)
0 120 120 120 120 120 120 120 
##$TP= (0..7)
150 150 150 150 150 150 150 150 
##$TP07= 0
##$TPNAME0= <>
##$TPNAME1= <>
##$TPNAME2= <>
##$TPNAME3= <>
##$TPNAME4= <>
##$TPNAME5= <>
##$TPNAME6= <>
##$TPNAME7= <>
##$TPOAL= (0..7)
0.5 0.5 0.5 0.5 0.5 0.5 0.5 0.5 
##$TPOFFS= (0..7)
0 0 0 0 0 0 0 0 
##$TUNHIN= 0
##$TUNHOUT= 0
##$TUNXOUT= 0
##$USERA1= <user>
##$USERA2= <user>
##$USERA3= <user>
##$USERA4= <user>
##$USERA5= <user>
##$V9= 5
##$VALIST= <valist>
##$VCLIST= <CCCCCCCCCCCCCCC>
##$VD= 0
##$VDLIST= <DDDDDDDDDDDDDDD>
##$VPLIST= <PPPPPPPPPPPPPPP>
##$VTLIST= <TTTTTTTTTTTTTTT>
##$WBST= 1024
##$WBSW= 4
##$XGAIN= (0..3)
0 0 0 0 
##$XL= 0
##$YL= 0
##$YMAX_a= 158079
##$YMIN_a= -165256
##$ZGOPTNS= <>
##$ZL1= 120
##$ZL2= 120
##$ZL3= 120
##$ZL4= 120
##$ABSF1= 10
##$ABSF2= 0
##$ABSG= 5
##$ABSL= 3
##$ALPHA= 0
##$AQORDER= 0
##$ASSFAC= 0
##$ASSFACI= 0
##$ASSFACX= 0
##$ASSWID= 0
##$AUNMP= <proc_1d>
##$AZFE= 0.1
##$AZFW= 0.1
##$BCFW= 1
##$BC_mod= 2
##$BYTORDP= 1
##$COROFFS= 0
##$CY= 11.3945322036743
##$DATMOD= 1
##$DC= 2
##$DFILT= <>
##$DTYPP= 0
##$F1P= 18.9103706918063
##$F2P= -1.10871071338519
##$FCOR= 0.5
##$FTSIZE= 0
##$FT_mod= 4
##$GAMMA= 1
##$GB= 0.15
##$INTBC= 1
##$INTSCL= 1
##$ISEN= 128
##$LB= 0.24
##$LEV0= 0
##$LPBIN= 0
##$MAXI= 10000
##$MC2= 0
##$MEAN= 0
##$ME_mod= 0
##$MI= 1.114404
##$NCOEF= 0
##$NC_proc= 0
##$NLEV= 6
##$NOISF1= 3.799351
##$NOISF2= 2.8
##$NSP= 1
##$NTH_PI= 0
##$NZP= 0
##$OFFSET= 15.70392
##$PC= 1
##$PHC0= -8864.075
##$PHC1= 20.60025
##$PH_mod= 1
##$PKNL= yes
##$PPARMOD= 0
##$PSCAL= 0
##$PSIGN= 0
##$REVERSE= no
##$SF= 200.130013532006
##$SI= 16384
##$SIGF1= 3
##$SIGF2= 2
##$SINO= 400
##$SIOLD= 16384
##$SREGLST= <1H.CDCl3>
##$SSB= 0
##$STSI= 0
##$STSR= 0
##$SW_p= 3612.71676300578
##$SYMM= 0
##$S_DEV= 0
##$TDeff= 0
##$TDoff= 0
##$TI= <>
##$TILT= no
##$TM1= 0
##$TM2= 0
##$TOPLEV= 0
##$USERP1= <user>
##$USERP2= <user>
##$USERP3= <user>
##$USERP4= <user>
##$USERP5= <user>
##$WDW= 1
##$XDIM= 8192
##$YMAX_p= 0
##$YMIN_p= 0
$$ End of Bruker specific parameters
$$ ---------------------------------
##NTUPLES= NMR FID
##VAR_NAME=  TIME,          FID/REAL,        FID/IMAG
##SYMBOL=    X,             R,               I
##VAR_TYPE=  INDEPENDENT,   DEPENDENT,       DEPENDENT
##VAR_FORM=  AFFN,          ASDF,            ASDF
##VAR_DIM=   8192,          8192,            8192
##UNITS=     SECONDS,       ARBITRARY UNITS, ARBITRARY UNITS
##FACTOR=    0.0002004,     1,               1
##FIRST=     0,             0,               0
##LAST=      1.6414764,     0,               0
##MIN=       0,             -165256,         0
##MAX=       1.6414764,     158079,          0
$$ Real data points
##PAGE= N=1
##DATA TABLE= (X++(R..R)), XYDATA
0@%%%%%%%qJ6j6J6j6K4l2M0m8N6p2Q4r5J12j33J55j79K04k32K67l06L47l94M44
31B34m97N58o26O97p77Q69r64J070j189J316j457J614j786J977k193K434k707
48a427L022l384L807m310M922n682O658p966R818j2672J7702k9219J06339K0183
62A07791j36922M5076Q5151M0021q0280o8961r13N9937J4226l8756n6013j0713
74d0356J9116K9077N419k4730n4631l0738L3195P4992J8099p3800q4083J8985
86a09455J02239N9597n9693r2785k301R0638O1319l6256p0852l431O3742M7441
98E0203j9766m7928j4574L0015M0883J8614j8431m4180k9557K4906O3960L0173
110H4318n2169q2629j0550P7429O4691l8153r3615k8609O7461O3587k8805p8629
$$ plain form
0 0 0 0 0 0 0 0 0 -8 8 -8 8 -8 16 -16 24 -24 32 -40 44 -51 61 -72 83 -96 108 -124 143 -163 184 -210 234
31 234 -263 295 -331 366 -411 458 -506 564 -625 691 -766 848 -938 1039 -1154 1280 -1427
48 -1427 1595 -1789 2018 -2292 2630 -3052 3606 -4360 5458 -7214 10488 -18731 87608 107791
62 107791 -29131 15945 101096 141117 60837 -8124 -9037 50900 65126 26370 -29643 -40356
74 -40356 -21240 7837 13256 -11474 -66105 -96843 -63648 11344 29443 -44357 -128440 -109455
86 -109455 -7216 52381 -7312 -100097 -102398 -11760 49559 13303 -57549 -60980 2762 50203
98 50203 30437 -17491 -32065 -2050 38833 57447 39016 -5164 -34721 -9815 54145 84318
110 84318 32149 -50480 -61030 16399 81090 42937 -50678 -79287 -11826 51761 22956 -55673
122e5673k3951N3936N1554j5556n6119k6005K7252M2910J6745j6555l3137k1836
134e6435J4631N1843M1005k1835o5308k3630N9609P4741m918p3336l8896N1409
146H880P3858k082o9257l7926M5063O4070K76n7052l9548J8145M4656J9366j9660
159D8789l6695k5908M323L4751L0402j4562n6867l7615L0095O1142P857o3543
171a7831n3345K7263O7159J0778o3799n1817K9055O7246J5386n3515n0207J1379
183f2248N0094K8167j5862l3893j7126P679K6819K7258Q20l3912l2980J4110N2134
196A1060K5295l8731n1217Q700O2432L1078m3430n8233Q792O6265L7248l8693
208B0566n8702m555M9650M0694q591l6752k2048R168K6857K2367k48k4778k4630
$$ plain form
122 -55673 -79624 -25688 25866 10310 -45809 -71814 -44562 -1652 15093 -1462 -34599 -56435
134 -56435 -41804 10039 51044 29209 -36099 -59729 -120 74621 69703 -3633 -42529 8880
146 8880 82738 80656 11399 -26527 18536 82606 82882 25830 -13718 4427 49083 68449 48789
159 48789 12094 -13814 -9491 25260 55662 41100 -15767 -53382 -23287 37855 45712 -17831
171 -17831 -71176 -43913 23246 34024 -29775 -81592 -52537 14709 30095 -23420 -73627 -62248
183 -62248 -12154 16013 151 -33742 -50868 -43189 -16370 10888 11708 -22204 -55184 -41074 11060
196 11060 36355 -2376 -53593 -44893 17539 48617 5187 -53046 -44254 22011 59259 20566
208 20566 -38136 -42691 6959 47653 39062 2310 -19738 -10570 16287 38654 38406 13628 -11002
221a1002O538L7817K3556k5435m4174j072M9422L3988l1099n6835o715N3758M2122
234G0869k4662n8570j9926L6599M0486k748l5556k6849K033J9780J5833l09k0012
247c032k5147l394K6150K3152j6418m1896j2472L8436L9411j6975n7019k1304
259g0508M5276N3069q146n6651k9722L1353M8815O957l2545k6361P260K4691J5331
272H819j972j2700j2346K69J8038K0209m158k8995j5656K6637L9574k062m6612
285a0955l0461K9251N3305Q481m7479m0055J5801M6809J7887k8037l2576M18K3917
298F306J6629n355j4972j0846J928J4175J4860l197k3366j6275J7734L5046O603
311C9270l6182l5493J6145M9699K0523l6499m4796L465M3382K6322k1232l4929
$$ plain form
221 -11002 -4464 33353 56909 31474 -12700 -13772 35650 69638 38539 -18296 -25011 28747 70869
234 70869 46207 -12363 -32289 4310 44796 42048 6492 -20357 -18324 1456 17289 16980 -3032
247 -3032 -28179 -31573 -5423 17729 1311 -40585 -53057 -14621 24790 7815 -49204 -70508
259 -70508 -25232 27837 19691 -36960 -66682 -35329 13486 20443 -12102 -38463 -31203 -6512 8819
272 8819 6847 -5853 -18199 -17930 108 20317 16159 -12836 -28492 -1855 37719 35657 -10955
285 -10955 -41416 -12165 41140 49621 2142 -37913 -22112 24697 42584 14547 -18029 -17611 6306
298 6306 22935 17580 2608 -8238 -6310 7865 22725 19528 -3838 -20113 -2379 32667 39270
311 39270 3088 -32405 -16260 33439 53962 17463 -27333 -23868 19514 45836 24604 -10325
323a0325o275K3801J8836o555j9168r876M327J2403Q640o022j9651j5343R231
336a5977K7798R859k7423l6468J215L9536K6642k3410m4509r431L4475L1596j1149
349B754l4225j3018K0575K3621j133j8172j1418O836J6665J0966l111j5664j2818
362b8142R842K8724J6486j7396l2711l934L5766L3588j0881l9841j4327K9867
374G041L4562l491l2375j5665J8956K5096N51k1004j3775O150J5254P399n939
387B2760j4842j2851K180J8724J5303j0872l1088j5321K1112L2225o97l5717k5963
400c5047J6208L5088N188k9981k5244J1558K9748P584k1511k0484L958K0735J2587
413A0387o464j5773r784N498J7511J4150n689k2602j3566J4581K8832P109k4857
$$ plain form
323 -10325 -16600 7201 26037 19482 314 -9562 -5235 7168 15808 9786 -9865 -25208 -15977
336 -15977 11821 21680 -5743 -42211 -40996 -1460 25182 1772 -42737 -52168 -17693 13903 2754
349 2754 -31471 -44489 -23914 -293 -1426 -19598 -31016 -24180 -7515 3451 340 -15324 -28142
362 -28142 -18300 10424 26910 9514 -23197 -27131 8635 42223 31342 -8499 -22826 7041
374 7041 41603 38112 5737 -9928 9028 34124 34675 13671 -104 6046 21300 28699 22760
387 22760 7918 -4933 -2753 15971 31274 20402 -10686 -26007 -4895 27330 26633 -9084 -35047
400 -35047 -18839 16249 21437 -8544 -33788 -22230 7518 15102 -6409 -26893 -22935 -2200 10387
413 10387 3923 -11850 -21634 -16136 1375 15525 9836 -12766 -26332 -11751 17081 24190 -667
426f67k5503Q280L0614J1872k1589k6251M314K6152J2778j6392k4029k533J8466
439d488J4966l514j6768j3474K308J4825J3831k781j9327j5709Q883K5518J1517
452A5787j7734k4521J816K8347J8558j4232k5363n24K6762K0037j0020k3436n198
465i721J9309K0680J428j6105j2658K641J4953J3916j344j4927j4740K779J9269
478B5480J1725j3314k4481n434J9520J6467j1345k8232r778J8368J8492p718k6599
491a6849j4254J1637J8647J801j6491j6744j429J1165J2059Q69j1888j3730K53
504c4954J6273J5104n195j8897o656J8209K2276r32k1943j1417J8099K7030L147
517B0144k1315j5707J1846K4845R303j2993j6105o36J3790J2644k6j0570j0830
$$ plain form
426 -667 -26170 -17890 12724 24596 3007 -23244 -18930 7222 20000 3608 -20421 -22954 -4488
439 -4488 10478 6964 -9804 -23278 -20970 -6145 7686 4905 -14422 -30131 -21248 4270 15787
452 15787 -1947 -26468 -24652 3695 22253 8021 -17342 -17866 8896 28933 18913 -4523 -9721
465 -9721 9588 30268 31696 15591 2933 5574 20527 34443 33099 18172 3432 6211 25480
478 25480 37205 23891 -590 -6024 13496 29963 18618 -9614 -19392 -1024 17468 9750 -16849
491 -16849 -31103 -19466 -819 982 -15509 -32253 -33682 -22517 -10458 -9589 -21477 -35207 -34954
504 -34954 -18681 -3577 -8772 -27669 -34325 -16116 6160 5228 -16715 -28132 -10033 16997 20144
517 20144 -1171 -16878 -5032 19813 29116 16123 18 -618 13172 25816 25790 15220 4390
530D390m89J0674R848l876j5394j0068Q386J6111N81j9493j6720O832K1019O762
544A8563j8240k1741R14J9845J3311q888j8848o760J1115J4456K713r914j1044
557a4518K20J2035J1542j394j2899p917R253J7158M352j4896j4557N140K0904
570A4423J0403j3312j9676k033J7613J4148n684j7131q685O677J2252K450r062
583B383j1464k386O865Q489r15j1717j0575L477J4218N980j1199j7710o45J8069
597g130J4166p823j9831o388J4756J8180L59j5566j0060O971J5428N956o778r501
611g261m29R568R616K82q651p535M072J3157P850p633j4733l181J3761J4523k668
626B0738j7894j0184R368J6576L128j3884j3273K773J2896O542p214j1173l136
$$ plain form
530 4390 3901 14575 24423 20547 5153 -4915 3471 19582 20163 670 -16050 -9218 11801 18563
544 18563 323 -21418 -20504 -659 12652 3764 -15084 -21844 -10729 3727 6440 -3474 -14518
557 -14518 -14298 -2263 9279 7885 -5014 -12931 -3678 13480 17832 2936 -11621 -6481 14423
570 14423 24826 11514 -8162 -10195 7418 21566 15882 -1249 -9934 -3257 8995 11445 2383
583 2383 -9081 -11467 -4602 3887 2972 -8745 -19320 -15843 -1625 4355 -6844 -24554 -25199 -7130
597 -7130 7036 -787 -20618 -27006 -12250 5930 6289 -9277 -19337 -12366 3062 9018 2240 -7261
611 -7261 -7690 1878 11494 11776 3125 -4410 -338 12819 20669 13036 -1697 -4878 8883 23406 20738
626 20738 2844 -7340 2028 18604 21732 7848 -5425 -2652 10244 16786 9572 -1601 -4737
639d737P119Q289l21r339q654J162J0390P637n537j4198o783R544J4269R49j4778
654d988j3414M858J5508O350j0519j4132j210J1771R330n013j2193m755P145J0325
668i37O62q931q683J799J0695Q163l738j1833n479Q659J3859L426r988j0867L093
683a0100J3774Q686n701j0780j795J0303J0324r57q950n634N601J0557L782o681
697A2429r373j376R082R327j825j1833q909M166J2373M862j0372j3682j640J1245
711D474Q229n886j3674n580Q575Q906j825j1245p192M331R911K865o812r007j035
726a4965P682Q150K90p834p282L132J0577O880m114j0086k389R480J0284o16r522
741c33o489O072J1110K541q840q603J769J0311N997n609j0925l569O425Q927L8
$$ plain form
639 -4737 2382 10671 10350 1011 -7643 -6481 3909 11546 6009 -8189 -14972 -5428 8841 9790 -4988
654 -4988 -18402 -13544 1964 8314 -2205 -16337 -17547 -5776 3554 -1459 -13652 -18407 -11262 -937
668 -937 -275 -9206 -17889 -16090 -5395 2768 -970 -12803 -18282 -9623 4236 7662 -2326 -13193 -10100
683 -10100 3674 12360 6659 -4121 -5916 4387 14711 13754 4804 -830 4771 15328 19110 12429
697 12429 3056 1680 10762 20089 18264 6431 -2478 1688 14061 18923 8551 -5131 -6771 4474
711 4474 12703 6817 -6857 -12437 -3862 5044 3219 -8026 -15218 -10887 -976 1889 -4923 -13930 -14965
726 -14965 -7283 867 1157 -6677 -13959 -10827 -250 6630 2516 -7570 -9959 -479 9805 9189 -333
741 -333 -6822 -750 10360 12901 4061 -4542 -2773 7538 13535 7926 -2999 -6568 -143 8784 8822
756H822q973r110O63Q699N755m878j0076m530O406Q714l26q970p032L854J0074
771i08L498o983q042N43J0402O989k256q996l302N994J0261L613o057p536M46
786b334Q705P585j449p721m308N282Q590K038p638p284J411Q847M646o025r437
801I08k688O545P377j795j0063p202K597Q058L272o574r846k212O087P005j959
816d90q331o149L763P908K408o510p477J394Q462N816l853q462k092O631Q933
831A951O02o579n507K928P759N123k365o762k076N463P335J159n769n844K080
846e02P515M381l888q191j778P013P197j694r161n740N055Q679J784p133q328
861d791Q2P669N430l593p982l117M618O445L86o466n268J892O394L335l929o523
$$ plain form
756 8822 -151 -9261 -8598 101 5856 978 -9098 -13628 -7222 1492 1166 -7804 -14836 -10982 -908
771 -908 2590 -4393 -12435 -11892 -1490 5499 3243 -5753 -9055 -3061 7200 10813 4756 -2780 -2334
786 -2334 6371 13956 12507 4786 478 5760 14350 16388 8750 1466 2877 11724 16370 10345 908
801 908 -1780 4765 12142 10347 284 -6918 -4321 3737 7009 435 -9411 -11623 -5536 1469 -490
816 -490 -8821 -14970 -11207 -3299 -891 -7401 -14878 -13484 -5022 794 -3059 -11521 -13613 -6982 1951
831 1951 2553 -4026 -9533 -6605 1154 6277 3912 -2850 -4926 537 7872 9031 3262 -2582 -502
846 -502 7013 11394 7506 -685 -2463 4550 11747 10053 892 -4848 207 8886 10670 3537 -4791
861 -4791 -4709 2960 8390 4797 -3185 -6302 -1684 4761 5147 -1319 -6587 -4695 1699 5034 1105 -5418
877e418j409N307O640n02o602m881K640P248L931m292o781j921O064O668p60o643
893g11m637K741O988K461n256o570K8O726M643k818p674l166M632O925N85o850
909a953o187J465O650M173l838p158j749M564O090m62n240m305K168N763L041
924C022l498n554p47N678N456r67n623l756L688P132K444m362n881R0O270N575
940H967j507o514l226L939O020J366m827n148Q83N467L379k794o499j572L750
955A684N021j41o178n190K025N956K659m288o824j617M898M969r45o200m180K563
971e788O003J451m419n058R22N194L779k295n256j921L587N917P17m193m538J652
987d246N684L511k293m821k347L877N402J122m579m295J212N129L542l197n303
$$ plain form
877 -5418 -6827 -1520 5120 4618 -1984 -6865 -4225 3023 6954 2662 -4119 -6040 24 6692 5932 -711
893 -711 -5348 -2607 4381 6842 1586 -4984 -4956 1770 6413 3595 -4079 -7245 -2613 4312 4897 -1953
909 -1953 -8140 -6675 -25 4148 310 -6848 -8597 -4033 2057 1595 -3645 -7950 -5782 -19 3022
924 3022 -476 -6030 -6777 -1099 4357 3390 -2233 -5989 -2301 4831 7275 2913 -2968 -2878 3392 8967
940 8967 7460 946 -2280 1659 7679 9045 4218 -930 -47 5420 8799 6005 -494 -2066 1684
955 1684 6705 6564 386 -4804 -2779 3177 5836 1548 -5276 -6893 -1995 2974 2029 -4171 -8351 -5788
971 -5788 215 1666 -2753 -7811 -6889 -1695 2084 -211 -5467 -7388 -3801 2116 2833 -1360 -5898 -4246
987 -4246 1438 4949 2656 -2165 -4512 -635 4767 5889 1310 -2985 -1773 3356 6898 3701 -1602
1002a602j363M613M525j155n487l825K594N956J788m965n480O2N229L898k005
1017B783n655k586L660M158P47m224l467N92M562K807k203m215j246L540L698
1032B951L76l889l296J529M840K600k272m887j468L905N180j71m731l832K016
1047a149N349J928l249m981m06M435L632j747n060k184K780M623L6m035l983P63
1063c248M425K384k519m489k149L215L914j96l684l355J061M197K030k466l611
1078d491j379L283L461%l779k994K142M630J951l117l524m14M279L845o34m610
1094a351j912K605M626J190k832l577M97M087L003j772l814j443K878L881L02
1109F368l932l322J445L600K297l165m105j132L092L438r12m272l176J540L839
$$ plain form
1002 -1602 -2965 1648 6173 5018 -469 -4294 -1700 4256 6044 1079 -4401 -4339 890 4788 2783
1017 2783 -2872 -5458 -1798 2360 3107 -1117 -4584 -3992 570 3377 1174 -3041 -4287 -747 2951
1032 2951 3327 -562 -3858 -2329 2511 5111 2839 -2048 -3516 389 5569 5398 667 -3165 -1149
1047 -1149 4200 6128 2879 -2102 -2508 1927 5559 3812 -1248 -3432 -652 3971 4007 -28 -4011 -3248
1063 -3248 1177 3561 1042 -3447 -5596 -2381 1533 1337 -2347 -5702 -4641 -444 1586 -880 -4491
1078 -4491 -5870 -2587 874 874 -2905 -5899 -3757 873 2824 -293 -3817 -4231 48 3893 3259 -1351
1094 -1351 -3263 -658 3968 5158 2326 -1251 -754 3333 6336 4564 750 -693 2185 6066 6368
1109 6368 2436 -886 559 4159 6456 3291 -814 -1946 1146 4584 3672 -600 -3776 -2236 1603
1124A603J083l156l862n60K978K913j639l609k081K440L072L51k417l371O71L651
1140a933K437r48l757j127K794L641J115k818k964J048M049K960j571l890m43
1155a407K795L855K1l682k530K018M399J206l090l789K41L375K645j613m099k022
1171a677K181L062J37k991l307K77K466J548j423k910j764J756K367K29k744k315
1187e108J90L231K381j581l845j041K905L735K73l297k534J693M261K057k333
1202I87l070p4L776K724j028k855j320K302L174L68k233k522L37L173J690j390
1218D039l206j006J482L261m55k757k933L5K993J330j824l264j165J815K481m70
1234C56k736k171N84K568J254j902k779n17K759K611m25l403j572J996L458J044
$$ plain form
1124 1603 2686 -470 -4332 -4892 -1914 999 -640 -4249 -6330 -3890 -818 -467 -2884 -6255 -5584 -1933
1140 -1933 504 -444 -4201 -5328 -2534 1107 2222 -596 -3560 -2512 1537 4497 2926 -964 -1407
1155 -1407 1388 5243 5264 1582 -948 1070 5469 6675 3585 -204 37 3412 6057 4444 345 -1677
1171 -1677 504 3566 3703 712 -2595 -2318 148 1696 273 -2637 -4401 -2645 -278 -49 -2793 -5108
1187 -5108 -4918 -1687 694 -887 -4732 -5773 -2868 867 1140 -2157 -4691 -2998 1263 3320 987
1202 987 -2083 -2157 1619 4343 3315 460 -860 1442 4616 4984 2751 229 566 3739 5429 4039
1218 4039 833 -173 1309 4570 4115 1358 -1575 -1540 1453 2783 959 -2305 -3470 -1655 826 356
1234 356 -2380 -4551 -3967 -1399 -145 -2047 -4826 -5343 -2584 27 -398 -3801 -5373 -3377 81 1125
1250A125k413k483P63L204K041o03k630j016K183K884M09j994k137J282K890J768
1266E273j694k728q52J838K756l44k395k235O63K862R32k042k866k53J788J877
1282B580r92k876j378P84K317J54j856k333j48K431J791j299k549j110J345K411
1298g28R27k101k349L35L108K017j084k801m64K257K639L27k816j415J390L183
1314B425J111k002j886K78K221K066q53k213j019R47K346P10k000k024j90J429
1330A346J937q44k193j742J021J924O30j964k428j25J822J411j220k645q45J742
1346b173K096J60k673j873J015K433J349j461k400n1J856K701n89k227q49J338
1362a348K705N75j787j288M19K420J190o17j908o93J798J812L51j662j595K48
$$ plain form
1250 1125 -1288 -3771 -3008 196 2237 1634 -996 -2012 171 3055 3464 1470 -667 615 3505 5273
1266 5273 3579 851 -1 1837 4593 4249 1854 -381 282 3144 4076 2034 -832 -1085 703 2580
1282 2580 1588 -1288 -2666 -1882 435 589 -1267 -3600 -3748 -1317 474 -825 -3374 -4484 -3139 -728
1298 -728 199 -1902 -4251 -3916 -808 1209 125 -2676 -3140 -883 1756 2083 -733 -2148 -758 2425
1314 2425 3536 1534 -352 -74 2147 4213 3360 1147 128 1075 3421 4131 2131 107 -83 1346
1330 1346 3283 2439 246 -1496 -475 1449 2079 115 -2313 -2438 -616 795 -425 -3070 -3915 -2173
1346 -2173 -77 83 -2590 -4463 -3448 -1015 334 -1127 -3527 -3578 -1722 979 390 -1837 -2686 -1348
1362 -1348 1357 1932 145 -1143 -724 1696 2886 2269 361 -332 1466 3278 3629 1967 372 620
1378F20J690J190q18k094r52Q73J756P22k046k404L06J842J456j738k654j04J502
1395h53K163q60k790j237J373K299L86j551j707mJ941R34k79j653p75Q67K112
1412C66P81j608j499J78K338J509j081j928n30K152J365K31k100r09L91K292L62
1429B310r21j858j63J275J475m29j508j165K87J637L88q92k185q9J530J599m88
1446H03j778j426P90K010R55j965j759L64K036J100r46j712p09J587K045J10j331
1463A74j534Q76J752R53j054j860J57J175J839n31j295j365J140J567O78j203
1479A469j829j05J243R59m18j712p58L40J690N53j462j291o77J405J334m79j902
1496a640r54J046J664K17j736j469M74J821J383j197j801l24J869J327l22j480
$$ plain form
1378 620 2310 3500 2682 588 -364 509 2265 2987 941 -1463 -1157 685 2141 403 -2251 -2355 -853
1395 -853 1310 450 -2340 -3577 -2204 95 481 -1070 -2777 -2781 -840 94 -185 -1838 -2613 -1746 366
1412 366 1147 -461 -1960 -1782 556 2065 984 -944 -1474 678 2043 2274 174 -735 -344 1948 2310
1429 2310 1389 -469 -632 643 2118 1689 181 -984 -697 940 1328 436 -1749 -1838 -308 1291 803
1446 803 -975 -2401 -1611 399 1354 -611 -2370 -2006 30 1130 184 -1528 -2237 -650 1395 1505 174
1463 174 -1360 -484 1268 2221 1167 -693 -536 639 2478 1947 652 -713 427 1994 2672 1469
1479 1469 -360 -465 778 1737 1319 -393 -1151 -811 879 1432 -30 -1321 -1998 -593 741 262 -1640
1496 -1640 -2594 -1548 116 333 -1403 -2872 -2398 -577 806 -391 -2192 -2516 -647 680 358 -1122
1512a122r03J460J161O43j235p49J82J402R13m96j200n97J236Q56N57o77j339
1529I2l56J304J395p99j633q11J079J390K76j397j398K47J235R06j099j241p22
1546a532J380J122j67j553j191J118J359J42j031j333L84R13J223P3j539p02O59
1563f75J293P48j224j125J1J287J100m56j112n47Q99J095qj061r11R9J048R67
1581A428o89j618m53R98J216J33j658j214Q30J110N36r57j181l97J468O56n1j478
1599a321m90N20J352j59n24j055L20J410Q56k25j556o67J308J249N04j226j106
1616h10L87J651Q38q89r99k33J012J258l36j200m13N30O38M88m55j350l26P46
1634E37J080l27j030o82J41R51P61j159j208j49R07J029l61j412q53P20J320j01
$$ plain form
1512 -1122 -2025 -565 596 1239 4 -745 -563 839 1752 1256 56 -541 695 1551 2108 1431 92
1529 92 -264 1040 2435 1636 3 -808 271 1661 1937 540 -858 -611 624 1530 431 -810 -1532
1546 -1532 -152 970 803 -750 -1941 -823 536 678 -353 -1686 -1302 -389 834 907 -632 -1334 -675
1563 -675 618 1366 142 -983 -972 315 1415 959 -153 -700 199 1294 1286 225 -686 -587 461 1428
1581 1428 739 -879 -1332 -334 882 1015 -643 -1857 -1027 83 619 -338 -1519 -1916 -448 208 157 -1321
1599 -1321 -1811 -1291 61 -98 -622 -1677 -1357 53 909 684 -872 -1539 -231 1018 1522 296 -810
1616 -810 -423 1228 2066 1177 178 -55 957 2215 1879 679 266 796 1434 1922 1467 117 -209 537
1634 537 1617 1290 260 -422 -281 670 1431 272 -936 -1085 -178 851 490 -922 -1775 -1055 265 164
1652A64j454q45N89J105M56m66j395Q8Q36Q25N1j179n34N91Q61K94m32r80J10
1671a315Q35O80J01q10m06M57J008K11m81p60M4P62J050k60q65p15P98J039M02
1690A775q13r06j9J331R19n79r91o03Q86Q89j77r81p01K51J153J83j087q34k64
1709e68J074N11p12q64r22L92J181j29o36r00j11R30M71l12r17k82O16M56O33
1728h9p49q94J62J124O59k5q15k57R71Q06J89q34p50M88J246O58o99q31k64O67
1748G63Q37m80n39o26Q9Q75K80o22r85j04N67L37j74j020r51M52Q74J67j093m68
1768a821j10J055o8P0q21o47J369N70J97n91k43K83Q24P60M8p53N7R18O16L84
1788B097m59o89M89O63Q67m87j164j02P27Q97m70j072o06M20N69J56j051j290
$$ plain form
1652 164 -1290 -2135 -1546 -441 15 -451 -1846 -1758 -922 -97 -46 -1225 -1759 -1168 -307 -13 -445 -1425 -1315
1671 -1315 -480 200 301 -509 -915 -458 550 761 280 -480 -436 326 1376 1116 251 -464 334 1373 1775
1690 1775 962 56 37 1368 2287 1708 717 114 1000 1889 1712 731 30 281 1434 1617 530 -304 -568
1709 -568 506 1017 305 -559 -1481 -1089 92 -37 -673 -1573 -1684 -754 -283 -595 -1512 -1794 -1178 -722 -89
1728 -89 -838 -1732 -1570 -446 213 188 -627 -884 87 893 1082 248 -502 -14 1232 1890 1191 360 96 763
1748 763 1600 1120 581 -45 44 919 1199 577 -408 -512 55 392 218 -802 -1753 -1301 -427 -260 -1353 -1821
1768 -1821 -1931 -876 -944 -874 -1695 -2342 -973 -403 -206 -797 -1040 -757 67 827 875 122 179 1097 1713 2097
1788 2097 1638 949 1438 2101 2968 2481 1317 1215 1942 2839 2369 1297 691 1111 1680 1836 785 -505
1806e05J47M95L30q04r77m60L61M13o13r58P6K08M24K5l21l39k44N68O00K76o99
1827a997j15N34P63M40k74j29K91R0J363Q9l56o43N19J358L3j17p77MP77N61l43
1848B071o27o46R19M78k38q67r15P2Q10N8n92p27l05N16K53j56o09m17M7M87J35
1869b53m86m07j18K02P37J71p13j4K66O19Q5m33l68K2N68O77k10m78k41L58J045
1890A029J39q92m83j1Q70K11o17n67n4L86O20m76p59k41L40N27mm43n33j88M69
1911f77N50N0p91n58R25N92j3k98o03L42N71L60k57l50k20N15L08N09m74k40K5
1932B66M70N75n63n21N3N37K8J46n22m43M08L39N17o48o67j45N01L62K06r66l44
1953d11N16P23j71n13r37K72P88O16o94m68j35K31L97Q4n95l75O8O04L9k05m60
$$ plain form
1806 -505 -358 137 467 -337 -1314 -1774 -1413 -1000 -1613 -2571 -2495 -2287 -1863 -1838 -2159 -2498 -2742 -2174 -1574 -1298 -1997
1827 -1997 -2112 -1578 -815 -375 -649 -778 -487 -397 966 1055 699 56 575 1933 1966 1849 1072 1076 1853 2414 2071
1848 2071 1444 798 1717 2195 1957 1090 175 247 1057 1115 523 -204 -509 7 260 104 -505 -922 -875 -388 -253
1869 -253 -739 -1146 -1264 -1062 -325 -154 -867 -881 -615 4 89 -344 -712 -690 -122 555 345 -133 -374 -16 1029
1890 1029 1168 276 -207 -218 652 863 246 -321 -375 11 631 155 -604 -845 -505 22 18 -425 -958 -1146 -677
1911 -677 -127 -77 -868 -1426 -501 91 78 -220 -823 -481 90 450 193 -157 -377 138 446 955 481 241 266
1932 266 736 1311 748 227 280 817 845 991 469 26 434 773 1290 642 -25 -170 331 693 899 -67 -411
1953 -411 105 828 657 144 -793 -521 267 883 189 -279 -414 -183 214 298 -297 -672 -604 0 39 -166 -626
1974f26k28M34M35K2j23n57j03M35M89n23k61l57L82P37j68o10k78jM78N06l54
1995b71m25q7L97O55q0o10j5O7N32L30k24n01L66M99M69m12o09M6M94K44J00k09
2017G56k08K12K49j50K1m14K2K21K94j06n12l9k93N88L1r7p71l47N24K05n5k79
2039a48o98L90P18M0q33m72J25N67L9j78j25n08Q04J51l70L95o65P2M82j8j71
2060d03J0k39M51L08k08J61m68J23L32L47m68l39J36L42L33p5l37l05J94N31r7
2081C29R8j05m83jP18n18q0k1r7M30K35l51l88l3R55k63J01p31P4M86L14l2o81
2104d4j11K66M23K17l21k46J08L40j2O0o09K4N66m50M73l44l22l58M52J94m9k44
2126A3m15n8P22j39o23k36J9K06K92m31j39Ko2K38R7n02j57K75L83M6k8m32n7
$$ plain form
1974 -626 -854 -420 15 37 -86 -643 -746 -311 178 -345 -606 -963 -581 156 -12 -622 -900 -901 -423 83 -271
1995 -271 -696 -783 -386 269 189 -421 -436 -369 163 493 269 -232 134 633 1102 690 81 127 621 865 965 756
2017 756 548 760 1009 859 880 466 488 709 1003 897 385 346 53 641 672 575 -196 -543 -19 186 131 -148
2039 -148 -846 -456 262 302 -531 -1003 -878 -311 -272 -450 -575 -1083 -279 -128 -498 -103 -768 -696 -214 -232 -403
2060 -403 -393 -632 -181 127 -81 80 -388 -265 67 414 -54 -393 -257 85 418 343 6 -299 -105 426 329
2081 329 427 322 -161 -162 556 38 -42 -63 -160 270 505 154 -234 -267 688 425 526 -205 -131 355 669 637 -44
2104 -44 -155 111 534 751 430 184 292 632 620 680 71 95 661 211 684 340 18 -340 112 306 257 13
2126 13 -402 -460 262 123 -500 -736 -717 -511 -219 -650 -789 -787 -849 -611 -514 -1016 -1173 -898 -515 -469 -497 -929 -986
2149i86O53J35K66m05l85N43O27p5o94R1J9O49L00P4m30J43N6P70l45l08J2qJ50
2172H52j47M01m02l79O5K81Q7j56o20o2M49J68m63n12k31J91N84m73m77k2L23
2193e43K99l5j46k09j54L38J31K58l45l75J47Q09lk48k42P3L13P17o18M3l66K72
2215A16Q24k57o96K49LL48J35o66l8k93J23K58j67m01j38N6J38Q2M38r54l39L88
2237g91N84k36l54n04L97O00j9k40m10J28M84L26l8k54K9M52N26nq4j27L25J60
2259I49K68o1j79k67J82N72J06p82j56J02M34Om98o02J83J82J93l04n10m7J75
2280e4jl16k99k40l09L55q4L75j87p35O9P43j7j81m55J3P07J41K10k88r8M61N32
2303C42l72k34rM25M16n9m31N42l5j62L81R5j42m15R9J91J61On70k34M74O8p8
$$ plain form
2149 -986 -333 -198 68 -337 -722 -179 448 373 -321 -230 -211 438 738 812 382 525 581 1351 1006 698 710 702 852
2172 852 705 1106 704 325 390 671 758 602 -18 -80 369 537 74 -438 -669 -478 106 -367 -844 -866 -543
2193 -543 -244 -279 -425 -634 -788 -450 -319 -61 -406 -781 -634 175 172 -76 -318 -245 68 785 167 210 -156 116
2215 116 940 683 -13 236 239 587 722 56 18 -275 -152 106 -61 -462 -600 -544 -406 -324 114 -840 -1179 -791
2237 -791 -207 -443 -797 -1301 -904 -304 -323 -563 -973 -845 -361 -35 -73 -327 -298 154 680 675 591 464 789 949
2259 949 1217 1156 977 710 892 1464 1570 788 632 734 1168 1174 676 74 257 439 632 328 -182 -229 -54
2280 -54 -55 -371 -670 -910 -1219 -864 -948 -573 -760 -1495 -1426 -683 -700 -881 -1336 -1323 -616 -475 -265 -553 -651 -190 342
2303 342 -30 -264 -273 152 568 509 78 620 585 423 804 899 757 342 441 632 793 799 229 -5 469 537 459
2326D59p37J06L87j64l65j74j37K98K53p1j96o9L8L37L6j06J10l75q7N34m2K86
2348C21n23j25P35O0k41K81o28O20J07K6o01o6J96J60J1j53j06j58K3oL00k97
2370f4Pl83o6M18N6n21R7l28M31K56l01k88J81M06p4m4l72OM58M4L0nj40L05K35
2395C44j39J62m27L54k79K2N71m49R9j22K63L14m53q9m22N16K92n75j24p7K48
2416B9P9L7l72j90M66r1j06k17L63j43L0j0K73J31l01j0r9P33l64j71m37P09L46
2439F85j48n93Q6J88N77n73O5l65L60N8j23k48k83N36o16L71j58l06j09Qk38J14
2461g12L23k98l71N09L55r2j62n21N50O28k14m79j2N24J05j57P9K25K04n38L02
2482B48K45l2K9q0J33R3J46j37l99N93r9L96o41m48K66J45k23L5m01J20J00K4
$$ plain form
2326 459 -278 -172 215 51 -314 -488 -625 -327 -74 -145 -341 -410 -372 -35 1 -105 5 -370 -457 77 35 321
2348 321 -202 -327 408 468 227 508 -120 500 607 633 32 -34 162 322 333 180 74 -84 -61 -67 233 -64
2370 -64 -57 -440 -506 -88 -32 -553 -456 -784 -353 -97 -398 -686 -505 -99 -173 -217 -589 -583 -125 -81 -51 -56 -196 109 344
2395 344 205 367 -60 294 15 37 608 159 258 136 399 713 260 171 -251 265 557 -18 -142 -219 29
2416 29 108 145 -227 -417 49 -42 -148 -365 -2 -145 -115 -125 148 279 -22 -32 -131 602 238 67 -370 339 685
2439 685 537 -56 30 218 795 222 287 -78 282 340 217 -31 -314 222 -394 -23 -181 -487 -596 -588 -826 -712
2461 -712 -389 -687 -1058 -549 -194 -286 -448 -969 -419 209 -5 -484 -496 28 133 -24 55 280 484 -54 248
2482 248 493 461 490 410 543 636 782 645 246 839 740 1136 495 47 313 458 235 270 -131 -11 89 113
2504A13n17J46m5K02j58k21K32k28O9j3L27k64K34k92j58K97L21j40m29K60K78
2525A4J32N7m65L56J93L32n65J04n5Q3m2j36J78J46r1n2j83L46k28l40k96N89
2547G7j2L28o20r4L23pj12k27l0P2N21l78j89q0L39R9j60l2P2J46N5Q7j66R0o3
2572C9q1R2L62J17k80k07J51L36J56m82j04l7O68j91m21O9o0J52j58k95J85j0
2594AK82m65L3L17l06N7l20L52n1M3m79j66O30J51m42m20L99L73k7o90K07M20
2616a01L3J4m53J52M14l0j17j99N71j97Nl95J21O48j76l48k8K02K69j12k34M6
2638H5L78k9k44j18n41Q07m7l19k0M5K39j67Q4p2J28k57J64m92P34l04J4m32M67
2661A03O9j09k14r1K15J61k7l56j14K91J96K5k99j68L63J92j30j14J34j9j15j07
$$ plain form
2504 113 -404 -258 -303 -101 -259 -480 -248 -476 -407 -420 -93 -357 -123 -415 -573 -276 45 -95 -524 -264 14
2525 14 146 203 -262 94 287 619 54 158 103 186 144 8 186 332 241 189 6 352 124 -216 -512 77
2547 77 65 393 -227 -321 2 -5 -117 -344 -374 -302 219 -159 -348 -428 -89 10 -150 -182 -110 36 91 178 12 102 39
2572 39 -42 50 412 529 249 42 193 529 685 203 99 62 730 539 118 187 127 279 121 -174 11 1
2594 1 283 -182 -149 168 -138 -81 -401 -49 -100 -57 -536 -702 -72 79 -363 -783 -384 -11 -38 -728 -521 -101
2616 -101 -68 -54 -507 -355 59 29 -88 -287 284 87 92 -303 -182 466 290 -58 -86 116 385 273 39 85
2638 85 463 434 190 72 -469 338 291 -28 -48 -3 236 69 153 81 209 -48 116 -376 358 54 68 -364 103
2661 103 172 63 -151 -242 -27 134 107 -249 -363 -72 124 149 -150 -318 45 237 107 -7 127 108 -7 -114
2683a14K47m5j19n1KK49K28o43J12J06K74J21m37l39J68L37p6n02M77k19M34n78
2705c68k91P86k34j93j11j55O21j59k60L61K7q7j82M4J13K76k5j75j93M21J6K6
2727B58R2k52j94O98j10m27M59j44j94l55N51j18J22p9m75K22M35l42k52J59n6
2748bL09k22m00j7N09K74o15j35r5M55n7n05L44j03K50j22j49K25n3L27m28K9
2770a81K62j43o9R0O4P8J7m3l82J95J70K95k24j95K86j33K43l51j47K95l57l0
2792b60K59m82N75j71K4K89k06k66j44M75k21J67p4l20L14r7L03Pql77M79k38
2814B8m8q0R7K18o4o0J95R9q9k74J96J89m43k04J04K64j00K59k22k2l2J14p7l37
2838b89R8K01K06m12k99L06M6J59k19l9K13l96K25J13j09M30j39m44K25J27J75
$$ plain form
2683 -114 133 88 -31 -82 -80 169 397 -246 -134 -28 246 367 -70 -409 -241 96 20 -482 -5 -224 210 -368
2705 -368 -659 127 -107 -300 -411 -566 55 -104 -364 -3 24 -63 -245 -201 -88 188 163 -12 -205 216 232 258
2727 258 350 98 -96 602 492 65 524 380 186 -169 382 264 386 307 -168 54 489 147 -105 54 -2
2748 -2 307 85 -315 -332 177 451 -164 -299 -394 61 4 -501 -157 -260 -10 -132 -281 -56 -109 218 -210 -181
2770 -181 81 -62 -131 -41 23 101 118 75 -307 -112 58 353 129 -66 220 87 330 -21 -168 127 -230 -260
2792 -260 -1 -483 92 -79 -55 234 28 -238 -382 93 -128 39 -35 -355 -41 -138 165 172 164 -213 266 28
2814 28 -20 -100 -3 215 151 91 286 385 296 22 218 407 -36 -240 -136 128 28 287 65 43 11 125 48 -289
2838 -289 -191 10 216 -196 -495 -189 -143 16 -203 -242 -29 -425 -200 -87 -196 234 95 -349 -124 3 178
2859A78m5l75L56J55K09k54j08L9kl80J42m3J39O9J35l68J40M13l82O0N2j71J81
2882A40j48j05L53k49j33r2j6J50j71J59k75n9M88K0J2PK4K83l38l0R2J48L90
2905F50m31j87j4J06o6j61K09K93l15r1k8K06q2Lk22K77J28m04Q4k1j53L9M4O5
2929g1l51K34o7J95l19J88o4J84j45m1Q1k24K31J38l1J36J8l06K32M8l03K37J27
2952A27p4N94k45j00J00j77J60r7k2k41L12P0P8k34m3J90k80j64M22m40L7L8J54
2975A65k65K77j75j82Q5j00L1K8n08J18L54m7K73l2j33j49J78Q4r8J77j66Qm9
2998a26L33n1j68l00L79L75k58k82J52L0LK06j64k09K44p0M8j17m9J55Pl96Lk
3022b57J07L03m90J27J87r8j75K0K88J8J4l34o0L18L55l46k45J69n8L15k71J20
$$ plain form
2859 178 133 -242 114 269 478 224 116 155 153 -227 -85 -128 11 80 215 -153 -13 400 18 78 130 -41 140
2882 140 -8 -113 240 -9 -142 -234 -250 -100 -271 -112 -387 -446 42 62 74 81 105 388 50 20 112 260 650
2905 650 219 32 18 124 58 -103 106 399 84 -7 -35 171 89 92 -130 147 275 -129 -45 -66 -219 -180 -136 -71
2929 -71 -422 -188 -255 -60 -379 -191 -255 -71 -216 -257 -176 -400 -169 -31 -62 74 92 -214 18 66 -237 0 127
2952 127 53 647 402 302 402 225 385 288 266 25 337 407 485 251 208 398 118 -46 376 -64 -27 11 165
2975 165 -100 177 2 -180 -95 -195 -164 -136 -644 -526 -172 -219 54 22 -111 -260 -82 2 -96 81 -85 -77 -126
2998 -126 207 156 -12 -312 67 442 184 -98 54 84 87 293 129 -80 164 94 142 25 -24 131 138 -258 -255 -257
3022 -257 -150 153 -337 -210 -23 -121 -296 -276 12 30 44 -290 -350 -32 323 -23 -268 -99 -157 158 -113 7
3044GL54n99M40k23J04K66k27j07O7L90m91J57j59L11K05l11O1k44P7J51l85J09
3066d7l10K87r9K29m7r9J92k59K5k0j64K2J35n0K56N5j80N7k4K44j38k47r4L10
3090C4K17j67j76J01J2n2K59l87J4K27q4j4J16N6j07L5Q6l2K56m11K57m24N37
3113C53J2p05J54L1K68j14k4j18L96j82k76J58J48k44M70j91J77o45K98L0j48
3134a52K59l8P1j28q9l9L29k99qL94k66M12m38J6K9n6K61m13n2P2J90k07j2l11
3158d75M83k62J13o4R7J42r1OJ55J1l32K22j71L11P3k65k66O7M80k80J10J55l83
3181a64j37L74j35J61K19m64K32L10j79L3K28m65Pp8j10M71n24J76o4q6K78j52
3203f9J32J14l78O4q6Q2K34l1Qq7k2k14j58J08L30L2J71k06m6K30N8j49l42M50
$$ plain form
3044 7 361 -238 202 -21 83 349 122 15 82 472 -19 138 -21 290 495 184 245 1 78 229 -156 -47
3066 -47 -357 -70 -169 60 13 -86 106 -153 -128 -148 -312 -290 -155 -205 51 106 -74 -17 -41 203 65 -182 -276 34
3090 34 251 84 -92 9 21 -31 228 -159 -145 82 -2 -16 100 156 49 84 170 138 394 -17 240 -184 353
3113 353 365 -340 -186 -155 113 -1 -25 -143 253 71 -205 -47 101 -143 327 136 313 -332 -34 -4 -152
3134 -152 107 69 140 12 -77 -116 213 -86 -94 300 34 446 8 24 53 -3 258 -155 -207 -135 55 -152 -164 -475
3158 -475 8 -254 -141 -205 -108 34 -57 -51 104 115 -217 5 -166 145 218 -47 -313 -246 234 -46 64 219 -164
3181 -164 -301 73 -62 99 318 -146 86 396 217 250 478 13 20 -58 -168 303 -221 -45 -109 -195 83 -69
3203 -69 63 177 -201 -137 -223 -141 93 62 70 -17 -39 -253 -411 -303 27 59 230 24 -22 208 266 117 -225 225
3227B25k67j82L29q1m2L0k31L77J02j93k1p0M0l53M12k12K58k71K73m5K8j34%
3250b8j6K57l49J26l2K4k75R9J66J82M6k90k8L00m39K12l6k63O53k68k5j86J08
3273f2K84j29j3m6m7l32M29Pk37K6J95j19N3N9L3l74J34J94q6J81k08J53j0j65
3297h0K87j55l01L16P3k81J22K02m03K89k39J18n4J1k21J54L31n1k67K02k58N9
3319a46K7K66l57L63N8m00L68j21R3o3J6K72m43J85J68j64K62j50l10LJ23M4k45
3342a51J45J25l29M06j01l8r1oR4Rm21Q8K34j90K03K14l09N6L15l67q9K35j31
3365i9O6j29L60q6M2j0l19J47L64l26K39j78J90l96L46n48K0P34j54l67J49m93
3387d48K07J85L6L97n24J89M3j56P5m5l7k8M7QK62j95k0Q5l47K18l92L85J3P3
$$ plain form
3227 225 -42 -224 105 24 -18 12 -219 158 260 67 46 -24 16 -337 75 -137 121 -150 123 78 106 -28 -28
3250 -28 -44 213 -136 -10 -42 -18 -293 -194 -28 154 200 -90 -118 182 -257 -45 -81 -344 309 41 16 -170 -62
3273 -62 222 93 80 34 -13 -345 84 91 -146 -120 75 -44 9 68 101 -273 -139 55 -31 150 -58 95 85 -80
3297 -80 207 52 -249 67 140 -141 -19 183 -220 69 -170 -52 -106 -95 -316 -162 169 118 -149 53 -205 -146
3319 -146 -119 147 -210 153 211 -189 179 58 151 88 104 376 -67 118 286 122 384 234 -76 -73 50 94 -151
3342 -151 -6 119 -210 196 95 57 -34 -40 54 63 -358 -270 -36 -226 -23 191 -118 -62 253 -114 -203 32 -99
3365 -99 -33 -162 198 112 154 144 -175 -28 336 10 249 71 261 -135 211 -337 -317 417 263 -104 45 -448
3387 -448 -241 -56 -20 377 -147 42 85 -71 4 -41 -78 -106 -59 -51 211 16 -4 81 -266 -48 -440 -55 -42 31
3411C1j12J29J1O7j77J69j0J58m32K46p2J40j18K46j66L8q5j57J99k48L80j23
3433A14J48k31P6J22Q1k91l1r3P9K99m41L19J21n15J46M39l74J68k27j8K37j15
3455A3J31j81j12l3J05P3l6m3o2M6M16n06M6L03k40J28k70M56j45j04K55k71j45
3478a76N35k07n3j49J15J85k38J7k29K16O1j1O6l81J45j7J40M9k06R1j11J3Q9
3501e6J69n0j77m08P55l95J27p1j51P1J39ON6j14N4k30J81M27k06l9Q4l62M65
3524B75j81l16L43k25K40lq3k5j76J12j1N1K01m38M47j42k10L37o5j62J76k97
3546a52L4J50j16K66j11r7O7J86k93q1K52M5j84J44j42j68L34j70k5P7K68k34
3568E0k62K81n38N17l8lj29K56j97j58K65O9K0n6j11J12p9K10r7l81J25L64J6
$$ plain form
3411 31 -81 48 59 126 -51 118 108 266 -166 80 8 148 30 276 110 148 63 -94 105 -143 237 114
3433 114 262 31 107 229 310 19 -12 -105 -26 273 -168 151 272 -243 -97 342 -32 136 -91 -109 128 13
3455 13 144 -37 -149 -182 -77 -4 -40 -83 -145 -99 317 -189 -143 160 -80 48 -222 234 89 -15 240 -31 -176
3478 -176 359 152 99 -50 65 250 12 29 -200 16 77 66 132 -249 -104 -121 19 68 -138 -47 -158 -145 -56
3501 -56 113 63 -114 -522 233 -162 -35 -106 -257 -186 -47 -41 15 -99 -45 -275 -94 333 127 88 172 -190 275
3524 275 94 -222 121 -104 136 133 50 25 -151 -39 -50 1 202 -236 211 69 -141 196 131 -31 145 -152
3546 -152 -118 32 -84 182 71 -26 41 227 -66 -147 105 150 -34 110 -32 -200 134 -36 -61 16 284 50
3568 50 -212 69 -469 48 10 7 -122 134 -63 -221 44 113 133 77 -34 78 -1 209 112 -269 -144 220 236
3591B36p4k48K38O5Q3m20L03k52J78L8k07N8K40l47K0k08M04k61p0Q5L18J33m86
3614a74jJ36j40L33m56K94K5k28Rj03M16l2K21q9j41l5j93Q9K2k06L42J13k41
3637c9M7J7j46J10J21J58k64m34O06l14j3L61k7l90L52j78j34J07J74o2nn3j89
3660a95L05m7p2L18l69P5p4K91J1k52J64J24m31K25j54K53k11O0J0k58P2K00j69
3683a24J03K72l77N7J57q6kJ4J50j35K22l19P7J45n8j08N2j29J55m1q7Q6j02J21
3707D3J64k56R9k05J76J53q2J15j90j70Q6K08J25k32k8J59k6j70K42q9k9l40K15
3730c2L37k20Q5m70K29J84j80o7Q0K51j80l27q2J60O71l60l3k90N37l31j48J28
3752e8O3M6J11K56l49k81NM98m94J14Kk4J54R3j83K52j06k68L95j06M7K12n03
$$ plain form
3591 236 162 -86 152 217 300 -120 183 -69 109 147 -60 -2 238 -109 -89 -297 107 -154 -224 -139 179 312 -174
3614 -174 -175 -39 -179 154 -302 -8 17 -211 -202 -305 111 79 300 211 70 35 -158 -69 -47 -253 89 202 -39
3637 -39 8 25 -121 -11 110 268 4 -430 176 -138 -151 210 183 -207 145 -33 -167 -60 114 52 47 -6 -195
3660 -195 110 63 -9 309 -60 15 -59 232 243 -9 155 279 -152 73 -81 172 -39 21 31 -227 -155 45 -124
3683 -124 -21 251 -126 -69 88 2 0 14 164 29 251 -68 9 154 96 -12 40 -89 66 25 -62 24 -78 43
3707 43 207 -49 50 -155 21 174 92 207 17 -153 -67 141 266 34 6 165 139 -31 211 122 93 -247 -32
3730 -32 305 85 170 -300 -71 113 -67 -134 -54 197 17 -310 -392 -232 439 79 46 -244 293 -38 -186 -58
3752 -58 5 51 162 418 69 -212 -207 291 -203 -89 -87 -111 43 136 -47 205 99 -169 226 120 167 379 -124
3775a24M40j27N7k8k23n5k19N2O3K09K03k02K67o74J91K82Q9mk04P2M2M7j31j49
3799a26M94l69Q5j23jK10k64j33L07J18j72l6L6J70j61p7j67J40k38M1M78p7k9
3822A06j69k49M75k18k07L13Lj23n9K14r1K32j50j55l4N7K19k02O7j38l4L36k38
3845d5p2N6K00m0q1l7J64k30k67O67j31j79j37N2J54mq5n3L46k31q0K12j20j97
3869a38P7j61K91j94J85J16j92o5J1L51j16m24m1K25j59k6N4L00k01j54K32R4
3891F5o9q3j1J65j82J5M18n42L62O1m10L68j74l61K93p0K97Nn1j37L27q2n01K33
3915f4J60N4m12N26k7j77j96RK36k43r5J12j09J69j13j61J60J46K8j51L06k77
3937a19K17J95k43j82J42K08n1j35l51L21J85k11N9K98m51o2L23K7j51O9j54J8
$$ plain form
3775 -124 316 189 246 218 -5 -60 -279 -227 -164 45 248 46 313 -361 -170 112 201 197 -7 65 107 154 23 -126
3799 -126 368 -1 84 -39 -40 170 -94 -227 80 198 26 -10 26 196 35 -42 -209 -69 -307 -266 212 135 106
3822 106 -63 -312 163 -55 -262 51 54 -69 -128 86 -5 227 77 -78 -112 -55 164 -38 29 -109 -143 193 -45
3845 -45 -117 -61 139 99 18 -19 145 -85 -352 315 184 5 -132 -80 74 70 -15 -68 278 47 -33 179 59 -138
3869 -138 -61 -222 69 -125 60 176 -16 -81 -70 281 165 -259 -300 -75 -234 -260 -206 94 -107 -261 -29 65
3891 65 -4 -87 -98 67 -115 -100 318 -224 138 199 -211 157 -17 -378 -85 -155 142 147 96 -41 286 204 -297 -64
3915 -64 96 150 -262 264 237 60 -136 -127 109 -134 -229 -117 -226 -57 -170 -331 -171 -25 3 -148 158 -119
3937 -119 98 293 50 -132 10 218 167 32 -319 2 187 -24 35 333 -118 -180 143 170 19 88 -66 -48
3959d8K5J22R5l10L80m07oL52k7l3k85J14k8K9O4j66M7K23Jj87l4M21r23O71k26
3984a36R5P8j56J9p3L60j33Np8j63N04k34q9j74k4j7L55k37K26n5J5k7n1j26K49
4009A33J47m89J1K43j93M5k1J64K96l26K12j88p2k09L64k91L39k72K15n57N02
4030E3l80M11p9k54L83m1o27L03K79r0J62j51k51K26L47j57j23L04j90k06L64
4051B83l14J57K74k27j8l45N7P01n61r6M6L20p8n09K53M7j34Q5k82K95r1J54q2
4074f5J81n58M70k51J95J65l14J48K42k23n6j31O7l0K58m72N28r2j90N0j63K98
4096E7jM3r8j43n3L59j46O9k34P4j1m9j29K74J4N4l09P5m7K39m37J30n4J68LM8
4122a04j89J50K07J1l56M25k77K08J0m21L25J89j67J29kn0k85J97r5J61L64n56
$$ plain form
3959 -48 -23 99 194 -116 264 -143 -149 203 176 143 -142 -28 -56 -27 37 -129 -82 141 142 -45 -79 342 -581 90 -136
3984 -136 -41 37 -119 -100 -173 187 54 59 -19 -182 322 88 -1 -175 -199 -216 139 -98 128 73 88 61 10 -116 133
4009 133 280 -209 -198 45 -148 -103 -124 40 336 10 222 34 -38 -247 117 -174 165 -107 108 -449 53
4030 53 -327 84 5 -249 134 93 -534 -231 48 -42 120 -31 -282 -56 291 134 11 315 125 -81 283
4051 283 -31 126 400 173 155 -190 -133 568 7 -89 -43 277 199 -310 -57 -10 -144 -59 -341 -46 -137 17 -65
4074 -65 116 -442 28 -223 -28 137 -177 -29 213 -10 -66 -197 -130 -160 98 -374 154 62 -128 -78 -241 57
4096 57 56 99 1 -142 -195 164 18 87 -147 -73 -84 -133 -262 12 26 80 -229 -154 -201 38 -399 -269 -323 -155 -152 -104
4122 -104 -293 -143 64 75 -281 144 -133 75 85 -336 -11 178 11 140 138 88 -197 0 -95 66 430 -126
4144a26K28p7J70j20j99L7l5rL45j1k30l1j5O8R0mj00j66L89m44M7L73r9J0k5
4169F6r7l34L80j55J92k98P1J73j48K40j58n7L7j6K65k11K2k8n4O3L44j94J81
4192B84j65j58J53J19p4q1J10Qk58j60M10l68K67l28J51R1k7k82L93l51K17O3
4214A4k6q1L8m2pM16q2J21k74J09J8k64n0K64k50R6M41k40Lo3j63j95K72M0m6
4239D9k23L75n7p6r0j7Q7qj69J85J45k11k34K16J5n9k49L04N6o4J83k48N9J21
4263I0j37k0R0K44k74j35M14k57k75N91k56J82j22M8p6j81j21K98k23R8l58L31
4285d9P0K7j65m3J7L31l24J07Nl8J34j11K88l19K24k64k57J27J21J76k04k84L77
4308e4N4o3P8r7K73j59L9J02n5J59m85K76K0J35n76L34K5N1K25o3n3j63k13J57
$$ plain form
4144 -126 102 25 195 75 -124 -87 -122 -131 214 203 -27 -58 -73 -5 85 81 -19 -185 204 -240 -193 180 81 91 66
4169 66 -31 -365 15 -140 52 -246 -175 -2 -150 90 -68 -125 -88 -104 161 -50 -28 -56 -110 -47 297 103 284
4192 284 119 -39 114 233 159 78 188 196 -62 -222 188 -180 87 -241 -90 1 -26 -308 85 -266 -49 14
4214 14 -12 -93 -55 -97 -104 312 230 351 77 186 204 -60 -110 154 -96 0 441 201 204 141 -22 -217 55 95 49
4239 49 -174 201 144 68 -22 -39 48 40 -129 56 201 -10 -244 -28 -13 -72 -321 -17 39 -25 158 -90 -31 90
4263 90 -47 -67 23 267 -7 -142 272 15 -260 331 75 257 135 183 107 -74 -195 103 -120 -22 -380 -49
4285 -49 21 48 -117 -160 -143 188 -136 -29 -24 -62 72 -39 249 -70 154 -110 -367 -240 -119 57 -147 -431 -54
4308 -54 0 -63 15 -82 191 32 71 173 118 277 -208 68 88 223 -353 -19 6 57 282 219 166 3 -210 -53
4332e3r1J06J73j34N9k12J84n9j61J04n6l2K69o1n5j3p7R7j05o6N32o08J15J00
4356d4O6o2n8J14k78L21J56j31M4k11K48P1j87J7J2k42P8M7J40j82J41L7r5j37
4380a35J93p2j24n6j96N15p2k11L30l70J86k22J38J03j59P0J06J22o6q1K2J11
4402A32l4K42l35L4l35J11k9K63Jqm1K17m1M3k62L2j51J68j6M4l01M65P7k43J28
4427A61J07r5m69J72L71k11k29K77j6l39K26M9r9j31L91k41K4J80j44J38k38K31
4449A15j6j08j15n0J58O5m76M85k88L25J41k53N3M3o2j44K4j02K43j64J71j94
4471a49Q4J32j12N8n9j76J99q0J28r5j30K64J71n27K85M8j16J3N3m1K7k35K12
4494d6N5l05M16m09L99r7k68K16j11R7K14lr0j07J73k80J38J75J6j40N0r6p0Q8
$$ plain form
4332 -53 -144 -38 135 1 60 -152 32 -27 -188 -84 -140 -172 97 36 -19 -32 -109 -12 -117 -183 349 -259 -144 -44
4356 -44 22 -40 -98 16 -262 59 215 84 128 -83 165 236 49 66 78 -164 -86 -39 101 -81 60 97 2 -135
4380 -135 58 -14 -138 -194 -390 125 53 -158 172 -198 -12 -234 -96 7 -152 -82 24 146 80 -1 21 132
4402 132 98 340 5 39 -296 -185 -214 49 50 42 1 218 177 220 -42 -10 -161 7 -9 35 -266 199 276 33 161
4427 161 268 173 -296 -124 247 36 -193 84 68 -271 -45 4 -95 -226 165 -76 -52 128 -16 122 -116 115
4449 115 99 -9 -124 -174 -16 49 -427 58 -230 95 236 -17 36 79 17 -127 -103 -205 38 -126 45 -149
4471 -149 -65 67 -45 13 -46 -222 -23 -103 25 -70 -200 64 235 -292 -7 41 -75 -62 -9 -50 -23 -258 -46
4494 -46 9 -296 120 -289 110 13 -255 -39 -150 -53 161 158 68 -39 134 -146 -8 167 183 43 93 -3 -73 15
4518A5K36k15j62K00K10k19k26K12m9l8K61k32m51O90l22j74J39J13m7J09o2K32
4540B20k78j77J09K01j96K63k65J44j30K60J27k83J64J03j98J06J01k68J54m2
4560A15o7J17o4n4J49k87K89k16j48J01J13k59L04j39L75m48j77M85k94j89M71
4581A77l48L64m87L82J8m8l39L08r1q3k3N06n97L53j94Rk3n8K59k74L41l25L03
4604A30K6l48M77N7j88Rl43J36n1J55j36R4L34p2m28j6K50P8n23L76l42J40J05
4627h0o7K32p3o3N0k50K19r6M20k82J01j33J81j80Kl8QK98l59L84k40K04k81r1
4651a34J35J72k53n5J72j50j64K80l03L11j33p2O16n30M72l67l75L24qL04m72
4672b30L1L22m17J66J97Q1k18K44l09K84l86J79R1m9L12j83p7J80k70k35L85m28
$$ plain form
4518 15 251 36 -126 74 284 65 -161 51 2 -36 225 -7 -458 232 -90 -264 -125 -12 -59 50 -12 220
4540 220 -58 -235 -126 75 -121 142 -123 21 -109 151 278 -5 159 262 64 170 271 3 157 115
4560 115 48 165 101 47 196 -91 198 -18 -166 -65 48 -211 93 -46 329 -119 -296 189 -105 -294 177
4581 177 -171 193 -294 88 106 58 -281 27 -64 -147 -170 336 -261 92 -102 -93 -116 -174 85 -189 152 -173 130
4604 130 156 -192 285 342 154 163 -180 -44 -95 60 -76 18 352 280 -148 -164 86 164 -359 17 -325 -185 -80
4627 -80 -147 85 12 -51 -1 -251 -32 -128 292 10 111 -22 159 -21 -19 -57 -49 249 -110 274 34 238 -43 -134
4651 -134 1 173 -80 -135 37 -113 -277 3 -300 11 -122 -194 422 -108 364 -3 -378 -54 -62 242 -230
4672 -230 -199 123 -294 -128 69 150 -68 176 -133 151 -235 -56 35 -14 298 115 38 218 -52 -287 98 -330
4694c30M21J54k69L4j37L76P2k55L55m41J93j81M2k1o1M9L52p19J99J82n0Q5k75
4717b25K64O4J43n05J81k01J43J60p5J31k06qJ00j52K37k36P5M63k13J21j09k47
4739i5J19O4J08l65K55J2j48L05L0l7m9l16MM41k31j48l6r3K08j99j2K97k23q7
4763a96J45Q4j89L56op3j6k14J99OJ66L4m98K99kk09K20J05J21n58L98l6J44k48
4787C2LM2j67L05j7L1j06l8j05k95K96J46l9k84K6j0K89l7r4j91K44k66m3M62
4811A84k53J20j28j47K02q1K80k4l15J89J81l0m04L23R7j07j97J57k71K45p2O0
4833IK67l10J34j57Q3J16k07N34m18k71J78J50k15J77l1QM2r2l2m5j67M88m19
4856a78J34k52Q7K40rJ16j53J61j79M17k15j64K70q6l99L86J35j3j35j79N2K16
$$ plain form
4694 -330 91 245 -24 10 -127 249 321 66 421 -20 173 -8 34 13 -48 1 353 -366 -167 15 -35 50 -225
4717 -225 39 103 246 -259 -78 -279 -136 24 -51 80 -126 -134 -34 -186 51 -185 -110 353 140 261 152 -95
4739 -95 24 88 196 -169 86 98 -50 255 285 248 199 -117 -113 328 97 -51 -87 -180 28 -171 -183 114 -109 -196
4763 -196 -51 33 -156 200 194 121 105 -109 90 96 262 296 -202 97 95 -114 106 211 332 -226 172 136 280 32
4787 32 35 77 -90 215 198 229 123 85 -20 -315 -19 127 88 -196 -170 -180 109 72 -22 -213 31 -235 -278 184
4811 184 -69 51 -77 -224 -22 -103 177 153 -162 27 208 178 -226 97 194 87 -110 47 -224 21 -51 9
4833 9 276 -34 100 -57 26 142 -65 469 51 -220 -42 108 -107 70 39 47 89 -3 -35 -80 -247 241 -178
4856 -178 -44 -296 -209 31 22 138 -15 146 -33 384 169 5 275 189 -210 176 311 298 163 -16 36 252
4878B52k01J50k85K17j56j21L80l82J66j00K42j2M0k60K8k66M82l90o0K65o9Q7
4900Gk25J43P5k30K3J14R9k44M55l20M5J55k69K03k80J57J01l10L68j03j64K27
4922B7J20l3q9J66M9k60j75K75j15L00k04K59k81N2O6j26M0j01J16K30j96n0k67
4945a97L73k64J70k67J2J43Mj04m4J70J28j05K01m42O13n32lk9K27N9l85N63m23
4968a32M15l10k87J79Q3l34L46K4K43m22K61K0o10N83K9m3o5o2J63l09J58r0K10
4991E0k79M74l17j8L25m61K90j2L2q1n0J99k3l59L75j03J08p9n92M89K9j17n6
5014a76L64q8l1J17p9p2l11L82J90k57k07O3J19J88k4j09l4K7k09K76j14j51L08
5037A72J09j73k24K54j85jK32j02Lk07L29l9k22p4K8j44K99k82J67K8M4r2p9p7
$$ plain form
4878 252 51 201 -84 133 -23 -144 236 -146 20 -80 162 150 190 -70 -42 -308 174 -216 -276 -11 -80 7
4900 7 -218 -75 0 -230 -207 -93 6 -238 217 -103 -58 97 -172 31 -249 -92 9 -301 67 -36 -200 27
4922 27 147 114 25 191 240 -20 -195 80 -35 265 61 320 39 91 157 31 71 -30 86 316 120 70 -197
4945 -197 176 -88 82 -185 -173 -30 -26 -130 -174 -4 124 19 220 -222 391 -141 -144 -173 54 113 -272 291 -132
4968 -132 283 -27 -314 -135 -52 -386 -40 -16 227 -195 66 86 -524 59 88 45 -20 -82 81 -228 -70 -160 50
4991 50 -229 245 -72 -90 235 -226 64 52 84 3 -47 152 129 -230 145 42 150 71 -521 -32 -3 -120 -176
5014 -176 188 100 69 186 107 35 -276 106 296 39 -168 -105 14 202 178 69 35 62 -147 129 15 -136 172
5037 172 281 108 -116 138 -47 -48 184 82 85 -122 207 168 -54 -128 -100 -244 55 -227 -60 -32 12 -80 -159 -236
5061b36M4K70m46N11k57q3L59j99o0K10Mm7K23k54k2O3J84l71J78L01m01L39k92
5084A8l6l52M08N9Q9j61k24K07j83J09K5J75j70j5k24N98k05l61P5r3K37n4J50
5107G2k7J38k04J45k14N0q4N9K10j84M00l88J10M8k10L29k33k43K85l3J3Q0l93
5130b74L65j04J72l33L18j4j47m2j46J55n7J52m36L06OJ43lP7k02l4L27l61L7
5153i5k1J75k4j11M09n15J09J2J39n1k63K95j0K3r1J9O5qP8p1K2Q9k38J66J89
5178B92l77O0j12o7O4J88K11m54J1K11l53L14J20K25n47%K86j61K14k57J43p9
5200f8J90j25L04j95oR6k88j24L07o9Q0j71J13j00K2K15l48J81m0l05L27L0Nr8
5224f7JK04k13J78k00r6J19K86j92j35L8K24k87K41m67K87%K41l23L51j47M6q5
$$ plain form
5061 -236 -192 78 -368 143 -114 -197 162 -37 -97 113 117 70 293 39 17 80 264 -107 71 372 -29 310 18
5084 18 -18 -370 38 97 186 25 -199 8 -175 -66 -41 134 -36 -51 -275 323 118 -243 -168 -261 -24 -78 72
5107 72 45 183 -21 124 -90 -40 -124 -65 145 -39 361 -27 83 131 -79 250 17 -226 59 26 39 119 -274
5130 -274 91 -13 159 -174 144 130 -17 -59 -205 -50 -107 45 -391 -85 -79 64 61 138 -64 -98 229 -132 -95
5153 -95 -116 59 35 -76 333 -182 -73 -61 78 27 -236 59 49 72 -19 0 65 57 135 64 86 175 -63 103 292
5178 292 -85 -25 -137 -204 -140 48 259 -195 -184 27 -326 -12 108 333 -214 -214 72 -89 125 -132 11 -68
5200 -68 122 -3 301 106 100 196 -92 -216 91 22 102 -69 44 -56 -34 181 -167 14 -26 -331 -4 26 31 -67
5224 -67 -66 138 -75 103 -97 -193 -74 212 20 -115 -77 147 -140 101 -366 -79 -79 162 -161 190 43 89 4
5247Dr1J07j30L04j81J24k19J8J93j00K27k04J27j36J92j98K3j07j32L49l15J88
5269D3OK10j52k88l8J44k67J02J07K60j50j3k42Q3J48j65K1L7N0J1J35rO8k78
5293a77M53j08P3k37K22k26q6K8o3J1L64j70J84m18J53q7K67j04j9L00l66J50
5315A44j25j38o5M87j76o7o3J08k36M24n35L57k1l10j36R7J90L00n8k04K98l10
5337c9nJ56l6j26J05J28N3l95P0L07%k57J03J88N6O3n81j7K93l45M48J30q39N26
5361a4Q9J58j86J58j54n7K51k06k12K2J54k03K27l26J52J89q3J31j65K83l85J29
5383d8K21L6m19K93J22l31J87k33N11n43j2K5K68M1k47o6J85J38j12R8k95J75
5405fn2p7M08l27J15N0J49j92R6k35J81Qk20K34N5j16j46p9Q9K35k60j82K26k0
$$ plain form
5247 4 -87 20 -110 194 13 137 -82 -64 129 29 256 52 179 43 235 37 60 -47 -179 170 -145 43
5269 43 49 259 107 -181 -219 -75 -342 -240 -133 127 -23 -36 -278 -195 -47 -212 -191 -154 -104 -93 42 33 101 -177
5293 -177 276 168 241 4 226 0 -86 -58 -121 -110 254 84 268 -150 3 -84 183 79 60 360 -6 144
5315 144 19 -119 -184 303 127 60 -3 105 -131 293 -242 115 94 -216 -352 -255 -65 235 177 -27 271 -39
5337 -39 -44 112 76 -50 55 183 236 -159 -89 218 218 -39 64 252 308 371 -210 -227 66 -279 169 299 -540 -14
5361 -14 75 233 47 205 51 -6 245 39 -173 -151 3 -200 27 -299 -147 42 -41 90 -75 208 -177 -48
5383 -48 173 209 -210 83 205 -126 61 -172 339 -204 -216 -191 77 118 -129 -195 -10 128 16 114 -181 -6
5405 -6 -58 -135 273 -54 61 111 260 68 164 -71 110 118 -102 132 187 71 -75 -154 -65 170 -90 -272 -46 -66
5429f6L37k45L3r8K02j9j86n8O1j19K84j3l2j13J18K9j5k17J26k59j29L41M9j99
5453a88J6J31J75L0k28L13k17O7l20QL83k77K41l13J14J99o8k72j43M84j11n8
5475c4p8L24l03J43j9j70J18P1j51J1M36m37K48j42L0l85M20K9k1j72K16k90K45
5498H9r9N6N4j25K49n95N05P3j98j55J56J43l5j05n2J50l25K77P5M5l68n2M7J57
5522c3N0P9m2OP5j10j17M5n7J36j4k2j14l6J68O9j45P8P6n7n0m6Q7N9k28l4J61
5549a6k59N79l16j14J58j90J44j9k13j17M00K7M3m2o8K94k39k17K9J31J8m0K43
5572B16m3Q9l11m2J10j52J26J72m8l66J07K52k09Q4j24J92l72K46p3J71j51J71
5594D5N8p3k29j02M12k37R9j46O5k57R5Q4oj00L90l06J53kp3K23j23O4l73L42
$$ plain form
5429 -66 271 26 59 -39 163 144 -42 -100 -39 -158 126 113 81 -32 86 115 100 -117 9 -250 -379 -38 11 -188
5453 -188 -172 -41 134 164 -64 249 32 99 -221 -213 170 -107 134 -179 -65 134 66 -206 -349 135 24 -34
5475 -34 -112 212 -91 52 33 -137 -19 52 -99 -88 348 -89 159 17 47 -338 82 111 90 -82 134 -156 89
5498 89 -10 46 100 -25 224 -371 134 207 9 -146 10 153 118 13 -39 111 -214 63 138 183 -185 -237 -190 -33
5522 -33 17 96 54 60 135 25 -92 -47 -104 32 18 -4 -118 -154 14 83 -62 16 92 35 -15 -61 26 85 -143 -177 -16
5549 -16 -275 304 -12 -126 32 -158 -14 -33 -246 -363 37 64 107 65 -3 291 52 -165 -136 -5 13 -27 216
5572 216 173 262 -49 -91 19 -133 -7 165 117 -249 -142 110 -99 -15 -139 53 -319 -73 -146 25 -126 45
5594 45 103 30 -199 -301 111 -126 -27 -173 -108 -365 -270 -186 -192 -292 98 -208 -55 -57 -130 93 -30 34 -339 3
5618CJ31l13l3L0j29J76l2pK1n3J37L5o9Q9K96j79m7k03K84j89L3M86l68j44K80
5643B35k47P9L46o97L91m30N23j94L4k26O63k77k85Q4L6K37k35l0K12k51r8J11
5665a9P8o4j34J22j08M12k7l46Q7J1K55Q1m49k7j01M12l02J38k18J63j00N7o9
5688a48K92k13j02J4K67j16qL8l35L67L9j18mM5j48J76k08K75j26J73l07K90l42
5711a99L06m9k2J40j02r8J47j59K44k11j23Q3K50r6m8j59p7K82N00o76J6K8J52
5734A29O0m0k8j67L3j64J72k48L74r2rK98m34J07P8j00l1jQ0j71K10N4K9j44r6
5759a01K8QN0l7L22j92k40J62j38J36J90j02k31J65Ml2J21m0k35J14pL22O0n12
5783a85N84k47k57M90o12K47q3J17q5Q8N4N3N6k08k43N18m99oK94j63m6K7r3N5
$$ plain form
5618 3 134 -179 -212 -182 -311 -135 -167 -174 -153 -206 -69 -34 -103 -14 282 103 56 -147 137 -52 -19 467 99 -45 235
5643 235 -12 67 413 -284 107 -323 200 6 40 -186 477 200 -85 -1 35 272 37 7 219 -32 -130 -19
5665 -19 59 -5 -139 -17 -125 287 260 -86 1 12 267 348 -101 -128 -229 183 -119 19 -199 -36 -136 -79 -148
5688 -148 144 -69 -171 -157 110 -6 -14 24 -311 56 95 -23 -27 18 -130 46 -162 113 -13 160 -147 143 -199
5711 -199 107 58 36 176 74 -24 123 -36 208 -3 -126 -43 207 111 63 -96 -173 109 609 -67 -51 -23 129
5734 129 189 149 121 -46 -13 -177 -5 -253 121 29 20 318 -116 -9 69 -31 -62 -63 17 -154 56 110 139 -5 -101
5759 -101 -73 -65 -15 -52 270 78 -162 0 -138 -2 188 86 -145 20 24 -8 113 73 -162 -48 -55 267 327 -185
5783 -185 399 152 -105 385 -227 20 -63 54 -31 57 111 164 220 12 -231 287 -212 -218 76 -87 -133 -106 -199 -144
5807a44K9K83k80k3J61j31J13K6l27M30l12K54j6o2L1m33O63k90m04M89j83J89
5829F3N8j21l1L40q1k06J27j14p3J81p2j15M4J17j1k99K90p5l00J22P0J80NJ14
5853B13k76nJ06k19J71R9k06J05K71r1k62N1k39L12L94m30Ll5pj39l5J12k3K99
5877A69p7j55O0J1l8j95L62N6k55lM0j23l8L63k13Q1J4l9N2K38m61L20J3J53j07
5902B28J65m33J6K7j54PK98k07j78J20j32J70N7J71k35J38o4O7k2o7J2j46K09
5925D7j93P4k55K31m3k6J75j05L15J3j12q0J5k78L18l4j04M4J54m78O01m88Q2
5948a27J65k34Q6K12r9J91k49m0J6J4kO0m7K0P0k49J69J47j99J69j02J27j79j09
5972a90j70J77J36r4J66m2O0J05r0p1j90L01J33m89j3L58k25n1K47j7K29j22k21
$$ plain form
5807 -144 -115 168 -112 -135 26 -105 8 34 -293 137 -175 79 63 1 32 -401 262 -28 -432 57 -126 63
5829 63 121 0 -31 309 228 22 149 35 -38 143 71 -44 0 117 106 -193 97 22 -278 -156 -86 94 99 213
5853 213 -63 -68 38 -181 -10 89 -117 -12 259 168 -94 -43 -282 30 424 -6 -3 -38 -45 -184 -219 -107 -130 169
5877 169 92 -63 -3 8 -30 -225 137 193 -62 -65 -25 -148 -186 177 -36 45 59 20 72 310 -151 169 182 335 228
5902 228 393 -40 -24 3 -151 -144 154 -53 -231 -111 -243 -73 -16 155 -80 58 -6 61 39 -28 -16 -162 47
5925 47 -146 -72 -327 -96 -139 -165 10 -95 220 233 121 41 56 -222 96 62 -42 2 156 -322 279 -209 -127
5948 -127 38 -196 -110 102 3 194 -55 -95 -79 -65 -67 -7 -54 -34 36 -213 -44 103 -96 73 -29 98 -81 -190
5972 -190 -360 -183 -47 -141 25 -17 43 148 58 -13 -203 98 231 -258 -271 87 -138 -189 58 41 270 148 -73
5995g3R7m5j16J99k41J29J39j95K18L6j28k77M52m50M95J02n06J24P2P7n60L86
6017f5M52o77K64J38k22J59Q6m18J19L69j53K64l03J78j36k5J89k73Q8N7k32J70
6039B9o6L15m81J07L0j4J09L6k9j86J62l08K19r9J51m8k8m1N29p32L19k7O2K70
6063B79l05j7k28kK15j94K62N0K28k63L11j51l6K31l46j03k1l3N4K49k23K13k10
6086d0L9r7l7J98j80j27K14J11j29MQ8Q8j85K25j50L49m67j0O4JL66j26k71J86
6110A14n8Q1j69o6J81j05R0j17J85j73K66k83j34L19j41j23j19K24M6k22M2K21
6132E9J80j92R1o1j48K96l03k8J17J97j33q8j8k30J29M1L70j26j39N49p00R5J04
6155F2k21J27j6j28K79j37K49l37J3J42J0lr5j93J92J00j7K08j80K32q20O16k47
$$ plain form
5995 -73 24 -21 -137 62 -179 -50 89 -106 112 148 20 -257 195 -255 240 342 -164 -40 32 109 -451 -65
6017 -65 387 -290 -26 112 -110 49 135 -283 -164 205 52 316 13 191 55 30 219 -54 34 91 -141 29
6039 29 -37 278 -203 -96 -66 -80 29 65 36 -150 12 -296 -77 -176 -25 -73 -101 -142 387 -345 -26 -53 9 279
6063 279 -26 -43 -271 -273 -58 -252 10 60 288 25 336 185 149 380 34 -69 -90 -123 -69 180 -43 170 -40
6086 -40 -1 -98 -135 63 -117 -244 -30 81 -48 -44 44 132 -53 172 22 371 -96 -106 -42 -41 325 199 -72 114
6110 114 56 137 -32 -98 83 -22 68 -49 136 -37 229 -54 -188 131 -10 -133 -252 -28 18 -204 -162 59
6132 59 239 47 138 77 -71 225 -78 -106 11 208 75 -13 -31 -261 -132 -91 279 153 14 563 -137 -42 62
6155 62 -159 -32 -48 -176 103 -34 215 -122 -109 33 43 40 -55 -248 -56 44 27 235 55 287 -533 83 -164
6178a64q8L78k41N58m87K66l56R4j86M05j37j25J24K89k27j17l7Q3L46l9m34K28
6200A33Mk18J92J2j07K0K71k11j31K96k63k26M0P2J62j30QK8O4J10k21k99J56
6223b38K7L7Q8l1n5j00N08l78K56K31m97J68k45K94J00k52K33r0Q0q2k6k69N24
6246B83l96K91k74Ml3J9L6j34J87q3K48k66J82K4M1k53M03l6n8n23K04j57L79
6269H8j59j12j9J89Q9k31%j38K90J2J26l17J29m17O13om09N59l01k57K98k95L51
6292H3k69J52M1O2r1J24n5J00k70J49q2R3J56j49j34L23l36R2Q6k16J40L3O0P2
6316A64l67J6J70m8l8J92O9k02K6k40K92M1o8j47J85j84L50J11n44K90r3j03l9
6339a67K96j94k27M93j89j62P8l0QJ12k87N11m79J40J26QJ33K33r52L77J82%j84
$$ plain form
6178 -164 -252 126 -115 443 -44 222 -134 -40 -226 179 42 -83 41 330 103 -14 -51 32 378 339 -95 133
6200 133 137 -81 111 123 16 36 307 96 -35 261 -2 -228 -188 -116 46 -84 -76 -48 16 126 -95 -394 -238
6223 -238 -211 -174 -86 -117 -172 -272 236 -142 114 345 -152 16 -229 65 165 -87 146 56 136 54 28 -241 283
6246 283 -113 178 -96 -92 -125 -106 -70 -204 -17 -100 148 -118 64 88 129 -124 279 243 185 -338 -134 -291 88
6269 88 -71 -183 -202 -13 76 -155 -155 -293 -3 9 135 -182 -53 -470 143 137 -272 287 -14 -271 27 -268 83
6292 83 -186 -34 7 69 -22 102 47 147 -123 26 -56 37 193 44 -90 233 -103 -11 75 -141 -1 32 92 164
6316 164 -203 -187 -17 -65 -103 89 158 -44 -18 -258 34 75 7 -140 45 -139 211 322 -222 68 -25 -128 -167
6339 -167 129 -65 -292 201 12 -150 -72 -102 -94 18 -269 242 -237 -97 29 37 170 403 -549 -172 10 10 -174
6362a74L03l37K0J59K65l96Q2P9q1J33L5N0j37k45K52J35k06q7J5M6k59P4K6K87
6386C9oj17L61k15K0Q5j68q0p9K86j90o2m6j86J38L92n18L78k4M75l92p7K96k4
6410B86m2l00M9k04J89K30m51O7R1K93j55l30L21k87L58k88J35J28j46m8L67m89
6432b26K53pk04q2L47j32J35k62K05r5K40l41L6M4l3J0K72m08M41j85o6J48k4
6455F6j78P8J85k88L6N8k4J62J42j51R0J3k95K87p5l47K08K58j92j90L78N3p9
6478A95l53L54K6l91M10m55M07o6j63J13J0M4l48J73q6J82l03M39k30p7L57l69
6500a31k0J23k86N01m29L44O5m11K78l59R2N12m17N32n30l44L39K23j76K32O3
6521B01k26r9M2Q7Q4lj83K15j43k76M37k5o2K5P0k10J28q6L24m96K44j42K5K91
$$ plain form
6362 -174 129 -208 -188 -29 236 -160 -78 1 -80 53 88 138 1 -244 8 143 -63 -150 -135 -89 -348 -274 -248 39
6386 39 33 -84 277 62 82 167 -1 -81 -160 126 -64 -126 -172 -358 -220 172 -346 32 8 483 91 14 310 286
6410 286 244 -56 -7 -211 -22 208 -243 -176 -85 208 53 -277 44 -243 115 -173 -38 90 -56 -104 263 -226
6432 -226 27 20 -184 -266 81 -51 84 -178 27 -68 172 -169 -133 -89 -122 -112 160 -248 193 8 -58 90 66
6455 66 -112 -34 151 -137 -101 -43 -67 95 237 86 176 189 -106 181 106 -241 -33 225 33 -157 221 274 195
6478 195 -158 196 222 -169 241 -214 193 127 -36 77 87 131 -217 -44 -130 52 -251 188 -42 -119 238 -131
6500 -131 -151 -28 -314 187 -242 102 167 -244 34 -325 -233 279 -138 394 -136 -480 -141 82 -94 138 201
6521 201 -25 -124 -82 5 89 86 -97 118 -25 -301 136 111 49 74 144 -66 62 -24 300 -196 48 -94 -69 222
6545B22k91L53m07K17l8J62j34k91K1K39l8J48r5q8j94k45M02J68n7k24L78l05
6567i7K42j07J18l06nK0k1J88L0J28m37J30L36m07m2K44k50J50o04M35L70R2k36
6590b9K2PK68m46K32J79j86j50M9M0j47K93j56J32j98l7l7Q0M2J99p8K9l28K94
6614G4J00m1p2m6J44k89l54K44L70J2j38J30n2q2K76m25N2M7P5lk38j0K91m0J14
6639A39qj75j17J33J34l52K13Q8k45L06l78K84Q0R1k71Q3J92l86J22O0n9r0j28
6662b84L86k81K18m2K63k88N9j1jJ7K10r7k04j7p2N8J08j74K76j85J1k59J48J56
6686eL12l10m2J31p4j89J79L62m20m5O4R6Q5j9j36J06m01O23l89K89J6l10j30
6709b07K60n3%K7pj3K80m15j61J51PJ47J17q1K1L4K28q7k25j22oL02o8k62L14
$$ plain form
6545 222 -69 284 -123 94 56 218 84 -207 -186 53 15 163 68 -20 -214 -459 -57 111 54 -170 208 -97
6567 -97 145 38 156 -150 -155 -135 -156 32 62 190 -247 -117 219 -188 -230 14 -236 -86 -690 -255 115 207 -29
6590 -29 -7 0 268 -178 54 233 47 -103 -54 -14 -161 132 -24 108 -90 -127 -164 -84 -42 157 79 108 -220 74
6614 74 174 133 61 15 159 -130 -484 -240 130 142 4 134 82 0 276 -149 -97 -50 25 22 -216 -226 65 25 139
6639 139 131 -44 -161 -28 106 -246 -33 55 -190 116 -262 22 102 193 -78 5 197 -189 -67 -7 -66 -156 -284
6662 -284 102 -179 39 -3 260 -28 31 20 19 36 246 149 -55 -72 -144 -86 22 -152 124 -61 -50 -309 -161 -5
6686 -5 307 -3 -45 86 12 -177 2 364 -56 -101 -37 59 144 125 -11 95 -306 317 -72 217 233 -77 -207
6709 -207 53 0 0 27 20 7 287 -128 -289 -138 -131 16 133 52 73 107 335 248 23 -99 -105 197 129 -133 181
6734A81j78j9km2j01N8K1J84j24NR2J66n26K37K02j06j8j95P6J09j39j99M61o
6758A37n31M30R3kn31M35J18k0l28l3K75j09J21k35L18r0L4k4J29l81L19j58R4
6781F1K16k81n9P2N0J96l2k35J10j01o4K74l16K28l06L35o5l66K54J11J31k68
6803e5J35m9j45j56K39J62k86K32l43K00k15J35J92j52J60m71N28j44Jj01K90
6824A57m32J78k0L33k27M6j10J33pj04k1j96M50l62L40l0l30J54J87k96J46J59
6846A48m16M75j25M7k20N1J76k24m4J2m0K77Q6N8j09k77L18N1l76L7K49K18n00
6869a28J68q5O0L2j72L01k13Ql32K04J25l2K12j18j74J58J13l66K98m3p7m5j13
6892b19K49r3L2j20M7M8m5L46o90J78L38J00m47L64r4P5r8N9r3j89M18l59J16
$$ plain form
6734 181 3 -16 -18 -60 -161 -103 -82 102 -22 -17 75 241 -285 -48 154 48 30 -165 -89 20 -119 -318 143 137
6758 137 -394 36 129 127 -404 31 149 129 -199 -232 43 -66 55 -180 138 48 82 58 187 -194 125 -33 61
6781 61 277 -4 -63 9 59 255 223 -12 98 -3 -67 207 -109 119 -187 148 83 -283 -29 82 213 -55
6803 -55 80 31 -114 -270 -31 131 -155 77 -266 -66 -281 -146 46 -106 54 -417 111 -33 -32 -133 157
6824 157 -275 -97 -117 216 -11 35 -75 58 51 -53 -74 -270 180 -182 158 128 -202 -48 139 -157 -11 148
6846 148 -268 207 82 129 -91 -40 136 -88 -132 -120 -160 117 203 261 152 -125 193 244 -132 -95 154 372 -128
6869 -128 40 -45 15 47 -125 176 -37 -29 -361 -157 -32 -64 148 30 -144 14 127 -239 59 16 -61 -106 -219
6892 -219 30 -63 -31 -151 -104 -56 -101 245 -445 -267 71 171 -276 88 -6 69 -29 30 -63 -252 166 -193 -77
6915g7j69K05K0P3Jj52K19j09K38Nk65j36j3N07k62l9p7P1J82m67K05J80PJj99
6940e1R9JJ4k76J06l4M62m30n3N06n69M31k90j02J16J73j9k28j83M00MO9l7jj28
6965b0j29N0p2K68j57Q8J84m57M31m15J85J27R4j74K75l61p2j1L86l70K8K75L8
6988A91k56J6j46J34L3k23K44m1j04j61K60j16Q3K40N0r9k50J52pK85l13J53j05
7011B0o1l80N20k1r4K63J4k67O9l5m9j5lP4j16L8J92p9K6rl07J47m5r6j0K08m8
7038f4n1Km2j5N24k49L4K6j01j77k9j43L82L6J97l81L05m79J00J66l06J30j8J40
7062a3K26k00j91J94k5l09N9J64K86l68N0K07J46k10P4M5r2j62q8K82P6P3O9k89
7086DL1l66L35k2L60k31j46N4J37j66k39K44J08k4l07N03Q9m04J67k19J76Q5k89
$$ plain form
6915 -77 -246 -41 -21 52 53 -99 120 11 249 254 -11 -147 -160 347 85 46 -31 40 222 -245 -40 140 147 148 -51
6940 -51 48 49 63 -213 -107 -141 321 -109 -162 344 -225 206 -84 -186 -70 103 84 -144 -327 73 77 146 109 108 -20
6965 -20 -149 -99 -171 97 -60 28 212 -245 186 -229 -44 83 177 3 278 -83 -155 -166 220 -150 -122 153 191
6988 191 -65 -49 -195 -61 -28 -251 -7 -48 -152 -313 -53 -169 -86 154 204 105 -145 7 0 285 -28 125 20
7011 20 -41 -421 99 78 -16 247 261 -6 63 28 -21 -36 -39 35 -81 -43 149 70 96 87 -220 -73 -118 -214 -224 -16 -64
7038 -64 -115 -113 -155 -170 354 105 139 165 64 -113 -142 -285 97 133 330 -51 254 -225 -125 41 -265 -135 -153 -13
7062 -13 213 13 -178 16 -9 -318 -259 -95 191 -177 -127 80 226 16 90 135 43 -119 -207 75 151 224 293 4
7086 4 35 -331 4 -18 342 111 -35 19 156 -10 -249 -5 103 79 -228 275 364 -40 127 -92 84 169 -120
7109a20J0J69l6K68m31K05J24l81L17l70J50J60k10q6K41k14K61j91N3k26L52
7130D5M06p55O13j80j06P2k08J48k7j31j92L89k64L44L0N8l39J83m0J2o3j57j31
7153b93K28J94R8J1m04J97j6J94J7o0k21l7J24J4j36K85j55O7Q6r7j97L6p7P5
7177f7k1L18j59R5Q7j79k3j96j90N19l52K19j08p7J5j39M9K32K3j07P3m3lj33
7201a67L36k72k46K64k6L5J73j14K78l50L02k46K17j26o7j07m0K19J0m05L63M5
7223G6q6J11k12K77l86L46Q4l69l5j38K53L12l54J93N7n54M91Q6N0j61l30J77
7245a12J2O0J10k7q9M2L5j33j6M01m92J31o6M37n50L64r4k21K10n8M7J99k96L14
7269B08j88n32O86l72j4K04J57pj58k70K74K88q1k71j2q0L1L16j44L71p20K15
$$ plain form
7109 -120 -110 59 23 291 -140 65 189 -192 125 -245 -95 65 -145 -231 10 -204 57 -134 -81 -307 45
7130 45 451 -304 309 129 23 95 -113 35 8 -123 -315 74 -190 154 184 242 -97 86 46 58 -5 -162 -293
7153 -293 -65 129 227 238 -166 31 15 209 226 166 -55 -92 32 46 -90 195 40 107 193 96 -101 -65 -142 -67
7177 -67 -88 230 71 166 253 74 51 -145 -335 184 -168 51 -57 -134 -119 -258 -209 23 46 -61 12 -31 -34 -167
7201 -167 169 -103 -349 -85 -111 -76 97 -17 261 -89 213 -33 184 58 -9 -116 -156 63 73 -332 31 76
7223 76 -10 101 -111 166 -220 126 210 -159 -194 -332 -79 233 -121 72 129 -425 66 152 202 41 -289 -112
7245 -112 -100 -40 70 43 -46 -4 31 -102 -118 283 -209 -78 -144 293 -257 107 13 -208 2 -56 -9 190 -106 208
7269 208 20 -512 174 -198 -212 -8 149 142 -16 -286 -12 276 195 -76 -88 -168 -137 179 35 406 -314 -99
7291i9K21j07nj96L48l04J82j02J08J2k12M17p4k51J84l70K74n6k49L58N9k2m2
7314G4j60j2K11k59Q7Q9pr7M6J30n31M65k4J47o0K20l15o4L20j88l9j28lK88j03
7339H7J17l78J51J73j63O3M2O8j77K00j32j47K59k53l9K03j07k5L98l51k59L57
7361H7k45K42J6k19L41k21K8K2j21M3r6R9p4j3Q0k37N01Lm06K45p3r1J8M7l5J85
7387A26m06O6%M22j50k61J9K00j44Q1j39L53J8j31j95J25K47k69L3j28K52k57
7409a38j02L24J68j70j12Q7m3M77m06j51M5K69j97p3q8k9l1L51k7K9q9j02j70
7432a78K57j03j89L26j3j06J8l1R6k4j51J25k6j23J24k55j49J67J82K86j99J38
7454A72k09L9k6K90j81q1jJ35p9j70K98n64O10m36L89k10J64j26L86j60j29N3
$$ plain form
7291 -99 122 15 10 -186 162 -142 40 -62 46 58 -154 263 189 -62 122 -248 26 -30 -279 79 138 116 74
7314 74 -86 -98 113 -146 -59 30 23 -74 -28 102 -429 36 12 159 99 319 4 -60 260 72 33 -95 -98 190 87
7339 87 204 -174 -23 150 -13 50 92 160 -17 183 51 -96 163 -90 -129 74 -33 -58 340 -11 -270 87
7361 87 -158 84 100 -119 222 1 29 51 -70 -27 -123 -24 -98 -111 -31 -268 233 236 -170 75 2 -89 -71 -24 -59 126
7387 126 -280 -214 -214 208 58 -203 -184 16 -128 -47 -186 167 185 54 -141 -16 231 -38 -5 -133 119 -138
7409 -138 -240 84 252 82 -30 57 14 491 85 -66 -21 248 51 -22 -110 -139 -170 181 154 183 94 -8 -178
7432 -178 79 -24 -213 113 100 -6 12 -19 77 53 -98 27 1 -122 2 -253 -402 -235 -53 233 34 172
7454 172 -37 2 -24 266 85 4 3 138 59 -111 187 -377 233 -203 186 -24 140 14 400 240 111 164
7476A64m23J60O9p4K57j17j72K56r0k06j1K31j06k30K86M8j35O4J97k83J13K69
7498B67q9j85NM4O7j98j64L35L4k49L93k96K92j42l72O34k59j03j88J78j15J73
7520F2J96k85L45l49J83Q2m37K9L16l71J43N6K37k21K33k35k04l6J27k18L02J32
7542H7k19J63J82k6k20K48l19j8N8K8pj79j2N07l86K30M9j62J42k89J78l17M62
7565A80j87l5M5J13J9j95K37l57L80j78k01J32j1K58k87M7K11k0j33n6n9K13j50
7588c4M8j06RK30n1r4k5k00J42J33M6o6p3J88N8l40J96Ok15J69k59J17Q2J15q0
7613dl8J23j77K36k73J52k89K07j61L69q4J95j42l36L36J30j0%m29L39R7m04o4
7636b27K66k7k02R3j11K52J43O2j14O5k15q2L55k75j73j2L25j4k57K23j10O5o3
$$ plain form
7476 164 -259 -99 -30 -104 153 36 -136 120 30 -176 -187 44 -62 -292 -6 42 -93 -29 168 -115 -2 267
7498 267 178 -7 -2 42 109 -89 -253 82 116 -133 260 -36 256 114 -258 376 117 14 -174 4 -111 62
7520 62 258 -27 318 -31 152 234 -203 -174 142 -229 -86 -30 207 -14 219 -16 -220 -256 -129 -347 -45 87
7542 87 -132 31 213 187 -33 215 -104 -122 -64 -36 -43 -222 -234 273 -113 117 166 4 146 -143 35 -282 180
7565 180 -7 -42 3 116 135 -60 177 -180 200 22 -179 -47 -58 200 -87 -40 171 151 18 -38 -97 116 -34
7588 -34 14 -92 -83 147 96 2 -23 -223 -81 52 98 32 -41 147 205 -135 61 67 -148 21 -238 -121 -39 76 -4
7613 -4 -42 81 -96 140 -133 19 -270 -63 -224 145 61 256 114 -222 114 244 234 234 -195 144 241 -163 -227
7636 -227 39 12 -190 -97 -208 44 187 249 135 200 -15 -97 258 -17 -190 -202 123 109 -148 75 -35 30 -33
7659c3J26j74J19q7P3K8j12l2k26K31q0M6R6k11L49k01r2K87j83K43l40k35M50
7682D2k6P9J41j35j86R1J46K08n23K20L1L8j65K52O7l20OL4m9p8K75p6j9k73O0
7707a60K67n49L51J50Qj32j25J63o1k8j31N27l91K80j06K3k06M46k96R1m81M32
7729G2j25Q7j14K0J18P4J85k72j09O8j92M19k35K1k5j47K01j34J64J3K06l58P7
7752A4k7j86J70J83j52L7R5k82M97l48j45J26j23J25O8L9l20K97L6j1k71J95k08
7775a91J97j11J21j47J60m13J84K97j75Q6k69M14l4j38n7P3Lj64K03j74L30n6
7797A39j95J12%l3L2K45o27L90j93L43k31J14l40L25N4k32J11J46j21j70m1K03
7819C1j2j71J45k83N23l02%J75l94L71k95M47j61j5J11j68j56pK78j72K77k12
$$ plain form
7659 -33 93 -81 38 -49 24 52 -60 -92 -318 -87 -167 -121 -25 -236 113 -88 -180 107 -76 167 -173 -408 42
7682 42 16 95 236 101 -85 6 152 360 -163 57 88 126 -39 213 280 -40 -34 0 -49 -127 148 72 53 -220 -160
7707 -160 107 -442 -91 59 67 -65 -190 -27 -88 -116 -247 280 -111 169 63 86 -120 326 30 121 -360 72
7729 72 -53 34 -80 -60 58 132 317 45 -64 4 -188 231 -4 17 -8 -155 46 -88 76 89 295 -63 14
7752 14 -13 -199 -29 154 2 39 134 -148 349 1 -144 -18 -141 -16 52 91 -229 68 104 93 -178 17 -191
7775 -191 6 -105 16 -131 29 -384 -200 97 -78 8 -261 153 119 -19 -76 -3 0 -164 39 -135 195 139
7797 139 -56 56 56 23 55 300 -327 63 -130 213 -18 96 -244 81 135 -97 14 160 39 -131 -172 31
7819 31 19 -152 -7 -290 233 -69 -69 106 -288 83 -212 235 74 59 170 2 -154 -161 117 -55 222 10
7841A0rp2P8j46J29K67k90lJ34k27j37L11j46p4L19l54K53j56J16j79L39j46l46
7864c29L65%r9O3L1j56L10Lk57l7K1K09k36J85j82K29r7J06j62K32k59j04M63
7887B99k88o4L23l81m9K47q2m1M1k84K33K37m25J48L1l1j06N5J35k13J33M8n7
7910i1j05K60j71p1K58k4j2k01J73K3q9j32K81j82J54R8j0R6J16l08oj88J08m3
7934f6nk4K77k66J27pj5K7J7k23K15k47pJ04nJ12O8k05M0L15j09l69L90k51M8
7959e9Mm7J06P1j36J47J14l0j33K8%l30R2L53k63J5P2R4j72n1K70Q2r6j11K51
7984B71j71k11J36j56Q1n4K50j71J70j45L16J73l39m18N31R3n07R5j20J16Q0k83
8006b63M30l17L89j09m2om4j02J83q1l55K14R1k16K00q2k2J74j52Lr7R6J90k02
$$ plain form
7841 10 1 -71 7 -139 -10 257 -33 -36 98 -129 -266 45 -101 -175 144 -210 43 -113 3 -176 163 17 -329
7864 -329 36 36 -63 0 31 -125 185 188 -69 -106 -85 124 -112 73 -109 120 23 129 -33 199 -60 -164 299
7887 299 11 -53 270 -111 -160 87 5 -36 5 -279 -46 191 -234 -86 -55 -86 -192 -137 -2 -215 -82 -34 -91
7910 -91 -196 64 -107 -178 80 56 44 -157 16 39 -50 -182 99 -83 71 169 159 255 371 63 57 -131 -23 -66
7934 -66 -71 -95 182 -84 43 36 21 48 65 -158 57 -190 -197 -93 -98 14 82 -123 -83 232 123 -246 144 -107 -59
7959 -59 -55 -102 4 75 -61 86 200 170 37 65 65 -265 -173 180 -83 -68 4 98 -74 -125 145 227 131 20 271
7984 271 100 -111 25 -131 -50 -104 146 -25 145 0 316 489 150 -268 263 356 -151 -56 -176 -60 20 -263
8006 -263 167 -150 239 130 88 82 38 -64 119 38 -317 -103 -12 -228 -28 -110 -132 42 -110 -107 -204 -108 82 -120
8030a20O8M0j89K28n5M1K0L9q3m12L08J85Q8N6k20q2J98J01k60p7P9J37K23k63
8054E0L23k73L7k45M8K46m15K67kl7n5J76q7k2qq9J1L29j29L70l70q0K1n3j82
8079a69K00l01L13j94K77o5K35m11J61j02K5n1J45m55N49k03p4K61L2m40N51m53
8101a69L15J8l22J92j78k26M14k83L92j02P9JJ26om68K72J73k60J36M8l74K19
8123cr7M8L22k27kj11KK46j93j07L4r0J17r6K4K37J0k58kK87k5J07k02j80J8k13
8149c54K83L21k84n2q9N3P8K9m5k7K70O0j80l7k91L44K53k48J10j28L0j06J90
8172A80o9O1j60J0k48K29J66l31M9o1Q0J24N5o88O97L29l69j42Q1
$$ plain form
8030 -120 -52 -12 -201 27 -28 13 33 72 -11 -423 -115 70 158 214 -6 -88 110 211 -49 -126 -47 90 313 50
8054 50 373 100 137 -108 -60 186 -229 38 36 -1 -56 120 33 11 3 -86 -75 254 125 495 125 45 66 13 -169
8079 -169 31 -270 43 -151 126 61 296 -115 46 -56 -31 -82 63 -392 157 -46 -120 141 173 -267 284 -169
8101 -169 146 164 -158 34 -144 -370 44 -239 153 51 130 131 257 251 -217 55 228 -32 104 152 -222 -3
8123 -3 -100 -52 270 43 41 -70 -68 178 -15 -122 -88 -178 -61 -157 -133 104 114 -144 -146 141 116 223 21 -159 -141 -354
8149 -354 -71 250 -34 -86 -175 -122 -44 -15 -60 -87 183 243 63 26 -265 79 332 84 194 66 96 -10 180
8172 180 111 172 12 22 -226 3 169 -162 -113 -174 -94 30 85 -603 94 423 54 -88 -7
8191g
$$ Imaginary data points
##PAGE= N=2
##DATA TABLE= (X++(I..I)), XYDATA
0@%%%%%%%%%Kj0J6j6J6k1K9l2L8m6N6o5P3q8J00j11J29j50J70j91K16k43K74l11
33a65L47l85M30m79N32n92O56p22Q00q90R85j089J209j343J493j667J870k109
51a119K392k739L176l743M510n617P373j0578J8343p2064j05190J00999R4538
64C0281r591j14382n8253N0368R6604K1654n2064n6881L346M3108M7407J7185
76A8782j4981l5760j2502M1577O4998J0830n5275m1133M7510Q5740J3204q0626
88D2364o1737M8953J04214K4285q4473q3803J9341Q5215M0982m5697o9045k1613
100a014K7681L2684N104k7976m3021k5081J6893L7805K452n4669n4416J6706O7160
113C08K0055p0295p8215J8091R4126M4380o5181q9789P3Q2355N8377k5146o0674
$$ plain form
0 0 0 0 0 0 0 0 0 0 0 2 -8 8 -8 8 -13 16 -16 22 -24 32 -33 40 -48 52 -59 70 -80 90 -101 115 -128 146 -165
33 -165 182 -203 227 -252 280 -312 344 -378 422 -468 517 -572 637 -706 787 -880 990 -1119
51 -1119 1273 -1466 1710 -2033 2477 -3140 4233 -6345 11998 -60066 -165256 -64257 30281
64 30281 20690 -93692 -151945 -101577 -4973 16681 -35383 -92264 -88918 -45810 1597 18782
76 18782 3801 -31959 -44461 -2884 62114 72944 17669 -23464 24046 109786 122990 42364
88 42364 -19373 29580 133794 158079 73606 -10197 9144 94359 135341 89644 20599 -1014
100 -1014 26667 59351 64455 36479 -6542 -31623 -14730 23075 25527 -29142 -83558 -66852 308
113 308 20363 -49932 -128147 -110056 -15930 28450 -36731 -126520 -126447 -44092 14285 -10861 -71535
126g1535j9032L5825M2587J1561j4687j8909n604J8105L5602J7885k6406l9933
138c4541Q482O2375M0335m1382p4058l661P9964O3412l7147q8922k7358O5199
150A2698O7720j2190o5177l3980K5849M0149P270k2996k3477n729J2943K1277
162B4357Q440k2067l5350k567M5896M0737k4244o9490k3719O0740P1224j3004
174F0953q0927m3685M7466P2129M932n9218m1360K1172M4516J0121k6819k5141
186a5861Q98J5388J3613Q78j5754k5552q347K9212L7002p954n6948l9181L5464
199c7142O8977J2346o4497n8705K2192O9850K5441m6801n1043R352M9042K1938
211B0950k4883l1525m28K4977K0797j58j7657j9769j853K6133L3213R37m2069
$$ plain form
126 -71535 -90567 -54742 -12155 -594 -15281 -34190 -39794 -21689 13913 31798 5392 -34541
138 -34541 -26059 36316 76651 35269 -38789 -42450 37514 100926 63779 -25143 -52501 12698
150 12698 80418 68228 3051 -30929 -5080 35069 42339 19343 -4134 -9863 3080 24357
162 24357 32797 10730 -24620 -27187 18709 59446 35202 -34288 -58007 2733 73957 60953
174 60953 -19974 -63659 -16193 55936 60868 1650 -39710 -18538 25978 36099 9280 -15861
186 -15861 -14963 425 14038 14916 -838 -26390 -34737 -5525 31477 23523 -33425 -72606 -37142
199 -37142 31835 44181 -20316 -79021 -56829 13021 38462 -8339 -59382 -50030 -988 20950
211 20950 -3933 -35458 -35886 -10909 9888 9730 -7927 -27696 -29549 -3416 29797 30734 -11335
224a1335l6861K1110O0418K4847m5096n6614N785N8892L3691l1738m8952j840
236b7693M2429K6786j9440l4347n269K3551K2031N55j7506j9313n454J8566L0588
249C5484Q561l2224l9794N389N1169L4611k9420n7099j0225M9901M2156k1005
261C7504n2638j3045L9836L3727j6475m1188j2684K4901K5784j816k3750k0067
273a9911l583J3502K0931O603k1936l4373q194L4224L4735j3091m9557k2863L4597
286b8916M3675o045m7140k3273L0851M0874k991l8654k0605K1880L4641P715k0469
299h457k1014j073J8293K2708J0873j2921k5622p768K6401L5407N76l6225k5001
312b3823K3410M3518N903l9108k9302K1316M3027O747l6973l0426J2939L5498
$$ plain form
224 -11335 -48196 -27086 33332 58179 13083 -43531 -37746 21146 54837 23099 -25853 -27693
236 -27693 14736 41522 22082 -12265 -17534 6017 28048 28603 11097 -8216 -13670 4896 35484
249 35484 44045 11821 -27973 -22584 28585 63196 33776 -23323 -33548 16353 58509 37504
261 37504 -15134 -28179 11657 45384 28909 -12279 -24963 -62 25722 23906 156 -19911
273 -19911 -23494 -9992 10939 17542 -4394 -38767 -46961 -12737 21998 8907 -40650 -63513 -28916
286 -28916 14759 8714 -38426 -61699 -30848 10026 7035 -31619 -52224 -30344 4297 12012 -8457
299 -8457 -29471 -30544 -12251 10457 21330 8409 -17213 -24981 1420 36827 37403 1178 -23823
312 -23823 -413 43105 49008 9900 -19402 1914 44941 51688 14715 -15711 -2772 32726
324C2726J3240k1633k7819n894J5622J8315N291j3601k2519j1324J4085K6403
336B2892L939k8214k7158R254L5059J1479l0310l2657R369L8768J6268k8894l5620
349c5825K911L4444K1661j3944k8769j0549J4601K0857Q028r746j9219j0495J1857
362a4188K3755P987k1029k5143M291L1486J6480k3376l3674K355L6696K2404k2928
375E116l7889m721L2092K6342r746k9013j2976J3031J9664O691q203j3225p551
388b0388O629J7146J0631j0851k1150j943K5084K2779j1467l1591p081L1113L1290
401D0201q685l7202j5378K6978L4813O77k9121j9410J0239K3294R688j1015j5552
414I527n654P025J2485M376j0623j7675m848J5849J7058q662k9158j5180J9145
$$ plain form
324 32726 45966 24333 -3486 -9380 6242 24557 29848 16247 -6272 -17596 -3511 22892
336 22892 26831 -1383 -28541 -19287 15772 27251 -3059 -35716 -26347 12421 28689 -205 -35825
349 -35825 -32914 1530 23191 9247 -19522 -30071 -15470 5387 13415 3669 -15550 -26045 -14188
362 -14188 9567 17554 -3475 -28618 -24327 7159 23639 263 -33411 -31056 5640 28044 5116
375 5116 -32773 -37494 -5402 20940 11194 -17819 -30795 -17764 1900 8591 388 -12837 -20388
388 -20388 -13759 3387 14018 3167 -17983 -19926 5158 27937 16470 -15121 -22202 8911 40201
401 40201 31516 -5686 -21064 5914 40727 41404 12283 -7127 3112 26406 36094 25079 9527
414 9527 3873 10898 23383 27759 17136 -539 -5387 10462 27520 18858 -10300 -25480 -6335
427f335K7857k931l4134k3484J4002L0385O544k4634k4718K137K1225J2243q065
440i908j5921o841P940J2418O951o745j3604l275J5949J9564l67k2242j4438J6637
454a3882L1441Q536k5002k4258R482L2092J5843j7032k4549p07K1538J6021o103
467B3420j6453p591P321J1549L915q424j3404n427J0159J4605j75k0685j8379
480a9569O587K5416J1045k0642k8110p06K6069J8424j2145k4553o241J7239J7530
493A0344k489j5313p980P808J3572N850n713j0143l976R703J5927N224j3681j7692
507h559K289K3404J6341j1724k6800q030K1291K1642n909k5832j2998J3186J8416
520A6717j539j8934j3616N175J2874L415j0418j3253n033P407J0769K275j1104
$$ plain form
427 -6335 21522 18591 -15543 -39027 -25025 5360 11904 -12730 -37448 -35311 -14086 -1843 -9908
440 -9908 -25829 -32670 -24730 -12312 -5361 -12106 -25710 -28985 -13036 6528 6161 -16081 -30519 -13882
454 -13882 17559 26095 1093 -23165 -13683 18409 34252 17220 -7329 -8036 13502 29523 23420
467 23420 6967 -624 6697 18246 22161 13737 333 -5094 5065 19670 19495 -1190 -19569
480 -19569 -12982 12434 23479 2837 -25273 -25979 90 18514 6369 -18184 -24425 -7186 10344
493 10344 7855 -7458 -15438 -7630 5942 11792 6079 -4064 -8040 1663 17590 22814 9133 -8559
507 -8559 -6270 17134 33475 21751 -5049 -13079 8212 29854 23945 -1887 -14885 -1699 16717
520 16717 15178 -3756 -17372 -12197 677 4092 -6326 -19579 -24612 -17205 -6436 -4161 -15265
533a5265j5689k167J5671J6457m441k0784j0705J4096K3513L520j7790j3369R395
546a7558K1690Q321j1846j2888M542J7392J1557m763j2261m718R691J5039O568
559C0766r336j4970k637J4688J5446k241j8858j3322Q584J9132L095j7551j6821
572d025L019J6272O093j3032j6655j422J1375Q596n462j4123q735M783J1331N283
586C298p353j3689o707R360J5585K760j4285j4139M194J8421R828j1400j6086
599b0213N82J7239J2153p465j6164l404J4199J3913j913j3352q454N205J3422
612E748O590n614j1933n985P505J3081M128j0555j3159N64J4704J0006p541j5445
626g906l342J3398J2882m088j5785p137J0906J4506J031j2479j0427K949J1822
$$ plain form
533 -15265 -30954 -33121 -17450 -993 -5434 -26218 -36923 -22827 686 4206 -13584 -26953 -17558
546 -17558 4132 12453 607 -12281 -7739 9653 21210 16447 4186 -532 9159 24198 30766
559 30766 21430 6460 3823 18511 33957 31716 12858 -464 8120 27252 30347 12796 -4025
572 -4025 -1006 15266 21359 8327 -8328 -9750 1625 10221 4759 -9364 -18099 -13316 -1985 3298
586 3298 -4055 -17744 -24451 -15091 494 3254 -11031 -25170 -20976 -2555 7273 -4127 -20213
599 -20213 -19631 -2392 9761 2296 -13868 -17272 -3073 10840 8927 -4425 -12879 -7674 5748
612 5748 12338 6724 -5209 -11194 -3689 9392 13520 2965 -10194 -9630 5074 15080 7539 -7906
626 -7906 -11248 2150 15032 10944 -4841 -11978 -1072 13434 14465 1986 -8441 -5492 6330
639F330Q259m030j1225o185N215J1097N142p302j2488j696J0926J0207l607j4510
653c867o511R655J3765j127j4751j0649O234J5114M606j0778j3424m99J1754R596
667I118k790j1175p053M643J0889M774o642r865j159R566R002k460j1289n940
681a0381O936J2540J799j1166j0661L432J2646O368p024j2403m039Q877R662m4
695F542r677q990R93R371O075m373j1090m093P360R968J80j1578q585N855J3573
710A531M592r292j1827J838J3704R482m770j1304l029Q876J1428J731p368o357
724g65K566Q897O344k773p488k760N400Q725J305q065q566J713J0050N813p368
739A3028j2551l883Q741R498l029j2688q662L939R442K292r145j0090q73P369
$$ plain form
639 6330 14589 10559 -666 -6851 -1636 9461 14603 7301 -5187 -6883 4043 14250 10643 -3867
653 -3867 -10378 -723 13042 11915 -2836 -13485 -7251 7863 12469 1691 -11733 -12232 -478 9118
667 9118 6328 -4847 -11900 -7257 3632 8406 1764 -8101 -9260 306 9308 6848 -4441 -10381
681 -10381 -3445 9095 10894 -272 -10933 -7501 5145 11513 4489 -7914 -11953 -3076 6586 6542
695 6542 -3135 -12125 -11132 -1761 4314 -59 -11149 -15242 -7882 2086 2266 -9312 -17897 -12042 1531
710 1531 6123 -3169 -14996 -13158 546 10028 5258 -6046 -9075 -199 11229 12960 5592 -765
724 -765 1801 10698 17042 14269 6781 4021 9421 18146 19451 11386 2820 4533 14583 20396 13028
739 13028 477 -3406 5335 14833 11804 -884 -9546 -5607 3835 6127 -3018 -13108 -13981 -6612
753f612N833l915r219m480M457Q567J443p341p865J730R874P447m423r607k871
768a6982Q795J1287J226q254p004M388J0454N399m154p015r32P561P513o94p686
783C902m553M155Q316L073o054q763q56Q084P063k879j0649o043M807R254J661
798A0518q399q940J0Q109N206m124q539l166N541P303l66p375n754K450Q709M497
814E680n163q119j676Q104Q332o73q392n614L987R636L915o197p883N5P808N722
830I522k573p222l593M667O096J163o375n950Q62O149M306l258q347l942M470
845d025P756R69p395p929O67Q435N381m504r021k588O844P332j107p783m865M502
861g331Q202K296n925o594J637P859N616k452o994k720N109P470K155n665n500
$$ plain form
753 -6612 -779 -4694 -13913 -18393 -13936 -5369 -3926 -11267 -19132 -17402 -7528 -81 -4504 -14111 -16982
768 -16982 -8187 3100 4326 -3928 -10932 -6544 3910 9309 5155 -1860 -2792 4769 12282 11588 3902
783 3902 -651 3504 11820 14893 8839 76 -780 7304 14367 11488 839 -5204 -397 8857 10518
798 10518 2119 -6821 -6811 1298 6504 2380 -6159 -9325 -3784 3519 3153 -4222 -9976 -7526 1183 5680
814 5680 517 -7602 -9278 -1174 7158 6485 -1907 -7521 -3534 6102 10017 3820 -4063 -4008 3800 9522
830 9522 6949 -273 -3866 801 6897 8060 1685 -4265 -3403 2746 7052 3794 -4553 -8495 -4025
845 -4025 3731 4700 -2695 -10624 -9957 -1522 3859 -645 -9666 -12254 -5410 1922 815 -6968 -11833 -7331
861 -7331 871 3167 -2758 -9352 -7715 144 5760 3308 -3686 -6406 -1297 6173 8328 2663 -2837
876b837J115O788N284k327o132k888M443O242N92n912n264J295O630M030m383
891F676p780j774N205O381j126p709n781K788P674K097n150q040j004O278N523
906D258k296p328l941L976O483R38n659n271J459O256M137l218o357j859M960
921c462N993R99n568m954J714O789L990k985n933j934M873N953K41n729m309K226
937b096O171K345m055o048j40N582M761k078o472l575L300O107K230n780n473
952e221K28N277M715k298n893k788L576N850O41n087m586J388O248L354k831o023
968c450j075N433N505n73o269l586L194O099K834m612n121n21M509M699j138n370
984E58l061K576M901J101l946m870j59M307L816k295n817k694K795N398P05n272
$$ plain form
876 -2837 -1722 5066 10350 8023 1891 -997 3446 9688 10280 4368 -896 399 7029 11059 6676
891 6676 -1104 -2878 2327 8708 7582 -127 -5908 -3120 4554 6651 1501 -6539 -7543 -1265 4258
906 4258 1962 -5366 -9307 -5331 1152 2090 -3569 -8840 -7381 -1125 3012 -206 -6563 -8422 -3462
921 -3462 2531 3530 -2038 -6992 -5278 1511 5501 2516 -3417 -5351 -478 5475 5716 -13 -4322 -2096
937 -2096 4075 6420 2365 -3683 -3823 1759 6520 4442 -2030 -5605 -2305 3802 6032 252 -5221
952 -5221 -4993 284 4999 2701 -3192 -5980 -2404 3446 4087 -1000 -5586 -4198 2050 5404 2573 -3450
968 -3450 -4525 908 6413 5840 -429 -4015 -821 5278 8112 3500 -1621 -2142 2367 7066 5928 558
984 558 -2503 73 4974 6075 2129 -2741 -2900 1407 5223 2928 -2889 -5583 -2788 2610 3315 -1957
1000a957n203N02N673L622l055o171k176M817N003l35n252l949K659N442K268
1015A888l751m488O95N012L800j544m545k010L787M966J062l495l950Q26M424
1030B677L425r46m488j870K671M221J300l922l909L45M513L357k497n124j708
1045a955L261M669j92n298l858J363N380K227m398n070p97M316L749j508m724
1060b835k905K267M649L52l397l494K85M044K519j737l964j732L056L941O89l389
1076a651l357Q26M598L278k047m415j456L418M542K36l720l164J386M519K178
1091E171k443l704o11L566L198o83m431k545K423M039J154l407m017m54M007K904
1107D167j567m443k354K649L682M89l642l479K18L739K189j954m114j000L283
$$ plain form
1000 -1957 -7160 -6658 -985 2637 -418 -6589 -8765 -3948 1055 720 -4532 -8481 -5822 -380 1888
1015 1888 -1863 -6351 -5656 -644 3156 1612 -2933 -4943 -1156 3810 4872 1377 -2573 -1747 2677
1030 2677 6102 5156 668 -1202 1469 5690 6990 3068 -841 -496 4017 7374 4877 -247 -1955
1045 -1955 1306 5975 5783 485 -3373 -2010 3370 5597 1199 -3871 -4668 -352 3397 1889 -2835
1060 -2835 -5740 -3473 1176 1528 -1869 -5363 -5078 -1034 1485 -252 -4216 -5948 -2892 1049 1738 -1651
1076 -1651 -5008 -4182 416 3694 1647 -2768 -4224 -806 3736 3972 252 -2912 -1526 2993 5171
1091 5171 2728 -976 -1587 1979 5177 4494 63 -2482 -59 3980 5134 1727 -2290 -2744 1263 4167
1107 4167 2600 -1843 -4197 -1548 2134 2623 -1019 -4498 -4280 -541 1648 -306 -4420 -5420 -2137
1122b137L339k74l686k728J882M305J978l008l467r4L591L327k06l412j833J757
1138f66M064J623k937k464j97L426K780r41l401k118K386L565O61l490l466M11
1154g64L819K196k053m544j799K867L580m81m312l053R28L620J524l154l648k58
1170e532K901K155j043l271j726J959L151Q48k188k400J72L051K925q84k553j932
1186d367K096M006J614k383k730J74L989K786j399l065j168L011L287J78l763
1201B266k396J523L333J512k873l424k52K763K584j189l421k355J179K858O66
1216B774k460l269n88K646J706j123k849j848J490K904J43k288k703O22K939J693
1232b11r00l058j122K741L028N58k024k503J074L425J964j243k843m31K677L036
$$ plain form
1122 -2137 1202 928 -2758 -5486 -3604 701 2679 -329 -3796 -3890 -299 3028 2822 -590 -2423 -666
1138 -666 3398 5021 2084 -380 -577 2849 5629 4688 1287 -831 1555 5120 5781 2291 -1175 -764
1154 -764 3055 5251 3198 -1346 -3145 -278 3302 2821 -1491 -4544 -3616 4 1528 -1626 -5274 -5532
1170 -5532 -2631 -476 -1519 -4790 -6516 -4557 -1406 -558 -2746 -5146 -4974 -1923 1002 118 -2435 -4367
1186 -4367 -2271 1735 3349 966 -1764 -1590 2399 5185 3786 721 -447 2564 5851 6029 2266
1201 2266 -130 1393 4726 6238 3365 -59 -311 2452 5036 3847 426 -1929 -750 2108 2774
1216 2774 314 -2955 -3543 -897 809 -314 -3163 -5011 -3521 -617 -474 -2762 -5465 -4843 -1904 -211
1232 -211 -1111 -4169 -5291 -2550 478 1036 -988 -3491 -2417 1008 2972 1729 -1114 -1545 1132 4168
1248D168M9k972k023J819L274P87k155l058N45K525K038j329k761j869J654K623
1264C315M77k685k576k69K404J560j409k877j626J770K262J26k894k319Q68L011
1280h62J011j976k484l59K504K054l0k537j589J141L015P91j035k047k42K335
1296c10K485j38k206j460J757K651J307k338k089M14K810K095j587k885r74K444
1312A976K527k89k697k035O70K719Q89k240k560q9J601J272l61k524j341M32K144
1329I4L56j504k231k77J836J946j58k915j563J396K761M13j323k235J77K219J975
1346I67k35k533q05J732K273P33j891j840J012K671J645j771k089m62J983K184
1362C574k70k264j678J392J829N09j634k123J25J525R15n40j827r15M34J709L23
$$ plain form
1248 4168 4217 1245 -778 1041 4315 5102 2947 -111 434 2959 4997 3668 907 -962 692 3315
1264 3315 3792 1107 -1469 -1738 666 2226 817 -2060 -3686 -1916 346 472 -2422 -4741 -3873 -862
1280 -862 149 -1827 -4311 -4670 -2166 -112 -142 -2679 -4268 -3127 -112 679 -356 -2403 -2645 -310
1296 -310 2175 2037 -169 -1629 128 2779 4086 1748 -341 73 2883 4978 3391 506 -468 1976
1312 1976 4503 4214 1517 -518 152 2871 3760 1520 -1040 -1129 472 1744 1383 -1141 -2482 -2050 94
1329 94 450 -1054 -3285 -3562 -1726 220 62 -2853 -4416 -3020 -259 154 -1169 -3404 -3227 -1008 967
1346 967 732 -1801 -2606 -874 1399 2132 241 -1599 -587 2084 3729 1958 -131 -593 1390 3574
1362 3574 3304 1040 -638 754 2583 3092 1458 -665 -540 985 1900 1360 -467 -1382 -948 761 1084
1379A084j572j853k83J441J691l67k560j217J420K461L75j918k173O26K264J862
1395A281j335k037l95J945K190k65j914o98Q07K322O59j262j579l0K125J513o22
1412B705j915j134Q17K139P89j521j751m64J551J673j115k210r28J340J523l31
1428A168j717j605M12J518J127j434j695k20J027J227K71j752j493L94K452P86
1444D66j074j817m19J698K152l01j638r73P69K174J74r40j475K40J821J653r54
1461A556j664n89J153J897M7j536j595N64J871Q20j157j623m89J297J316j8j690
1478A60j608Q62J742j67p11j411k97J323J036l20j368j280P89J571Q41n41k076
1495a455m65J624J424p4j735j237J170J982L69j542j219M09J604Q41j128j625
$$ plain form
1379 1084 -488 -2341 -2624 -1183 508 141 -2419 -3636 -2216 245 620 -1298 -3471 -2845 -581 1281
1395 1281 -54 -2091 -2486 -541 1649 1384 -530 -1228 -421 1901 2560 1298 -281 -311 1814 3327 2705
1412 2705 790 -344 473 2612 3401 1880 129 -335 1216 2889 1774 -436 -1364 -24 1499 1168
1428 1168 -549 -2154 -1742 -224 903 -531 -2226 -2446 -1419 -192 79 -1673 -3166 -2772 -320 466
1444 466 -608 -2425 -2844 -1146 1006 705 -933 -1906 -1137 1037 1211 271 -1204 -964 857 2510 1556
1461 1556 -108 -697 456 2353 2400 864 -731 -167 1704 2524 1367 -256 -745 552 1868 1850 160
1478 160 -1448 -586 1156 989 278 -1133 -1430 -107 929 609 -759 -2039 -1250 321 1162 621 -1455
1495 -1455 -1920 -296 1128 1054 -681 -1918 -748 1234 1603 61 -1158 -749 855 1696 568 -1057
1511a057k0J406J309o47r34q68K56J315K52m27j291k65O62J184l47j112j174M40
1529a318J346N28r62j511l72J732J111n05r84j650J132K039M63j448j367N72J163
1546c1R29m83j212l72J270J242K6j007p68N76J536O48r07j078j21J094J085l26
1564B101j343m79K60J564pq92j222l81J258O85j20j690p30P55P66L90j182j176
1582a443j00J030J163r17j085o49Q86J023L5j377p56L68J401O27q20j279j08J227
1600g74J212k51q95q77M29J663M24n20j232j35J282J132l94j113p10Q44J444j18
1618A411j134p01P7J456M18o45j130m61J076J030m32p04n55n7J021M38o85q69
1636d46m73M52J336k04o23j079M37J083M17o95j093j96J202J021j38j606o96J010
$$ plain form
1511 -1057 -1077 329 1638 991 57 -811 -555 760 1012 585 -706 -971 -309 875 528 -584 -1758 -1318
1529 -1318 28 556 -406 -1917 -2289 -557 554 49 -935 -2585 -1453 586 1049 -399 -1766 -1194 -31
1546 -31 898 415 -797 -1169 101 1343 1369 362 -406 170 1706 2354 1447 369 248 1342 2427 2101
1564 2101 758 279 539 2103 2096 1204 -18 -399 859 1544 1424 -266 -996 -241 525 915 -267 -1443
1582 -1443 -1543 -513 650 -267 -1352 -2001 -1115 -92 -57 -1434 -2190 -1822 -421 206 -614 -1893 -2001 -774
1600 -774 438 187 -708 -1585 -1156 507 931 411 -821 -956 326 1458 1064 -49 -759 85 1529 1411
1618 1411 277 -424 -347 1109 1527 882 -248 -709 367 1397 965 261 -294 -351 670 1108 423 -446
1636 -446 -919 -467 869 665 42 -1037 -600 483 900 205 -888 -1084 118 1139 1001 -605 -1301 -291
1654b91J376n8j040p45k4J180O59o07r56k87N43J016N6r94p19N82P96J39l94r55
1674g23o5L76R85J22j268l26J25R10Q76r17j131l5P66Q96j34j289q31R67J022
1693C26K39q84j012J44Q10R68k59j459m27Q09J450n43r33o50K56J398K89n92r22
1712i92J35O09J117l47o09l65N07Q47O0Q0q61Q3Q58P66K12j053m58N15J059k80
1732A883Rj123J42O35K86m7q73o15L42M82K45j131r57j32P22M49q34r43p00P06
1752a454M28np55r44R3Q59O63n34q31k54Q15O87K46p46k76M39J284K60m91n2M1
1773e27Q62J189j69q40k56J536P60n50k37m40J53O85P26o12q22l68N90M36p2p58
1793A286j265K72L47O36q75q21o01L97N81k86j151l48J97R72K72q86r04OJ303
$$ plain form
1654 -291 1085 1027 -13 -758 -782 398 1057 450 -506 -793 -250 766 822 -172 -891 -309 487 626 232 -723
1674 -723 -788 -412 573 695 -573 -899 -774 136 1012 95 -1036 -1071 -305 591 457 -832 -1663 -696 326
1693 326 565 -319 -1331 -1187 -377 591 332 -1127 -1554 -745 705 162 -771 -1421 -1165 233 522 -70 -992
1712 -992 -857 -248 869 522 -87 -452 55 902 962 1042 181 264 1122 1888 2100 1047 589 1104 2163 1883
1732 1883 1892 769 911 1546 1832 1785 912 297 639 1121 1366 235 -722 -854 -132 317 -517 -1460 -2160 -1454
1752 -1454 -1026 -1031 -1786 -2730 -2637 -1778 -1115 -1649 -2480 -2734 -1919 -1232 -986 -1732 -2008 -1569 -285 -25 -516 -568 -527
1773 -527 335 1524 1355 515 259 1795 2555 2005 1768 1328 1481 2166 2892 2280 1458 1090 1680 2116 2044 1286
1793 1286 21 293 640 1276 401 -420 -1021 -624 -43 -329 -1480 -1828 -1631 -659 -387 -1273 -2177 -2171 -868
1812h68M37l66o72k91R30P73nk85l32N42P27N25l24l14k76O05J064j43p41k30
1832G56J11R16N6k53j200l83N79M84m5r31o58j07Q73J81r02j164M27J80P16l04
1852f68j183k73Q58M76q3q00k96K56O75P58l92m19N0O45M75K93l50k76N66O50
1872I62M26l39k42J00J71R87k51m26o51N09N37M92q17o48m77O29P16j94p84n37
1892A63J07L23J59o44r05M9R27n4m40q10l46N41P48j66l65p16L77M73O2n5o13
1913a185J53K39O29O4l89n01K02N81M54p59j30%N90L66l55l37q1J52O58O4q81
1934d66L04m73Q00J91J07p73k75M73M00M08p17o8j93P70L64l92l33k75M43R43
1954A238k46n78o84O15N65O38r46m27K26J34L67m5n31l16M40Q2K00l55o10R6K12
$$ plain form
1812 -868 -431 -797 -1469 -1760 -830 -57 -62 -347 -679 -137 590 1115 791 477 201 806 1870 1727 986 756
1832 756 867 1783 1839 1586 386 3 582 1066 1021 90 -568 -675 198 379 -523 -1687 -1260 -1080 -364 -668
1852 -668 -1851 -2124 -1266 -790 -873 -1673 -1969 -1713 -1038 -280 -672 -1091 -1041 -396 79 372 22 -254 312 962
1872 962 1388 1049 807 907 1078 2065 1814 1388 737 1246 1783 2275 1458 810 333 962 1678 1484 700 163
1892 163 270 593 752 108 -797 -748 179 125 -315 -1125 -1471 -930 -182 -348 -713 -1429 -1052 -579 -517 -572 -1185
1913 -1185 -1032 -793 -164 -100 -489 -990 -788 -207 247 -512 -642 -642 -52 314 -41 -378 -459 -307 351 415 -466
1934 -466 -162 -635 165 356 463 -310 -585 -112 288 696 -21 -89 -282 488 852 460 127 -148 295 1238
1954 1238 992 414 -270 345 910 1548 602 175 401 535 902 857 326 10 450 532 732 377 -233 -137 75
1975G5K25l70j12n09K14L63J21m18m55R7N89m1L0p07N8K85O03P1o37n8k78Q23
1997c1J09k46o51n6P54N81n4p68j65J50P01n6m05j28j05O95J51k56n03k15M89
2018iJ95L25q67n2L05L36J31l46k45l17K29M40K25k55l25n6M60O88m40p12J42
2039a48L46P11j36o43l2J91O19n6j81m31j1K63K82l4o12J08j0K50J33m3o53K99
2061B12q1P03o61n46L2N3O42j92q90OJ08L59J90k81o84Q6J93L32K95j103L53J44
2083g30K89j58L84o39M4L56J35J53k06m16O3R43J52l43m33K85L92N95k29m67J15
2104B85J45P07o7q80n5N49J92K41m76k21M5J12l63M07k33k61J31R7q6J05m92O4
2126e4L67J71l18m58m41N50L26j33m00k64q5N29M15m56j78j78L15L21l4r6j63
$$ plain form
1975 75 300 -70 -182 -691 -477 -114 7 -411 -866 -769 -180 -221 -191 -898 -840 -555 48 119 -518 -576 -854 -31
1997 -31 78 -168 -819 -875 -121 460 406 -362 -527 -377 324 268 -137 -265 -370 325 476 220 -283 -498 -9
2018 -9 186 511 -356 -408 -103 233 364 18 -227 -544 -315 125 350 95 -230 -286 174 862 422 -290 -148
2039 -148 198 909 773 130 98 289 908 852 671 240 229 492 774 740 128 236 226 476 609 566 -87 212
2061 212 131 834 173 -373 -341 -288 354 162 -728 -722 -614 -255 -65 -346 -1030 -944 -751 -419 -124 -1227 -874 -730
2083 -730 -441 -599 -215 -854 -810 -454 -319 -166 -372 -788 -725 218 370 27 -406 -121 271 866 637 170 285
2104 285 430 1137 1070 190 135 684 876 1117 641 420 465 577 214 621 388 127 258 355 269 374 -118 -54
2126 -54 313 484 166 -292 -733 -183 143 10 -390 -654 -739 -210 205 -251 -429 -607 -292 29 -5 -101 -264
2147b64k27O78J03j04n08k60K87O51r3q42K72L88J64J12n06n80M32J87r6km18
2168f26j12N69j61K5m9k95K23j52K45Nk24m57j51R16j4j54j88K44L30M15j64q33
2190f08K79Q66J3p1o6K7J23L67M45m77k18k5j50O13l6k07l30K99K27J49l14q97
2212IL99k96J46N9o78k20J43M20m47j19n32Q2K88n6O1l97j85N1L34m9k64R4j20
2235a277N52L45r3k63j9K40O71r5l41K16K25N56k24M6l62J24M90K95l7m95J86
2256G40k5r5L12k21l56k76K35M67k64m45l90K66L32l86k61l66M38J64l21j69k17
2277h38Q8M29k38Q5l54N33M0j89M56M6j9k18L04L13K12j26n26M03M03J84l74m68
2299A46J63O89j26p1m68K4K35P8l22m35J57J23m41j33p4M3j77k35J69j27K38m40
$$ plain form
2147 -264 -491 187 290 186 -322 -582 -295 356 263 -579 -307 81 245 357 -149 -729 -297 -110 -206 -208 -626
2168 -626 -738 -169 -330 -305 -354 -649 -426 -578 -333 -328 -552 -1009 -1160 -244 -258 -412 -600 -356 -26 389 225 -608
2190 -608 -329 537 550 479 413 440 563 930 1375 898 680 655 505 1118 1082 875 545 844 1071 1220 906 9
2212 9 408 112 258 317 -361 -581 -438 -18 -465 -584 -1116 -1034 -746 -802 -741 -1138 -1323 -1272 -938 -987 -1251 -1157 -1277
2235 -1277 -725 -380 -473 -736 -755 -515 156 61 -280 -64 161 717 493 539 177 301 791 1086 1049 554 740
2256 740 715 620 932 711 355 79 314 781 517 72 -318 -52 280 -106 -367 -733 -295 -131 -452 -621 -838
2277 -838 -750 -321 -559 -474 -828 -295 -255 -444 12 58 39 -179 125 438 650 524 -2 401 804 988 614 146
2299 146 309 998 872 801 333 357 592 670 348 -87 70 193 -248 -381 -455 -412 -589 -824 -655 -782 -544 -984
2321i84k08L29R9l7j53J16p0L60j38j17J2L32L37j77j48L62L27l3J41k32J44j74
2343H8r6M56K55J93n32qM12J90P3j020k4O09J50m20l5j96K64r9J53k65k6p4L40
2366C88o05j68M10L2jl78K61K68j81o64M79M27M9n14k14M17M43k33m78j62K97
2387a27L91k35l55j35O75k86M84q68K98k02j37M20k08K86j20l88oJ31L46l14k79
2408f29j68Q28j52m27J4J80M99j78k05J14P1N16l48n22M86J02L37o6M3j85K75
2429E85l71J28M5N18k19l99l47M46J70k93k09K33k5K26j03q10L99J53j63j76n3
2450b65j64K63j55q6j0K32l12J07J81l04J72k03J14K96J69k2n05O9L14M51j83
2471A59j6K42j08K72k26k10K91O7j7k0l99J65Lj95J75j8M0k64l19L87j08J70j16
$$ plain form
2321 -984 -1192 -863 -764 -801 -954 -838 -908 -548 -686 -803 -791 -459 -122 -299 -447 -85 242 209 350 118 262 88
2343 88 -8 448 703 896 364 356 768 958 1031 11 -13 596 746 326 291 95 359 260 413 148 122 48 388
2366 388 -217 -385 25 57 56 -322 -61 207 26 -638 -159 268 317 -197 -411 6 449 216 -262 -424 -127
2387 -127 264 29 -326 -461 214 -72 412 -456 -158 -360 -497 -77 -285 1 -119 -507 -513 -382 -36 -350 -629
2408 -629 -797 31 -121 -548 -534 -354 145 -33 -238 -124 -53 463 115 -407 79 181 518 452 495 310 585
2429 585 214 342 387 905 686 287 -60 386 556 263 54 287 262 488 385 -425 -26 127 -36 -212 -265
2450 -265 -429 -166 -321 -407 -417 -185 -497 -390 -209 -513 -341 -544 -430 -134 35 13 -492 -423 -109 342 159
2471 159 143 385 277 549 323 113 404 471 454 434 35 200 203 8 183 165 205 -59 -378 9 -99 71 -45
2494d5o23K71K69r3k12k77L73K60M6n22k46L26J74Q7J76m5K23R9l00K05k4M19
2516E41l59J91l1P76q99R3J02L52L2l55j8k83M60N8l06n89N09k78J2J81l13K73
2538A49l60J51k55j12K36k85k79K25L51o0p88K25L43M27m38j43l54O46J54rm28
2559f04J47M15K12l21k75M20j07J53j89J12N27k53Lj77J85J48j28k87L86J98l20
2580B45j26k1J42j86J50o7j96N84k09j6n8l49J95j91J04k39K70j77j05J60Kl4
2602a22J40n53L24N39k92m03K07K01Q4J63n12J80K34O8oj89J86J77j21k81J45
2623A69NK41m24j66J80J86j02n11K21o7M67m89j60NN69j71k86J5j20L33J24k14
2645a95jp3K43J3l54M11k4k70K6KK09kj42k52L64K39K39n20J43K58N8l72K70r5
$$ plain form
2494 -45 -668 -397 -128 -221 -433 -710 -337 -77 -31 -553 -799 -473 -299 -212 -36 -81 142 241 -59 146 122 541
2516 541 182 373 342 1118 219 312 414 766 798 443 425 142 602 660 354 -235 274 -4 8 189 -124 149
2538 149 -211 -60 -315 -427 -191 -476 -755 -530 -179 -239 -1027 -802 -459 -32 -470 -613 -967 -321 -167 -176 -604
2559 -604 -457 -42 170 -151 -426 -6 -113 40 -149 -37 490 237 240 63 248 396 268 -19 367 565 245
2580 245 119 98 240 54 204 137 -59 525 316 300 242 -107 88 -103 1 -238 32 -145 -250 -90 -88 -122
2602 -122 18 -535 -211 328 36 -367 -160 41 125 288 -224 -44 190 258 252 63 249 426 305 24 169
2623 169 174 415 -9 -175 5 191 89 -422 -201 -268 199 -290 -450 -445 124 -47 -333 -318 -438 -105 19 -195
2645 -195 -196 -269 -26 -13 -367 44 20 -250 -224 -222 -13 -15 -157 -409 -45 194 433 -87 56 314 372 0 270 175
2669A75K35J64k17k73j9K91p3J41n8j51N6L4m05L11J37j31n82J9L57N1k23j00
2691b61K87L6J30n86J16L45k88L0n08K81K89J09n7k43J71j12J45k56L29K07j0
2712A54n9l27L90o0M3k15p9N12o5l07m64L23O85j76k09l97L59j0M8J51l84L77
2734B90Q7l77K71n7kk31j09R4k1Q1l96J16K71P0p9m17Q1L48K75m95K98N5J4P7
2758B44m02J39K25J84j74j41q2N05j86m27K76j74K15j18J06r7L7J44m67j62O36
2779B81J29l94p5Qk88N37n69j16J56L7r0J59m25N56j68n9j0K30r7M7N0j46J65
2802h2L58m34l33N53j50K1j8j18L74l3k03R1k82M56o0o1k36K53R7l82L68M0k2
$$ plain form
2669 175 410 574 357 84 65 356 283 424 366 215 271 305 -100 211 348 217 -365 -346 11 62 -161 -261
2691 -261 26 62 192 -394 -278 67 -221 -191 -699 -418 -129 -20 -77 -320 -149 -261 -116 -372 -43 164 154
2712 154 95 -232 158 98 141 -74 -153 359 294 -13 -477 -154 531 355 146 -251 108 98 146 297 -87 290
2734 290 377 0 271 214 212 -19 -128 -34 -55 26 -370 -254 17 87 8 -409 -328 20 295 -200 98 153 167 244
2758 244 -158 -19 206 390 216 75 -7 498 312 -115 161 -13 202 84 190 93 130 274 -193 -355 281
2779 281 410 16 -59 -51 -339 198 -371 -487 -331 -294 -384 -225 -650 -94 -262 -321 -331 -101 -198 -151 -101 -247 -82
2802 -82 276 -158 -491 62 -88 -67 -85 -203 171 138 -65 26 -256 200 140 79 -157 96 193 -189 179 219 197
$$ [...]
8191a08
##END NTUPLES=NMR FID
##END=
