##TITLE=1H_CA-8570-6
 DMSO, 8 sc, 
 12.3.2019
##JCAMPDX= 6.0         $$ Bruker NMR JCAMP-DX V2.0
##DATA TYPE= NMR FID
##DATA CLASS= NTUPLES
##ORIGIN= UXNMR, Bruker Analytische Messtechnik GmbH
##OWNER= root
$$ XWIN-NMR		Version 3.5
$$ Tue Mar 12 17:07:24 2019 Russian Standard Time (UT+4h)  she@DPX200
##.OBSERVE FREQUENCY= 200.1316
##.OBSERVE NUCLEUS= ^1H
##.DELAY= (6, 6)
##.ACQUISITION MODE= SIMULTANEOUS
##.ACQUISITION SCHEME= undefined
##.AVERAGES= 8
##.DIGITISER RES= 18
##SPECTROMETER/DATA SYSTEM= spect
##.PULSE SEQUENCE= zg30
##.SOLVENT NAME= CDCl3
##.SHIFT REFERENCE= (INTERNAL, CDCl3, 0, 15.7039)
##AUDIT TRAIL= $$ (NUMBER, WHEN, WHO, WHERE, WHAT)
$$ ##TITLE= Audit trail, XWIN-NMR		Version 3.5
$$ ##JCAMPDX= 5.01
$$ ##ORIGIN= Bruker BioSpin GmbH
$$ ##OWNER= she
$$ F:/spectra/data/she/nmr/H-F/1/audita.txt
$$ ##AUDIT TRAIL=  $$ (NUMBER, WHEN, WHO, WHERE, WHAT)
(   1,<2019-03-12 17:06:19.26 +0400>,<she>,<DPX200>,
      <created by zg, POWCHK disabled, PULCHK disabled
       configuration hash MD5:
       00 E9 B6 7A A2 85 ED C7 34 08 36 98 17 FE 4E 26
       data hash MD5: 16K
       9C 58 2A BC 69 9D 7D 09 CE 57 F8 C7 2E B1 AE 89>)
$$ ##END=
$$ 
$$ hash MD5
$$ D8 C4 57 A5 90 96 FA BC 96 E8 82 A3 7A 7F 72 AB
##$RELAX= 
##$RELAX= 
##$RELAX= 
##$RELAX= 
##$RELAX= 
##$RELAX= 
$$ Bruker specific parameters
$$ --------------------------
##$DU= <F:/spectra>
##$EXPNO= 1
##$NAME= <H-F>
##$PROCNO= 1
##$TYPE= <nmr>
##$USER= <she>
##$AMP= (0..31)
100 100 100 100 100 100 100 100 100 100 100 100 100 100 100 100 100 100 
100 100 100 100 100 100 100 100 100 100 100 100 100 100 
##$AQSEQ= 0
##$AQ_mod= 1
##$AUNM= <au_zg>
##$AUTOPOS= <>
##$BF1= 200.13
##$BF2= 200.13
##$BF3= 200.13
##$BF4= 200.13
##$BF5= 200.13
##$BF6= 200.13
##$BF7= 200.13
##$BF8= 200.13
##$BYTORDA= 1
##$CFDGTYP= 0
##$CFRGTYP= 5
##$CHEMSTR= <none>
##$CNST= (0..31)
1 1 145 1 1 1 1 1 1 1 1 1 1 1 1 1 1 1 1 1 1 1 1 1 1 1 1 1 1 1 1 1 
##$CPDPRG= <>
##$CPDPRG1= <>
##$CPDPRG2= <>
##$CPDPRG3= <>
##$CPDPRG4= <mlev>
##$CPDPRG5= <mlev>
##$CPDPRG6= <mlev>
##$CPDPRG7= <mlev>
##$CPDPRG8= <mlev>
##$CPDPRGB= <>
##$CPDPRGT= <>
##$D= (0..31)
0 1.2 0 0 0 0 0 0 0 0 0 0.03 0 0 0 0 0 0 0 0 0 0 0 0 0 0 0 0 0 0 0 0 
##$DATE= 1552395978
##$DBL= (0..7)
120 120 120 120 120 120 120 120 
##$DBP= (0..7)
150 150 150 150 150 150 150 150 
##$DBP07= 0
##$DBPNAM0= <>
##$DBPNAM1= <>
##$DBPNAM2= <>
##$DBPNAM3= <>
##$DBPNAM4= <>
##$DBPNAM5= <>
##$DBPNAM6= <>
##$DBPNAM7= <>
##$DBPOAL= (0..7)
0.5 0.5 0.5 0.5 0.5 0.5 0.5 0.5 
##$DBPOFFS= (0..7)
0 0 0 0 0 0 0 0 
##$DE= 6
##$DECBNUC= <off>
##$DECIM= 24
##$DECNUC= <off>
##$DECSTAT= 4
##$DIGMOD= 1
##$DIGTYP= 9
##$DL= (0..7)
0 120 120 120 120 120 120 120 
##$DP= (0..7)
150 150 150 150 150 150 150 150 
##$DP07= 0
##$DPNAME0= <>
##$DPNAME1= <>
##$DPNAME2= <>
##$DPNAME3= <>
##$DPNAME4= <>
##$DPNAME5= <>
##$DPNAME6= <>
##$DPNAME7= <>
##$DPOAL= (0..7)
0.5 0.5 0.5 0.5 0.5 0.5 0.5 0.5 
##$DPOFFS= (0..7)
0 0 0 0 0 0 0 0 
##$DQDMODE= 0
##$DR= 18
##$DS= 0
##$DSLIST= <SSSSSSSSSSSSSSS>
##$DSPFIRM= 0
$$ [...]
##$SUBNAM2= <"">
##$SUBNAM3= <"">
##$SUBNAM4= <"">
##$SUBNAM5= <"">
##$SUBNAM6= <"">
##$SUBNAM7= <"">
##$SUBNAM8= <"">
##$SUBNAM9= <"">
##$SW= 24.9336934301222
##$SWIBOX= (0..15)
0 0 2 0 0 0 0 0 0 0 0 0 0 0 0 0 
##$SW_h= 4990.01996007984
##$TD= 16384
##$TD0= 1
##$TE= 0
##$TE2= 300
##$TE3= 300
##$TEG= 300
##$TL= (0..7)
0 120 120 120 120 120 120 120 
##$TP= (0..7)
150 150 150 150 150 150 150 150 
##$TP07= 0
##$TPNAME0= <>
##$TPNAME1= <>
##$TPNAME2= <>
##$TPNAME3= <>
##$TPNAME4= <>
##$TPNAME5= <>
##$TPNAME6= <>
##$TPNAME7= <>
##$TPOAL= (0..7)
0.5 0.5 0.5 0.5 0.5 0.5 0.5 0.5 
##$TPOFFS= (0..7)
0 0 0 0 0 0 0 0 
##$TUNHIN= 0
##$TUNHOUT= 0
##$TUNXOUT= 0
##$USERA1= <user>
##$USERA2= <user>
##$USERA3= <user>
##$USERA4= <user>
##$USERA5= <user>
##$V9= 5
##$VALIST= <valist>
##$VCLIST= <CCCCCCCCCCCCCCC>
##$VD= 0
##$VDLIST= <DDDDDDDDDDDDDDD>
##$VPLIST= <PPPPPPPPPPPPPPP>
##$VTLIST= <TTTTTTTTTTTTTTT>
##$WBST= 1024
##$WBSW= 4
##$XGAIN= (0..3)
0 0 0 0 
##$XL= 0
##$YL= 0
##$YMAX_a= 360196
##$YMIN_a= -459585
##$ZGOPTNS= <>
##$ZL1= 120
##$ZL2= 120
##$ZL3= 120
##$ZL4= 120
##$ABSF1= 10
##$ABSF2= 0
##$ABSG= 5
##$ABSL= 3
##$ALPHA= 0
##$AQORDER= 0
##$ASSFAC= 0
##$ASSFACI= 0
##$ASSFACX= 0
##$ASSWID= 0
##$AUNMP= <proc_1d>
##$AZFE= 0.1
##$AZFW= 0.1
##$BCFW= 1
##$BC_mod= 2
##$BYTORDP= 1
##$COROFFS= 0
##$CY= 11.3945322036743
##$DATMOD= 1
##$DC= 2
##$DFILT= <>
##$DTYPP= 0
##$F1P= 18.9103706918063
##$F2P= -1.10871071338519
##$FCOR= 0.5
##$FTSIZE= 0
##$FT_mod= 4
##$GAMMA= 1
##$GB= 0.15
##$INTBC= 1
##$INTSCL= 1
##$ISEN= 128
##$LB= 0.24
##$LEV0= 0
##$LPBIN= 0
##$MAXI= 10000
##$MC2= 0
##$MEAN= 0
##$ME_mod= 0
##$MI= 1.114404
##$NCOEF= 0
##$NC_proc= 0
##$NLEV= 6
##$NOISF1= 3.799351
##$NOISF2= 2.8
##$NSP= 1
##$NTH_PI= 0
##$NZP= 0
##$OFFSET= 15.70392
##$PC= 1
##$PHC0= -8863.775
##$PHC1= 19.80025
##$PH_mod= 1
##$PKNL= yes
##$PPARMOD= 0
##$PSCAL= 0
##$PSIGN= 0
##$REVERSE= no
##$SF= 200.130013532006
##$SI= 16384
##$SIGF1= 3
##$SIGF2= 2
##$SINO= 400
##$SIOLD= 16384
##$SREGLST= <1H.CDCl3>
##$SSB= 0
##$STSI= 0
##$STSR= 0
##$SW_p= 3612.71676300578
##$SYMM= 0
##$S_DEV= 0
##$TDeff= 0
##$TDoff= 0
##$TI= <>
##$TILT= no
##$TM1= 0
##$TM2= 0
##$TOPLEV= 0
##$USERP1= <user>
##$USERP2= <user>
##$USERP3= <user>
##$USERP4= <user>
##$USERP5= <user>
##$WDW= 1
##$XDIM= 8192
##$YMAX_p= 0
##$YMIN_p= 0
$$ End of Bruker specific parameters
$$ ---------------------------------
##NTUPLES= NMR FID
##VAR_NAME=  TIME,          FID/REAL,        FID/IMAG
##SYMBOL=    X,             R,               I
##VAR_TYPE=  INDEPENDENT,   DEPENDENT,       DEPENDENT
##VAR_FORM=  AFFN,          ASDF,            ASDF
##VAR_DIM=   8192,          8192,            8192
##UNITS=     SECONDS,       ARBITRARY UNITS, ARBITRARY UNITS
##FACTOR=    0.0002004,     1,               1
##FIRST=     0,             0,               0
##LAST=      1.6414764,     0,               0
##MIN=       0,             -459585,         0
##MAX=       1.6414764,     360196,          0
$$ Real data points
##PAGE= N=1
##DATA TABLE= (X++(R..R)), XYDATA
$$ plain form
0 0 0 0 0 0 8 -8 8 -8 16 -16 24 -25 32 -40 50 -62 73 -88 104 -121 145 -169 194 -225 261 -296 337 -385
28 -385 439 -495 556 -627 703 -786 876 -979 1088 -1208 1339 -1485 1646 -1821 2016 -2232
44 -2232 2474 -2744 3047 -3395 3791 -4250 4793 -5443 6237 -7234 8533 -10298 12849 -16889
58 -16889 24289 -42293 178808 81277 -285589 43643 360196 271164 -58174 -72372 86789
69 86789 159573 102145 93851 38662 -49735 -19395 164471 174600 -45022 -154621 46188 195304
81 195304 42873 -137106 -30826 125996 39561 -114213 -33556 113542 38315 -126220 -75377
92 -75377 86034 69314 -69965 -72857 19613 10733 -42955 19606 74801 -45113 -148924 5617
104 5617 198472 78356 -188433 -152743 139381 221003 -13725 -171247 -39315 129229 112806
$$ packed form
0@%%%%Qj6J6j6K4l2M0m9N7p2R0j12J35j61J92k25K66l14L63m19M86n57O33p22
28c85Q24r34J051j183J330j489J662j855K067k296K547k824L131l467L837m248
44b232M706n218N791o442P186q041R043j0236J1680j3471J5767j8831K3147k9738
58a6889M1178o6582K21101r7531l66866L29232L16553q9032l29338j4198J59161
69H6789P2784n7428q294n5189q8397L0340J83866J0129k19622j09599K00809J49116
81A95304j52431j79979J06280J56822q6435j53774Q0657J47098p5227j64535N0843
92g5377J61411j6720j39279k892R2470q880n3688O2561N5195j19914j03811J54541
104E617J92855j20116k66789L5690K92124Q1622k34728j57522J31932J68544j6423
$$ plain form
115 112806 16872 -24673 -34434 -7572 98064 155871 21044 -136830 -40544 187022 175239
126 175239 -61762 -130136 63765 172315 38471 -65169 25519 93576 4259 -40709 68415
137 68415 114237 -20346 -100222 26021 134924 38912 -83939 -35463 59801 33175 -23611
148 -23611 8418 29209 -43908 -67608 43100 98446 -28037 -135153 -35289 101219 48130
159 48130 -85010 -77292 16225 18325 -30330 -5861 20797 -51970 -99729 7330 106618 4162
171 4162 -147528 -89803 84039 87489 -64643 -112653 -11821 41614 -10125 -30953 2901 -20583
183 -20583 -76146 -30484 67446 36476 -95038 -111380 16612 79311 -9399 -91042 -59611 -4395
195 -4395 337 -1387 -3312 -55632 -101419 -31127 74915 28772 -122623 -135858 19392 90120
$$ packed form
115A12806r5934m1545r761K6862J05636N7807j34827j57874R6286K27566j1783
126A75239k37001o8374J93901J08550j33844j03640R0688O8057q9317m4968J09124
137F8415M5822j34583p9876J26243J08903r6012j22851M8476R5264k6626n6786
148b3611L2029K0791p3117k3700J10708N5346j26483j07116R9864J36508n3089
159D8130j33140P718R3517K100m8655K4469K6658p2767m7759J07059R9288j02456
171D162j51690N7725J73842L450j52132m8010J00832N3435n1739k0828L3854k3484
183b0583n5563M5662R7930l0970j31514j6342J27992O2699q8710q1643L1431N5216
195d395M732j724j925n2320m5787P0292J06042m6143j51395j3235J55250P0728
$$ plain form
207 90120 -31872 -135821 -66369 32065 1647 -67733 -49958 -10668 -41008 -68715 -20324 17164
219 17164 -34975 -89540 -49470 10414 -6099 -49004 -42041 -25453 -44428 -39601 14140 17550 -66706
232 -66706 -102869 -6922 76840 8290 -103535 -81378 27510 53981 -13264 -53852 -35670 -16600
244 -16600 -226 33089 25801 -53186 -88853 5844 101899 37613 -97592 -91434 44343 97928
256 97928 3157 -80152 -42888 29887 38922 6105 -16401 -28545 -24485 12905 42221 6263
268 6263 -50667 -35688 28447 33318 -22403 -35283 8827 15186 -30466 -30087 28732 33097 -41964
281 -41964 -69869 7272 65766 9475 -69391 -51910 21427 40247 -1368 -33414 -34543 -19112
293 -19112 10667 34935 7921 -54224 -58790 17379 66544 10881 -66759 -52934 22944 50541
$$ packed form
207I0120j21992j03949O9452R8434l0418o9380J7775L9290l0340k7707M8391L7488
219A7164n2139n4565M0070N9884j6513m2905O963J6588j8975M827N3741L410q4256
232f6706l6163R5947Q3762o8550j11825K2157J08888K6471o7245m0588J8182J9070
244a6600J6374L3315p288p8987l5667R4697R6055o4286j35205O158J35777N3585
256I7928r4771q3309L7264P2775R035l2817k2506j2144M060L7390K9316l5958
268F263n6930J4979O4135M871n5721j2880M4110O359m5652L79N8819M365p5061
281d1964k7905P7141N8494n6291p8866J7481P3337J8820m1615l2046j129J5431
293a9112K9779K4268k7014o2145m566P6169M9165n5663p7640J3825P5878K7597
$$ plain form
305 50541 8222 -34082 -34196 -8709 21971 36740 7450 -44179 -44045 24254 64607 10915 -56394
318 -56394 -34737 36010 46109 -4829 -28288 -2169 13748 2760 4581 19771 6983 -23223
330 -23223 -15556 26660 37415 -434 -29358 -12150 19146 27579 14207 -6619 -23354 -13250
342 -13250 27062 46600 3644 -47829 -27656 40518 53857 -5189 -46483 -14899 30806 29084
354 29084 1169 -11306 -10810 -8648 9058 31858 17916 -28137 -37836 11885 50199 18645 -35594
367 -35594 -34955 11158 35411 15051 -14369 -23397 -11087 11848 26327 10913 -23889 -32733 3441
380 3441 33765 15610 -23367 -28816 -1624 16133 10788 -1427 -12850 -21616 -11004 18194 25887
393 25887 -9644 -43421 -22293 27015 32042 -12943 -42664 -20271 16720 20788 -3909 -24184
$$ packed form
305E0541m2319m2304j14K5487L0680J4769k9290n1629J34O8299M0353n3692o7309
318e6394K1657P0747J0099n0938k3459K6119J5917j0988J821J5190j2788l0206
330b3223P667M2216J0755l7849k8924J7208L1296Q433j3372k0826j6735J0104
342a3250M0312J9538m2956n1473K0173O8174J3339n9046m1294L1584M5705j722
354B9084k7915j2475M96K162J7706K2800j3942m6053r699M9721L8314l1554n4239
367c5594O39M6113K4253k0360k9420r028J2310K2935J4479j5414l4802q844L6174
380C441L0324j8155l8977n449K7192J7757n345j2215j1423q766J0612K9198P693
393B5887l5531l3777K1128M9308N027m4985k9721K2393L6991M068k4697k0275
$$ plain form
405 -24184 -23469 -6419 11839 12788 -8669 -29238 -21195 6570 17593 -19 -22128 -24152 -8042
418 -8042 9065 12701 -4028 -28377 -29717 2777 29103 8397 -35441 -39708 2326 31546 9054
431 9054 -29618 -33260 -4612 16574 10967 -8780 -23780 -21200 -518 18357 9744 -19667 -32258
444 -32258 -9435 19157 16365 -12092 -28904 -16436 7197 16980 3991 -19017 -27477 -7680 19502
457 19502 17376 -13882 -32808 -12928 17596 17366 -8263 -23461 -13368 2683 9007 5199 -5573
470 -5573 -17881 -16811 2708 19731 7535 -21693 -28724 -1132 25001 14369 -18011 -29547 -7734
483 -7734 19098 19912 -5577 -25544 -17012 10437 23761 6623 -19273 -21272 2507 21365 13783
496 13783 -7620 -17290 -6586 12244 19372 7957 -10510 -15573 2003 22794 20973 -3019 -18696
$$ packed form
405b4184P15J7050J8258R49k1457k0569Q043K7765J1023j7612k2109k024J6110
418h042J7107L636j6729k4349j340L2494K6326k0706m3838m267M2034K9220k2492
431I054l8672l642K8648K1186n607j9747j5000K580K0682J8875q613k9411j2591
444c2258K2823K8592k792k8457j6812J2468K3633R783j2989k3008q460J9797K7182
457A9502k126l1258j8926J9880L0524k30k5629j5198J0093J6051O324l808j0772
470e573j2308J070J9519J7023j2196k9228p031K7592K6133j0632l2380j1536K1813
483g734K6832Q14k5489j9967Q532K7449J3324j7138k5896j999K3779J8858p582
496A3783k1403r670J0704J8830P128j1415j8467n063J7576K0791j821k3992j5677
$$ plain form
509 -18696 -4682 21439 27365 6392 -13903 -9038 14013 27770 16477 -4713 -10611 4890 23269
522 23269 22989 6322 -7153 -2290 14313 25275 18289 1247 -8273 2697 23491 29382 10014
535 10014 -11599 -6721 20670 34419 16785 -8888 -9730 14514 31437 21922 298 -7379 5256
548 5256 22948 25837 12059 -3111 -2628 13517 27745 22068 3617 -5837 5420 24126 28491
561 28491 12940 -3419 -1625 16663 30790 22866 1763 -6384 9225 30065 29309 8499 -5872
574 -5872 4029 24331 29763 15766 -320 114 13870 25704 22527 8245 -2555 2312 18174
587 18174 26982 16472 -3030 -7007 9844 26351 20699 -1202 -11645 1440 20242 21347 3727
600 3727 -10739 -6167 10435 18597 9486 -5415 -10604 -559 13291 14389 1402 -11366 -9531
$$ packed form
509a8696J4014K6121N926k0973k0295M865K3051J3757j1293k1190n898J5501J8379
522B3269k80j6667j3475M863J6603J0962o986j7042r520J0970K0794N891j9368
535A0014k1613M878K7391J3749j7634k5673q42K4244J6923r515k1624p677J2635
548E256J7692K889j3778j5170M83J6145J4228n677j8451r454J1257J8706M365
561B8491j5551j6359J794J8288J4127p924k1103q147J5609K0840p56k0810j4371
574e872R901K0302N432j3997j6086M34J3756J1834l177j4282j0800M867J5862
587A8174Q808j0510j9502l977J6851J6507n652k1901j0443J3085J8802J105j7620
600C727j4466M572J6602Q162r111j4901n189J0045J3850J098j2987j2768J835
$$ plain form
613 -9531 5718 16952 9189 -8164 -14246 -866 16004 15771 -856 -14137 -6215 12809 20441
626 20441 7768 -9388 -9425 8266 22584 16146 -1956 -8138 4016 19827 20301 6682 -3597
639 -3597 405 13244 20838 15903 3826 -2546 4710 19065 22605 9438 -4603 -2095 14368 23171
653 23171 13379 -3012 -5545 6165 16333 13730 1703 -7743 -5494 5433 12544 5729 -9235
666 -9235 -15979 -5451 8361 7166 -9548 -22246 -15426 492 5479 -7343 -22862 -24294 -9859
679 -9859 2787 -3215 -21970 -30206 -17860 -875 -1521 -18642 -29948 -22188 -6687 -2507 -12670
692 -12670 -24020 -23222 -12588 -4130 -5163 -15203 -21372 -16520 -5408 -34 -6329 -16281 -18066 -8331
706 -8331 1255 1701 -7994 -15852 -11964 720 7086 232 -11839 -13226 -2213 8257 6324 -5455
$$ packed form
613i531J5249J1234p763j7353o082J3380J6870k33j6627j3281P922J9024P632
626B0441j2673j7156l7J7691J4318o438j8102o182J2154J5811M74j3619j0279
639c597M002J2839P594m935j2077o372P256J4355L540j3167j4041K508J6463Q803
653B3171r792j6391k533J1710J0168k603j2027r446K249J0927P111o815j4964
666i235o744J0528J3812j195j6714j2698O820J5918M987j2822j5519j432J4435
679i859J2646o002j8755q236J2346J6985o46j7121j1306P760J5501M180j0163
692a2670j1350P98J0634Q458j033j0040o169M852J1112N374o295r952j785R735
706h331R586M46r695p858L888J2684O366o854j2071j387J1013J0470j933j1779
$$ plain form
720 -5455 -12573 -7198 5126 10709 2586 -11370 -13706 232 12922 7849 -10379 -17226 -4417 10497
734 10497 8380 -7421 -16664 -9535 3245 6933 -2273 -14193 -15765 -4730 5340 1399 -12468
747 -12468 -18533 -9558 1811 989 -9082 -15533 -11769 -5552 -2051 -3158 -8797 -14701 -13525 -3747 2663
762 2663 -3832 -16131 -16484 -4752 3836 -568 -11569 -15124 -8316 703 3080 -3251 -12456 -13328 -2971
777 -2971 7398 3292 -10649 -15842 -5368 7694 6349 -6563 -13591 -7465 3253 7142 256 -10282
791 -10282 -12118 -2150 7728 5116 -7453 -13497 -5495 5835 5920 -3620 -10477 -8370 -68 4876 1718
806 1718 -6209 -10653 -5910 3361 6092 -2066 -10883 -8947 1327 6470 1681 -6663 -9378 -3534 4526
821 4526 7169 -379 -9320 -7174 4579 10697 3651 -7237 -6762 3236 9777 6380 -820 -4075 -355
$$ packed form
720e455p118N375J2324N583q123j3956k336J3938J2690n073j8228o847J2809J4914
734A0497k117j5801r243P129J2780L688r206j1920j572J1035J0070l941j3867
747a2468o065Q975J1369q22j0071o451L764O217L501j107n639n904J176R778O410
762B663o495j2299l53J1732Q588m404j1001l555O808R019K377o331r205q72J0357
777b971J0369m106j3941n193J0474J3062j345j2912p028O126J0718L889o886j0538
791a0282j836R968R878k612j2569o044Q002J1330Q5r540o857K107Q302M944l158
806A718p927m444M743R271K731q158q817J936J0274N143m789q344k715N844Q060
821D526K643p548q941K146J1753O118p046j0888M75R998O541l397p200l255L720
$$ plain form
836 -355 6186 10520 6801 -1815 -4407 4134 13614 10849 -432 -4273 2974 11047 11268 4275 -892
851 -892 -317 4874 11003 10803 1885 -5167 -216 11323 13362 2744 -6143 -2482 8519 11795 4543
866 4543 -3794 -4122 1525 8288 8565 329 -7431 -4488 6284 10225 1750 -8255 -6021 3795 8211
881 8211 2167 -4648 -5523 -927 3636 4454 285 -4798 -5209 610 6137 3854 -3474 -6050 -1257 4157
897 4157 4890 489 -3551 -4250 429 6523 6024 -1339 -6989 -2327 6952 8970 851 -6505 -3828 4833
913 4833 9364 4627 -3734 -5843 798 8728 8923 -1052 -7809 -1958 8441 9967 737 -6594 -3190
928 -3190 5074 7922 3702 -2620 -4028 194 5801 6520 781 -5305 -3118 4488 7188 2086 -3490
943 -3490 -2778 1534 4112 2994 897 -1571 -2643 357 5386 5221 -1918 -5769 -1476 6067 6066 -639
$$ packed form
836c55O541M334l719q616k592Q541R480k765j1281l841P247Q073K21o993n167
851h92N75N191O129k00q918p052M951J1539K039j0618q887L661J1001L276p252
866D543q337l28N647O763K77q236p760K943J0772L941q475j0005K234R816M416
881H211o044o815q75M596M563Q18m169n083m11N819N527k283p328k576M793N414
897D157P33m401m040o99M679O094m99p363n650M662R279K018q119p356K677Q661
913D833M531m737q361k109O641P930J95r975o757N851J0399J526r230p331L404
928c190Q264K848m220o322j408M222N607P19n739o086K187P606K700n102n576
943c490P12M312K578j118k097k468j072L000N029j65p139l851M293P543jo705
$$ plain form
959 -639 -5855 -3046 3128 5810 2722 -3120 -5422 -1467 5944 6602 -1356 -8017 -4060 5912 7640 -586
975 -586 -7125 -4565 3111 5726 1705 -4184 -5121 -692 4060 4481 -1109 -6135 -4022 2627 4964 580
991 580 -5095 -4821 94 3317 1988 -1729 -3949 -2984 889 3824 2048 -3665 -5411 -699 3721 3599
1007 3599 -1912 -4953 -2984 1786 4340 1257 -3603 -5065 -108 4927 3898 -2525 -6239 -2074 3838
1022 3838 4691 -453 -4773 -3442 1436 4312 2606 -2455 -5050 -1381 3938 4394 -994 -5516 -2807
1037 -2807 2860 4601 330 -3671 -3330 -86 3220 2805 -309 -4041 -3573 1843 5147 1551 -4471 -4175
1053 -4175 965 4852 2391 -2437 -3410 -1165 2841 3477 932 -2931 -3588 669 5095 3516 -2367 -4399
1069 -4399 69 5028 4008 -347 -3340 -1280 2412 3846 2363 -1336 -2456 -3 3976 4767 283
$$ packed form
959f39n216K809O174K682l088n842k302L955P411O58p958o661L957R972J728q226
975e86o539K560P676K615m021n889r37M429M752M21n590n026K113O649K337m384
991E80n675K74M915L223j329l717k220R65L873K935j776n713j746M712M420j22
1007C599n511l041J969M770K554l083m860j462M957N035j029o423l714M165N912
1022C838Q53n144m320J331M878K876j706n061k595L669N319M56n388m522K709
1037b807N667J741m271m001L41L244L306m15l114l732M68N416L304l596o022K96
1053d175N140L887k461m828r73K245M006O36k545l863o57M257M426j579n883k032
1069d399M468M959j020m355k993K060L692J434j483l699j120K453L979P91m484
$$ plain form
1084 283 -3230 -1165 3141 4669 1667 -2360 -2105 437 3799 3589 -46 -2957 -1754 2592 4667 1648
1100 1648 -3424 -3210 924 4768 2855 -2088 -4101 -1158 3165 3906 234 -3961 -3221 1627 4350 1367
1116 1367 -3288 -3903 -277 2814 2124 -1636 -3351 -1807 1066 3289 946 -2632 -3791 -552 3412
1131 3412 2233 -1898 -3521 -1167 1831 2411 244 -1813 -2348 -655 2513 3197 -63 -3532 -2184 2864
1147 2864 4686 493 -3145 -2116 1815 3847 1824 -1054 -2554 -672 2633 4120 1293 -2807 -2855
1162 -2855 2049 5294 1977 -2860 -2709 1847 3852 2238 -1246 -1946 -512 1779 3169 1809 -1679
1177 -1679 -3101 383 3663 2718 -1224 -3161 -413 2462 2340 -180 -1766 -1793 -157 2182 1952 -749
1193 -749 -3259 -1787 1956 2740 -534 -3262 -2281 439 2233 691 -1936 -3265 -1428 1747 2561 -139
$$ packed form
1084B83l513K065M306J528l002m027K55K542L362k10l635k911J203M346K075l019
1100A648n072K14M134L844j913m943k013K943M323P41l672m195P40M848K723k983
1116A367m655o15L626L091o90l760j715J544K873K223k343l578j159L239L964
1131C412j179m131j623K354K998N80k167k057n35J693L168O84l260l469J348N048
1147B864J822m193l638J029L931K032k023k878j500J882L305J487k827m100m8
1162b855M904L245l317m837J51M556K005j614l484p00J434K291J390j360l488
1177a679j422L484L280r45l942j937K748K875j22k520j586k7J636K339k30k701
1193g49k510J472L743P84l274k728R81K720J794j542k627j329J837L175Q14k700
$$ plain form
1209 -139 -3933 -2995 1276 3046 139 -3127 -2609 242 1873 1242 -660 -2365 -1906 1070 2948 788
1225 788 -3008 -2958 1071 3714 1547 -1719 -1635 613 1727 1710 698 -989 -1684 261 3255 2890 -1051
1242 -1051 -3212 -130 3888 2985 -938 -2209 137 1699 2062 1280 -65 -1081 -1045 1949 3463 201
1258 201 -3470 -1977 2320 3218 -316 -2976 -1432 647 1111 575 -342 -1852 -2260 -62 2387 1050
1274 1050 -3207 -3735 254 2501 194 -2775 -2357 -688 375 430 63 -1742 -3253 -1305 1805 1737 -1988
1291 -1988 -3940 -1024 2496 1640 -1671 -2649 -1395 695 1219 685 -636 -2267 -868 2407 2441 -1389
1307 -1389 -3199 -1126 2496 2184 -506 -1164 -206 620 1127 1552 737 -1302 -1664 1647 3119 1165 -2386
1324 -2386 -1345 1989 2319 521 -899 -216 -217 392 1803 1366 -1081 -2915 -333 3230 1813 -2342 -3336
$$ packed form
1209a39l794R38M271J770k907l266N18K851J631o31j902j705M59K976J878k160
1225G88l796N0M029K643k167l266Q4K248J114j7j012j687o95J945K994l65l941
1242a051k161L082M018r03l923j271K346J562L63p82j345j016L6K994J514l262
1258B01l671J493M297Q98l534k660J544K079M64n36r17j510m08K198K449j337
1274A050m257n28L989K247k307k969M18J669J063N5l67j805j511J948L110o8l725
1291a988j952K916L520q56l311r78J254K090N24n34j321j631J399L275L4l830
1307a389j810K073L622l12k690o58R58Q26N07M25q15k039l62L311J472j954l551
1324b386J041L334L30j798j420O83jO09J411m37k447j834K582L563j417m155r94
$$ plain form
1341 -3336 378 2205 678 -1222 -1573 -713 -150 761 1418 -995 -3419 -1664 2367 2558 -2147 -4010
1357 -4010 -321 2348 773 -1647 -1622 -241 176 -38 424 30 -2308 -1936 1134 2452 -124 -2875 -1026
1374 -1026 1373 1368 -469 -859 -426 -612 -450 1183 1188 -1041 -2776 -187 2829 1530 -2379 -2647 255 1668
1392 1668 819 -819 -1039 -1215 -320 1274 1395 -870 -2929 -901 2739 1970 -1851 -2800 -177 1651 969
1409 969 -758 -1074 -1014 -556 610 1182 -581 -2815 -1162 1921 1846 -1440 -2402 -256 1375 325 -438
1426 -438 -237 -319 -1071 -331 1653 1018 -1326 -2328 545 2396 197 -1662 -907 1153 1183 264 464 171
1444 171 -1093 -491 2087 2366 -911 -2356 146 3133 1666 -1562 -1631 774 1545 281 148 385 -409
1461 -409 -824 1272 2244 56 -2508 -986 1900 2159 -1092 -2274 8 1335 531 -221 -310 -540 -1083
$$ packed form
1341c336L714J827j527j900l51Q60N63R11O57k413k424J755M031J91m705j863
1357d010L689K669j575k420K5J381M17k14M62l94k338L72L070J318k576k751J849
1374a026K399nj837l90M33j86J62J633Nk229j735K589L016j299l909k68K902J413
1392A668q49j638k20j76Q95J594J21k265k059K028L640p69l821r49K623J828o82
1409I69j727l16O0M58J166N72j763k234J653L083p5l286r62K146J631j050p63
1426d38K01q2p52P40J984o35k344j002K873J851k199j859P55K060L0r19K00k93
1444A71j264O02K578K79l277j445K502K987j467l228o9K405P71j264j33K37p94
1461d09m15K096R72k188k564J522K886K59l251j182K282J327q04p52q9k30n43
$$ plain form
1478 -1083 96 1462 489 -2097 -1927 1025 1801 -417 -1865 -742 630 641 57 74 -190 -1370 -169
1495 -169 1197 1573 -1464 -2371 300 1835 808 -1366 -834 476 605 221 80 65 -1155 -947 1304
1512 1304 1614 -304 -2010 -43 1749 1254 -962 -1077 -21 452 285 582 379 -1095 -1298 847 1916
1529 1916 164 -2102 -1034 1801 1743 -105 -1123 -4 479 370 346 659 -551 -1248 435 2001 675
1546 675 -2142 -1492 1021 1948 -516 -1404 -187 581 356 90 578 160 -1281 -507 1522 1450 -556 -2046
1564 -2046 327 1678 1025 -450 -287 555 -39 -259 597 499 -1204 -1247 843 1822 -117 -1885 -1087 1017
1582 1017 1305 -49 -815 -581 -15 308 724 232 -1122 -1117 437 1727 124 -1973 -1215 1204 1612 -466
1600 -466 -1270 -450 -250 180 223 621 -838 -1097 -11 1246 244 -1028 -982 767 1124 -367 -693 182
$$ packed form
1478a083J179J366r73k586J70K952P76k218j448J123J372J1n84J7k64j180J201
1495a69J366L76l037r07K671J535j027k174N32J310J29l84j41j5j220K08K251
1512A304L10j918j706J967J792m95k216j15J056M73j67K97k03j474k03K145J069
1529A916j752k266J068K835n8j848j018J119M83j09k4L13j210o97J683J566j326
1546F75k817O50K513R27k464q88J217P68k25k66M88m18j441P74K029p2k006j490
1564b046K373J351o53j475J63Q42n94k20Q56r8j703m3K090R79j939j768P98K104
1582A017K88j354p66K34N66L23M16m92j354NJ554J290j603k097P58K419M08k078
1600d66q04Q20K00M30M3L98j459k59J086J257j002j272M6J749L57j491l26Q75
$$ plain form
1618 182 192 -555 398 1052 110 -1044 -1005 1198 1377 -284 -1274 -299 1197 548 -379 -464 -154 -530 354 1281
1638 1281 513 -1371 -1028 850 1656 -54 -1522 -741 1073 1164 -457 -572 -377 -117 148 480 500 -969
1656 -969 -1097 67 1544 467 -1206 -743 576 791 217 -293 -183 43 -239 578 805 -198 -1051 -839
1674 -839 1153 1240 -446 -1161 61 978 409 214 -248 -317 -256 624 1380 85 -1019 -807 984 1658 36
1693 36 -1119 -585 681 1094 440 -459 -543 78 347 1044 249 -876 -771 623 1375 110 -758 -548 494
1712 494 312 156 132 -509 -183 -268 576 576 -689 -1159 85 831 358 -597 -731 99 463 350 -146 -576 -799
1733 -799 -213 636 576 -565 -1059 -822 1149 713 -576 -967 -280 586 124 19 97 -486 -399 296 866 85
1753 85 -1059 -625 316 1110 284 -766 -422 273 411 308 -157 -511 -730 -146 860 401 -717 -978 31
$$ packed form
1618A82J0p47R53O54r42j154L9K203J79j661r90R75J496o49r27q5L10l76Q84R27
1638A281p68j884L43J878Q06j710j468P81J814R1j621j15J95K60K65L32K0j469
1656i69j28J164J477j077j673M63J319K15n74n10J10K26k82Q17K27j003q53K12
1674h39J992Q7j686p15J222R17n69j95m62o9O1Q80P56j295j104K12J791O74j622
1693C6j155N34J266M13o54q99q4O21K69O97p95j125J05J394P52j265q68K10J042
1712D94j82j56k4o41L26q5Q44%j265m70J244P46m73r55j34Q30L64j13m96m30k23
1733g99N86Q49o0j141m94K37J971m36j289l91O87Q66m62j05P8n83Q7O95N70p81
1753H5j144M34R41P94q26j050L44O95J38j03m65l54k19N84J006m59j118k61J009
$$ plain form
1772 31 896 735 -753 -651 -301 641 432 80 -631 -799 -112 567 538 -536 -1360 -316 723 403 -359
1791 -359 -678 -326 202 577 362 -167 -350 -211 551 909 -81 -966 -576 804 271 -168 -385 -70 109 127
1811 127 391 70 -728 -389 372 594 123 -605 -497 305 882 234 -475 -241 -283 153 371 324 -370 -638 55
1832 55 1062 635 -777 -967 55 1070 378 -482 -410 -282 3 318 190 -137 -748 -352 540 702 -343
1851 -343 -800 -447 623 500 -81 -518 -261 -199 373 37 395 -317 -496 232 901 196 -687 -238 679 836
1871 836 201 -493 -304 -112 289 436 102 -121 -345 197 756 432 -179 -499 195 855 538 -29 -478 -200
1891 -200 590 465 358 67 -625 -105 832 621 -57 -478 -262 499 369 37 -217 -89 -221 574 687 -48
1911 -48 -644 -500 623 831 322 -427 -465 -9 338 265 -24 -215 -522 -68 717 109 -620 -895 384 396 154
$$ packed form
1772C1Q65j61j488J02L50R42k09l52p11j68O87O79k9j074q24J044J039l20p62
1791c59l19L52N28L75k15n29j83J39P62L58r90q85L90J380n33m39k17L15J79J8
1811A27K64l21p98L39P61K22m71p28J08Q02N77o48p09K34m2M36K18m7o94k68O93
1832E5J007m27j412j90J022J015o92q60P2J28K85L15j28l27o11L96Q92J62j045
1851c43m57L53J070j23n81m37K57O2N72l36L58p12j79P28O69p05q83M49R17J57
1871H36o35o94J89J92M01J47l34k23k24N42N59l24o11l20O94O60l17n67m49K78
1891b00P90j25j07k91o92N20R37k11o78m21K16P61j30l32k54J28j32P95J13p35
1911d8n96J44J123K08n09p49l8M56L47p3k89j91l07M54P85o08p29k75J279J2k42
$$ plain form
1932 154 -708 -498 10 348 175 198 -57 -400 -99 394 495 -160 -544 64 866 715 -343 -294 118 564
1952 564 412 61 -37 -355 230 286 776 59 -563 -286 458 696 -161 -586 -234 455 162 139 174 -224 -189 366
1974 366 691 193 -453 -418 294 781 -86 -453 -653 380 705 166 94 -65 -137 278 -95 385 -88 -327 -107
1995 -107 451 139 -182 -512 -360 223 103 84 230 -323 -276 719 495 -132 -470 -358 456 -193 74 -531 -362
2016 -362 107 360 358 -172 -354 -373 370 244 -281 -818 -527 409 396 -109 -603 -390 26 310 -172 -114 -435 -571
2038 -571 340 512 94 -480 -499 217 384 87 -592 -536 232 -152 21 10 391 -149 -556 349 298 -248 -828
2059 -828 68 626 211 -251 -398 -160 31 39 -3 -47 -478 -247 271 383 60 -549 -412 32 459 252 -413
2080 -413 -89 71 408 219 236 -382 -223 465 346 370 -255 -505 221 534 52 -237 -99 -16 252 201 228 -35
$$ packed form
1932A54q62K10N08L38j73K3k55l43L01M93J01o55l84O08Q02j51j058M9M12M46
1952E64j52l51r8l18N85N6M90p17o22K77P44K38q57m25L52O89k93k3L5l98L5N55
1974C66L25m98o46L5P12M87q67l67k00J033L25n39p2j59p2M15l73M80m73k39K20
1995a07N58l12l21l30J52N83j20j9J46n53M7R95k24o27l38J12Q14o49K67o05J69
2016c62M69K53kn30j82j9P43j26n25n37K91R36j3n05m94K13M16K84m82N8l21j36
2038e71R11J72m18n74j9P16J67k97o79N6P68l84J73j1L81n40m07R05n1n46n80
2059h28Q96N58m15m62j47K38J91Qm2m4m31K31N18J12l23o09J37M44M27k07o65
2080d13L24J60L37j89J7o18J59O88j19K4o25k50P26L13m82k89J38Q3K68n1K7k63
$$ plain form
2102 -35 -485 -109 289 203 -418 -551 -135 171 123 208 -180 -516 -4 194 31 -169 -896 -156 327 617 -275
2123 -275 -760 -25 295 321 -352 -375 34 -498 114 203 -275 -519 -304 58 418 -110 -667 -478 397 414 -173
2144 -173 -27 -181 -59 -59 190 177 -565 -489 5 636 356 -313 -257 464 350 53 -55 -382 -282 -107 -106 5
2166 5 91 -476 -97 256 560 -140 -542 -158 489 377 -21 -372 9 -33 176 260 -12 -501 -437 342 214 150
2188 150 -826 -108 381 303 210 -200 -113 -153 -65 719 78 -322 -454 -118 752 333 -147 -354 15 345 259 -391
2210 -391 -162 -293 -120 386 563 -236 -365 148 404 373 7 -556 73 228 315 240 -60 -305 -190 250 222
2231 222 -92 -453 -88 513 537 -410 -317 -83 532 218 -192 -6 -125 -234 -133 74 109 -321 -437 17 594
2252 594 390 -163 -166 342 153 -77 -37 -372 -235 128 427 -19 -747 -587 151 380 377 -246 -242 61 105 -251 93
$$ packed form
2102c5m50L76L98q6o21j33M16L06m8Q5l88l36N12J98j63k00p27P40M83K90q92
2123b75m85P35L20K6o73k3M09n32O12Q9m78k44K15L62L60n28n57J89Q75J7n87
2144a73J46j54J22%K49j3p42P6M94O31k80o69N6P21j14k97j08l27J00J75JJ11
2166EQ6n67L79L53L04p00m02L84O47j12l98l51L81m2K09Q4k72m89O4P79j28o4
2188A50r76P18M89p8r3m10Q7m0Q8P84o41m00j32L36Q70m19m80k07L69L30q6o50
2210c91K29j31J73N06J77p99j29N13K56l1l66n63O29J55Q7p5l00k45J15M40k8
2231B22l14l61L65O01K4r47R3K34O15l14m10J86j19j09J01K07L5m30j16M54N77
2252E94k04n53lN08j89k30M0l35J37L63K99m46p28J60P38K29lo23ML03M4l56L44
$$ plain form
2275 93 -353 -89 -206 -121 164 -80 -475 -391 150 492 -297 -515 -105 269 -130 -209 -20 -434 -177 78 172 158
2297 158 -253 -356 471 540 -120 171 -486 -215 149 259 392 153 -37 50 661 205 -76 -360 494 648 -80
2318 -80 -182 -348 7 280 206 271 184 405 78 699 604 -27 -135 90 537 374 12 -259 195 103 155 160 68
2341 68 -253 -311 300 759 -1 -429 -75 425 328 -501 -307 259 139 -479 -269 -127 -600 -401 -398 102 200 -642
2363 -642 -808 -346 239 82 -427 -746 -364 208 -256 -139 -98 -281 -146 101 179 -450 -277 117 27 161 -419
2384 -419 97 -409 89 10 122 157 -315 -59 152 451 25 -371 -79 434 464 180 24 -33 -5 369 323 -237
2406 -237 -67 45 168 473 -258 159 -28 128 132 348 -153 134 -323 -15 172 286 -146 -438 -68 335 16
2427 16 -410 -306 -295 346 -21 -163 -211 -16 -346 -165 109 -102 -148 -101 -139 161 -208 -474 -317 4 37 -233
$$ packed form
2275I3m46K64j17Q5K85k44l95Q4N41L42p89k18M10L74l99p9J89m14K57K55R4j4
2297A58m11j03Q27O9o60K91o57K71L64J10J33k39j90Q7O11m56k81k84Q54J54p28
2318h0j02j66L55K73p4O5q7K21l27O21r5o31j08K25M47j63l62k71M54r2N2Nr2
2341F8l21n8O11M59p60m28L54N00r7q29J94N66j20o18K10J42m73J99LN00R8q42
2363f42j66M62N85j57n09l19L82N72m64J17M1j83J35K47P8o29J73L94r0J34n80
2384d19N16n06M98p9J12L5m72K56K11K99m26l96K92N13L0k84j56n7K8L74m6n60
2406b37J70J12J23L05p31M17j87J56MK16n01K87m57L08J87J14m32k92L70M03l19
2427A6m26J04J1O41l67j42m8J95l30J81K74k11m6M7l8L00l69k66J57L21L3k70
$$ plain form
2449 -233 -19 -324 -485 -8 325 -210 -392 -271 -101 -5 -20 -310 -130 -118 211 134 -144 -165 10 -33 338 134
2471 134 64 -303 -198 131 -171 203 -77 -484 398 150 -82 -287 -207 -342 230 -9 -604 -199 324 276 286
2492 286 -46 -267 190 -75 54 -152 -170 -11 -53 28 -204 3 -293 -158 -89 525 180 -229 -367 236 365
2513 365 -7 -4 -274 -90 -54 458 203 -162 108 221 -10 -239 -118 361 -87 -178 246 -181 110 -303 -307 142
2535 142 203 243 -388 -5 441 379 28 -88 130 454 220 -2 -150 -71 -66 -132 240 51 -120 -330 291 371 -48
2558 -48 -205 -335 20 -46 15 179 -141 -3 147 74 112 -176 172 126 337 112 -430 -210 -70 233 334 36
2580 36 -31 -25 -112 165 2 14 -311 -62 -292 455 302 54 -100 109 321 312 139 -273 164 666 288 -189 -77
2603 -77 293 57 411 259 34 205 145 99 153 518 -4 -178 429 240 -56 28 -49 178 324 186 -72 -198
$$ packed form
2449b33K14l05j61M77L33n35j82J21J70R6j5k90J80J2L29p7k78k1J75m3L71k04
2471A34p0l67J05L29l02L74k80m07Q82k48k32k05Q0j35N72k39n95M05N23m8J0
2492B86l32k21M57k65J29k06j8J59m2Q1k32K07k96J35O9O14l45m09j38O03J29
2513C65l72Lk70J84L6N12k55l65K70J13k31k29J21M79m48r1M24m27K91m13mM49
2535A42O1M0o31L83M46o2l51j16K18L24k34k22j48P9No6L72j89j71k10O21Q0m19
2558d8j57j30L55o6O1J64l20J38J50p3L8k88L48m6K11k25n42K20J40L03J01k98
2580C6o7Oq7K77j63J2l25K49k30P47j53k48j54K09K12rj73m12M37N02l78m77J12
2603g7L70k36L54j52k25J71o0m6N4L65n22j74O07j89k96Q4p7K27J46j38k58j26
$$ plain form
2625 -198 -179 486 557 281 -18 -53 32 73 85 -74 -198 497 -125 136 0 90 -74 44 131 35 -84 -221 10
2648 10 112 532 -31 -398 -71 273 404 -188 -476 -34 -46 87 -67 -451 -219 123 -9 -16 10 -339 -2 -125
2670 -125 211 177 294 -68 -312 -4 475 201 -196 -338 247 698 229 -290 91 432 362 357 4 17 197 -51
2692 -51 130 130 210 -288 225 487 63 325 -84 -10 -313 -25 217 -423 -305 -26 331 91 -105 -211 -63 298
2714 298 159 -72 -437 54 -10 -71 -43 86 -39 -337 -481 -127 589 -234 -751 -131 286 335 -139 -325 -118
2735 -118 264 -78 -71 -111 -307 -370 136 170 -31 -121 -13 167 -158 -344 -276 99 -118 -226 14 -21 68 -183 263
2758 263 351 72 -599 -441 264 284 -117 -88 1 282 40 -23 -302 -182 172 318 58 -156 -256 -9 -37 83
2780 83 126 -244 39 -217 -6 -17 104 211 81 -15 200 152 -313 -461 243 117 195 -194 -173 253 -144 -36
$$ packed form
2625a98J9O65P1k76k99l5Q5M1J2j59j24O95o22K61j36R0j64J18Q7r6j19j37K31
2648A0J02M20n63l67L27L44J31n92k88M42j2J33j54l84K32L42j32pK6l49L37j23
2670a25L36l4J17l62k44L08M79k74l97j42N85M51m69n19L81L41p0nl53J3J80k48
2692e1J81%Q0m98N13K62m24K62m09P4l03K88K42o40J18K79L57k40j96j06J48L61
2714B98j39k31l65M91o4o1K8J29j25k98j44L54P16q23n17O20M17M9m74j86K07
2735a18L82l42Pm0j96o3N06L4k01r0J08J80l25j86O8L75k17j08K40l5Q9k51M46
2758B63Q8k79o71J58P05K0m01K9Q9K81k42o3k79J20L54J46k60k14j00K47k8J20
2780H3M3l70K83k56K11j1J21J07j30r6K15m8m65j48P04j26P8l89K1M26l97J08
$$ plain form
2802 -36 -75 23 -22 167 85 143 -87 -78 121 89 86 147 -61 88 -281 418 282 -151 -322 -347 290 225 -149 -445 -150
2827 -150 372 138 -232 -258 -167 -107 -147 -278 128 287 -320 -221 122 -61 -312 -466 -161 185 66 18 -251 -142
2849 -142 78 287 -75 -174 -249 -88 158 356 -403 -513 44 -102 -101 -124 -7 65 60 -236 -131 17 -153 -496 26
2872 26 199 0 -350 -324 -154 465 -227 -375 -364 117 -107 -43 -165 -243 217 24 8 -205 -167 18 -239 -102
2894 -102 -93 91 -51 -332 -200 -132 94 -148 -197 -56 122 4 -438 -356 -252 222 -327 21 -193 -250 -198 130
2916 130 47 339 -214 -131 164 -197 -14 55 -29 -37 300 459 -120 75 -69 74 200 124 -12 -53 650 142 -62
2939 -62 -400 150 510 98 -224 -255 118 -176 -126 44 -9 -223 -407 -460 91 79 -266 -385 -242 -260 -295 -426 -596
2962 -596 -281 -717 -349 -333 183 -722 -330 -487 -457 -553 -177 -505 -211 -282 -560 -127 -457 -215 -499 -39 -61 -495
$$ packed form
2802c6l9R8m5J89q2N8k30RJ99l2lO1k08J49l69O99j36m33j71k5O37o5l74k96K95
2827a50N22k34l70k6R1O0m0j31M06J59o07R9L43j83k51j54L05L46j19m8k69J09
2849a42K20K09l62r9p5J61K46J98p59j10N57j46Jk3J17P2nk96J05J48j70l43N22
2872B6J73j99l50K6J70O19o92j48J1M81k24O4j22p8M60j93j6k13L8J85k57J37
2894a02RJ84j42k81J32O8K26k42m9J41J78j18m42Q2J04M74n49L48k14n7N2L28
2916A30q3K92n53Q3K95l61J83O9q4qL37J59n79J95j44J43J26p6j36m1P03n08k04
2939f2l38N50L60m12l22l1L73k94N0J70n3k14j84n3N51j2l45j19J43j8l5j31j70
2962e96L15m36L68J6N16r05L92j57L0r6L76l28K94p1k78M33l30K42k84M60k2m34
$$ plain form
2984 -495 -174 -115 277 16 -375 6 -150 139 -149 -50 -109 -5 294 440 -90 267 14 368 171 181 194 -49
3006 -49 325 231 379 513 192 -91 106 407 613 283 316 262 322 403 258 193 173 127 35 122 234 295 -163 199
3030 199 259 -9 -196 -128 66 16 -142 -305 165 -121 -344 147 -90 -218 -224 128 179 -377 -529 -346 336 140
3052 140 -313 -119 -52 96 236 70 -30 239 -30 138 -133 353 -240 -133 3 46 84 -189 -239 -132 160
3073 160 174 -56 92 141 271 214 308 -197 -338 167 473 356 -310 -37 48 -138 -36 40 218 186 -17 229
3095 229 -122 164 -178 -348 -16 191 -81 -129 -20 -74 134 288 -16 -365 -120 270 445 123 -256 -335 245
3116 245 293 409 200 59 343 164 367 436 265 52 212 649 215 35 26 558 546 146 -65 -71 408 178
3138 178 114 -16 212 236 137 503 450 255 -243 8 185 -3 -90 196 -219 7 -24 440 -96 17 -242 -152
$$ packed form
2984d95L21N9L92k61l91L81j56K89k88R9n9J04K99J46n30L57k53L54j97J0J3k43
3006d9L74r4J48J34l21k83J97L01K06l30L3n4O0Q1j45o5k0m6r2Q7J12O1m58L62
3030A99O0k68j87O8J94n0j58j63M70k86k23M91k37j28oL52N1n56j52J83O82j96
3052A40m53J94O7J48J40j66j00K69k69J68k71M86n93J07J36M3L8k73n0J07K92
3073A60J4k30J48M9J30n7R4n05j41N05L06j17o66K73Q5j86J02P6J78l2k03K46
3095B29l51K86l42j70L32K07k72m8J09n4K08J54l04l49K45L90J75l22l79p9N80
3116B45M8J16k09j41K84j79K03O9j71k13J60M37m34j80rN32j2m00k11oM79k30
3138A78o4j30K28K4r9L66n3j95m98K51J77j88q7K86m15K26l1M64n36J13k59R0
$$ plain form
3160 -152 239 210 -150 -146 99 87 -158 -331 110 -39 -395 -308 -102 -368 -333 22 -97 -135 -73 -188 -566 93 233
3183 233 -361 -147 -26 -163 77 -127 -265 -47 -106 25 302 -18 -74 -52 327 121 181 2 -380 72 193
3204 193 159 77 44 32 223 167 159 247 204 -27 187 181 283 -111 173 85 227 36 -126 -113 142 431 26 77 -216
3229 -216 135 -50 -108 43 67 -200 -15 237 200 -249 -408 -44 179 152 -185 -481 -32 18 65 160 -157 -564
3251 -564 -68 -141 166 -157 -256 -268 165 38 -76 -296 -205 378 -300 85 48 -299 -267 -293 130 -168 -179 -208 -111
3274 -111 115 169 -85 114 -88 -112 -264 -284 -66 93 212 66 85 -164 -102 -110 82 -228 -219 16 -239 144 189
3297 189 164 -207 -315 8 225 184 -212 -276 28 406 -120 -85 -318 76 -280 -52 212 -56 -255 -162 368 75
3319 75 22 -176 19 -61 -10 179 -56 -19 186 -167 112 -204 -208 -70 -32 330 59 -197 -71 131 83 -54 -210
$$ packed form
3160a52L91k9l60MK45j2k45j73M41j49l56Q7K06k66L5L55j19l8O2j15l78O59J40
3183B33n94K14J21j37K40k04j38K18n9J31K77l20n6K2L79k06O0j79l82M52J21
3204A93l4q2l3j2J91n6qQ8m3k31K14oJ02l94K84q8J42j91j62J3K55K89m05N1k93
3229b16L51j85n8J51K4k67J85K52l7m49j59L64K23k7l37k96M49N0M7R5l17m07
3251e64M96p3L07l23r9j2M33j27j14k20R1N83o78L85l7l47L2k6M23k98j1k9R7
3274a11K26N4k54J99k02k4j52k0K18J59J19j46J9k49O2qJ92l10RK35k55L83M5
3297A89k5l71j08L23K17m1l96o4L04L78n26L5k33L94l56K28K64k68j99R3N30k93
3319G5n3j98J95q0N1J89k35L7K05l53K79l16mJ38L8L62k71k56J26K02m8j37j56
$$ plain form
3342 -210 -136 -44 -54 77 83 -102 -489 -183 378 234 -168 -424 -161 171 -8 -335 -340 -36 40 190 -383 -55 -254
3365 -254 175 614 162 -136 -18 -29 171 88 121 -69 308 9 -37 336 -312 -63 -79 338 369 -105 -115 -303
3387 -303 86 167 -121 61 251 68 -241 9 23 -117 64 352 -57 -2 -246 -270 45 178 137 182 129 -461
3409 -461 -251 279 7 48 -227 -113 373 462 -174 -262 232 -85 105 29 256 96 81 66 -22 5 -227 162 123
3432 123 144 83 -66 26 -30 19 -91 -390 17 -54 -2 -17 255 -436 -48 149 62 -251 -309 -104 221 -50 -102 -46
3456 -46 28 197 -34 255 156 -123 68 -199 259 -218 217 -283 60 95 263 176 -23 109 89 215 102 -49
3478 -49 -168 -152 280 -35 19 -205 133 54 85 535 -51 -56 86 46 55 -201 -245 -162 406 4 -50 -251 -126 93
3502 93 240 34 -146 -144 -192 36 183 328 -41 -173 159 73 109 -206 -56 103 -51 486 183 158 121 238 532
$$ packed form
3342b10P4R2j0J31Oj85l87L06N61j44m02k56K63L32j79l27nL04P6J50n73L28j99
3365b54M29M39m52k98J18j1K00q3L3j90L77k99m6L73o48K49j6M17L1m74j0j88
3387c03L89Q1k88J82J90j83l09K50J4j40J81K88m09N5k44k4L15J33m1M5n3n90
3409d61K10N30k72M1k75J14M86Q9o36q8M94l17J90p6K27j60j5j5q8K7k32L89l9
3432A23K1o1j49R2n6M9j10k99M07p1N2j5K72o91L88J97q7l13n8K05L25k71n2N6
3456d6P4J69k31K89r9k79J91k67M58m77M35n00L43L5J68q7j99J32k0J26j13j51
3478d9j19J6M32l15N4k24L38p9L1M50n86nJ42m0Rk56m4Q3N68m02n4k01J25K19
3502I3J47k06j80Km8K28J47J45l69j32L32q6L6l15J50J59j54N37l03k5l7J17K94
$$ plain form
3525 532 196 26 82 224 584 102 357 -6 268 513 159 152 77 109 -33 129 345 -14 -138 117 59 72
3547 72 109 -161 191 -26 -93 -106 -39 -254 -203 -86 -148 -89 -465 -241 -130 147 -545 -283 -210 287 175 -564 -246
3570 -246 -320 -249 -368 -139 151 -290 -147 -462 -209 -114 -222 87 -72 -88 285 175 -262 -90 137 93 13 246
3592 246 108 154 72 317 242 422 316 193 -129 442 328 -156 345 308 514 170 14 174 419 290 116
3613 116 -52 77 -6 61 -89 335 -208 59 -126 76 -94 -127 -122 247 53 -111 -181 -106 -208 -152 -497 29 -60
3636 -60 -569 90 -22 54 -390 -306 -269 152 -290 -611 -310 -136 -136 -132 -201 -343 -451 -108 -81 182 266 -268 -156 144
3660 144 270 31 -308 -81 108 -13 -67 -291 56 -117 242 205 70 12 -301 224 13 -28 -5 -122 -133 63
3682 63 172 117 47 -36 -51 295 -146 121 -396 75 29 -138 -164 -69 170 17 -220 -232 -261 -178 -276 109 225 14
$$ packed form
3525E32l36j70N6J42L60m82K55l63K74K45l54pp5L2j42J62K16l59j24K55n8J3
3547G2L7k70L52k17o7j3O7k15N1J17o2N9l76K24J11K77o92K62P3M97j12p39L18
3570b46p4P1j19K29K90m41J43l15K53R5j08L09j59j6L73j10m37J72K27m4q0K33
3592B46j38M6q2K45p5J80j06j23l22N71j14m84N01l7K06l44j56J60K45j29j74
3613A16j68J29q3O7j50M24n43K67j85K02j70l3NL69j94j64p0P5j02N6l45N26q9
3636f0n09O59j12P6m44Q4L7M21m42l21L01J74%Mo9j42j08L43K7K63Q4n34J12L00
3660A44J26k39l39K27J89j21n4k24L47j73L59l7j35n8l13N25k11m1K3j17j1J96
3682F3J09n5p0q3j5L46m41K67n17M71m6j67k6R5K39j53k37j2k9Q3r8L85J16k11
$$ plain form
3706 14 50 97 47 -91 132 87 -163 -81 292 -26 112 -81 102 -69 375 -122 100 183 394 70 53 340 248
3729 248 262 47 56 236 41 -316 200 423 265 5 -10 319 287 15 191 277 -354 54 93 -18 -134 -269
3751 -269 -121 259 263 -270 -399 -68 -24 -21 -131 -279 -178 -383 51 -188 -156 -220 -211 -163 120 -228 -397 -57 172
3774 172 -21 -408 -498 -279 -117 99 -176 115 -424 158 10 65 74 72 -132 -153 297 77 107 101 -73 -233 334
3797 334 121 105 244 490 71 179 -2 -46 315 402 165 253 251 -95 39 547 -12 -280 -39 148 100 137 -201
3820 -201 308 -12 140 -24 95 -88 -132 -128 -64 268 -131 45 114 -109 196 38 -162 -15 -42 -196 -236 -182 -65
3843 -65 -297 -30 -37 -120 -183 -183 96 -109 11 -97 217 -116 38 -201 -137 95 -244 226 308 94 -131 -323 -139
3866 -139 478 211 137 86 334 66 -70 -114 31 -15 -140 214 119 -2 31 -179 -126 63 -23 -42 -236 -219 258
$$ packed form
3706A4L6M7n0j38K23m5k50Q2L73l18J38j93J83j71M44m97K22Q3K11l24j7K87r2
3729B48J4k15RJ80j95l57N16K23j58k60j5L29l2k72J76Q6o31M08L9j11j16j35
3751b69J48L80Mn33j29L31M4Lj10j48J01k05M34k39L2o4RM8K83l48j69L40K29
3774A72j93l87r0K19J62K16k75K91n39N82j48N5Rkk04k1M50k20L0oj74j60N67
3797C34k13j6J39K46m19J08j81m4L61Q7k37Q8kl46J34N08n59k68K41J87m8L7l38
3820b01N09l20J52j64J19j83m4MO4L32l99J76O9k23L05j58k00J47k7j54m0N4J17
3843f5k32K67pq3o3%K79k05J20j08L14l33J54k39O4K32l39M70Q2k14k25j92J84
3866a39O17k67p4n1K48k68j36m4J45m6j25L54r5j21L3k10N3J89q6j9j94J7M77
$$ plain form
3889 258 -219 48 -257 159 133 12 -209 -301 11 124 -122 146 431 -305 -15 53 173 -118 308 65 217
3910 217 -65 49 11 197 -39 -42 158 -225 -103 3 -236 17 -69 -53 70 98 -189 2 -247 61 -178 -201
3932 -201 -232 -82 130 74 23 -2 59 -101 -83 99 318 150 -409 80 127 -11 4 187 -33 32 -208 76 208
3955 208 -3 67 -135 128 209 30 -125 216 -19 -54 -69 30 -231 241 -145 14 11 -3 -72 129 -286 79 15
3978 15 -13 121 3 97 -100 18 243 151 157 -154 -23 107 91 227 0 48 4 -81 124 205 123 -114 -73 -37 -73
4003 -73 -264 -286 -136 -43 -145 31 106 -159 -346 38 4 94 10 -15 -114 263 368 106 13 -133 -81 67 22 -162
4027 -162 85 229 -89 -247 -55 19 -88 -126 119 -378 148 29 -153 184 141 362 114 109 -63 -254 -162 -84
4049 -84 -137 -126 -54 506 94 -192 -229 167 -107 -44 -126 -49 423 268 95 156 71 -83 -22 88 70 115 -462 -185
$$ packed form
3889B58m77K67l05M16k6j21k21r2L12J13k46K68K85p36K90O8J20k91M26k43J52
3910B17k82J14l8J86k36lK00l83J22J06k39K53q6J6J23K8k87J91k49L08k39k3
3932b01l1J50K12n6n1k5O1j60J8J82K19j68n59M89M7j38J5J83k20O5k40K84J32
3955B08k11P0k02K63Q1j79j55L41k35l5j5R9k61M72l86J59lj4o9K01m15L65o4
3978A5k8J34j18R4j97J18K25r2Ol11J31J30j6J36k27M8m4q5K05Q1q2k37M1L6l6
4003g3j91k2J50R3j02J76P5k65j87L84l4R0q4k5r9L77J05k62r3j46N2J48m5j84
4027a62K47J44l18j58J92P4j07l8K45m97N26j19j82L37m3K21k48nj72j91R2P8
4049h4n3J1P2N60m12k86l7L96k74O3q2P7M72j55j73O1q5j54O1J10j8M5n77K77
$$ plain form
4073 -185 12 213 -166 58 185 -7 -240 -329 -32 -42 -6 -75 140 12 162 18 423 257 613 -141 -268
4094 -268 83 79 231 -202 105 68 -70 5 126 -59 229 -105 179 231 -170 -125 -173 -55 48 -19 230 -182 17
4117 17 193 -450 -349 41 -327 -111 -51 242 -55 -28 -202 186 -11 166 -23 114 -75 -65 -82 239 294 -43
4139 -43 203 81 19 29 -88 55 -115 -148 -85 -44 307 269 70 -128 362 31 16 -38 -36 -113 40 15 -174 222
4163 222 -360 -27 -136 -137 168 101 -78 -309 272 46 -110 -214 -45 82 106 211 163 -39 49 -71 29 -21
4185 -21 346 145 -63 -176 340 -42 -9 -97 -327 89 9 88 63 -61 58 -84 -39 104 -22 93 17 264 92
4208 92 118 103 72 149 113 -299 -176 277 267 55 -40 90 -76 -50 -53 -215 -178 37 184 -79 -220 194 244 86
4232 86 -61 -72 114 -36 -11 85 -165 45 -51 94 -35 -101 149 -161 -70 201 -84 -41 -76 -82 33 -53 -181 45
$$ packed form
4073a85J97K01l79K24J27j92k33q9K97j0L6o9K15j28J50j44M05j66L56p54j27
4094b68L51mJ52m33L07l7j38P5J21j85K88l34K84N2m01M5m8J18J03o7K49m12J99
4117A7J76o43J01L90l68K16O0K93k97K7j74L88j97J77j89J37j89J0j7L21N5l37
4139d3K46j22o2J0j17J43j70l3O3M1L51l8j99j98M90l31j5n4Kp7J53k5j89L96
4163B22n82L33j09jL05o7j79k31N81k26j56j04J69J27K4J05m8k02Q8j20J00n0
4185b1L67k01k08j13N16l82L3q8k30M16q0P9k5j24J19j42M5J43j26J15p6K47j72
4208I2K6j5l1P7l6m12J23M53j0k12r5J30j66K6lj62L7K15J47k63j41M14N0j58
4232H6j47j1J86j50K5R6k50K10r6J45j29o6K50l10R1K71k85M3l5oJ15q6j28K26
$$ plain form
4256 45 69 -227 94 108 151 -150 -137 293 212 -65 160 32 315 46 -111 -169 -103 54 203 17 108 -340 -301
4279 -301 9 -127 -10 -65 -313 -169 31 -130 130 39 -148 84 -39 -95 288 75 -58 68 -347 -61 175
4300 175 113 311 -243 -68 128 -310 59 396 -105 -35 -199 255 496 41 -380 -178 -62 -169 121 56 -143
4321 -143 -19 198 -309 -66 67 -199 21 66 299 -120 29 183 26 -246 -331 207 100 -32 91 41 38 63
4343 63 231 66 232 -205 -95 -106 67 -100 9 -211 -45 -228 41 78 24 -370 -164 54 147 -19 -119 -101
4365 -101 -175 -53 179 264 22 -293 35 -23 -152 -251 -239 188 59 87 -180 -145 -90 17 78 -42 15 -118 -95 9
4389 9 173 73 218 -232 234 -30 -160 194 213 104 -327 393 -49 -106 -184 235 15 55 -49 155 221 16
4411 16 -45 -6 89 196 -79 -156 5 -199 -4 -134 -68 167 245 -36 -139 -321 8 27 -219 -113 -175 -28 218
$$ packed form
4256D5K4k96L21J4M3l01J3M30q1k77K25j28K83k69j57n8O6J57J49j86R1m48L9
4279c01L10j36J17n5k48J44K00j61K60r1j87K32j23n6L83k13j33J26m15K86K36
4300A75o2J98n54J75J96m38L69L37n01P0j64M54K41m55m21K02J16j07K90o5j99
4321a43J24K17n07K43J33k66K20M5K33m19J49J54j57k72q5N38j07j32J23n0lK5
4343F3J68j65J66m37J10j1J73j67J09k20J66j83K69L7n4l94K06K18R3j66j00J8
4365a01p4J22K32Q5k42l15L28n8j29r9J2M27j29K8k67L5N5J07O1j20N7j33K3J04
4389IJ64j00J45m50M66k64j30L54J9j09m31P20m42n7p8M19k20M0j04K04O6k05
4411A6o1L9R5J07k75p7J61k04J95j30O6K35P8k81j03j82L29J9k46J06o2J47K46
$$ plain form
4434 218 207 -142 -41 129 -157 -28 112 -289 103 -75 -234 -113 -39 -36 150 -47 -3 -83 -19 273 15 393
4456 393 -152 28 281 -28 45 63 418 137 -63 -14 227 -3 -46 -180 164 -82 -269 -400 145 5 -40 -64
4478 -64 -78 173 -111 95 36 -120 -322 -37 -111 -145 42 219 -185 107 -140 154 -49 -71 -209 -92 -149 131
4500 131 168 -10 55 -63 -24 69 -65 -107 59 12 276 246 178 57 165 212 -149 -265 264 176 -72 -8 166 -384
4524 -384 130 211 -1 160 -88 -23 33 355 103 -210 100 -50 -147 -77 -135 -59 138 -105 -127 152 60 -138 -284
4547 -284 -126 -137 -45 141 322 -118 -93 -217 27 21 -100 -54 -13 -212 -161 46 -100 224 -60 -72 -323 -64 143
4570 143 243 117 154 3 143 101 140 183 -64 -6 -157 180 -252 58 203 -18 325 97 63 -16 -242 -39
4592 -39 49 120 229 -82 139 217 -91 54 -29 206 30 148 -19 -104 44 -211 -3 85 -257 -254 -78 -14 69 91
$$ packed form
4434B18j1l49J01J70k86J29J40m01L92j78j59J21P4LJ86j97M4q0O4K92k58L78
4456C93n45J80K53l09P3J8L55k81k00M9K41k30m3j34L44k46j87j31N45j40m5k4
4478f4j4K51k84K06n9j56k02K85p4l4J87J77m04K92k47K94k03k2j38J17n7K80
4500A31L7j78O5j18L9R3j34m2J66m7K64l0o8j21J08M7l61j16N29q8k48O4J74n50
4524c84N14Q1k12J61k48O5N6L22k52l13L10j50r7P0n8P6J97k43k2K79r2j98j46
4547b84J58j1R2J86J81m40K5j24K44oj21M6M1j99N1K07j46L24k84j2k51K59K07
4570A43J00j26L7j51J40m2L9M3k47N8j51L37m32L10J45k21L43k28l4p9k26K03
4592c9Q8P1J09l11K21P8l08J45q3K35j76J18j67q5J48k55K08Q8l42LJ76O4Q3K2
$$ plain form
4616 91 27 9 -45 -42 -4 -217 11 -172 113 121 84 3 131 202 -20 119 -11 -283 -90 79 15 7 78 -92 35
4641 35 99 -200 -12 30 170 29 150 277 116 94 7 97 185 -122 -59 22 123 19 224 197 1 -120 355
4664 355 -159 -52 85 -136 93 159 -11 -211 13 86 -207 -88 12 -259 223 84 -60 -189 40 144 -125
4685 -125 175 156 -316 99 183 114 -13 -155 -56 -51 318 -270 140 156 -111 -131 -171 6 258 73 271 -407 -194
4708 -194 141 111 117 -12 290 -220 96 68 -68 44 30 161 111 -2 -99 -106 -31 -288 254 36 254 -194 107
4731 107 182 49 319 -49 -30 38 -364 11 57 8 30 387 287 -88 -165 53 -88 -117 261 253 0 252 -74
4754 -74 23 14 232 -140 37 107 4 -146 68 -119 90 260 -255 58 -104 -61 100 117 -65 108 -60 128
4776 128 -135 132 -215 24 -42 -48 51 59 268 15 234 7 37 119 -177 51 -83 8 87 -104 78 -16 -196 87
$$ packed form
4616I1o4j8n4LL8k13K28j83K85Ql7q1J28P1k22J39j30k72J93J69o4qP1j70J27
4641C5O4k99J88M2J40j41J21J27j61k2q7R0Q8l07O3Q1J01j04K05k7j96j21M75
4664C55n14J07J37k21K29O6j70k00K24P3k93J19J00k71M82j39j44j29K29J04k69
4685a25L00j9m72M15Q4o9j27j42R9NL69n88M10J6k67k0m0J77K52j85J98o78K13
4708a94L35l0Oj29L02n10L16k8j36J12j4J31n0j13r7pP5k57N42k18K18m48L01
4731A07P5j33K70l68J9O8m02L75M6m9K2L57j00l75p7K18j41k9L78qk53K52l26
4754g4R7rK18l72J77P0j03j50K14j87K09J70n15L13j62M3J61J7j82J73j68J88
4776A28k63K67l47K39o6oR9QK09k53K19k27L0Q2k96K28j34R1P9j91J82r4j80K83
$$ plain form
4800 87 -28 84 -17 108 117 -28 114 -267 75 104 94 -120 71 -132 107 61 -227 15 -366 -129 60 115
4822 115 257 130 127 -111 -105 53 25 -69 118 -272 -376 -282 157 -3 7 -133 62 219 93 -135 -194 149 -61
4845 -61 130 -115 -147 -223 -253 152 -118 85 122 -77 -46 -122 234 -77 32 -333 36 30 -196 -31 -174 -98 181
4868 181 -12 -36 125 229 67 -197 105 -376 493 38 109 152 -294 -63 35 179 -246 -84 -217 106 -162
4889 -162 282 32 -35 -35 66 104 -335 -300 57 102 -107 -66 -175 40 112 84 145 6 100 358 -248 -180 -173 -173 -291
4914 -291 -26 -161 -130 -299 149 22 319 207 75 11 119 364 -78 -27 -12 29 61 129 225 11 -129 267 132
4937 132 108 34 -127 51 -77 -4 121 143 -149 32 -106 -225 183 83 209 10 -186 60 -82 -96 138 -48
4959 -48 -134 -134 -99 221 314 -9 153 -143 -11 -165 -36 138 -72 267 -143 96 -275 164 -31 -181 26 -142
$$ packed form
4800H7j15J12j01J25Rj45J42l81L42K9j0k14J91k03K39m6k88K42l81K37J89N5
4822A15J42j27lk38OJ58k8r4J87l90j04R4M39j60J0j40J95J57j26k28n9L43k10
4845f1J91k45l2p6l0M05k70K03L7j99L1p6L56l11J09l65L69ok26J65j43P6K79
4868A81j93k4J61J04j62k64L02m81Q69m55P1M3m46K31R8J44m25J62j33L23k68
4889a62M44k50o7%J01L8m39L5L57M5k09M1j09K15P2k8O1j39R4K58o06O8P%j18
4914b91K65j35L1j69M48j27K97j12j32o4J08K45m42N1J5M1L2O8R6k14j40L96j35
4937A32k4p4j61J78j28P3J25K2k92J81j38j19M08j00J26j99j96K46j42j4K34j86
4959d8q6%L5L20R3l23J62k96J32j54J29J74k10L39m10K39l71M39j95j50K07j68
$$ plain form
4981 -142 139 -139 -5 -134 154 -95 277 190 134 -1 -13 -158 -220 310 13 107 -117 -32 122 72 448 366 -228
5004 -228 144 47 293 -25 281 245 -190 -101 -168 44 -74 61 -277 250 -2 -174 -90 114 65 74 101 179 101 -106
5028 -106 41 362 306 -39 -111 -283 -40 -261 -33 93 -338 -54 -33 97 -128 77 -180 286 35 151 117
5049 117 26 -56 148 23 196 -114 140 -85 -117 99 -324 105 29 -153 214 4 -187 -270 -59 301 89 -33
5071 -33 -430 70 -132 195 180 -211 -142 118 64 98 -121 341 42 -169 395 -90 -74 79 -14 300 -27 -160
5093 -160 298 -99 89 23 -163 -14 -37 -137 4 32 -173 134 -24 27 383 -111 207 7 -71 -74 173 120 77
5116 77 -12 50 20 -82 18 -85 183 -192 -91 -85 112 95 -86 -218 6 -359 8 -108 -43 104 40 80 -202
5139 -202 302 -116 68 117 125 96 -296 -11 -92 -60 279 130 331 153 -158 138 -38 -69 5 -143 206 61 -12
$$ packed form
4981a42K81k78J34j29K88k49L72q7n6j35j2j45o2N30k97R4k24Q5J54n0L76q2n94
5004b28L72r7K46l18L06l6m35Q9o7K12j18J35l38N27k52j72Q4K04m9RK7P8p8k07
5028a06J47L21n6l45p2j72K43k21K28J26m31K84K1J30k25K05k57M66k51J16l4
5049A17r1q2K04j25J73l10K54k25l2K16m23M29p6j82L67k10j91q3K11L60k12j22
5071c3l97N00k02L27j5l91O9K60n4L4k19M62k99k11N64m85J6J53r3L14l27j33
5093a60M58l97J88o6j86J49k3j00J41K8k05L07j58N1L56m94L18k00p8lK47n3m3
5116G7q9O2l0j02J00j03K68l75J01OJ97j7j81j32K24l65L67j16O5J47o4M0k82
5139b02N04m18J84M9Qk9l92K85q1L2L39j49K01j78l11K96j76l1P4j48L49j45p3
$$ plain form
5162 -12 -137 -53 39 -46 -83 -196 -309 -35 -338 18 9 24 46 -127 35 -121 184 44 -5 -253 -60 119 -111
5185 -111 219 182 -152 -6 -85 -34 -14 -66 108 145 121 250 206 -288 -225 -230 199 152 -142 41 -175 7 170 -208
5209 -208 -15 22 -123 3 -94 -318 114 -317 413 104 48 212 -209 78 -63 46 177 -261 96 -479 219
5230 219 191 -134 -194 101 20 -8 -109 -122 25 108 199 45 -11 -264 -203 -20 -213 149 185 -12 -136 -130 66 0
5254 0 -225 49 -24 89 204 179 -210 -183 95 -265 34 -45 6 -120 60 -141 -456 -106 -268 -165 -168 -249 204
5277 204 -58 -20 22 165 96 123 161 -95 102 -204 383 -82 87 1 7 202 -46 259 1 -129 207 50 -122
5300 -122 237 29 -36 -237 -64 -236 37 -191 -42 -313 157 -34 -69 284 -227 -237 220 -151 20 75 -43
5321 -43 -107 -125 100 239 168 -337 -27 -2 193 -152 -118 79 -54 93 102 21 -293 252 12 -90 325 -63 -212
$$ packed form
5162a2j25Q4R2q5l7j13j13K74l03L56rJ5K2j73J62j56L05j40m9k48J93J79k30
5185a11L30l7l34J46p9N1K0n2J74L7k4J29m4m94O3nM29m7k94J83k16J82J63l78
5209b08J93L7j45J26r7k24M32m31P30l09n6J64m21K87j41J09J31m38L57n75O98
5230B19k8l25o0K95q1k8j01j3J47Q3R1j54n6k53O1J83j93L62L6j97j24OJ96o6
5254@k25K74p3J13J15k5l89K7K78l60K99p9N1j26J80k01l15L50j62J03lq1M53
5277B04k62L8M2J43o9K7L8k56J97l06N87m65J69q6OJ95k48L05k58j30L36j57j72
5300a22L59k08o5k01J73j72K73k28J49k71M70j91l5L53n11j0M57l71J71N5j18
5321d3o4j8K25J39p1n05L10K5J95l45L4J97j33J47Rq1l14N45k40j02M15l88j49
$$ plain form
5344 -212 49 35 -15 -89 -370 -106 -84 26 162 82 -91 272 49 -72 -149 73 -1 -11 75 132 -116 -54 -149 100
5368 100 -217 20 85 -426 -10 -28 -95 50 302 -239 101 53 295 -165 -51 -48 -426 19 140 126 -8 -174
5390 -174 -68 -21 -110 17 22 320 -118 -77 70 -49 227 -122 355 149 254 -291 -360 30 24 162 78 -196 -97
5413 -97 128 26 -106 -102 53 4 248 -18 300 -132 -223 144 179 -99 -8 -81 27 -37 -246 28 171 25 -31
5436 -31 46 -36 -197 -49 -21 254 -53 114 -38 237 -60 -38 106 246 241 42 -67 29 90 126 302 -184 542
5459 542 -221 -160 286 -71 -63 136 44 98 -100 149 93 6 282 -359 -18 102 3 -246 19 17 40 220 -25 181
5483 181 142 -68 -127 68 -76 243 6 -37 218 -314 92 -244 -18 -8 -249 -239 -51 -296 174 -15 205 142
5505 142 240 -359 -179 -103 -264 130 27 2 -162 56 -32 117 -184 95 14 117 -19 -31 40 111 126 -52 -25
$$ packed form
5344b12K61j4n0p4k81K64K2J10J36q0j73L63k23j21p7K22p4j0Q6N7k48O2r5K49
5368A00l17K37O5n11M16j8o7J45K52n41L40m8K42m60J14Ll78M45J21j4j34j66
5390a74J06M7q9J27NK98m38M1J47j19K76l49M77k06J05n45o9L90oJ38q4k74R9
5413i7K25j02j32MJ55m9K44k66L18m32r1L67L5k78R1p3J08o4k09K74J43j46n6
5436c1P7q2j61J48K8K75l07J67j52K75k97K2J44J40nj99j09R6O1L6J76m86P26
5459E42p63O1M46l57QJ99r2N4j98K49n6q7K76o41L41J20r9k49K65kK3J80k45K06
5483A81l9k10n9J95j44L19k37m3K55n32M06l36K26J0k41J0J88k45M70j89K20o3
5505A42R8n99J80P6j61L94j03k5j64K18q8J49l01K79q1J03j36j2P1P1J5j78K7
$$ plain form
5528 -25 56 -207 -154 -67 69 128 -321 175 113 -121 -106 -32 -293 493 163 85 222 -71 -376 -99 -21 86 44 -14
5552 -14 206 -85 0 34 -81 -251 -35 87 124 26 13 -40 -1 135 126 -39 143 133 -4 -38 124 172 -90 472
5576 472 -130 110 -91 -44 79 124 31 221 -115 -55 24 138 231 -139 126 -84 105 -34 -276 -233 295 -214
5598 -214 286 27 -93 -36 -125 66 31 65 115 -9 169 -4 -177 185 33 -4 207 -74 127 243 255 -30
5620 -30 -122 -116 124 -22 -190 31 181 51 -11 18 172 15 -324 -38 -54 71 34 73 44 -131 -13 160 55
5643 55 -65 158 -15 20 -89 32 -37 339 -71 -47 252 -15 -233 110 -216 265 132 248 -188 -67 -100 -48
5665 -48 -26 -164 -64 51 40 -20 -53 -177 1 -261 -44 -119 274 -94 159 49 -294 -78 -91 49 133 130 193 29
5689 29 -300 262 312 -33 293 -21 114 206 209 238 211 -143 89 -126 124 212 138 166 -92 -112 -60 11 -84 -70 -191
$$ packed form
5528b5Q1k63N3Q7J36N9m49M96o2k34J5P4k61P86l30p8J37k93l05K77P8J07m2n8
5552a4K20k91Q5L4j15j70K16J22L7r8j3n3L9J36rj65J82j0j37l4J62M8k62N62
5576D72o02K40k01M7J23M5r3J90l36O0P9J14R3l70K65k10J89j39k42M3N28n09
5598b14N00k59j20N7q9J91l5L4N0j24J78j73j73L62j52l7K11k81K01J16J2k85
5620c0r2OK40j46j68K21J50j30o2K9J54j57l39K86j6J25l7L9k9j75J18J73j05
5643E5j20K23j73L5j09J21o9L76m10K4K99k67k18L43l26M81j33J16m36J21l3N2
5665d8K2j38J00J15j1o0l3j24J78k62K17p5L93l68K53j10l43K16j3J40Q4lO3j64
5689B9l29N62N0l45L26l14J35R2LK9k7l54K32k15K50Q8p4K8k58k0N2P1r5J4j21
$$ plain form
5714 -191 -153 -98 -13 -42 -279 346 220 -136 386 -78 -87 28 -75 117 212 28 2 -71 -155 -66 -332 213 6 -101
5738 -101 -170 145 122 176 -159 -10 -187 -37 108 100 -46 -173 -48 -179 -98 -110 59 127 84 -90 87 197 -89
5761 -89 -160 73 41 -84 191 138 78 49 -27 91 -56 -103 176 85 -5 -122 -159 -115 -116 73 32 53 -63 155 243 55
5787 55 -105 89 38 15 -148 -139 93 -92 302 -49 -31 63 182 -28 -83 253 -30 -11 24 321 229 -33 -312 -194
5811 -194 -123 85 71 44 65 34 -70 -148 235 -221 237 12 155 -71 -239 -20 -160 -18 33 83 132 160 8
5834 8 -3 98 -114 35 -139 -28 178 -7 -188 -96 205 11 -275 167 95 -66 -14 -92 -92 -303 0 260 -175
5857 -175 -41 11 -52 -41 -29 -169 287 134 -311 223 -175 -145 52 -216 -209 -11 339 -51 -105 23 -124 -50 395
5880 395 -48 92 404 -276 69 82 225 26 130 -59 -85 -183 215 -48 -58 -209 -19 -33 45 32 -215 63
$$ packed form
5714a91L8N5Q5k9k37O25j26l56N22m64rJ15j03J92R5j84k6p3q4Q9k66N45k07j07
5738a01o9L15k3N4l35J49j77J50J45qj46j27J25j31Q1j2J69O8m3j74J77J10k86
5761h9p1K33l2j25K75n3o0k9p6J18j47m7K79r1r0j17l7M4jJ89m1K1j16K18Q8j88
5787E5j60J94n1k3j63RK32j85L94l51J8R4J19k10n5L36k83J9L5K97r2k62k79J18
5811a94P1K08j4k7K1l1j04p8L83m56M58k25J43k26j68K19j40J42N1N0M9K8j52
5834Hj1J01k12J49j74J11K06j85j81R2L01j94k86M42p2j61N2p8%k11L03K60m35
5857a75J34N2o3J1J2j40M56j53m45N34l98L0J97k68PJ98L50l90n4J28j47P4M45
5880C95m43J40L12o80L45J3J43j99J04j89k6r8L98k63j0j51J90j4P8j3k47K78
$$ plain form
5902 63 140 26 16 161 55 37 -209 -220 -194 -343 -70 211 -209 413 277 187 129 -107 -57 23 -222 -101 142
5925 142 -30 19 -31 -19 193 272 258 32 272 -176 57 99 -50 -155 -19 -32 19 161 93 6 -43 243 -156 171
5949 171 38 -88 117 155 -142 -2 -10 184 67 -59 -235 -226 72 133 125 45 -2 -60 -25 -93 -73 2 11 -227 51 -141
5975 -141 -255 148 -162 273 26 42 -29 59 -154 79 134 -180 -5 -27 179 -61 171 -48 -11 -160 284 300
5997 300 31 184 21 254 541 162 182 85 37 -195 135 21 213 78 145 4 222 26 8 62 237 59
6019 59 -59 -63 -470 -188 3 -111 -197 78 114 -110 -298 300 -87 -125 -167 -74 -65 -16 168 -87 48 234 270 399
6043 399 -185 -45 54 234 74 46 -319 10 -50 -99 19 43 -108 -41 50 0 -159 -36 -464 42 -130 -205 -286
6066 -286 114 -113 386 120 -38 77 -156 133 -121 197 -19 -292 187 175 -114 -22 -166 216 70 193 -100
$$ packed form
5902F3P7j14j0J45j06j8k46j1K6j49K73K81m20O22j36r0n8k36N0Q0k45J21K43
5925A42j72M9n0J2K12P9j4k26K40m48K33M2j49j05J36j3N1J42o8q7m9K86l99L27
5949A71j33j26K05L8k97J40qJ94j17j26j76RK98O1qq0m7n8L5o8K0P5Rk38K78j92
5975a41j14M03l10M35k47J6p1Q8k13K33N5l14J75k2K06k40K32k19L7j49M44J6
5997C00k69J53j63K33K87l79K0r7m8k32L30j14J92j35O7j41K18j96j8N4J75j78
6019E9j18mm07K82J91j14q6K75L6k24j88N98l87l8m2R3RM9J84k55J35J86L6J29
6043C99n84J40R9J80j60k8l65L29o0m9J18K4j51O7R1n0j59J23m28N06j72p5q1
6066b86M00k27M99k66j58J15k33K89k54L18k16k73M79j2k89R2j44L82j46J23k93
$$ plain form
6087 -100 1 -313 68 -98 100 -73 -206 -46 273 223 23 -164 254 188 -71 -169 130 159 -165 111 53 165
6109 165 -208 171 -126 -52 204 32 -73 4 167 -123 -104 -199 272 -51 55 -118 -22 -43 153 -179 68 208
6131 208 -106 87 -278 23 0 136 336 84 85 -114 272 29 -265 112 38 173 279 -166 273 -157 -13
6152 -13 165 -377 -15 230 51 -193 -27 118 30 -9 30 -62 -62 -154 -496 13 -159 -234 -406 58 105 -55 133
6175 133 -36 56 5 104 -85 151 -94 96 46 -187 89 118 85 -41 -18 124 -285 62 -37 -124 -300 101 26
6198 26 -221 213 189 -120 126 -258 127 93 -76 -30 23 12 -142 -44 -29 85 163 -115 121 154 -232 -98 -189 62
6222 62 292 128 -303 68 85 -86 78 -217 53 -156 -60 144 -99 33 -157 46 -50 -243 179 -108 -257
6243 -257 -14 -142 -205 -58 163 -108 -273 25 425 21 -190 143 -37 -24 2 -119 -83 65 -46 62 206
$$ packed form
6087a00J01l14L81j66J98j73j33J60L19n0k00j87M18o6k59r8K99K9l24K76n8J12
6109A65l73L79k97P4K56j72j05P7J63k90J9r5M71l23J06j73R6k1J96l32K47J40
6131B08l14J93l65L01k3J36K00k52Jj99L86k43k94L77p4J35J06m45M39m30J44
6152a3J78n42L62K45j79k44J66J45q8l9L9r2%r2l42N09j72p5j72M64M7j60J88
6175A33j69R2n1R9j89K36k45J90n0k33K76K9l3j26K3J42m09L47r9q7j76M01p5
6198B6k47M34k4l09K46l84L85l4j69M6N3j1j54R8J5J14P8k78K36L3l86J34r1K51
6222F2K30j64m31L71J7j71J64k95K70k09R6K04k43J32j90K03r6j93M22k87j49
6243b57K43j28o3J47K21k71j65K98M00m04k11L33j80J3K6j21L6J48j11J08J44
$$ plain form
6264 206 55 39 54 162 -28 246 -86 -113 -271 7 88 -222 -23 93 -182 131 390 16 -350 151 87 95
6286 95 230 3 18 330 137 -39 -46 23 33 76 83 -55 135 34 32 198 44 -140 216 -155 67 46 98 -243
6310 -243 86 51 -53 42 -85 89 -220 -161 -103 -341 -23 -65 -58 -34 -3 -221 -64 129 179 257 -107 151 30 -189
6334 -189 -21 34 -28 -189 60 443 -126 -57 85 212 7 -134 -72 -152 -29 67 -121 302 -237 -138 118 -155
6356 -155 -268 335 62 -176 44 -60 -69 69 73 220 -490 -266 109 164 -16 37 -24 -76 -63 63 142 110 -63 -26
6380 -26 3 -108 -204 146 61 -96 33 43 193 -18 -22 -237 -122 282 -264 53 -148 204 -44 2 -103 74 115
6403 115 351 -34 -44 8 140 82 73 -214 -173 25 -143 197 -76 -234 65 86 -171 354 -189 -122 -41 -147 -34
6426 -34 131 -151 53 -133 182 160 -52 106 44 -24 28 0 299 -29 19 5 6 -14 101 47 -37 -145 -23 78
$$ packed form
6264B06j51j6J5J08j90K74l32k7j58K78Q1l10J99J16k75L13K59l74l66N01o4Q
6286I5J35k27J5L12j93j76pO9J0M3Pj38J90j01kJ66j54j84L56l71K22k1N2l41
6310b43L29l5j04R5j27J74l09N9N8k38L18m2PK4L1k18J57J93N0P8l64K58j21k19
6334a89J68N5o2j61K49L83n69O9J42J27k05j41O2q0J23R6j88M23n39R9K56k73
6356a55j13O03k73k38K20j04rJ38MJ47p10K24L75N5j80N3o1n2J3J26P9l2j73L7
6380b6K9j11r6L50q5j57J29J0J50k11mk15J15M04n46L17k01L52k48M6j05J77M1
6403A15K36l85j0N2J32n8rk87M1J98j68L40k73j58K99K1k57N25n43O7Q1j06J13
6426c4J65k82K04j86L15k2k12J58o2o8N2k8K99l28M8j4Jk0J15n4q4j08J22J01
$$ plain form
6450 78 -13 69 15 50 239 -63 -18 -31 -318 -270 227 15 47 -79 -65 212 -1 -50 -172 174 31 300 140 4
6474 4 18 -327 141 277 235 25 213 -22 268 374 85 23 -62 161 40 -101 60 -157 -20 -29 115 201 149
6497 149 -302 -45 -23 -54 -12 -86 -147 146 0 4 114 -354 -60 173 -128 26 -31 103 101 56 76 110 241 37
6521 37 -184 182 100 -201 55 -449 -38 -1 163 26 -25 45 52 -42 -36 258 197 26 -62 -72 138 37 -255 -45
6545 -45 92 29 -34 178 216 -262 177 -8 -21 98 31 191 270 -90 -24 -30 -54 -67 -67 -221 182 24 -266 -24 -298
6570 -298 28 -309 -167 38 63 -292 -133 -201 -60 119 -125 -16 305 14 -65 138 74 101 13 -168 -207 -16
6592 -16 7 -113 -19 -67 28 -7 -46 359 46 -225 -207 -121 75 32 261 53 -32 120 -36 9 145 -44 159 -23
6616 -23 0 -86 84 -167 -284 -55 -102 14 -196 123 -67 73 54 289 106 -206 -228 -96 -188 -145 63 -140 -16
$$ packed form
6450G8r1Q2n4L5J89l02M5j3k87M8M97k12L2j26J4K77k13m9j22L46j43K69j60j36
6474DJ4l45M68J36m2k10J88k35K90J06k89o2q5K23j21j41J61k17J37rJ44Q6n2
6497A49m51K57K2l1M2p4o1K93j46MJ10m68K94K33l01J54n7J34km5K0L4J31k04
6521C7k21L66q2l01K56n04M11L7J64j37n1P0Pr4OK94o1j71q8j0K10j01k92K10
6545d5J37o3o3K12L8m78M39j85j3J19o7J60P9l60O6ok4j3%j54M03j58k90K42k74
6570b98L26l37J42K05K5l55J59o8J41J79k44J09L21k91p9K03o4K7q8j81l9J91
6592a6K3j20R4m8R5l5l9M05l13k71J8Q6J96m3K29k08q5J52j56M5J36j89K03j82
6616b3K3q6J70k51j17K29m7J16k10L19j90J40j9K35j83l12k2J32r2M3K08k03J24
$$ plain form
6639 -16 -11 178 -16 95 -7 197 81 237 123 256 102 -100 204 -61 130 -108 -70 -124 -21 165 -250 187
6661 187 -23 -161 -7 -150 21 -72 -212 -81 -281 -24 -302 -38 -203 -84 -200 -37 -27 74 -100 -254 -228
6682 -228 -172 -139 -17 -31 -54 143 129 96 -33 -280 248 138 77 39 -110 -105 -164 151 5 85 -179 105 188 28
6706 28 28 176 52 182 -101 -77 433 310 9 107 -253 240 -29 -202 109 -85 166 343 -317 -78 -246 111
6728 111 55 11 -184 131 87 -31 -148 132 210 -132 60 -45 153 -197 -140 -26 83 -125 481 -210 6 -108
6750 -108 -76 -173 -35 -170 -192 -176 -88 -6 230 77 95 141 -18 74 30 -128 -126 147 305 -204 -25 35 79 1 -34
6775 -34 325 -103 -233 207 31 4 237 -61 -108 -46 236 23 131 -134 156 7 -127 2 -390 133 195 -27
6797 -27 -207 -174 22 125 -58 128 -135 177 22 -1 80 -94 261 -116 148 246 -92 282 256 -36 -65 -53 -19
$$ packed form
6639a6NJ89j94J11j02K04j16J56j14J33j54k02L04k65J91k38L8n4J03J86m15M37
6661A87k10j38J54j43J71r3j40J31k00K57k78K64j65J19j16J63J0J01j74j54K6
6682b28N6L3J22j4k3J97j4l3j29k47N28j10o1l8j49Nn9L15j46Q0k64K84Q3j60
6706B8%J48j24J30k83K4N10j23l01R8l60M93k69j73L11j94K51J77o60K39j68L57
6728A11n6m4j95L15m4j18j17K80P8l42J92j05J98l50N7J14J09k08O06o91K16j14
6750a08L2r7J38j35k2J6Q8Q2K36j53J8M6j59R2m4j58KK73J58n09J79O0M4p8l5
6775c4L59m28j30M40j76k7K33k98m7O2K82k13J08k65K90j49j34J29l92N23O2k22
6797b7j80L3J96J03j83J86k63L12j55k3Q1j74L55l77K64R8l38L74k6k92k9J2L4
$$ plain form
6820 -19 64 35 -15 26 106 -14 30 148 -149 -137 43 230 123 147 -177 9 -146 79 -1 271 -206 8 -71 -44
6844 -44 -200 216 52 -77 -163 -50 97 -310 -126 -76 -86 -8 9 -239 -28 -162 7 -214 15 -17 -28 88 51
6867 51 -172 58 -8 -50 201 -239 206 131 48 -97 41 -206 -172 -48 -56 86 73 132 -201 -34 -31 -200 120 28
6891 28 -248 3 99 101 91 119 87 12 100 -192 -107 -74 64 -11 179 -55 -405 -147 -13 296 245 -149 42 -125
6915 -125 138 -234 -165 136 251 268 126 93 -25 314 -253 83 -34 6 -234 -76 123 15 -90 -193 -205 -179
6937 -179 145 -131 37 43 -9 75 -121 -77 82 175 53 -153 5 119 -231 48 255 148 115 -275 -100 237
6959 237 90 -373 220 -152 -73 92 89 -332 -219 52 -155 -25 -82 56 53 113 81 43 -40 300 232 -108 -105 -56 92
6984 92 48 179 -44 186 189 -109 97 268 2 4 202 -166 -24 233 -114 81 20 228 53 -67 -33 -156 -150
$$ packed form
6820a9Q3k9n0M1Q0j20M4J18k97J2J80J87j07K4l24J86j55K25q0K72m77K14p9K7
6844d4j56M16j64j29q6J13J47m07J84N0j0P8J7k48K11j34J69k21K29l2j1J16l7
6867E1k23K30o6m2K51m40M45p5q3j45J38k47L4J24qJ42j3N9l33J67Lj69L20r2
6891B8k76K51R6Kj0K8l2p5Q8k92Q5L3J38p5J90k34l50K58J34L09n1l94J91j67
6915a25K63l72O9L01J15J7j42l3j18L39n67L36j17M0k40J58J99j08j05j03j2K6
6937a79L24k76J68On2Q4j96M4J59R3j22k06J58J14l50K79K07j07l3l90J75L37
6959B37j47m63N93l72P9J65lm21J13K71k07J30n7J38lO0l2l8q3L40o8l40LM9J48
6984I2m4J31k23K30Lk98K06J71k66KJ98l68J42K57l47J95o1K08j75j20L4j23O
$$ plain form
7007 -150 -90 -337 51 107 -21 80 470 7 58 86 -250 84 -314 331 -174 -21 -84 203 -82 4 77 -62
7029 -62 236 275 -43 179 -178 -31 -82 68 -78 89 -154 -145 -252 0 255 -96 -258 22 -180 -105 -45 -61 -310
7052 -310 144 -1 -49 177 79 17 -15 196 319 -12 -28 275 267 -115 -225 -248 -65 108 -20 -34 -61 -296 -60
7075 -60 106 -159 59 -43 -120 173 139 -64 339 89 108 -74 -76 53 -45 88 -144 -115 -7 -48 198 -181 -32
7098 -32 -104 -5 112 -105 -121 -121 -213 18 -145 -10 -285 203 -132 66 30 210 112 -160 218 120 -84 92 -241
7121 -241 -74 180 93 25 -73 41 -21 61 132 147 108 98 2 147 144 -192 -99 -66 -7 -210 -37 37 -26 280 193 6
7147 6 -35 -371 -121 46 232 -239 102 54 247 260 72 310 65 118 -80 299 -194 142 -21 -225 -20 6
7169 6 109 -16 -147 51 -135 16 -156 -49 136 65 61 100 1 -61 -53 131 -232 -207 -130 64 10 -109 2 145
$$ packed form
7007a50O0k47L88N6j28J01L90m63N1K8l36L34l98O45n05J53o3K87k85Q6P3j39
7029f2K98L9l18K22l57J47n1J50j46J67k43Rj07K52K55l51j62K80k02P5O0j6k49
7052c10M54j45m8K26r8o2l2K11J23l31j6L03ql82j10k3J83J73j28j4k7k35K36
7075f0J66k65K18j02p7K93l4k03M03k50J9j82kJ29r8J33k32K9J08m1K46l79J49
7098c2p2R9J17k17j6%r2K31j63J35k75M88l35J98l6J80r8k72L78r8k04J76l33
7121b41J67K54q7o8r8J14o2Q2P1J5l9j0r6J45ll36R3L3N9k03J73P4o3L06q7j87
7147Fm1l36K50J67J86m71L41m8J93J3j88K38k45N3j98L79m93L36j63k04K05K6
7169FJ03j25j31J98j86J51j72J07J85p1mL9r9o2QJ84l63K5P7J94n4j19J11J43
$$ plain form
7193 145 19 -235 -125 -101 13 -139 75 -97 -70 -271 -149 19 -43 -98 -35 -104 -19 239 -97 -170 -70 -57 -297
7216 -297 293 139 -160 138 -138 -6 171 248 84 284 -1 -34 -141 68 108 45 160 86 -109 91 76 -58
7238 -58 -103 -134 -131 11 214 -101 -38 -140 43 22 70 253 -117 294 -135 35 61 -130 23 79 -246 273 -96
7261 -96 -54 147 89 -81 52 -6 37 -13 -306 -79 -169 -192 -31 44 113 13 -106 -86 -126 -157 -84 204 99 -176 -92
7286 -92 -41 12 -321 -39 -15 -239 26 -157 -13 -203 -356 -225 -321 93 60 365 28 -101 168 -128 -65 -69 83
7309 83 45 88 385 -59 -160 132 47 1 -189 144 187 -25 123 -142 -237 73 -64 -173 -23 59 474 135 239
7332 239 14 -212 190 -228 -52 139 498 -184 25 46 -213 28 -273 54 373 -200 138 -216 -48 -76 119
7353 119 145 -77 -91 2 27 31 -45 -180 170 -281 -288 -352 -54 94 161 -148 -81 -167 159 69 -18 173 -263 208 -111
$$ packed form
7193A45j26k54J10K4J14j52K14j72K7k01J22J68o2n5O3o9Q5K58l36p3J00J3k40
7216b97N90j54k99K98k76J32J77P7j64K00k85l3j07K09M0o3J15p4j95K00j5j34
7238e8m5l1LJ42K03l15O3j02J83k1M8J83l70M11m29J70K6j91J53N6l25N19l69
7261i6M2K01n8j70J33n8M3n0k93K27r0k3J61P5O9j00j19K0m0l1P3K88j05k75Q4
7286i2N1N3l33K82K4k24K65j83J44j90j53J31r6M14l3L05l37j29K69k96O3mJ52
7309H3l8M3K97m44j01K92q5m6j90L33M3k12J48k65r5L10j37j09J50Q2M15l39J04
7332B39k25k26M02m18J76J91L59o82K09K1k59K41l01L27L19n73L38l54J68k8J95
7353A19K6k22j4R3K5Mp6j35L50m51po4K98J48O7l09O7q6L26r0q7J91m36M71l19
$$ plain form
7378 -111 213 -95 202 115 -242 6 179 210 59 95 -228 -318 2 33 167 97 -44 9 -4 37 72 199 -280
7401 -280 -93 199 -252 -17 352 -239 193 60 163 -272 -323 227 -56 -142 -125 -314 -129 145 -24 199 -205
7422 -205 34 -33 43 111 52 163 -19 209 -223 98 64 -131 370 -137 -223 -16 169 -84 57 -168 -235 383
7444 383 -169 -73 -47 -118 -195 -171 149 128 -305 -103 -242 -122 -32 157 -9 438 121 93 -182 -98 192 10 -9
7467 -9 51 101 55 90 -47 15 69 -77 -22 7 70 -47 77 130 -399 39 -49 -116 -104 102 -39 -53 150 100 -128 65
7493 65 -50 94 118 133 54 -4 -44 27 -262 61 42 -39 -160 132 8 29 102 218 80 269 -133 -62 33 -208
7517 -208 46 -126 21 104 165 -118 -52 -15 -323 -152 279 107 45 -237 176 92 113 182 -18 197 112 203 -117
7540 -117 46 -30 79 -373 82 133 -153 -140 -329 -18 -80 313 66 -51 44 47 -31 -10 8 165 -162 26 89 129
$$ packed form
7378a11L24l08K97q7l57K48J73L1j51L6l23r0L20L1J34p0j41N3j3M1L5J27m79
7401b80J87K92m51K35L69n91M32j33J03m35n1N50k83q6J7j89J85K74j69K23m04
7422b05K39o7P6O8n9J11j82K28m32L21l4j95N01n07q6K07J85k53J41k25o7O18
7444C83n52R6K6p1p7K4L20k1m33K02j39J20R0J89j66M47l17k8k75Q4K90j82j9
7467iO0N0m6L5j37O2N4j46N5K9O3j17J24N3n29M38q8o7J2K06j41j4K03n0k28J93
7493F5j15J44K4J5p9n8m0P1k89L23j9q1j21K92j24K1P3J16j38J89m02P1R5k41
7517b08K54j72J47Q3O1k83O6L7l08J71M31j72o2k82M13q4K1O9k00K15q5R1l20
7540a17J63p6J09m52M55N1k86J3j89L11o2L93k47j17R5Lp8K1J8J57l27J88O3M0
$$ plain form
7564 129 -30 45 56 -220 13 -198 -114 -139 74 84 -150 -245 210 -84 27 -19 156 94 341 -21 116 -186 -346
7587 -346 -110 143 116 121 -95 42 -17 -256 197 206 112 204 -50 -139 -198 -102 -139 46 -76 123 -7 -58 107 -101
7611 -101 112 -66 -338 66 -150 -149 -360 -243 88 -77 -89 51 426 12 0 -83 102 -173 101 44 -6 -233
7633 -233 201 -71 50 130 -69 -51 3 -201 126 -275 126 -133 -267 -141 -204 288 162 -235 200 154 -82 -104
7655 -104 173 25 25 45 -93 188 118 -11 -30 183 59 162 -30 180 41 601 -267 -97 98 161 72 -133
7677 -133 -126 38 277 421 153 -49 25 130 -260 158 -57 202 -181 -267 129 -118 330 -25 434 -17 196
7698 196 -232 34 -285 -173 77 -184 -175 -33 59 -50 -80 -40 59 -202 -351 118 -90 27 75 150 -206 83 130
7721 130 39 -183 -69 48 -183 311 -62 -52 144 53 -121 53 -113 116 123 -275 -58 -92 -186 30 48 -159 -109
$$ packed form
7564A29j59P5J1k76K33k11Q4k5K13J0k34r5M55k94J11m6J75o2K47l62J37l02j60
7587c46K36K53k7Nk16J37n9k39M53Rr4R2k54q9n9R6l7J85j22J99j30n1J65k08
7611a01K13j78k72M04k16Jk11J17L31j65j2J40L75m14j2q3J85k75K74n7n0k27
7633b33M34k72J21Q0j99J8N4k04L27m01M01k59j34J26o3M92j26l97M35m6k36k2
7655a04K77j48%K0j38K81p0j29j9K13j24J03j92K10j39N60q68J70J95O3q9k05
7677a33PJ64K39J44k68k02P4J05l90M18k15K59l83q6L96k47M48l55M59m51K13
7698A96m28K66l19J12K50k61RJ42R2j09l0M0R9k61j49M69k08J17M8P5l56K89M7
7721A30r1k22J14J17k31M94l73J0J96r1j74J74j66K29Pl98K17l4r4K16J8k07N0
$$ plain form
7744 -109 385 -125 40 -43 -11 -51 152 28 29 225 -108 -75 285 95 65 -240 -39 292 87 -196 84 274
7766 274 74 281 204 -62 -358 -116 343 276 -88 -4 23 318 -3 -19 49 204 41 -10 -248 -85 -53 -94 217
7789 217 89 -87 56 135 102 -14 145 19 257 -225 -150 -39 208 84 31 -74 -159 -159 -3 -71 -111 57 -316
7812 -316 -132 -48 90 256 -40 -23 -132 -12 -94 -56 -212 129 43 58 171 -96 -67 8 30 -11 -79 147 122 193
7836 193 69 93 -260 -16 -61 -165 119 20 -183 -137 16 -78 0 214 -118 -226 -213 66 366 -35 155 216 197
7859 197 -76 282 -130 251 -34 -106 194 -72 74 -192 152 -331 -32 13 -120 341 -59 57 198 -179 -366
7880 -366 143 -138 -35 24 132 -290 -38 231 -26 225 141 8 -205 -43 -411 -29 140 -214 288 -217 -364
7901 -364 -79 -34 -189 157 148 -335 -160 -432 -132 -35 -55 14 -16 -255 -72 231 129 20 76 28 149 -266 132
$$ packed form
7744a09M94n10J65q3L2m0K03j24JJ96l33L3L60j90l0l05K01L31k05k83K80J90
7766B74k00K07p7k66k96K42M59o7l64Q4K7K95l21j6O8J55j63n1k38J63L2m1L11
7789B17j28j76J43P9l3j16J59j26K38m82P5J11K47j24n3j05q5%J56o8m0J68l73
7812c16J84Q4J38J66k96J7j09J20q2L8j56L41q6J5J13k67K9P5K2m1o8K26k5P1
7836A93j24K4l53K44m5j04K84r9k03M6J53r4P8K14l32j08J3K79L00m01J90O1j9
7859A97k73L58m12L81k85p2L00k66J46k66L44m83K99M5j33M61m00J16J41l77j87
7880c66N09k81J03N9J08m22K52K69k57K51q4j33k13J62l68L82J69l54N02n05j47
7901c64K85M5j55L46rm83J75k72L00R7k0O9l0k39J83L03j02j09N6m8J21m15L98
$$ plain form
7924 132 -169 252 187 39 197 87 91 248 306 171 -309 -189 -127 -64 153 -64 257 1 -213 176 146 218 -13
7947 -13 -7 -71 -13 -27 63 94 -60 21 -4 -151 79 -58 -16 -51 -104 44 88 18 -119 164 205 -25 77 -43 114
7972 114 -76 341 -49 233 66 -199 196 54 169 -24 279 -194 26 48 63 413 96 -28 -11 -77 -117 -56
7994 -56 -39 113 124 245 -115 -111 166 112 -60 224 43 -99 80 -225 -89 -45 -253 -13 -333 127 115 58 -166
8017 -166 -129 217 169 -133 -140 -53 338 254 421 -56 -235 65 74 61 289 107 -84 112 127 -43 59 35 96 -20
8041 -20 309 -72 40 -61 -70 -106 139 29 -298 152 -228 -110 540 -254 207 32 -7 90 299 45 12 -136
8063 -136 52 -5 103 415 -60 17 -15 -208 12 118 -170 -140 39 170 49 -281 239 74 -162 -164 90 198
8085 198 -124 62 123 212 97 135 -62 48 100 95 428 70 -85 115 -169 -15 251 208 386 -86 60 71 -10
$$ packed form
7924A32l01M21o5j48J58j10MJ57N8j35m80J20O2O3K17k17L21k56k14L89l0P2k31
7947a3Oo4N8j4R0L1j54Q1k5j47K30j37M2l5n3J48M4p0j37K83M1k30J02j20J57
7972A14j90M17l90K82j67k65L95j42J15j93L03m73K20K2J5L50l17j24J7o6m0O1
7994e6J7J52J1J21l60MK77n4j72K84j81j42J79l05J36M4k08K40l20M60j2n7k24
8017a66L7L46m8l02pQ7L91q4J67m77j79L00Rj3K28j82j91J96J5j70J02k4O1j16
8041b0L29l81J12j01rl6K45j10l27M50l80J18O50p94M61j75l9R7K09k54l3j48
8063a36J88n7J08L12m75P7l2j93K20J06k88L0J79J31j21l30N20j65k36kK54J08
8085A98l22J86O1Q9j15L8j97J10N2nL33l58j55K00k84J54K66m3J78m72J46J1q1
$$ plain form
8108 -10 39 -153 -189 122 -47 43 217 -135 140 149 44 -65 176 -95 43 186 51 -158 -82 233 -29 -72 42
8131 42 -333 -56 -99 -2 22 -555 14 -87 254 187 297 -340 303 107 -275 14 13 -338 -72 100 -294 -224 246
8154 246 80 -183 38 -76 191 -202 2 115 -219 -171 -234 -131 34 270 131 -281 42 -190 59 62 -20 152
8176 152 -518 122 -110 81 10 16 -167 88 -22 41 162 65 62 27 189
$$ packed form
8108a0M9j92l6L11j69R0J74l52K75Rj05j09K41k71J38J43j35k09P6L15k62m3J14
8131D2l75K77m3R7K4n77N69j01L41o7J10o37O43j96l82K89jl51K66J72l94P0M70
8154B46j66k63K21j14K67l93K04J13l34M8o3J03J65K36j39m12L23k32K49Lq2J72
8176A52o70O40k32J91p1Oj83K55j10O3J21r7ll5J62
8191A89
$$ Imaginary data points
##PAGE= N=2
##DATA TABLE= (X++(I..I)), XYDATA
$$ plain form
0 0 0 0 0 0 0 0 -8 8 -8 8 -16 16 -17 24 -30 32 -41 48 -57 69 -81 91 -107 124 -142 159 -184 208 -237 266
30 266 -299 337 -377 421 -470 524 -581 645 -716 793 -877 972 -1076 1192 -1321 1466 -1631
47 -1631 1821 -2036 2291 -2595 2960 -3412 3995 -4769 5848 -7470 10175 -15513 30066 -153049
61 -153049 -459585 -64983 249055 61913 -293127 -254995 -16188 47718 -65383 -110138 -124281
72 -124281 -156773 -106992 38602 21242 -183539 -245264 -24839 109464 -63900 -232390 -100716
83 -100716 70900 -17238 -168937 -81959 68998 -5606 -158243 -88478 80664 51473 -99308
94 -99308 -91600 29193 35789 -31778 4364 55566 -33832 -104449 41784 190302 46926 -185586
106 -185586 -99976 190107 214827 -57246 -183271 5176 178321 107725 -33039 -54698 -10282
$$ packed form
0@%%%%%%qJ6j6J6k4L2l3M1n4O2p3Q9j05J26j50J72j98K31k66L01l43L92m45N03
30B66n65O36p14P98q91R94j105J226j361J509j670J849k048K268k513K787l097
47a631L452l857M327m886N555o372P407q764J0617j3318J7645k5688M5579j83115
61a53049l06536L94602L14038j87142l55040L8132K38807O3906j13101m4755j4143
72a24281l2492M9781J45594j7360k04781o1725K20425J34303j73364j68490J31674
83a00716J71616q8138j51699Q6978J50957p4604j52637O9765J69142k9191j50781
94i9308P708J20793O596o7567L6142N1202q9398p0617J46233J48518j43376k32512
106a85586Q5610K90083K4720k72073j26025J88447J73145p0596j40764k1659M4416
$$ plain form
117 -10282 33188 95616 104486 -26087 -135974 -13719 184383 126302 -115244 -148149 70352
128 70352 163407 -1535 -114475 -7555 78112 -9078 -64061 32516 72745 -52773 -113812
139 -113812 19861 114917 761 -119758 -48546 64714 30805 -45717 -21123 14832 -35035
150 -35035 -51864 42416 79023 -44025 -125006 -6102 120166 42999 -95856 -67666 49030
161 49030 51988 -16926 -9290 24521 -23039 -54661 39631 110985 1272 -125482 -41146 126720
173 126720 99786 -67994 -98075 30570 86129 11928 -28604 9033 6512 -34270 3968 80053
185 80053 36142 -82399 -73552 61434 102257 -10380 -87663 -28103 45654 36183 5493 -4158
197 -4158 -31652 -49539 17377 93353 30060 -102340 -83765 75590 119683 -22538 -113669 -16841
$$ packed form
117a0282M3470O2428Q870j30573j09887J22255J98102n8081k41546l2905K18501
128G0352R3055j64942j12940J06920Q5667q7190n4983R6577M0229j25518o1039
139a13812J33673R5056j14156j20519P1212J13260l3909p6522K4594L5955m9867
150c5035j6829R4280L6607j23048q0981J18904J26268p7167j38855K8190J16696
161D9030K958o8914P636L3811m7560l1622R4292P1354j09713j26754Q4336J67866
173A26720k6934j67780l0081J28645N5559p4201m0532L7637k521m0782L8238P6085
185H0053m3911j18541Q847J34986M0823j12637p7283N9560P3757r471l0690r651
197d158k7494j7887O6916P5976o3293j32400J8575J59355M4093j42221r1131R6828
$$ plain form
209 -16841 89249 42661 -42353 -21198 32194 11326 -18869 21882 53445 1333 -44155 4888
221 4888 64912 37457 -15572 -5866 25075 15426 12611 47962 43820 -26727 -43344 50977 111453
234 111453 24893 -76072 -29421 85624 89472 -2211 -41225 1343 35130 37879 42910 24709
246 24709 -34605 -45964 45524 110694 25011 -95156 -58723 81067 105941 -13852 -87941
257 -87941 -22712 59613 47885 -7940 -29025 -20616 -4472 22978 34749 -5948 -51907 -25058
269 -25058 37667 32882 -28191 -39292 9322 20093 -23097 -25088 26066 25489 -42184 -55945 22941
282 22941 66660 -2731 -73892 -35773 44729 47318 -12185 -41506 -21182 6559 25157 28894
294 28894 -3513 -48216 -33804 39260 66997 -2676 -68775 -32647 48681 57805 -4691 -43065
$$ packed form
209a6841J06090m6588q5014K1155N3392k0868l0195M0751L1563n2112m5488M9043
221D888O0024k7455n3029R706L0941r649k815L5351m142p0547j6617R4321O0476
234A11453q6560j00965M6651J15045L848r1683l9014M2568L3787K749N031j8201
246B4709n9314j1359R1488O5170q5683j20167L6433J39790K4874j19793p4089
257h7941O5229Q2325j1728n5825k1085Q409J6144K7450J1771m0697m5959K6849
269b5058O2725m785o1073j1101M8614J0771m3190j991N1154n77o7673j3761P8886
282B2941M3719o9391p1161L8119Q0502K589n9503k9321K0324K7741J8598L737
294B8894l2407m4703J4412P3064K7737o9673o6099L6128Q1328R124o2496l8374
$$ plain form
306 -43065 -22229 15764 34444 27615 -6952 -41638 -23894 39826 59624 -4762 -61504 -22939
318 -22939 49449 45337 -17991 -37393 483 21809 5595 -1965 8486 -120 -22827 -10536 27224
331 27224 27816 -14715 -36128 -7090 25543 21060 -3488 -20277 -21962 -3575 26620 29645 -15459
344 -15459 -51901 -17639 44770 40918 -26257 -55667 -8630 37826 22208 -17071 -25073 -11111
356 -11111 -698 9634 19182 187 -35736 -31821 19193 43434 100 -48623 -32136 20849
368 20849 34683 -294 -30043 -25212 -2312 16094 17056 -4753 -31636 -26908 10932 31491 2995
381 2995 -34692 -28125 6343 20524 4016 -13757 -18455 -15295 -1745 17767 15058 -19734 -40848
394 -40848 -10039 33498 24767 -25156 -43651 -8261 27512 18802 -13896 -28055 -14830 6172
$$ packed form
306d3065K0836L7993J8680o829l4567l4686J7744O3720J9798o4386n6742L8565
318b2939P2388m112o3328j9402L7876K1326j6214p560J0451q606k2707J2291L7760
331B7224N92m2531k1413K9038L2633m483k4548j6789j685J8387L0195L025m5104
344a5459l6442L4262O2409l852o7175k9410M7037M6456j5618l9279q002J3962
356a1111J0413J0332R548j8995l5923L915N1014K4241m3334m8723J6487N2985
368B0849J3834l4977k9749M831K2900J8406R62k1809k6883M728L7840K0559k8496
381B995l7687O567L4468J4181j6508j7773m698L160J3550J9512k709l4792k1114
394d0848L0809M3537q731m9923j8495L5390L5773q710l2698j4159J3225K1002
$$ plain form
406 6172 16541 7369 -14590 -26397 -9494 16619 18130 -6325 -24905 -16282 5199 15994 8811
419 8811 -10563 -25692 -15860 15106 29265 -152 -36910 -27733 17675 35703 2012 -34353 -25429
432 -25429 10163 24794 7141 -16086 -21902 -9389 10808 19519 3404 -23213 -25143 3027 24817
445 24817 11166 -19289 -26835 -5220 16630 15705 -4139 -22719 -19607 3906 23172 10679 -20931
458 -20931 -29883 -2356 24420 14449 -15924 -24638 -6069 11293 10589 -330 -10535 -14962 -7934
471 -7934 10079 17744 -3 -24677 -20912 10074 27505 7088 -23579 -24340 4803 26586 14854
484 14854 -13145 -24165 -5820 20157 23192 -1000 -22320 -13837 13369 24722 8331 -13580
496 -13580 -15366 2405 18608 17306 554 -13720 -9778 9948 24360 13658 -10804 -18123 2296
$$ packed form
406F172J0369r172k1959j1807J6903K6113J511k4455j8580Q623K1481J0795p183
419H811j9374j5129R832L0966J4159k9417l6758R177M5408J8028l3691l6365Q924
432b5429L5592J4631j7653k3227n816J2513K0197Q711j6115k6617j930K8170K1790
445B4817j3651l0455p546K1615K1850r25j9844j8580L112K3513J9266j2493l1610
458b0931q952K7527K6776r971l0373q714J8569J7362p04j0919j0205m427P028
471g934J8013P665j7747k4674L765L0986J7431k0417l0667p61K9143K1783j1732
484A4854k7999j1020J8345K5977L035k4192k1320Q483K7206J1353j6391k1911
496a3580j786J7771J6203j302j6752j4274L942J9726J4412j0702k4462p319K0419
$$ plain form
509 2296 25166 20778 -4324 -18532 -5345 18522 23338 5137 -13896 -11514 8375 21824 13489
522 13489 -6039 -13400 -1979 14955 18438 5350 -9957 -11371 4260 20399 17397 -4377 -19340
535 -19340 -5554 20770 25315 1344 -20145 -11025 16116 25789 7657 -13350 -12109 6440 20724
548 20724 15590 -1892 -11739 -3908 13865 21201 9537 -8468 -11029 5488 21290 17195 -1386
561 -1386 -12529 -3070 16170 22600 7847 -11057 -11315 8403 24361 15031 -7641 -15172 804
574 804 19890 17632 -1173 -13482 -5947 10579 16758 6863 -7349 -12359 -1540 12876 14377 -142
588 -142 -15324 -11507 7900 18715 6749 -13987 -16738 1778 17882 12034 -7705 -16177 -4502
601 -4502 13100 15510 1831 -10976 -8528 6004 16736 12159 -2155 -9830 -918 15037 20197
$$ packed form
509B296K2870m388k5102j4208J3187K3867M816j8201j9033K382J9889J3449q335
522A3489j9528p361J1421J6934L483j3088j5307j414J5631J6139l002k1774j4963
535a9340J3786K6324M545k3971k1489R120K7141R673j8132k1007J241J8549J4284
548B0724n134j7482r847P831J7773P336j1664j8005k561J6517J5802m095j8581
561a386j1143R459J9240O430j4753j8904k58J9718J5958r330k2672p531J5976
574H04J9086k258j8805j2309P535J6526O179r895j4212n010J0819J4416J501j4519
588a42j5182L817J9407J0815j1966k0736k751J8516J6104n848j9739q472J1675
601d502J7602K410j3679j2807K448J4532J0732m577j4314p675Q912J5955N160
$$ plain form
614 20197 7759 -7528 -6032 10945 24398 17200 -1617 -8196 5608 23467 23511 6029 -7340
627 -7340 -708 18693 26159 12791 -4371 -4883 11391 23396 16576 -367 -6861 2065 14336 16166
641 16166 5753 -6247 -7416 2987 13590 10242 -4972 -15382 -7585 8175 10790 -4171 -18236
654 -18236 -15151 -1029 6289 -2118 -15538 -19932 -12185 -1373 787 -9263 -21911 -21782 -8059 3018
668 3018 -3232 -20434 -25940 -13336 2423 1655 -13444 -24496 -18213 -879 6717 -3979 -20398
681 -20398 -20836 -3337 10576 4375 -13569 -18752 -4814 10360 9103 -4362 -11937 -5577 6701
694 6701 11567 5670 -3913 -6270 1710 11684 12306 3236 -5433 -2843 7777 14334 9162 -2114 -6180
709 -6180 1313 12057 13242 2302 -8301 -5797 6839 12823 4800 -7560 -10736 -1990 8512 8074
$$ packed form
614B0197j2438j5287J496J6977J3453p198j8817o579J3804J7859M4j7482j3369
627g340O632J9401P466j3368j7162n12J6274J2005o820j6943o494Q926J2271J830
641A6166j0413j2000j169J0403J0603l348j5214j0410P797J5760K615j4961j4065
654a8236L085J4122P318q407j3420m394P747J0812K160j0050j2648J29J3723J1077
668C018o250j7202n506J2604J5759p68j5099j1052O283J7334P596j0696j6419
681b0398m38J7499J3913o201j7944n183J3938J5174j257j3465p575O360J2278
694F701M866n897r583k357P980R974O22r070q669K590J0620O557n172j1276m066
709f180P493J0744J185j0940j0603K504J2636N984q023j2360l176Q746J0502m38
$$ plain form
723 8074 -4013 -15112 -11794 2681 10150 -685 -17383 -18834 -2602 8617 821 -16100 -20947
736 -20947 -8885 3450 1441 -10269 -19250 -15054 -2613 3749 -3801 -16719 -18147 -5757 3989
749 3989 -887 -12233 -15378 -8162 -594 337 -3695 -9088 -11402 -6777 1930 4676 -4189 -13734 -10153
764 -10153 2651 8469 -394 -10712 -10135 -535 6783 4235 -3958 -10250 -7120 3695 9718 1905
778 1905 -11370 -12036 1304 11145 4699 -9339 -12100 -2830 7452 6686 -3522 -11415 -8206 2727
792 2727 8795 1783 -9671 -11820 -888 8613 4790 -6302 -10559 -4234 4575 5982 440 -6556
806 -6556 -7211 -158 7844 6754 -2772 -8451 -3159 7770 9481 1652 -5497 -4110 3579 10017 7705
821 7705 -667 -6315 -936 10406 12707 2731 -6539 -2504 8852 12644 5181 -2619 -2530 3493 8570
$$ packed form
723H074j2087j1099L318J4475P469j0835j6698j451J6232J1219p796j6921m847
736b0947J2062J2335k009j1710q981M196J2441O362p550j2918j428J2390R746
749C989m876j1346l145P216P568R31m032n393k314M625Q707K746q865r545L581
764a0153J2804N818q863j0318N77R600P318k548q193o292L130J0815O023p813
778A905j3275o66J3340R841o446j4038k761R270J0282p66j0208p893L209J0933
792B727O068p012j1454k149J0932R501l823j1092m257O325Q809J407n542o996
806f556o55P053Q002j090r526n679N292J0929J711p829p149J387P689O438k312
821G705q372n648N379J1342K301r976r270M035J1356L792p463p800Q9O023N077
$$ plain form
836 8570 8485 3119 -3928 -3465 5725 12243 6104 -5114 -6414 3121 9793 6028 -2734 -5841 -2084 3634
852 3634 6487 3009 -4953 -8544 -1231 8175 7002 -5450 -11643 -3997 6811 6519 -3342 -9025 -5881
867 -5881 1423 5683 2096 -5742 -9548 -3336 6332 6973 -3142 -10870 -4969 5883 7208 -805 -7113
882 -7113 -4515 2472 5522 3568 -1043 -4420 -2068 4120 7202 2750 -4102 -3571 2625 7094 5275
897 5275 -62 -2882 -1133 4276 7964 4809 -2514 -5113 1392 9387 8050 -1601 -6685 -922 7643
912 7643 8999 1574 -5573 -4706 3748 9341 5601 -3787 -7823 466 9831 7515 -3624 -8132 -1477
927 -1477 6739 6312 -649 -5355 -3781 1617 5735 3573 -2688 -6276 -1919 5203 5364 -1525 -5543 -2688
943 -2688 2517 3613 964 -2021 -3205 -2227 1138 4157 2050 -4354 -6239 -252 6205 3971 -4157
$$ packed form
836H570q5n366p047M63R190O518o139j1218j300R535O672l765q762l107L757N718
852C634K853l478p962l591P313R406j173j2452o193P646J0808k92r861n683L144
867e881P304M260l587p838l806O212R668O41j0115p728N901J0852J325q013o308
882g113K598O987L050j954m611l377K352O188L082m452o852N31O196M469j819
897E275n337k820J749N409L688l155p323k599O505P995j337r651n084N763Q565
912G643J356p425p147Q67Q454N593l740r388m036Q289R365k316j1139m508O655
927a477Q216m27o961m706J574N398M118k162o261l588M357P122J61o889m018K855
943b688N205J096k649k985j184R78L365L019k107o404j885N987O457k234q128
$$ plain form
958 -4157 -6856 -1652 4506 4415 -799 -5676 -5149 543 5937 3711 -4749 -8203 -1603 6636 5380 -4206
974 -4206 -8683 -2789 4980 5133 -1181 -6187 -4443 1027 4305 2357 -3340 -5917 -2072 4063 4815 -1491
990 -1491 -5790 -3244 2425 4141 965 -2982 -3762 -805 2941 3753 369 -3874 -3758 1475 4915 2612
1006 2612 -2712 -4378 -316 4109 4283 152 -4149 -3304 2607 5885 2753 -3358 -4955 774 5971
1021 5971 4159 -1703 -4433 -688 4126 4864 1075 -3046 -3010 1417 5789 4246 -2058 -4610 -47 5366
1037 5366 5159 -166 -3344 -867 3070 4655 3221 -543 -2452 -287 4595 5766 1057 -3631 -1589
1052 -1589 4508 6461 2270 -2353 -1804 2518 5397 4386 573 -1899 -696 3963 6635 3255 -2207
1067 -2207 -2545 3308 6951 4071 -1202 -1852 1348 5301 4466 1851 -1128 -1186 2247 5142 3871 -395
$$ packed form
958d157k699N204O158r1n214m877N27N692N394k226q460l454O600Q239j256r586
974d206m477N894P769J53o314n006J744N470L278j948n697k577L845O135P52o306
990a491m299K546N669J716l176l947p80K957L746Q12l384m243J16N233L440k303
1006B612n324j666M062M425J74m131m301Q45N911L278l132o111j597N729N197
1021E971j812n862k730L745M814P38l789m121L6M427M372j543o304k552M563N413
1037E366k07n325l178K477L937J585j434l764j909K165M882J171m709m688K042
1052a589O097J953m191m623N49M322K879j011l813k472J203M659K672l380n462
1067b207l38N853L643k880n273o50L200L953q35k615k979n8L433K895j271m266
$$ plain form
1083 -395 -2988 194 4884 4973 489 -2711 -825 2815 4675 2452 -1112 -2582 137 3775 4489 90
1099 90 -3677 -1644 3158 5044 1702 -2918 -2871 938 4681 3447 -863 -3464 -1057 3719 5165 647
1115 647 -3155 -1977 2598 4594 2241 -1546 -2069 809 3705 3669 1024 -1995 -1776 2570 4925 2586
1131 2586 -1623 -2037 1328 4302 2814 120 -1260 -510 1584 3386 3083 -500 -2874 -33 4382 4304
1147 4304 -654 -3502 -883 3722 4054 823 -2081 -2089 580 3061 2722 -531 -3736 -2099 2858 3994
1163 3994 -358 -4540 -2986 2042 3220 161 -3057 -2894 -740 1256 1153 -744 -3222 -3279 -186 1986
1179 1986 114 -4094 -4068 -520 1805 294 -2598 -3535 -2663 -269 703 -172 -3023 -4344 -1391 1839
1195 1839 1114 -2459 -4821 -2463 901 1281 -1105 -3530 -3502 -939 1165 958 -2322 -4577 -2403 1763
$$ packed form
1083c95k593L182M690Q9m484l200J886L640J860k223l564j470K719L638P14m399
1099I0l767K033M802J886l342m620M7L809L743j234m310k601K407M776J446m518
1115F47l802J178M575J996k353l787n23K878K896l6k645l019K19M346K355k339
1131B586m209m14L365K974j488k694j380P50K094J802l03l583k374K841M415p8
1147D304m958k848K619M605L32l231k904qK669K481l39l253l205J637M957J136
1163C994m352m182J554N028J178l059l218J63K154J996j03j897k478n7L093K172
1179A986j872m208K6L548K325j511k892r37Q72K394R72q75k851j321K953L230
1195A839p25l573k362K358L364L80k386k425K8K563K104k07l280k255K174M166
$$ plain form
1211 1763 2318 -1774 -4445 -2466 728 1545 -181 -2584 -3216 -1437 1064 2049 -1224 -3845 -2837 1056
1227 1056 2464 -550 -3589 -2821 -98 1064 -133 -1760 -2461 -2793 -624 1546 488 -3735 -4496 -832
1243 -832 2357 420 -3864 -4410 -1289 504 -299 -1816 -3170 -3402 -1952 271 519 -2833 -5228 -2500
1259 -2500 1197 1066 -3024 -5032 -2206 -2 -216 -1417 -2300 -3061 -2346 -335 832 -1146 -4458 -3458
1275 -3458 495 1720 -985 -3978 -2699 249 671 -10 -1455 -2092 -2201 -451 2310 1017 -2745 -3263
1291 -3263 478 3351 1175 -2231 -2305 244 1705 1468 153 -1179 -1750 -63 2864 2329 -1555 -2976
1307 -2976 283 3242 1890 -1458 -1751 6 1351 979 735 -344 -1450 -907 1668 2566 -319 -2801
1323 -2801 -1405 1811 1983 -680 -1982 -818 218 257 973 414 -1728 -2287 467 3057 1159 -3119
$$ packed form
1211A763N55m092k671J979L194Q17j726k403o32J779K501R85l273k621J008L893
1227A056J408l014l039P68K723J162j197j627p01l32K169K170j058m223p61L664
1243h32L189j937m284n46L121J793q03j517j354k32J450K223K48l352k395K728
1259b500L697j31m090k008K826K204k14j201q83p61P15K011J167j978l312J000
1275c458L953J225k705k993J279K948M22o81j445o37j09J750K761j293l762n18
1291c263L741K873k176l406p4K549J461k37j315j332n71J687K927n35l884j421
1307b976L259K959j352l348k93J757J345l72k44j079j106N43K575Q98k885k482
1323b801J396L216J72k663j302J164J036L9P16n59k142n59K754K590j898m278
$$ plain form
1339 -3119 -3065 1204 2888 739 -1884 -1389 167 392 1101 772 -1130 -2317 -218 3424 2303 -2383
1355 -2383 -3252 1004 3797 1211 -1787 -1185 1175 1536 1083 771 577 -671 -414 2478 2779 -14 -1969
1372 -1969 -84 2828 2079 -343 -582 612 853 547 1499 1386 -556 -1492 1399 3404 1681 -2118 -1619
1389 -1619 1812 2615 721 -1142 -600 224 736 1839 1570 -1449 -1966 463 3538 2088 -2471 -2099 1157
1406 1157 3087 871 -879 -732 383 819 1261 1492 -350 -1370 240 2831 2171 -1142 -1751 1521
1422 1521 2853 984 -475 478 667 76 732 1966 1439 -967 -1372 1868 3260 587 -1963 -367
1438 -367 1913 1606 -18 144 220 -270 25 1729 1684 -1154 -2558 824 3428 636 -2358 -1593 1510
1455 1510 1686 6 -1068 -324 -458 -650 805 1334 -977 -2739 -713 2298 1306 -1901 -2512 304 1888
$$ packed form
1339c119N4M269J684k149k623M95J556K25P09l29j902j187K099L642j121m686
1355b383q69M256K793k586k998O02K360L61m53l12j94j248K57K892L01k793j955
1372a969J885K912p49k422k39J194K41l06R52j13j942r36K891K005j723l799M99
1389a619L431Q03j894j863N42Q24N12J103k69l019n17K429L075j450m559L72L256
1406A157J930k216j750J47J115M36M42K31j842j020J610K591o60l313o09L272
1422A521J332j869j459R53J89n91O56J234n27k406m05L240J392k673k550J596
1438c67K280l07j624J62P6m90K95J704m5k838j404L382K604k792k994P65L103
1455A510J76j680j074P44j34j92J455N29k311j762K026L011r92l207o11K816J584
$$ plain form
1472 1888 -212 -836 -488 -232 -726 110 1382 -231 -1923 -1255 1485 2283 -860 -2186 -417 1145 930
1489 930 -470 -232 -585 -554 42 1732 755 -1769 -1753 1050 2478 -15 -1874 -775 1199 974 107 -4
1507 -4 -230 -631 -173 1698 1145 -801 -1963 55 2207 727 -1336 -1172 739 864 145 270 -126 -1078
1525 -1078 -954 966 2123 -234 -2301 -856 2002 1615 -1113 -1916 268 950 295 -328 -164 -521 -1319
1542 -1319 248 1808 236 -1989 -1243 1651 1601 -868 -1692 -151 1080 244 -392 223 168 -728 -244 1162
1560 1162 858 -1109 -1544 519 1789 -68 -1215 -889 99 505 -95 280 417 -1199 -982 885 1540
1577 1540 -240 -2069 -925 1395 1067 -859 -1496 -99 957 418 157 -426 -1310 -667 928 1729 -36
1594 -36 -1744 -1032 1534 1150 -877 -1344 127 990 381 -60 45 -462 -885 412 1094 165 -1160 -717
$$ packed form
1472A888k100o24L48K56m94Q36J272j613j692O68K740P98l143j326J769J562k15
1489I30j400K38l53L1N96J690r77k524J6K803J428k493j859J099J974k25q67j11
1507dk26m01M58J871n53j946j162K018K152j480k063J64J911J25p19J25l96r52
1525a078J24J920J157k357k067J445K858l87k728q03K184O82o55o23J64l57p98
1542a319J567J560j572k225P46K894n0k469q24J541J231q36o36O15n5q96M84J406
1560A162l04j967m35K063J270j857j147L26R88M06o00L75J37j616K17J867O55
1577A540j780j829J144K320l28j926o37J397J056n39k61n83q84O43J595Q01j765
1594c6j708P12K566l84k027m67J471Q63o09m41J05n07m23J297O82r29j325M43
$$ plain form
1612 -717 744 1285 -484 -864 -51 381 -38 510 737 156 -1165 -381 1320 1547 -845 -1471 211 1282
1630 1282 597 -729 -756 -223 -294 634 1184 -148 -1578 -804 1631 1175 -575 -1617 -355 1376 936 -649
1648 -649 -883 183 -77 299 433 173 -848 -890 770 1322 -73 -1341 -738 962 1008 -296 -534 -110
1666 -110 300 23 513 333 -266 -815 203 1139 541 -523 -870 374 746 513 -250 -517 -451 -9 500
1685 500 563 -301 -1520 -453 906 1275 -533 -1129 -341 814 886 -234 -405 -628 13 561 794 36 -1123
1704 -1123 -566 925 925 -279 -1249 -317 570 807 -135 -219 -498 -171 150 967 312 -722 -985 295 1312
1723 1312 70 -854 -638 112 534 272 -41 -317 -383 17 633 820 -316 -1143 42 946 688 -928 -870
1742 -870 32 734 425 -42 -226 -355 -246 401 1004 1 -1024 -617 998 1017 -290 -947 -505 518 743
$$ packed form
1612g17J461N41j769l80Q13M32m19N48K27n81j321P84J701K27k392o26J682J071
1630A282o85j326k7N33p1R28N50j332j430P74K435m56j750j042J262J731m40j585
1648f49k34J066k60L76J34k60j021m2J660N52j395j268O03J700M6j304k38M24
1666a10M10k77M90j80n99n49J018R36n98j064l47J244L72k33p63k67O6M42N09
1685E00O3q64j219J067J359L69j808n96P88J155P2j120j71k23O41N48K33p58j159
1704a123N57J491%j204r70R32Q87K37r42q4k79L27L21Q17o55j034k63J280J017
1723A312j242r24K16P50M22k62l13k76o6M00O16J87j136q27J185R04k58j616N8
1742h70R02P02l09m67j84j29J09O47O03j003j025M07J615J9j307o57M42J023K25
$$ plain form
1761 743 -114 -424 -377 -467 375 713 349 -550 -698 536 1072 357 -955 -904 392 467 246 -412 -888 -194
1781 -194 164 519 254 -608 -820 -221 719 104 -633 -683 32 518 126 -281 -383 -455 -605 554 393 -113
1801 -113 -926 -107 666 504 -34 -543 -348 96 111 233 -122 -719 -358 326 907 121 -772 -927 503 433
1821 433 -1 -587 -572 -214 82 358 -44 -415 -893 68 788 157 -632 -934 -101 1132 60 -513 -459 26
1841 26 457 237 8 -430 -768 123 803 400 -489 -879 86 716 531 -203 -604 -116 251 225 212 40 -452
1862 -452 -68 434 583 57 -1013 -862 680 634 -426 -513 -285 217 240 209 65 -465 -548 376 570 89 -770
1883 -770 -577 227 917 151 -451 -677 -62 295 -16 63 -494 -459 -44 342 387 -256 -625 68 402 509 -185
1904 -185 -337 -397 -83 584 166 -311 -422 -430 557 482 -436 -637 -10 309 331 49 -109 -92 219 447 548 -183
$$ packed form
1761G43q57l10M7r0Q42L38l64q99j48J234N36p15j312N1J296P5k21o58m76O94
1781a94L58L55k65q62k12N99R40o15p37n0P15M86l92m07j02p2j50J159j61n06
1801a13q13Q19P73j62n38n09J95M44J5J22l55n97L61O84N81p86q93j55J430p0
1821D33m34n86J5L58K96K76m02l71m78R61P20o31p89l02Q33J233j072n73N4M85
1841B6M31k20k29m38l38Q91O80m03q89l90R65O30j85p34m01M88L67k6j3j72m92
1862d52L84N02J49n26j070J51J542m6j060q7K28N02K3l1j44n30q3R24J94m81q59
1883g70J93Q04O90p66o02k26O15L57l11P9n57L5M15L86M5o43l69O93L34J07o94
1904a85j52o0L14O67m18m77j11qR87p5r18k01O27L19K2k82j58J7L11K28J01p31
$$ plain form
1926 -183 -629 -283 378 702 -3 -688 26 345 813 276 -183 -352 235 456 753 363 -294 -366 507 1030
1946 1030 611 -164 -380 548 460 156 -285 220 55 166 642 502 -80 -502 -156 757 849 100 -523 64
1966 64 657 479 -46 -488 40 12 684 542 203 -660 -440 729 473 -189 -607 -184 730 297 -15 -41 -254
1987 -254 -89 238 401 126 -202 -534 138 360 29 -425 -291 -183 542 135 -32 -152 -236 -100 397 514
2007 514 -483 -379 -8 348 620 -262 -544 -173 229 459 -11 -502 -565 -83 627 340 -607 -661 -157 340 633
2028 633 -429 -607 -233 238 172 299 -203 -194 -82 329 456 11 -535 -305 472 552 -307 -502 -404 496 360
2049 360 -156 25 -493 -368 -119 565 298 -299 -579 -229 660 524 -422 -663 -146 507 200 238 -118 -317
2069 -317 -509 548 640 25 -537 -220 593 616 12 -643 -278 261 337 135 -322 -361 -173 319 367 -65 -608
$$ packed form
1926a83m46L46O61L24p05o85P14L19M68n37m59j69N87K21K97l90o57p2Q73N23
1946A030m19p75k16R28q8l04m41N05j65J11M76j40n82m22L46R13R2p49o23N87
1966F4N93j78n25m42N28k8O72j42l39q63K20J169k56o62m18M23R14m33l12k6k13
1987b54J65L27J63k75l28l32O72K22l31m54J34J08P25m07j67j20q4J36M97J17
2007E14r97J04L71L56K72q82k82L71M02K30m70m91o3M82P10k87r47n4N04M97K93
2028F33j062j78L74M71o6J27n02RJ12M11J27m45n46K30P77Q0q59j95R8R00j36
2049C60n16J81n18J25K49O84k67n97k80L50Q89j36r46k41N17O53l07L8l56j99
2069c17j92J057R2o15n62L17Q13K3o04o55L65N39P6k02m57l9J88M92M8m32n43
$$ plain form
2090 -608 -452 560 514 70 -606 -9 76 -128 -55 -81 -645 -252 -63 540 -189 -555 -284 -28 219 70 -187
2111 -187 -801 -291 287 103 21 -333 -397 -20 494 420 -557 -988 -84 592 118 -451 -151 135 103 120 72 -214
2133 -214 -357 -346 501 510 -505 -857 -218 263 392 -68 -324 -304 122 162 520 271 -537 -500 83 761 518 -331
2155 -331 -101 211 580 -56 -244 65 -144 325 191 119 122 -181 -199 630 495 -109 -417 -110 627 135 -311
2176 -311 -536 -50 277 180 160 268 -221 -265 490 561 -65 -91 -120 214 87 75 -158 -190 -185 335 379 148 -219 -611
2200 -611 325 623 43 -834 -517 -30 544 192 -198 -261 -355 -65 48 28 -485 -516 -29 394 61 -187 -165 194
2222 194 185 43 -265 -201 -276 -239 135 26 -178 -1024 -215 520 271 -444 -490 -111 137 60 -80 -441 153 -347
2244 -347 -352 -20 263 -512 -337 154 48 -231 -544 -416 -60 16 -163 -37 -475 -297 246 386 -2 -471 -557
$$ packed form
2090f08J56J012m6m44o76N97Q5k04P3k6n64L93J89O03p29l66K71K56K47j49k57
2111a87o14N10N78j84q2l54o4L77N14p4r77m31R04O76m74n69L00K86l2J7m8k86
2133b14j43J1Q47Rj015l52O39M81J29m60k56K0M26M0L58k49q08L7N83O78k43q49
2155c31K30L12L69o36j88L09k09M69j34p2Ll03j8Q29j35o04l08L07P37m92m46
2176c11k25M86L27r7k0J08m89m4P55P1o26k6k9L34j27j2k33l2NN20M4k31l67l92
2200f11R36K98n80q77L17M87N74l52l90o3r4K90J13k0n13l1M87M23l33k48K2L59
2222A94rj42l08O4p5L7L74j09k04q46Q09P35k49p15m6L79K48p7j40l61N94n00
2244c47nL32K83p75J75M91j06k79l13J28L56P6j79J26m38J78N43J40l88m69q6
$$ plain form
2265 -557 53 392 -17 -590 -458 14 184 -164 -224 -220 -131 -218 -193 294 -480 -75 -285 259 82 -454 -212 -256
2287 -256 0 156 -289 -164 -21 -225 227 152 -21 -16 18 171 389 -62 -41 140 137 435 209 138 -214 -71 104
2310 104 554 342 -241 -146 411 821 255 -654 -293 119 338 460 -215 -82 21 93 97 12 -326 -458 -312 235
2332 235 -34 -287 -357 -33 -199 -156 98 -372 -303 -554 -35 233 -193 -497 -172 268 277 -621 -405 -118 97 -177
2354 -177 -243 -329 -142 -305 -191 365 153 -352 -390 254 484 141 -88 -86 111 275 486 4 -164 125 534 748
2376 748 7 89 236 168 466 363 -61 206 396 281 486 477 377 533 110 417 699 566 -233 385 725
2397 725 554 169 -378 49 471 269 152 244 91 70 307 266 -280 -178 -190 118 330 223 62 225 35
2418 35 -131 7 185 208 -452 294 549 -186 -132 -69 223 217 201 -230 23 312 363 175 13 -27 -161 -34 385
$$ packed form
2265e57O10L39m09n73J32M72J70l48o0MQ9q7K5M87p74M05k10N44j77n36K42m4
2287b56K56J56m45J25J43k04M52p5j73NL4J53K18m51K1J81lK98k26p1l52J43J75
2310A04M50k12n83R5N57M10n66r09L61M12K19J22o75J33J03P2Mq5l38j32J46N47
2332B35k69k53p0L24j66M3K54m70O9k51N19K68m26l04L25M40Rq98K16K87K15k74
2354a77o6q6J87j63J14N56k12n05l8O44K30l43k29KJ97J64K11m82j68K89M09K14
2376G48p41Q2J47o8K98j03m24K67J90j15K05rj00J56m23L07K82j33p99O18L40
2397G25j71l85n47M27M22k02j17R2j53k1K37m1n46J02j2L08K12j07j61J63j90
2418C5j66J38J78K3o60P46K55p35N4O3K92oj6m31K53K89N1j88j62m0j34J27M19
$$ plain form
2441 385 239 -256 104 230 409 448 -426 242 -76 103 447 137 213 -285 -68 239 716 -149 -107 -27 590
2462 590 216 -329 -35 148 410 190 -10 129 271 -35 -43 277 75 99 -156 146 494 215 193 110 64 438
2484 438 254 384 13 10 155 165 381 -253 105 291 157 171 38 -173 -89 66 7 -10 95 -9 -178 221
2506 221 385 43 -391 -191 -19 319 -276 62 -190 -251 124 127 -178 -132 -29 458 214 -308 -425 -16 90
2527 90 -154 -122 -222 -111 -362 -202 259 407 -42 -367 10 184 57 -317 -615 -35 197 12 -145 -117 -310
2548 -310 -371 -163 34 -342 -380 -404 -81 -235 -428 -183 -73 114 -280 -73 133 -375 -196 10 93 -148 -662
2569 -662 -495 119 160 -83 -325 -212 -255 -178 -249 164 30 277 54 62 62 -144 30 -131 522 -2 -190 -465 5
2592 5 188 214 179 -197 -228 -164 234 -285 -271 -217 194 343 58 -193 -146 -162 -19 26 71 20 6 -304 128 251 -4
$$ packed form
2441C85j46m95L60J26J79L9q74O68l18J79L44l10P6m98K17L07M77q65M2Q0O17
2462E90l74n45K94J83K62k20k00J39J42l06qL20k02K4k55L02L48k79k2q3m6L74
2484D38j84J30l71lJ45J0K16o34L58J86j34J4j33k11Q4J55n9j7J05j04j69L99
2506B21J64l42m34K00J72L38n95L38k52o1L75Ll05M6J03M87k44n22j17M09J06
2527I0k44L2j00J11k51J60M61J48m49l25L77J74j27l74k98N80K32j85j57K8j93
2548c10o1K08J97l76l8k4L23j54j93K45J10J87l94K07K06n08J79K06Q3k41n14
2569f62J67O14M1k43k42J13m3P7p1M13j34K47k23Q%k06J74j61O53n24j88k75M70
2592EJ83K6l5l76l1O4L98n19J4N4M11J49k85k51M7j6J43M5M5n1j4l10M32J23k55
$$ plain form
2617 -4 -392 -405 -1 254 136 -29 -489 -93 206 -27 -265 -1029 38 -11 -402 -178 -352 4 -95 -54 -258 -233
2639 -233 163 -80 -174 75 -262 -188 -469 -1 -158 -76 -321 -43 -279 51 265 -425 -315 237 209 -77 2 -40
2661 -40 -89 -158 -10 164 -15 -108 60 116 -204 104 33 -45 92 -91 312 152 24 10 322 507 228 -314 -103
2684 -103 89 337 -128 -269 214 -27 312 301 39 34 -121 -194 304 139 -140 -171 -96 -155 -44 -136 -239 -173 -26
2707 -26 -10 -2 -212 -470 202 215 -225 -71 -184 118 98 -237 -154 58 198 257 93 -102 -211 173 -75 143 145
2730 145 49 -24 -128 -33 107 48 167 172 179 73 260 262 -217 -286 118 509 -173 -264 -48 223 11 -258 7 -239
$$ packed form
2617dl88j3M04K55j18j65m60L96K99k33k38p64J067m9l91K24j74L56r9M1k04K5
2639b33L96k43r4K49l37P4k81M68j57Q2k45K78k36L30K14o90J10N52k8k86P9m2
2661d0m9o9J48J74j79r3J68N6l20L08p1p8J37j83M03j60j28j4L12J85k79n42K11
2684a03J92K48m65j41M83k41L39j1k62nj55p3M98j65k79l1P5n9J11r2j03O6J47
2707b6J6Qk10k58O72J3m40J54j13L02k0l35Q3K12J40N9j64j95j09L84k48K18K
2730A45r6p3j04R5J40n9J19NPj06J87Km79o9M04L91o82r1K16K71k12k69K65k46
$$ [...]
8191h
##END NTUPLES=NMR FID
##END=
