##TITLE=1H_CA-8570-5
 DMSO, 8 sc, 
 12.3.2019
##JCAMPDX= 6.0         $$ Bruker NMR JCAMP-DX V2.0
##DATA TYPE= NMR FID
##DATA CLASS= NTUPLES
##ORIGIN= UXNMR, Bruker Analytische Messtechnik GmbH
##OWNER= root
$$ XWIN-NMR		Version 3.5
$$ Tue Mar 12 17:00:34 2019 Russian Standard Time (UT+4h)  she@DPX200
##.OBSERVE FREQUENCY= 200.1316
##.OBSERVE NUCLEUS= ^1H
##.DELAY= (6, 6)
##.ACQUISITION MODE= SIMULTANEOUS
##.ACQUISITION SCHEME= undefined
##.AVERAGES= 8
##.DIGITISER RES= 18
##SPECTROMETER/DATA SYSTEM= spect
##.PULSE SEQUENCE= zg30
##.SOLVENT NAME= CDCl3
##.SHIFT REFERENCE= (INTERNAL, CDCl3, 0, 15.7039)
##AUDIT TRAIL= $$ (NUMBER, WHEN, WHO, WHERE, WHAT)
$$ ##TITLE= Audit trail, XWIN-NMR		Version 3.5
$$ ##JCAMPDX= 5.01
$$ ##ORIGIN= Bruker BioSpin GmbH
$$ ##OWNER= she
$$ F:/spectra/data/she/nmr/H-F/1/audita.txt
$$ ##AUDIT TRAIL=  $$ (NUMBER, WHEN, WHO, WHERE, WHAT)
(   1,<2019-03-12 16:59:37.23 +0400>,<she>,<DPX200>,
      <created by zg, POWCHK disabled, PULCHK disabled
       configuration hash MD5:
       00 E9 B6 7A A2 85 ED C7 34 08 36 98 17 FE 4E 26
       data hash MD5: 16K
       3E C1 97 66 F6 CA EE 2E 06 03 A5 1C 35 24 B9 0B>)
$$ ##END=
$$ 
$$ hash MD5
$$ 17 1B 2B 98 AD E8 8B 99 18 9E B6 6F 54 C8 73 46
##$RELAX= 
##$RELAX= 
##$RELAX= 
##$RELAX= 
##$RELAX= 
##$RELAX= 
$$ Bruker specific parameters
$$ --------------------------
##$DU= <F:/spectra>
##$EXPNO= 1
##$NAME= <H-F>
##$PROCNO= 1
##$TYPE= <nmr>
##$USER= <she>
##$AMP= (0..31)
100 100 100 100 100 100 100 100 100 100 100 100 100 100 100 100 100 100 
100 100 100 100 100 100 100 100 100 100 100 100 100 100 
##$AQSEQ= 0
##$AQ_mod= 1
##$AUNM= <au_zg>
##$AUTOPOS= <>
##$BF1= 200.13
##$BF2= 200.13
##$BF3= 200.13
##$BF4= 200.13
##$BF5= 200.13
##$BF6= 200.13
##$BF7= 200.13
##$BF8= 200.13
##$BYTORDA= 1
##$CFDGTYP= 0
##$CFRGTYP= 5
##$CHEMSTR= <none>
##$CNST= (0..31)
1 1 145 1 1 1 1 1 1 1 1 1 1 1 1 1 1 1 1 1 1 1 1 1 1 1 1 1 1 1 1 1 
##$CPDPRG= <>
##$CPDPRG1= <>
##$CPDPRG2= <>
##$CPDPRG3= <>
##$CPDPRG4= <mlev>
##$CPDPRG5= <mlev>
##$CPDPRG6= <mlev>
##$CPDPRG7= <mlev>
##$CPDPRG8= <mlev>
##$CPDPRGB= <>
##$CPDPRGT= <>
##$D= (0..31)
0 1.2 0 0 0 0 0 0 0 0 0 0.03 0 0 0 0 0 0 0 0 0 0 0 0 0 0 0 0 0 0 0 0 
##$DATE= 1552395576
##$DBL= (0..7)
120 120 120 120 120 120 120 120 
##$DBP= (0..7)
150 150 150 150 150 150 150 150 
##$DBP07= 0
##$DBPNAM0= <>
##$DBPNAM1= <>
##$DBPNAM2= <>
##$DBPNAM3= <>
##$DBPNAM4= <>
##$DBPNAM5= <>
##$DBPNAM6= <>
##$DBPNAM7= <>
##$DBPOAL= (0..7)
0.5 0.5 0.5 0.5 0.5 0.5 0.5 0.5 
##$DBPOFFS= (0..7)
0 0 0 0 0 0 0 0 
##$DE= 6
##$DECBNUC= <off>
##$DECIM= 24
##$DECNUC= <off>
##$DECSTAT= 4
##$DIGMOD= 1
##$DIGTYP= 9
##$DL= (0..7)
0 120 120 120 120 120 120 120 
##$DP= (0..7)
150 150 150 150 150 150 150 150 
##$DP07= 0
##$DPNAME0= <>
##$DPNAME1= <>
##$DPNAME2= <>
##$DPNAME3= <>
##$DPNAME4= <>
##$DPNAME5= <>
##$DPNAME6= <>
##$DPNAME7= <>
##$DPOAL= (0..7)
0.5 0.5 0.5 0.5 0.5 0.5 0.5 0.5 
##$DPOFFS= (0..7)
0 0 0 0 0 0 0 0 
##$DQDMODE= 0
##$DR= 18
##$DS= 0
##$DSLIST= <SSSSSSSSSSSSSSS>
##$DSPFIRM= 0
$$ [...]
##$SUBNAM2= <"">
##$SUBNAM3= <"">
##$SUBNAM4= <"">
##$SUBNAM5= <"">
##$SUBNAM6= <"">
##$SUBNAM7= <"">
##$SUBNAM8= <"">
##$SUBNAM9= <"">
##$SW= 24.9336934301222
##$SWIBOX= (0..15)
0 0 2 0 0 0 0 0 0 0 0 0 0 0 0 0 
##$SW_h= 4990.01996007984
##$TD= 16384
##$TD0= 1
##$TE= 0
##$TE2= 300
##$TE3= 300
##$TEG= 300
##$TL= (0..7)
0 120 120 120 120 120 120 120 
##$TP= (0..7)
150 150 150 150 150 150 150 150 
##$TP07= 0
##$TPNAME0= <>
##$TPNAME1= <>
##$TPNAME2= <>
##$TPNAME3= <>
##$TPNAME4= <>
##$TPNAME5= <>
##$TPNAME6= <>
##$TPNAME7= <>
##$TPOAL= (0..7)
0.5 0.5 0.5 0.5 0.5 0.5 0.5 0.5 
##$TPOFFS= (0..7)
0 0 0 0 0 0 0 0 
##$TUNHIN= 0
##$TUNHOUT= 0
##$TUNXOUT= 0
##$USERA1= <user>
##$USERA2= <user>
##$USERA3= <user>
##$USERA4= <user>
##$USERA5= <user>
##$V9= 5
##$VALIST= <valist>
##$VCLIST= <CCCCCCCCCCCCCCC>
##$VD= 0
##$VDLIST= <DDDDDDDDDDDDDDD>
##$VPLIST= <PPPPPPPPPPPPPPP>
##$VTLIST= <TTTTTTTTTTTTTTT>
##$WBST= 1024
##$WBSW= 4
##$XGAIN= (0..3)
0 0 0 0 
##$XL= 0
##$YL= 0
##$YMAX_a= 369610
##$YMIN_a= -584653
##$ZGOPTNS= <>
##$ZL1= 120
##$ZL2= 120
##$ZL3= 120
##$ZL4= 120
##$ABSF1= 10
##$ABSF2= 0
##$ABSG= 5
##$ABSL= 3
##$ALPHA= 0
##$AQORDER= 0
##$ASSFAC= 0
##$ASSFACI= 0
##$ASSFACX= 0
##$ASSWID= 0
##$AUNMP= <proc_1d>
##$AZFE= 0.1
##$AZFW= 0.1
##$BCFW= 1
##$BC_mod= 2
##$BYTORDP= 1
##$COROFFS= 0
##$CY= 11.3945322036743
##$DATMOD= 1
##$DC= 2
##$DFILT= <>
##$DTYPP= 0
##$F1P= 18.9103706918063
##$F2P= -1.10871071338519
##$FCOR= 0.5
##$FTSIZE= 0
##$FT_mod= 4
##$GAMMA= 1
##$GB= 0.15
##$INTBC= 1
##$INTSCL= 1
##$ISEN= 128
##$LB= 0.24
##$LEV0= 0
##$LPBIN= 0
##$MAXI= 10000
##$MC2= 0
##$MEAN= 0
##$ME_mod= 0
##$MI= 1.114404
##$NCOEF= 0
##$NC_proc= 0
##$NLEV= 6
##$NOISF1= 3.799351
##$NOISF2= 2.8
##$NSP= 1
##$NTH_PI= 0
##$NZP= 0
##$OFFSET= 15.70392
##$PC= 1
##$PHC0= -8859.704
##$PHC1= 14.20025
##$PH_mod= 1
##$PKNL= yes
##$PPARMOD= 0
##$PSCAL= 0
##$PSIGN= 0
##$REVERSE= no
##$SF= 200.130013532006
##$SI= 16384
##$SIGF1= 3
##$SIGF2= 2
##$SINO= 400
##$SIOLD= 16384
##$SREGLST= <1H.CDCl3>
##$SSB= 0
##$STSI= 0
##$STSR= 0
##$SW_p= 3612.71676300578
##$SYMM= 0
##$S_DEV= 0
##$TDeff= 0
##$TDoff= 0
##$TI= <>
##$TILT= no
##$TM1= 0
##$TM2= 0
##$TOPLEV= 0
##$USERP1= <user>
##$USERP2= <user>
##$USERP3= <user>
##$USERP4= <user>
##$USERP5= <user>
##$WDW= 1
##$XDIM= 8192
##$YMAX_p= 0
##$YMIN_p= 0
$$ End of Bruker specific parameters
$$ ---------------------------------
##NTUPLES= NMR FID
##VAR_NAME=  TIME,          FID/REAL,        FID/IMAG
##SYMBOL=    X,             R,               I
##VAR_TYPE=  INDEPENDENT,   DEPENDENT,       DEPENDENT
##VAR_FORM=  AFFN,          ASDF,            ASDF
##VAR_DIM=   8192,          8192,            8192
##UNITS=     SECONDS,       ARBITRARY UNITS, ARBITRARY UNITS
##FACTOR=    0.0002004,     1,               1
##FIRST=     0,             0,               0
##LAST=      1.6414764,     0,               0
##MIN=       0,             -584653,         0
##MAX=       1.6414764,     369610,          0
$$ Real data points
##PAGE= N=1
##DATA TABLE= (X++(R..R)), XYDATA
0@%%%%Qj6J6k4L2l2M0n6P2q8J05j29J60j92K25k66L14l65M26m94N66o52P48q46
28d48R59j087J225j380J552j738J941k164K408k678K973l296L655m048M478m961
44b609N496o088O760p522Q389r390J0564j1958J3648j5750J8445k2046K7135l4937
58a9863M8562p9163K68670o2849m98336K02769L87585J22235l45935k64064K6372
69b14017J77509N903m8892J7638L2951j41258j33826J28242L27476O9274l09520
80h8520k78977J81397M05940R2980l23012k54491J32912K69741K157k02170o4502
91a26545J30954L3468j58712p5031J92413J91462j27856k90651j0836L26013K32326
102C17005j55073k81903l214K47799J38322r8366j10054L3650L0214r3952n4870
$$ plain form
0 0 0 0 0 0 8 -8 8 -16 16 -16 24 -32 40 -48 57 -72 88 -104 121 -145 169 -196 230 -264 302 -350 398 -448
28 -448 511 -576 649 -731 821 -917 1024 -1140 1268 -1410 1563 -1733 1922 -2126 2352 -2609
44 -2609 2887 -3201 3559 -3963 4426 -4964 5600 -6358 7290 -8460 9985 -12061 15074 -19863
58 -19863 28699 -50464 218206 155357 -342979 -140210 247375 369610 23675 -240389 -214017
69 -214017 -36508 -30605 -79497 -61859 -28908 -170166 -303992 -175750 151726 221000 -88520
80 -88520 -367497 -186100 219840 312820 -10192 -264683 -131771 137970 140127 -62043 -126545
91 -126545 4409 37877 -120835 -195866 -3453 188009 60153 -230498 -241334 84679 317005
102 317005 161932 -119971 -123185 124614 262936 164570 54516 88166 118380 24428 -30442
113c0442J43766J44927j55186l38972o7983L31744K79473j92094m32477j03403
123d20647L39627L08941j01115l07196r2550J75452J59214l469m0710O490m0563
134a6526j05926J3180K11444J52991j71678l20642l3704L24732K46339j72028
144A28182l50381n6532K77673K05688j08502j98475M703J41647L6060p4691J1375
155A6747J18122J5319j54947r5015J42732J94774m6425k40419j07623J50629J61470
166A55364o1932j71369l5847R1930J8984q6997j2398J18122M7874j50656j47462
177b34387J10749K61098N3166k41966k03554J21723K83687P4255j98686j79851
187a53766M7055J54508N3803n2024m4331k2075n2403k8001R7116J43703k3816
$$ plain form
113 -30442 113324 258251 103065 -235907 -303890 27854 307327 115233 -317244 -420647
123 -420647 -81020 227921 126806 -180390 -272940 -97488 61726 58257 17547 24037 -16526
134 -16526 -122452 -109272 102172 255163 83485 -237157 -270861 53871 300210 128182
144 128182 -222199 -278731 -1058 204630 96128 -102347 -97644 44003 80063 5372 16747
155 16747 134869 150188 -4759 -99774 42958 237732 191307 -49112 -156735 -6106 155364
166 155364 93432 -77937 -113784 -21854 -2870 -89867 -102265 15857 63731 -86925 -234387
177 -234387 -123638 137460 190626 -51340 -254894 -133171 150516 224771 26085 -153766
187 -153766 -106711 47797 101600 49576 5245 -16830 -69233 -97234 -118 143585 119769
198A19769k15042j32104J62072K70860K2391k55226j84178J29502K54685M7889
208B20618j79969j37776N6391J15256J1167n6438j4284R508m7469o1727L9346
219d5377J09366Q423j38981j06983P9908J56663J3845j35426p8326Q3460J05927
230E2499k0338q1306J0716Q5805R511r3215l9522R9910J01964n8350j49264l1685
242a13275J29550J07339n6075j30641l4152P8697O7865p386l1603j1927j6857
253a8465k4256K8735R1350M3199r3005j29277J7412J64973J00221j07478j81883
264a08474k4031J51948J17588o2114j45630m9594P3938P7397O66m4055l2254j5338
276e9953N67L7315O0069J0451p1337o7996L8921J10518M0108q3506r0715K5334
$$ plain form
198 119769 -95273 -227377 -65305 205555 227946 -27280 -211458 -81956 172729 220618
208 220618 40649 -97127 -40736 74520 85687 29249 14965 24473 -22996 -84723 -45377
219 -45377 63989 72412 -66569 -173552 -93644 63019 76864 -58562 -136888 -53428 52499
230 52499 32161 -49145 -38429 47376 56887 -36328 -75850 24060 126024 67674 -81590 -113275
242 -113275 16275 123614 67539 -63102 -97254 -18557 49308 41922 10319 -1608 -18465
253 -18465 -42721 -13986 77364 120563 27558 -101719 -84307 80666 180887 73409 -108474
264 -108474 -132505 19443 137031 74917 -70713 -120307 -46369 31028 31694 -12361 -44615 -59953
276 -59953 -59386 -22071 37998 48449 -22888 -90884 -51963 58555 98663 15157 -75558 -50224
288e0224J00210L3625o8749o4692K5208N9672j38n0783j6359L9580K5709l0255
300B804l6675J5036M4626J1280l0826k1649J3047J9956K157j519O911o244l1064
313a2160j6425L4774M9073j4866p8115m5072N2122Q4108K083q6570o6564L5901
325f1711Q8576L1834n3427o4760k516N3464M8476K958l6598l9180n299M0460N0027
338E2304M380n5174n3758J4569O8679L7577m3626p1560j0617O0449N1576j9989
350C4810n8694k2278L5283M4167K563l2002k5088Q343K6596J6736r181k4291j4579
363a7615J1897K5321O455k6510l0421M378L4183J7430k7109l8760j75L9706K8015
376B6795j9252m0767r177L3932L6950j749l3586k4709J3687L6786K0709j7019
$$ plain form
288 -50224 49986 83611 14862 -49830 -24622 35050 34912 -15871 -32230 7350 33059 2804
300 2804 -33871 -18835 25791 37071 6245 -15404 -2357 17599 19756 18237 25148 18904 -12160
313 -12160 -28585 6189 55262 40396 -37719 -82791 -30669 53439 55522 -31048 -97612 -61711
325 -61711 26865 58699 5272 -59488 -62004 -8540 39936 42894 6296 -32884 -38183 2277 52304
338 52304 56684 1510 -52248 -37679 31000 68577 24951 -46609 -57226 3223 54799 34810
350 34810 -23884 -46162 -10879 33288 35851 3849 -21239 -12896 13700 30436 21255 -3036 -17615
363 -17615 -5718 19603 26058 -452 -30873 -26495 7688 25118 -1991 -40751 -40926 -1220 26795
376 26795 7543 -33224 -42401 -8469 28481 26732 -6854 -31563 -17876 18910 39619 22600
388B2600l7504j5812K6023M1365O046m0536m1038Q475M9425K7978k9262n0706
400c2946r842M2077M0773q219m3644k4684K1173L8951J2895k3751l2687o874K5559
413a219L1093N58l3789l2262Q353M0485K3297k6762m7411q052M2359L9002j4816
426B0836m9115j9699L3812M3372J099l7603k6485J3981L5806J6724j6646k8684
438a2602r971J7928K8795P991k3993l2110l283L4605L0814j3378m5127k0924L1728
451i527M4801J09m4760l1951K0791M5818J2699l2917l4517M002L3911K1550j2465
464A7544k9362j4450J3612K6028J1109j8218k9570p943K5784L1148k944l6485
476a3747k6798J9595M3257J2894l3960l6992P506M2563K4428k1817l8214p154
$$ plain form
388 22600 -14904 -30716 -4693 36672 42718 2182 -38856 -30381 19044 47022 17760 -32946
400 -32946 -42788 -711 40062 31843 -11801 -36485 -15312 23639 36534 12783 -19904 -26778 -1219
413 -1219 29874 30432 -3357 -35619 -27266 13219 36516 9754 -37657 -45709 -3350 35652 20836
426 20836 -28279 -47978 -14166 29206 30305 -7298 -33783 -19802 16004 32728 16082 -12602
438 -12602 -22573 -4645 24150 32141 8148 -23962 -27245 7360 38174 24796 -20331 -41255 -9527
451 -9527 35274 35383 -9377 -41328 -20537 25281 37980 5063 -29454 -25452 8459 30009 17544
464 17544 -11818 -26268 -12656 13372 24481 6263 -23307 -31250 -5466 25682 22738 -13747
476 -13747 -40545 -20950 22307 35201 1241 -35751 -28245 14318 38746 16929 -21285 -28439
488b8439K9578K9304l969k9417k1151R535K7656J4610j4909k9193j0499K0906
500e988K8952J513k9662k5289J1216L5447J5489k4221l3527q63L2772K5769j1898
513A9710l5302j5324K2132L2403M246k9471k9347M760L3515K3725j5539l8272
525b2764j5676K7257L9030L475l6449l2599J1280M2152K2785k1201l8738j0981
537c2429K7899L4519K929k9863l0463J635L2593K7683q888l8355k4710J9606M1470
550B3626J2830l2326l8615L918L9884K4265j9730l4523n530K6525K0922q410k0407
563g571n438J0851Q943j084n464k968j448J270N843L610p859j1865L331K0162
577A0313R038k1652k6499R991M0855J6196l6266m4271J0953N5942K7148l7544
$$ plain form
488 -28439 1139 30443 26474 -2943 -24094 -14559 13097 27707 12798 -16395 -26894 -5988
500 -5988 22964 24477 -5185 -30474 -19258 16189 31678 7457 -26070 -26933 5839 31608 19710
513 19710 -15592 -30916 -8784 23619 27865 -1606 -30953 -26193 7322 31047 15508 -22764
525 -22764 -38440 -11183 27847 31322 -5127 -37726 -26446 15706 38491 17290 -21448 -32429
537 -32429 -4530 29989 32918 3055 -27408 -25773 6820 34503 25615 -12740 -37450 -17844 23626
550 23626 36456 4130 -34485 -30567 9317 33582 13852 -20671 -26201 324 21246 12836 -7571
563 -7571 -13009 -2158 6785 5701 237 -2731 -4179 -2909 2934 6544 -1315 -13180 -9849 10313
577 10313 19351 -2301 -28800 -18809 22046 38242 1976 -42295 -31342 24600 51748 14204
589A4204n3240j404M8567L5101j5871m1403j8496J4780K7180J7498k830k6853
601b767l2833n29M5097M4560j7047o8395l5879M8990P5932M306p3232n5186L1264
614c5719P0733J8793m6344m3551P950L2819J2303p247n388m253j4608r018K1450
627b080L3108l061m4210k6436L0582M6737k674m5182j9719L0886K8729j8184k9998
640b1502J2564L6431l927m7701j9048M7400N0088k2844o9323j9311N6177N3909
652E2913j7092n5868k0756K6908K7914L699l810l878k1370k8671J3151O1770L4710
665F9620n5983q8450M06J01539P2976n5509j12606k2644R0362P9108k6194q0072
677b7447k9691L7491L8894M353p830n821k2167k9154J2616O2620L5302n4268q3977
$$ plain form
589 14204 -39036 -40440 8127 43228 27357 -14046 -32542 -17762 9418 26916 24086 -2767
601 -2767 -35600 -36129 8968 53528 36481 -31914 -67793 -18803 57129 61435 -11797 -66983 -35719
614 -35719 35014 53807 7463 -36088 -28138 4681 16984 9737 4349 96 -14512 -23530 -2080
627 -2080 31028 27967 -16243 -42679 -12097 34640 31966 -13216 -32935 -2049 26680 8496 -21502
640 -21502 -8938 27493 23566 -24135 -43183 4217 54305 31461 -37862 -57173 -996 52913
652 52913 35821 -20047 -40803 -13895 14019 17718 13908 10030 -11340 -40011 -26860 34910 69620
665 69620 13637 -74813 -74407 27132 100108 44599 -68007 -90651 -289 78819 52625 -27447
677 -27447 -57138 -19647 19247 23600 15770 9949 -12218 -41372 -28756 33864 69166 14898 -69079
690f9079J928R2690O0005n3327q9216m752P4075M1773l7899m5011J3531L2918
702A7636j2316l3594J5143N1483L373o6515m2426N0190P7400l819p7593m2874
714f3912M2754N7706k990l8088r701J5038q489j9811K3619N4891j540q3472n8502
727i2497O4029J14465Q289j18246q9472N7418J23656K8591q9236p8662J9648O6247
739A4230K6389j7219j5648j2554k8473j1931N0989O9680j4908j05533o2036P6679
751c0335J23348M216j22230q3710N9900J10936J3994p9769n0568L1100M0486r139
763H229j7082K2269K0357l9322n3888K3499Q6281K7225p8947q0430K9960R5320
775D3471K7450o6263n4645K4895M4391o963k7151J7900L5535k5529o9896k616
$$ plain form
690 -69079 -67151 25539 85544 32217 -56999 -61751 12324 54097 16198 -28813 -15282 17636
702 17636 5320 -28274 -13131 38352 41725 -24790 -67216 -17026 60374 56555 -21038 -63912
714 -63912 -21158 36548 33558 -4530 -14231 807 -7682 -27493 -3874 51017 49477 -33995 -92497
727 -92497 -28468 85997 94286 -23960 -113432 -56014 67642 96233 6997 -71665 -52017 14230
739 14230 40619 23400 7752 -4802 -33275 -45206 5783 75463 60555 -44978 -107014 -30335
751 -30335 93013 97229 -25001 -108711 -48811 62125 76119 -3650 -54218 -23118 17368 8229
763 8229 -8853 13416 33773 -5549 -59437 -35938 50343 77568 -1379 -81809 -51849 43471
775 43471 70921 4658 -49987 -25092 19299 12336 -14815 3085 38620 13091 -56805 -59421
787e9421R2291O5659o5633j19492q607J17387Q5335n5440j11576k2238P4896N9048
799E2209j4458l8390j2098n362j4899J5223O1174L0739o8883r8866J1307J27569
811D5265P9396q1804j39199j2187J24659R0424n1747j05399k0626O3420M4169
822C6371j5532j8952O211q348l7784k096O5412N2613m8815r9703j2404J00050
834A7023P7244m9500j01217j3781P6423M7975l5355m3934J5872K9057k2990l7353
846d0536K8188O8352p62q8943n6414O5408J03730p06j02814o3408N1922Q3749
858D7766P861n4207l0683J3330R095n920K0492L9962j0872p8702m5477P0901J08982
871I2528l811j23883q3078P0038J28429J8697j02848q0767L3304P9850K2856l5069
$$ plain form
787 -59421 32870 98529 32896 -86596 -95203 22184 107519 52079 -59497 -81735 -6839 52209
799 52209 37751 -639 -12737 -18099 -32998 -17775 43399 74138 5255 -93611 -82304 45265
811 45265 124661 42857 -96342 -108529 16130 106554 54807 -50592 -71218 -7798 36371
822 36371 20839 1887 8098 -250 -38034 -40130 25282 77895 29080 -70623 -83027 17023
834 17023 94267 44767 -56450 -70231 6192 54167 18812 -25122 -9250 19807 -3183 -40536
846 -40536 -12348 56004 55242 -33701 -90115 -24707 79023 78317 -24497 -87905 -35983 47766
858 47766 55627 1420 -29263 -15933 -6838 -12758 7734 47696 36824 -41878 -87355 -16454 92528
871 92528 88717 -35166 -118244 -48206 80223 98920 -3928 -84695 -51391 28459 51315 16246
883A6246k6863j866p800p253L2825N1183j0266q2131n0478O1991J02627K723j02894
896b1956o9764N2772R4359Q639p1041m0994L2501L6194j4062k1410K1595K6983
908C3816k9590n4085R672P4595L5806o0016p6004J2870P9577L5842m7412n1933
920c6862Q512L5244M012j4594J1530K0220k4229n1985L501P6212M9270n7721r7663
933g4553l937R9295P1232m8728r7065j9543O8063N7587j4850m4500j7383O236
945a8146N588J2294L0488J0829m5317n7131J3585Q3860M6138n9781r2160j327
957g1080Q9052N8899m3343p6036q876N2636L2674j9479k3554N945P615j6988r577
970b2112K8681L3737j9542n4825j3420N2048M5549k2105n5991j0879M0151K6372
$$ plain form
883 16246 -10617 -12483 -20283 -27536 5289 56472 46206 -35925 -86403 -24412 78215 80938 -21956
896 -21956 -91720 -38948 55411 64050 -6991 -47985 -15484 20710 6648 -14762 6833 33816
908 33816 4226 -49859 -40187 34408 70214 10198 -65806 -52936 26641 62483 15071 -36862
920 -36862 -28350 6894 10906 -3688 7842 28062 3833 -48152 -44651 31561 80831 23110 -74553
933 -74553 -78490 20805 92037 43309 -53756 -73299 -5236 52351 37501 -6999 -24382 -18146
945 -18146 -12558 -264 30224 41053 -4264 -61395 -47810 36050 82188 22407 -69753 -71080
957 -71080 17972 76871 33528 -42508 -51384 1252 33926 14447 -9107 -3162 4453 -12535 -22112
970 -22112 6569 40306 20764 -34061 -47481 4567 50116 28011 -27980 -38859 1292 27664
982B7664j9097k1709J1228J6083j7583k5513J8336M6805K889n6563m1451L7457
994b1454O9292O795o3394m8031K6566N7187J4580l3406k9349J668J2646P678J1969
1007A2747J2017j3351m0002j5361M2567N4824r784o9758m0073M4985P1036M785
1019E4632o2676m5356K5195N1883J2055k9402k4123L642J1191K410O025J1091
1031A6567n391k6687j4713K5222L6207l297m0971k3391K6156L6836l356l2914
1043i732j2440K1462J6514j3502j6769J0914K1532o374k8469p518K9485K5001
1055C0104j6219l4657o119K7903K2206q931k1550o065P727N753L043P117K371
1068A2683j6850k0156P036L5479J7821k8543m1953M06M4955L1195k2445m5038
$$ plain form
982 27664 8567 -13142 -1914 14169 -3414 -28927 -10591 36214 39103 -17460 -58911 -21454
994 -21454 47838 54633 -8761 -56792 -30226 26961 41541 8135 -21214 -19546 -6900 778 12747
1007 12747 24764 11413 -28589 -43950 -1383 53441 43657 -26101 -66174 -21189 49847 54632
1019 54632 -8044 -53400 -28205 23678 35733 6331 -17792 -14150 -2959 -549 5476 16567
1031 16567 11176 -15511 -30224 -5002 31205 27908 -13063 -36454 -10298 26538 23182 -9732
1043 -9732 -22172 -710 15804 2302 -14467 -3553 17979 11605 -16864 -24382 5103 30104
1055 30104 13885 -20772 -26891 1012 23218 14287 -7263 -13328 -5601 152 3195 10312 12683
1068 12683 -4167 -24323 -17287 18192 36013 7470 -34483 -34077 10878 42073 19628 -25410
1080b5410j0456L3037L1157o357k7382j4593Q146J5160Q175K01q392j4143o755
1093a7612J3159K2399K958k3860k2878R929L0714J0867k2799k4539O110K5095
1105I543Q733j6428j5287O001J4430R74j0901m067P491O522n223o893P86O164
1119A845J808l065j182N46j742k832M510Q311m99j3006r604J0093J9386K256k0330
1134c505j7471R300K4598Q609j8414k1146K064K0093J3378p262j7071q043P763
1147g107J3763O419o667j3144p399P929J6074O138j2742j7680p46J7962J5140
1160A7940p322k0395p412J3822J7587p38j6712j0870O882J4608L775r133j0298
1173h266j45Q782P521j355q968n811L335R488M529o139j0345j696J0180R458l572
$$ plain form
1080 -25410 -35866 -2829 28328 21971 -5411 -20004 -11858 3302 11477 11678 3286 -10857 -17612
1093 -17612 -4453 17946 20904 -2956 -25834 -15905 14809 25676 2877 -21662 -15552 9543
1105 9543 18276 1848 -13439 -7438 6992 7966 -2935 -7002 489 7011 1788 -5105 -4319 1845
1119 1845 3653 588 -594 -48 -1790 -4622 -112 8199 7700 -5306 -14910 -4817 14569 16825 -3505
1134 -3505 -20976 -11676 12922 21531 3117 -18029 -15965 4128 17506 10244 -6827 -14870 -7107
1147 -7107 6656 13075 6408 -6736 -14135 -6206 9868 16006 3264 -14416 -15162 2800 17940
1160 17940 10618 -9777 -17189 -3367 14220 13482 -3230 -14100 -7218 7390 11165 2032 -8266
1173 -8266 -8411 371 7892 6537 -2431 -8242 -4907 4581 9110 2971 -7374 -9070 1110 10568 6996
1188F996j2379o467R069J2771O50j2124j0550M600J3687N786q662j2726j503J1052
1202B00J0105j568j2145p984N705J2282M782p977j2298k212J1050J0939j680j2742
1216c543q938O608J3092N007r630j2628k65J2097R860l651j2918o963P459J2681
1230H268K563r906j1293J371J1734Q494n170j2257m898Q303J1588J217j0811r943
1244a0740K799J2271O688o209j2148l551R636J0496o44j1243q025M634J1877M725
1258A0566q220j0595j150J0149R263k644j1267o832N878J1663M004q787j1730
1271i702l20J1903R760l776j3824o754Q653J3542J918j1873j1170K564J3324P861
1285A2106o513j2711m142Q843J0649J077q871r740J132J0234P644k726j0996o978
$$ plain form
1188 6996 -5383 -11850 -2781 9990 10640 -1484 -12034 -7434 6253 12039 3377 -9349 -10852 200
1202 200 10305 8737 -3408 -11392 -5687 6595 11377 3400 -8898 -11110 -60 10879 9199 -3543
1216 -3543 -12481 -5873 7219 12226 2596 -10032 -10297 1800 11660 8009 -4909 -11872 -4413 8268
1230 8268 10831 925 -10368 -8997 2737 11231 6061 -6196 -11094 -2791 8797 10014 -797 -10740
1244 -10740 -7941 4330 11018 4809 -7339 -10890 -1254 9242 8598 -2645 -10670 -6036 5841 10566
1258 10566 2346 -8249 -9399 750 10013 7369 -3898 -10730 -4852 6811 10815 2028 -9702
1271 -9702 -10022 1881 11641 7865 -5959 -12713 -4060 9482 11400 -473 -11643 -9079 4245 12106
1285 12106 5593 -7118 -11260 -2417 8232 9309 438 -9302 -8170 2064 9708 6982 -4014 -10992
1299a0992N963J2256M060r890j2052J196J3131P704o567j2393j963J0143Q398
1312H994l910r737k610O688O320j202o260k678K102M143K104j927m529l069L372
1327b199O966K643p235r605J529J3211Q508r409j6672j797J6332J4462o986j9401
1341i653p238J3583J6512m02j5093j0034L579J1882O884k276r244q555L6J1022
1355A003J2809j931j6992j3597Q831K2842P364j8257k0513L168K2288J1317j2032
1368F300j7393o89J3043P317m778o308P32J343j802l39N402M045n804r012J598
1383f345J0872M248q211q288M894Q889k774r709K73J2873M544j3924j3805R307
1397g156K1875L868k2279j8056J0191K5020O641j8337j7691L406J5185P638l015
$$ plain form
1299 -10992 -5029 7227 11287 1397 -10655 -9459 3672 11376 4809 -7584 -9547 596 8994
1312 8994 5084 -4653 -7263 -575 5745 4543 -1717 -4395 -2293 1850 3954 2027 -2502 -5571 -2199
1327 -2199 4767 7410 175 -9430 -7901 5310 13818 4409 -12263 -14060 2272 16734 9748 -9653
1341 -9653 -16891 -3308 13204 12802 -2291 -12325 -8746 3136 10020 7744 -1500 -10055 -10019 1003
1355 1003 13812 11881 -5111 -18708 -9877 12965 20329 2072 -18441 -15273 7015 18332 6300
1368 6300 -11093 -11782 1261 8578 3800 -2508 -1776 -433 -2235 -2574 2828 6873 1069 -7943 -6345
1383 -6345 4527 8775 564 -7724 -2830 6059 3285 -6424 -6151 6722 11266 -2658 -16463 -7156
1397 -7156 14719 18587 -3692 -21748 -11557 13463 20104 1767 -15924 -12518 2667 10305 7290
1410G290o182n829n709J943J4479J3954r437k7323j0420K4914L1237m530l6550
1423a2163k0942K1229L4779L421k8151k0507R341J9922N685q057n726j478m325
1436f972j713J0789J4406m553k3647j1793J9098K6438k587k8069j4427J7519K1220
1449A5709m340j8177k372J3101L284j3683n235J6865J3971j3865k5953J258K9359
1462I922J7286j9193k8223j00K4385J3490r913j3463l89L772k634J999J4921O934
1476A8794k0350k6877P006L9615K0634l0014m4209P17M5109K9723k2153m0961
1488b2966p257K7901K2067n163j4712o185j538k644O992J9554O820k3666l0525
1501c1322P415M1254K1933k9577m1977J391L9969K2696k0355k9377J314K0821
$$ plain form
1410 7290 1108 -4721 -10430 -8487 5992 19946 10509 -16814 -27234 -2320 28917 24387 -12163
1423 -12163 -33105 -11876 22903 26324 -1827 -22334 -12993 6929 12614 4557 -1169 -2647 -6972
1436 -6972 -8685 2104 16510 11957 -11690 -23483 -4385 22053 19466 -8603 -23030 -5511 15709
1449 15709 11369 -6808 -9180 3921 7205 -6478 -11713 5152 19123 5258 -20695 -19437 9922
1462 9922 27208 8015 -20208 -20308 4077 17567 7654 -5809 -6198 -2426 -5060 -3061 11860 18794
1476 18794 -1556 -28433 -21427 18188 38822 8808 -35401 -34684 10425 40148 17995 -22966
1488 -22966 -30223 -2322 19745 14582 -130 -6315 -7853 -10497 -3505 16049 22869 -797 -31322
1501 -31322 -23907 17347 39280 9703 -32274 -30883 9086 31782 11427 -17950 -16636 4185
1513D185M769j1470r66J2781k85k1128j0115K3192K7315j0154l6838j2320K9083
1526a951K9364r038k9363p703J7178J0101p598l018J0661R03k1638j4172K3933
1539b341L5428m976m6985k6028L2847M9510Q0m6858l0441K1244L7788O927k2031
1552D164j6033J861L616J795J2212J4974j0223l4025j4594L3817M3984p238n3486
1565a9176k9454L3584N0429J354m3542k6703J8843K9636P90j5675l239N885o638
1578c906j1857J0334K6649L343l3534k6110K0098M1756N966l6747k7713J6917
1590a4804L0697J861k0556o782J2204K144j5809j851K5431J5930k5236l7172N741
1603b8202M7170K4265l2902m5115J663M2398K4030j9449k8305k763J3767N326
$$ plain form
1513 4185 8954 -2516 -3482 9299 9014 -12114 -22229 963 28278 18124 -18714 -31034 -1951
1526 -1951 27413 18375 -10988 -18691 -1513 8588 990 -2028 8633 9536 -12102 -26274 -2341
1539 -2341 33087 28111 -18874 -44902 -12055 37455 37535 -9323 -39764 -18520 19268 26195 4164
1552 4164 -11869 -10008 -6392 -4597 7615 22589 12366 -21659 -36253 -2436 41548 34310 -19176
1565 -19176 -48630 -15046 35383 36737 -6805 -33508 -14665 14971 15761 86 -3153 2732 -3906
1578 -3906 -15763 -5429 21220 24563 -8971 -35081 -14983 26773 32739 -4008 -31721 -14804
1590 -14804 15893 17754 -2802 -9584 2620 4764 -11045 -12896 12535 28465 3229 -33943 -28202
1603 -28202 18968 43233 10331 -34784 -33121 9277 33307 13858 -14447 -17210 -3443 1883
1615A883O73Q641L933k0309k5147J0282M3700J9909l7686m9571N510N5144L2085
1628D9047l1507m9414l594L8100K4795j3109k1556k565N760j670J528J5571J0555
1641B1941j9578l1004K820M0021K4783k6611m3001j037L9023K4242j9558k9296
1653a7255J366K0360L828j2142K47J5188J34k4121j3300K4428L2306p992m0557
1666a7510j7918K8955L5336n153l2365j4581J6351J6311k394n899M462j505j6485
1679a2395q721K2284L0271q300m3607k1479L3263M6309k383m6769k8426K3217
1691a6736L9304M395k5455j7749N140J0081K809M295P448o642k3055r599K4805
1704i59L2230o420m0704k1979K7619L9498j273l5279k0464J7950K3789j415j5626
$$ plain form
1615 1883 2556 11197 15130 -5179 -30326 -20044 23656 43565 5879 -43692 -38182 16962 49047
1628 49047 17540 -31874 -35468 2632 27427 14318 -7238 -9803 -4043 -5713 -4185 11386 21941
1641 21941 2363 -28641 -25821 14200 38983 12372 -30629 -31666 7357 31599 12041 -17255
1653 -17255 -15889 4471 8299 -3843 -3596 11592 11726 -12395 -25695 -1267 31039 23047 -17510
1666 -17510 -35428 -6473 28863 23710 -8655 -23236 -6885 9426 7032 1133 5595 4090 -12395
1679 -12395 -21116 1168 31439 23139 -20468 -41947 -8684 37625 35242 -11527 -39953 -16736
1691 -16736 22568 26963 1508 -16241 -11101 -1020 1789 6084 13532 6890 -16165 -25764 -959
1704 -959 31271 24851 -15853 -37832 -10213 29285 28012 -7267 -27731 -9781 14008 12593 -3033
1717c033k359Q744k622j1221L293J9917O701k1718k2777J0573L0803Q763k4329
1730G35k2556Q472K2239M691j2773o275O307P13j0023K15J8231J0794j8752k7001
1744b4983L433L5514J8756k3659l5234m0L2115K1007j3957k4710m780J2651R318
1757E431P64M95j771j0551j1745Q328K5057R640k4245k9183N267L5288J8264k1773
1771I266l1487j18K6616J5623j1408j7220k67Q671J632k344L669O089o589j3858
1785a1725n04J7843J2897j1889k0942j207J9053J1697r884j4218J646J0355J129
1798D251p923L34J0060J733j3592j0030J1383J9614q52k1423j3179J2688K0532
1811A3596J764j6526j1555N299J0342L306k203j679l342o842q84J1761J2984o228
$$ plain form
1717 -3033 -5392 3352 730 -10491 -7198 12719 19420 -2298 -25075 -14502 16301 25064 735
1730 735 -21821 -13349 8890 13581 808 -5467 840 1553 -8470 -8255 9976 20770 2018 -24983
1744 -24983 -21550 13964 32720 9061 -26173 -26213 5902 26909 12952 -11758 -16538 -3887 5431
1757 5431 6195 6690 4919 -5632 -17377 -9049 16008 25648 1403 -27780 -22513 12775 31039 9266
1771 9266 -22221 -22339 4277 19900 8492 -8728 -8995 -324 1308 -1036 2633 8722 2133 -11725
1785 -11725 -12229 5614 18511 6622 -14320 -15527 3526 15223 5339 -8879 -7233 3122 4251
1798 4251 -3672 -3338 6722 8455 -5137 -15167 -3784 15830 14978 -6445 -19624 -6936 13596
1811 13596 15360 -1166 -12721 -7422 2920 6226 4023 2344 -998 -7840 -8724 3037 16021 9793
1825I793k1245q831J7477K2293k271k4138j4368J3072K1368K210j5696j1336L948
1838g724R824L581k350j818k396m648n24P997Q565m436j3482m950J1278J2831
1852A1748l278j4151m719R484Q910l999q132l04O989J745o324k978N368O480l692
1867C147q984q04Q194N726l949p234j155M612L185p36p58k66k610l369K242Q058
1883E299L599q283j0796J655J3602P816q721j3734j949J2404J0008m007j0953
1896d060m541M984P536K167l922m217k877J550N024M555j399q166m919N607Q864
1911F186J814q929p543L337R652K883o792o640J983O254K767m273l911R41L336
1926A065O33j372j352L33Q03L07M12l99j113j422J748K743J46l727k880K182N620
$$ plain form
1825 9793 -11452 -20283 -2806 19487 17216 -6922 -21290 -8218 13150 15360 -336 -11672 -7724
1838 -7724 2100 5681 3331 1513 -883 -5531 -6055 1942 10507 6071 -7411 -12361 -1083 11748
1852 11748 8470 -5681 -10400 -916 7994 3995 -4137 -4441 2548 4293 -2031 -5009 359 6839 3147
1867 3147 -5837 -6641 1553 7279 3330 -3904 -5059 -447 2738 2002 1244 978 -1632 -5001 -2759 5299
1883 5299 8898 615 -10181 -8526 5076 12892 4171 -9563 -11512 892 10900 6893 -4060
1896 -4060 -8601 -3617 3919 6086 2164 -2053 -4930 -3380 1644 6199 4800 -3366 -8285 -2678 6186
1911 6186 8000 -929 -8472 -5135 4517 7400 608 -6032 -4049 2205 4972 699 -3212 -2271 1065
1926 1065 1698 326 -1026 -693 110 417 829 430 -683 -2105 -357 2386 2532 -1195 -4075 -1893 3727
1943C727O50m786n180K482O423K558n053n992N11O011M253k446n731k647L381
1958a839M734J410l180m540q87L763M756J99m787m864J510N856L831l661o216
1973c915j787N488N538r09o260l637L215N585J518m197m482J56M482L131j253
1988B673m269k207K212L991J563l148m194M3M125L142j303m680k361L304M526
2003C417M82m333l669J370M770K224k886m252q84M102L685j158m352k492J926
2018b050M545J885l479m473j80L974M104j404m494l133K980M573J463l905m572
2033d166K49M923L538j847n078k020L179M521O77l970l950R47M061K891j516m513
2049b074k029K884M274N65l758l390K99M116L398k215m481j378L488M052p59m203
$$ plain form
1943 3727 4377 -409 -5589 -3107 3316 5874 821 -5171 -4660 1351 5604 3158 -2573 -5220 -1839
1958 -1839 2895 4305 1125 -3415 -4302 -539 4217 4416 -371 -5235 -3725 2131 5962 2301 -3915
1973 -3915 -5702 -214 5324 4415 -1845 -5482 -2267 3318 4836 639 -3843 -3687 795 3926 2673
1988 2673 -1596 -3803 -1591 2400 3963 815 -3379 -3336 789 3931 2628 -2052 -4413 -1109 3417
2003 3417 3899 -434 -4103 -2733 2037 4261 1375 -2877 -3761 341 4026 2868 -1484 -3976 -2050
2018 -2050 2495 4380 901 -3572 -3752 222 4326 2922 -1572 -4705 -1725 2848 4311 406 -4166
2033 -4166 -3917 1006 4544 2697 -2381 -4401 -1222 3299 3976 6 -3944 -2997 1064 3955 2439 -2074
2049 -2074 -4103 -1219 3055 3620 -138 -3528 -3229 887 4285 2070 -2411 -3789 -301 3751 2992 -1211
2065a211k809K682L796O65l266l025J255K952J758j442l090j201K181L292N79
2080C116k827l846L05M449L240j863n755k406M757N847j04o218m882K706O772
2095C291K744n005n963k0N575L665p22m220l351P59M174L217o10m394m414J939
2111c335O316L074m045o734j163O327N531k193o706k145M749M250r26m150j170
2126b320K477J262j328j122J168J058j124j749J241J389J51j596J6J172K85k645
2142a665o87L748K492l219n769k16P708N153m647r430j180R056P100l677q911
2157d144l031N330O061P89m213l586j396J538M138L981j178p058n799M299J1377
2172G108L501r940j1168K017J2686P115p366j1228n98Q464N691k837m857r41J450
$$ plain form
2065 -1211 -4020 -1338 2458 3123 -143 -3168 -1913 1039 2797 1355 -1735 -2936 -755 2537 3116
2080 3116 289 -3557 -3252 1197 4437 2574 -3181 -5587 -830 5017 4913 -1305 -6187 -3481 3291
2095 3291 6035 1030 -4933 -4953 622 4287 3565 -655 -4006 -3247 927 4144 3534 -860 -5274 -3335
2111 -3335 2981 6055 2010 -4724 -5887 440 5971 3778 -2928 -5073 -324 3926 3000 -1150 -2320
2126 -2320 157 1419 91 -1031 137 1195 71 -1678 -437 952 1103 -493 -477 695 980 -1665
2142 -1665 -2352 1396 3888 669 -5100 -5316 2392 7545 2898 -6532 -7712 1344 8444 4767 -4144
2157 -4144 -7175 -1845 4216 5005 792 -2794 -4190 -2652 1486 5467 4289 -2769 -8568 -4269 7108
2172 7108 10609 669 -10499 -8482 4204 11319 3953 -7275 -7873 591 6282 3445 -1412 -2353 -903
2187i03N5J15L074J966l672o428J151P578M566n518q059L59P891L414m834m457
2203c702K930L399k512m647K932P424L14r740o436P456J1852J32j2239p971O158
2218d650J0584J811o815n362O27K482J382K869K518l137r448k745J0551J2668
2232A3335l363j7404r418J2362J8243J49j7020j1458P431J4017K818q003n984
2245d295N42J871Q55L358M420k982r913n363R992J4030j923j5948r290J0221J4424
2260I999K49j2804o526O705O675k029m908K946M282l981q708J781J2636N868j0877
2275A308j3822K847J5443O672r237j1511J023Q359L162k846n18J892l910p429
2289h567K941J3444O903j2881j8456K277K1847J2930j3394k1721j758J8228J2537
$$ plain form
2187 -903 -848 -733 2341 4307 635 -5793 -4642 2936 7502 1984 -6075 -5716 2175 5589 755 -3702
2203 -3702 -772 2627 115 -4532 -1600 5824 6138 -3602 -10038 -2582 9270 9402 -2837 -10808 -4650
2218 -4650 5934 7745 930 -4432 -3805 -1323 59 2928 5446 2309 -7139 -9884 667 13335
2232 13335 9972 -7432 -16850 -4488 13755 13904 -3116 -14574 -7143 6874 9692 1689 -4295
2245 -4295 -3753 -1882 -1027 2331 6751 3769 -6144 -11507 -1515 12515 10592 -5356 -14646 -4425 9999
2260 9999 10248 -2556 -9082 -2377 4298 2269 -2639 307 4589 608 -8100 -6319 6317 12185 1308
2275 1308 -12514 -9667 5776 12448 3211 -8300 -7277 1082 4244 1398 880 2772 -1138 -8567
2289 -8567 -5626 7818 14721 1840 -16616 -14339 7508 20438 7044 -14677 -16435 1793 14330
2302A4330o050j2792l623N028L695J567L266R74q811r984L988J7677Q643j4533
2316C375k0419J381K2003J2855j2069j8615j245J4206Q332n973o962J306K971
2329A146m005k677P502Q865m938j5697m226J5333J4209o384j7927m626J2418J1209
2343A0202m277q943k02M383k099m597N446J0068j628j6433q861J4472J9939j795
2357A5675k2665j3600J3237K0842J737j6047j0836N039R151J806j275M29k231
2370A262q817l705J2363J5380m072k2351j2011J6612K3944o69k3163j4629J1425
2383h431J8959J932j2373p498L719M287j528R85O436L74j2010q833R423J7682
2397A3124J833j8552j4162R800J8801K523j4092r448O327Q045k207m536L631N447
$$ plain form
2302 14330 8280 -4512 -8135 -3107 588 2155 5421 6395 -2416 -12400 -8412 9265 17908 3375
2316 3375 -17044 -15663 6340 19195 7126 -11489 -12734 1472 9804 3831 -3131 -1825 1146
2329 1146 -2859 -5536 1966 10831 5893 -9804 -14030 1303 15512 9128 -8799 -13425 -1007 10202
2343 10202 5925 -3018 -3220 1163 -936 -5533 -87 9981 8353 -8080 -16941 -2469 17470 15675
2357 15675 -6990 -20590 -7353 13489 15226 -821 -11657 -6618 2533 4339 3064 3493 1262
2370 1262 -7555 -11260 1103 16483 12411 -9940 -21951 -5339 18605 17936 -5227 -19856 -8431
2383 -8431 10528 12460 87 -7411 -3692 595 -933 52 6488 6862 -5148 -13981 -4558 13124
2397 13124 14957 -3595 -17757 -7957 10844 13367 -725 -10173 -3846 4199 1992 -2544 1087 6534
2411F534n793j1707K216J6301R217j4275j8877K247K0429J1065j1655j6614k86
2424a1198J2127O637l632l926l5j897n340K614J2785O240j3357j8132K628K3141
2438H655J3006j4959k3092q53K0383J3812q492j5481k942Q492N232j209P5J477
2452D104m658r142K052J4139Q994j1745j8445N01J9405J2070j0917j7248q21J3469
2466A758P476o375o508K725L814m572m675O016J0169k326j5282n777J2713J4751
2480A3907l756j6097p363J0550J1246k015q135j462L176j163k471L958Q011j749
2494F637j3699p255J1933J6948j067j9630j1840J1472J8597J400j4494j0372M843
2507f527R555K638l669j252r31m735j425P098R946k767j4929p770J1575J6706
$$ plain form
2411 6534 741 -10966 -8750 7551 16768 2493 -16384 -14137 6292 17357 5702 -10912 -11198
2424 -11198 929 7566 3934 8 -27 -1924 -7264 -4650 8135 14375 1018 -17114 -14486 8655
2438 8655 21661 6702 -16390 -17243 3140 16952 8460 -7021 -9963 -1471 3761 2552 2627 4104
2452 4104 -554 -9696 -7644 6495 15489 3744 -14701 -14200 5205 17275 6358 -10890 -11711 1758
2466 1758 9234 2859 -3649 -924 2890 -1682 -6357 -341 9828 7502 -7780 -13557 -844 13907
2480 13907 10151 -5946 -13309 -2759 8487 6472 -1663 -3125 51 -1112 -3583 375 8386 6637
2494 6637 -7062 -14317 -2384 14564 13497 -6133 -17973 -6501 12096 13496 -998 -11370 -6527
2507 -6527 3028 5666 1997 745 -186 -4921 -6346 752 10698 7931 -6998 -14768 -3193 13513
2521A3513j092j6998r817Q923J4339K44j0478n209M571M254k169j610M260K162
2535D893o345o851M163J1256K567j0630r416M765J1781K146q753n388L479M824
2549B491j710k814L111L929m059q540O23J1764O328q189j3172K29J3409Q141o807
2564D734j1703r46P952N438k095l325q47j378j366K000O598K573p919r620K868
2579g036J2612O662r571j2670M41J2196P590o147r512n31O072L763k327j632O34
2594E44r96k693K17N596L279m837p194P99P895M221n011o801M50O371J896l701
2610C5k350K056K658k807l292K419N636J04o597m095M435P264m11o295l733L006
2626a967M628Q6k260r65j4j462j66L257L859k523o455k050N553P320j361q683
$$ plain form
2521 13513 12421 -4577 -14394 -5471 8868 9112 -1366 -6575 -2004 2250 81 -1529 2731 4893
2535 4893 -1452 -8303 -4140 7116 9683 -947 -10363 -5598 6183 8329 -424 -5812 -2333 2491
2549 2491 781 -2033 1078 5007 948 -7592 -6969 4795 11123 2934 -10238 -10009 3400 11541 4734
2564 4734 -6969 -7915 37 5475 3380 55 -792 -2170 -3536 -1536 5062 7635 -284 -9904 -7036
2579 -7036 5576 12238 2667 -10003 -9562 2634 10224 4077 -5435 -5966 106 3869 1542 -90 544
2594 544 -452 -3145 -2928 2668 5947 1110 -6084 -5285 2610 6831 1820 -4981 -4531 1840 3736 35
2610 35 -2315 -259 2399 -408 -3700 -1281 4355 4459 -2138 -6233 -1798 5466 5055 -1240 -4973 -1967
2626 -1967 2661 2747 487 -478 -492 -1954 -2120 1137 4996 2473 -3982 -6032 -479 6841 5480 -3203
2642c203m647N875P508M20o754m625K640M522J454j811k059q36k95R17K420J480
2658C006k329l912o40M724L708k086n411j439M684L640j612m677l17L285J548
2673B172j923j497O67J796k34k025l99J941O38q69j447K96J440Qn54L15N82j164
2691b57j485Q00K263J202k451k962M63M232J888k528m053j32L275K918j393l096
2707a316j503J916K249P65j282k040j037Q64K497J193j452k784j038K590L254
2722B876o90l790j620K191L161P00l324j955J077K512O67j267j473K4R00Q35K07
2739A031n68j536RJ507R39m01k052q08J553J957L08k606j066R78K572o2k468j130
2757a843P00J891P75j178j484k8Q36J213L43j156j278L24J463Q79o22k312n53
$$ plain form
2642 -3203 -7850 -1975 5533 5953 -801 -5426 -2786 1736 3190 1379 -680 -1516 -1811 -894 1526 3006
2658 3006 677 -3235 -3875 849 4557 2471 -2940 -4379 305 3945 2333 -2344 -2661 624 2172
2673 2172 249 -1248 -581 1215 981 -1044 -1443 498 1136 267 -1180 -884 556 564 10 325 907 -257
2691 -257 -1742 -942 1321 2523 72 -2890 -2427 1805 3693 1165 -2888 -3020 255 3173 1780 -1316
2707 -1316 -2819 -903 1346 2111 829 -1211 -2248 -1384 1113 2306 854 -1930 -2968 -378 2876
2722 2876 2186 -1604 -3224 -1033 2128 2828 -496 -2451 -1374 1138 1805 538 -935 -911 -11 824 1031
2739 1031 463 -1073 -1064 443 1382 981 -1071 -1879 -326 1631 1939 -667 -1733 -755 1817 1755 -713 -1843
2757 -1843 -1143 748 1523 345 -1139 -1167 -331 882 1225 69 -1209 -885 578 1457 835 -1477 -2030
2774b030J693K340J06k820j593J141K516Q82k129j747j5K155J151j121j478l64
2790a313P64J389M90p54j567n49J333J715J89j947j634N40K782J060k109k472
2806b083K85K811J185j213k489n73K052J545k59j872q67R50J085M19l59j378m30
2823a191N15J639M65j573j560M25K110J491j751k094l66J840J885n28k342j123
2839b158J749J972K85k262j684J234J442R52p37j370r11P63J761N39j281j607
2855a313m77J565J895J12k578j192J072K248O89j445k371J71K120J203p23k056
2871a080n59J386J403l19j072q04P17J050j02m77o53o1P38N41l95p59j15L98J002
2890H39j4q23j243M82R82J657j108k235l74J714K657p08k929j634J933K625P67
$$ plain form
2774 -2030 -337 2003 2109 -711 -2304 -1163 1353 2235 106 -1641 -1656 499 1650 529 -949 -1313
2790 -1313 -549 840 1330 576 -991 -1540 -207 1508 1697 -250 -1884 -1344 1438 2498 389 -2083
2806 -2083 -1798 1013 2198 985 -1504 -2077 -25 1520 1261 -611 -1478 -528 557 976 617 -761 -1191
2823 -1191 -676 963 1428 -145 -1705 -1280 830 2321 570 -1524 -1890 -50 1835 1307 -1035 -2158
2839 -2158 -409 1563 1848 -414 -2098 -864 578 1530 793 -577 -1488 -725 1036 1575 294 -1313
2855 -1313 -1790 -225 1670 1782 -796 -1988 -916 1332 2021 576 -1795 -1624 496 1699 976 -1080
2871 -1080 -1639 -253 1150 831 -241 -1045 -328 722 620 143 -510 -571 167 708 313 -446 -561 -163 839
2890 839 825 2 -1241 -759 223 1880 772 -1463 -1837 -123 2534 1826 -1103 -2737 -804 1821 2588
2907B588k355k744K98K616K133r17k382j113M66K067J351m53k277j967R91L178
2923A480J807k056l681n80K898L445j066l369j655J576K810K61k081j133P39O31
2939B6J09K7M01j7j304n80J236J533k58j060j734Q81J709j50j352Q5J336p67j363
2958a242j02J940J968j669l824j6L950L304k327m647r83L422L477n71l462j859
2974b641J091J864J206K9p32k474j470J919M117J464m313m633L84O597L263l606
2990B065n949j052M917M189j730l683j219J572J414N89N9J01j836k505R53L914
3006A799K131k826m585l14M642L042k074m322J43K875J009j641n94J483P66k602
3022a068k280K883M426l12n711l165L318N970M31m995l611J863L363R02q91r24
$$ plain form
2907 2588 233 -2511 -2213 403 2536 1619 -763 -1876 -1410 657 2008 1555 -722 -2689 -1698 1480
2923 1480 3287 1231 -2450 -3030 -132 3313 2247 -1122 -2777 -1201 1609 1870 -211 -1344 -605 26
2939 26 135 162 563 546 -758 -1338 -102 1431 1173 113 -1621 -740 969 819 -533 -448 888 121 -1242
2958 -1242 -1344 596 2564 895 -2929 -2945 1005 4309 1982 -2665 -3648 -226 3251 2680 -782 -2641
2974 -2641 -1550 314 1520 1549 817 -1657 -3127 -1208 2909 4373 60 -4573 -4189 2408 5671 2065
2990 2065 -3884 -4936 -19 4170 2440 -1243 -2462 -890 524 1113 1172 1273 -563 -3068 -2115 1799
3006 1799 3930 1104 -3481 -3795 847 3889 1815 -2507 -2364 511 1520 -121 -715 768 1534 -1068
3022 -1068 -3348 -465 3961 3649 -2062 -5227 -1909 4061 4492 -503 -4114 -2251 1112 2014 1123 199
3038A99l95j665j054L741L898j277o951l494N692P880k31q047n799L898P913J606
3054E914n144m836P25L539J722m24Kj074k998j250L778N427q57o945m683M758
3070b346P633O35o977m871L138N596N25l458j195J480L30k066J34M033J489m144
3086f4n099J296O925L364n373o343Q26N854K961l177k884N79P56n19l8K829K140
3103D033l843o269J331Q323M719n800r399n70R037O257l865p776j932M715L789
3118B750k56j337j197j746j745J772N195L232o019p898R45R252O018n423r890
3133f347j022Q116N394k524o040j223L241J253j275J081K165j552n062j136O154
3148A223N614l138q217k169O751O037k445o268j266L333K451j606p47K190M67
$$ plain form
3038 199 -196 -1861 -2915 826 4724 3447 -3504 -6998 -1306 6574 6343 -1704 -7503 -3605 4308 5914
3054 5914 770 -4066 -3341 198 1920 1496 1498 424 -2574 -3824 -46 5381 4524 -2421 -7104 -2346
3070 -2346 5287 5922 -1055 -5926 -2788 2808 3333 -125 -1320 160 490 -1576 -1442 2591 4080 -64
3086 -64 -5163 -3867 3058 6422 1049 -5294 -4468 1386 4347 1170 -1714 -1135 -379 -898 -936 1893 4033
3103 4033 190 -6079 -4748 3575 8294 2494 -6905 -7475 1562 7819 3954 -3822 -5754 -1039 2750
3118 2750 2494 1157 -40 -1786 -3531 -1759 3436 6668 649 -7249 -6304 2948 8966 3543 -6347
3133 -6347 -7369 747 6141 3617 -2423 -3646 -405 848 -427 654 2819 1267 -3795 -4931 1223
3148 1223 6837 3699 -4518 -6687 64 6101 3656 -2612 -3878 -545 1906 300 -447 1743 2210
3163B210m673k525M519O621q65q491n280O366Q689M8p774n838L754O175J254l230
3179I60k287M93r66l77L236L985j485p196m182O399R122n34r883o433N286R568
3195E706J442p218n349K236M501J094j690L15k09k726j745K797N637N26p277n374
3211g334M318Q276J260p113n642L017N983L18l340j511K084K04k551k85M603K690
3227D977m571o155J434P478M050n375p639P42O540L054k564l832l13J601j11M91
3243a93K459J378m019n101J696P238M372o015q593K25Q314N947m148p765j338
3258e543N219L620r68k258o12q64q75J145L750K019l713o393L69P067M714m298
3274B379p331p12O301M405k593m570m54K732P02j364J61K093l18l759j401L775
$$ plain form
3163 2210 -2463 -4988 -469 6152 5287 -3204 -8484 -2118 6571 6619 -1155 -6993 -3239 2936 4190 960
3179 960 -1327 -834 -1800 -2177 1059 5044 3559 -3637 -7819 -1420 7702 7168 -2715 -9148 -3862 5706
3195 5706 7148 -70 -5419 -3183 1318 2412 722 1037 828 -1898 -3643 -846 4791 5317 -1960 -7334
3211 -7334 -3016 5260 6520 -593 -6235 -3218 2765 3083 -257 -1768 316 520 -2031 -2316 2287 4977
3227 4977 406 -5749 -4315 3163 7213 1838 -5801 -5059 1481 4535 1971 -1861 -2174 -573 -684 -193
3243 -193 2266 3644 -375 -5476 -3780 3458 7830 1815 -6778 -6553 1761 7708 3560 -4205 -5543
3258 -5543 -324 3296 2328 70 -542 -1406 -2281 -1136 2614 4633 920 -5473 -5104 1963 6677 2379
3274 2379 -4952 -5664 637 5042 2449 -2121 -2575 157 859 -505 -344 1749 1431 -2328 -3729 46
3290D6M609j688n434k551M306M723q65m306j769K203J966p24l92J058J47k904
3306a575k191L148M962k71o231l847M129O740N76o197m288K314M885J240k667
3321G27k215L39oM69J672J595j078m394j800L966N691j132n649l849L558N881
3337C775L79m588l111J790L072K33j454l20O79q67r91Q31K449K95k900k685J777
3354a636L947R05l133k837J239K808M40j915p65J017M58j853K0K202J951k168
3370F80l187l48L922K474k036l841j022L334K469j050j966j025O29R44J42J157
3386A276J71j741k592J420L378J537k863l927Q6M620K408k284l519n91K697K292
3402B368j207j482p87L42O19O24O39k83j105j314J96K285J263j787k280J72K530
$$ plain form
3290 46 4655 2967 -2467 -5018 -712 4011 3146 -1160 -2929 -726 1240 516 124 1182 1329 -1575
3306 -1575 -3766 -618 4344 4073 -2158 -6005 -1876 4864 5440 -757 -5045 -2731 2154 3394 727
3321 727 -1488 -1149 -1155 -686 986 2581 1503 -2891 -4691 -725 4966 3834 -1815 -5664 -2106 3775
3337 3775 4154 -434 -3545 -1755 1317 1550 96 -224 455 -412 -1403 -572 1877 2172 -728 -3413 -1636
3354 -1636 2311 3216 83 -2754 -1515 1293 1733 -182 -947 70 528 -1325 -1305 897 2848 680
3370 680 -2507 -2855 1067 3541 1505 -2336 -3358 -24 2445 1395 -571 -1596 -967 -23 119 1276
3386 1276 1447 -294 -2886 -1466 1912 3449 586 -3341 -3255 1365 3773 1489 -2030 -2621 76 2368
3402 2368 1161 -321 -1108 -766 -147 477 1116 833 -272 -1586 -1390 895 2158 371 -1909 -1737 793
3419G93R76j423j463K09J165N61r61m13P82O75p48j498Q60J659L38j538j491Q09
3437g08J240L44p94l51l79L74J56M53K68n10j087k60J034J876l20k241j101J399
3455f07K297M0j934j239L93J589J058r85j462k75P01P46L76O2q14q63O63Q78O15
3474A239p58j408k15J274J344n01j727j50R12Q83j03j274l03M29J025k30p02L6
3492b29J3K93N1j67n09M05MJ84L70m52m22N8K70P26l41r55O2Q25Q03n26o70p98
3514a005P54J032k31q14o02J59Q50N85p7r60o44N92R51J31q53k81l33R87M74k57
3534D58j071p2N67Q22k72o11m74J08R02L12m70o25j79O76Q42k71o90q20P63N08
3554D03M56q03o03m00R96P58k66p23n82M45P61N69o48q04k17N90O80R9j020l39
$$ plain form
3419 793 1769 346 -1117 -908 257 818 -143 -556 226 901 153 -1345 -485 1174 1512 -26 -1517 -708
3437 -708 532 876 82 -269 -648 -274 -118 335 603 93 -994 -1254 -220 1656 1336 -905 -2006 -607
3455 -607 1690 1730 -204 -1443 -1050 539 1597 612 -850 -1125 -424 322 698 760 -54 -917 -254 624 1239
3474 1239 481 -927 -1142 132 1476 975 -752 -902 10 893 790 -484 -787 -358 667 437 -265 -229
3492 -229 -216 77 128 -39 -548 -143 -139 45 415 -37 -459 -401 -131 595 254 -701 -639 186 989 463 -207 -1005
3514 -1005 -251 781 550 -264 -866 -707 143 728 651 -309 -953 -361 590 721 -132 -413 -746 241 715 458
3534 458 -613 -685 -118 704 432 -179 -653 -545 357 669 199 -426 -605 71 913 642 -48 -868 -105 403
3554 403 859 56 -547 -947 49 807 541 -182 -764 -319 442 1011 363 -441 -658 -68 612 711 -309 -648
3574f48P7P52N43r71k65j42J110R0l22p01n8L73P98l07o52k57K53P33ql86o88
3595f76K04Q98MM8r13rJ47P21L1q2q25k77P62M50j0p58n02L55Q57J6m19l24m98
3618h00J010K24M3r29n10O59N92J09j50o93J62N15M49m64p28j22Q53K08j54q7
3638A87p37j42J058K29m31o33nQ47r2J69n58k78LQ54K79o62n78l56Q93Q40k23
3659F64j133m34O21P25J32o20n12R2L52L86P3l90k87L8O27N29k58r20m82P89J029
3680A021m56p30n15M77P09N33r01p20K28P03J46o39l27M23K62q0l24J03L64J14
3700C91o35J14K19n1k87J88q1L97n03m64M13J146k04j255o25Q78J312O86k021
3719c82j051M96J899K86q92j295q4Q66N06K18m26n28p65L63J086Q59j30j891q26
$$ plain form
3574 -648 -571 181 724 -247 -512 -654 456 546 224 -477 -535 -162 636 329 -323 -580 -327 406 398 12 -676
3595 -676 -472 426 430 478 -435 -444 -297 424 455 373 -452 -729 33 483 473 -285 -787 -432 425 441 22 -302 -800
3618 -800 210 434 477 -452 -962 -303 289 398 248 -445 -283 232 681 217 -511 -633 220 428 274 187
3638 187 -550 -692 366 595 164 -469 -474 373 281 450 -108 -386 -383 471 750 88 -490 -846 47 887 664
3659 664 -469 -903 -282 443 575 -45 -557 -465 -113 273 346 -44 -331 -293 334 863 605 -315 -797 -8 1021
3680 1021 565 -165 -680 -203 506 1039 138 -582 -354 349 495 -144 -471 -48 214 134 -190 -87 277 391
3700 391 -244 -130 89 38 -249 -61 -142 255 -248 -712 -299 847 643 -612 -1237 -359 953 1639 -382
3719 -382 -1433 -937 962 1248 356 -939 -1023 -157 349 567 141 -387 -1152 -789 297 1156 1026 -865 -1691
3738a691J354J679M04k205j350J213J774J13j189j040K72J186p7l35l6L12o00
3755b16n78P12Q91L72j347j056O86J566J1r25j032O22P81k15o35M72L42n61j040
3774a150J58J521J199j109k200mK047J299q64k090k30J324R42k1l58r07l75qP45
3793h1J003Q73j848k140L41K843J703j882k757n08K564K067n64k343q69J256J086
3810G44J37l48l50n47o65K59J612J111j336k387j09K451J714j373k029o21J692
3827d5J517r36j018j68J141p05r80R48J569j81k255j270J978K430lk621j575J278
3845h96J895L97j524q79L57M99M8N29Q30j38k131j483J902L048L14l467k411J657
3863a453L682O01k866k215P53J834J286j188m55k40m21j06J182J569n19k486j659
$$ plain form
3738 -1691 -337 1342 1746 -459 -1809 -596 1178 1291 102 -938 -666 520 443 108 72 384 -216
3755 -216 -794 -82 809 1181 -166 -1222 -536 1030 1041 116 -916 -294 487 272 -363 109 451 -110 -1150
3774 -1150 -992 529 1728 619 -1581 -1585 462 1761 897 -1193 -1423 -99 843 822 464 -443 -818 -826 -81
3793 -81 922 1795 -53 -2193 -1852 991 2694 812 -1945 -2453 111 2178 1614 -729 -1598 -342 744
3810 744 881 533 183 -364 -1029 -770 842 1953 617 -1770 -1879 572 2286 913 -1116 -1737 -45
3827 -45 1472 536 -482 -650 491 -214 -1194 -246 1323 1142 -1113 -2383 -405 2025 2022 -599 -2174 -896
3845 -896 999 1396 -128 -1007 -650 -151 -103 426 1256 1118 -1013 -2496 -594 2454 2768 -699 -3110 -1453
3863 -1453 2229 2830 -36 -2251 -1498 336 1622 434 -21 -261 -682 -788 394 1963 1444 -1042 -2701
3880b701J504L516L70l209k373J411K987Q03k044j928R21Q34J67m11N72P18j551
3897d14j242O47K460R19k295k416M66K983J073j691j874K01J463K80n19L74N10
3914I25q62j396j31K509J756k269l113Q4L345K444j896l458o48K614K295n13j914
3931b28o19M18j76P43J046N49j608k635K98L580J975k385l661k83L476K429j407
3948A512k934o21J701J455m91n44J88k23r55j85J540J370n71k941n22K303K720
3965B802r16l002j245J869J699m68j037k56N81m36p45R14J794k60k087j875J885
3982g83L058P6k776k340J484K823M87j901j207K22Q27N3L72O42l80j466j320J736
4000c93L164j73l384k367J682L721N18k558k644R29K205P51j197m25j67N0m25
$$ plain form
3880 -2701 -1197 2319 2689 -520 -2893 -1482 1505 2308 264 -1664 -743 91 258 -153 419 1137 -414
3897 -414 -1656 -1009 1451 2370 75 -2341 -1875 1108 2181 490 -1384 -1183 280 560 41 415 925
3914 925 63 -1333 -1464 1045 2801 532 -2581 -2497 848 3292 1396 -2062 -2710 -96 2199 1686 -228
3931 -228 -847 -429 -605 138 1184 1733 125 -2510 -2212 1368 3343 958 -2703 -2986 490 2919 1512
3948 1512 -1422 -2043 -342 1113 622 78 266 43 -912 -1097 443 1813 1242 -1699 -2221 82 2802
3965 2802 1886 -1116 -2361 -492 1207 739 -298 -554 27 -409 -1154 -240 1554 1294 -793 -2668 -783
3982 -783 2275 2351 -425 -2765 -1281 1542 2029 128 -1079 -857 -30 23 395 1037 657 -809 -2129 -393
4000 -393 2771 2598 -786 -3153 -1471 2250 2768 210 -2434 -1505 700 1451 254 -171 -338 -288 -713
4017g13P67J239J51k182j281J203K655L70k445k305J037K359J032j353j550P0
4033i46J003m7l0K38R01j057j111j62K111J357j632k674M74J905J659j102j927
4050a040l39J266O90j25j51l3l21q92k08J981J120j366k868m1K667J672m22k874
4068a284j013J991J744k4j578n82K28K27N05L17K90r20j150P8J866J269j332k359
4086a727j45J893J779o31j908p50J024J210J72r26mK30n67l3K32J121j56j603
4104g89m83R36J674l14j890l82O08J249J02n15m08K64k39m38L45J292p4j511r89
4123a562P11J897P47j719j418N64J174J104j284j091K67M61M21j07J5K6o87j78
4141f59O39J115k41j360j016Q99J864K5j351j032K57J221M05q31n72K79K55J20
$$ plain form
4017 -713 54 1293 1444 -738 -2019 -816 1839 2209 -236 -2541 -1504 855 1887 534 -1016 -946
4033 -946 57 10 -20 218 1119 62 -1049 -1211 900 2257 625 -2049 -1575 330 1989 887 -1040
4050 -1040 -1379 -113 577 452 301 268 -53 -945 -1153 828 1948 582 -2286 -2327 340 2012 1590 -1284
4068 -1284 -2297 -306 1438 1414 -164 -746 -518 -291 214 531 821 -99 -1249 -1171 695 1964 632 -1727
4086 -1727 -1872 21 1800 1169 -739 -1489 -465 745 917 -9 -13 217 -350 -383 -151 970 814 -789
4104 -789 -1272 -336 1338 1024 -866 -1248 -640 609 711 196 -212 52 -187 -625 -280 1012 938 -573 -1562
4123 -1562 -851 1046 1793 74 -1344 -780 394 1498 214 -877 -610 -149 272 165 180 206 -481 -659
4141 -659 -20 1095 854 -506 -1522 -623 1241 1266 -85 -1117 -860 361 766 -65 -637 -358 -103 17
4159A7l3M84k10j30q08M80R88q2n77r99L63O48K38m61j2k55N60j33k58J01O22
4180E43k06n80o28J097O13k93p21n43P42P40m06l88n18J89J8P74r5k56o68K97
4200b89j75M83J023p13j027q8J028L89R8j145l28M80O73K75r47k07K72J81K59
4219B42J20p4k36k98L33J01P2l04m5j84L32L94m07m69J66J98N32J6m31k69N6M52
4241B97l30k95L45J1l0j51j2J68K47j11k04r2j22J30J40N55l20m32k00N17o0K77
4263C28k21l21L07M1Q7m8l35j55N42K63n74j70L5N2Q4L12J2l46J5o1K43K60k11
4286A39l22J91K3M48l38m47M6J87L21m8l73l55N54j8K47k93l83J55L60N3R1k75
4308c7j34O2L50k64K5j1j00o8M25J44o57K59j14L37J39%n96L2K49J03J86m95P9
$$ plain form
4159 17 -16 468 258 128 -680 -200 788 706 129 -870 -507 141 379 -82 -94 -349 211 78 -180 -79 543
4180 543 337 -243 -871 226 839 546 -175 -718 24 764 358 -30 -548 -359 -341 433 338 82 -586 -289
4200 -289 -464 19 1042 329 -698 -786 242 631 729 -416 -744 -264 409 684 -263 -470 -198 -17 242
4219 242 362 288 52 -246 87 188 260 -44 -89 -273 59 453 46 -423 -257 -59 473 489 58 -211 -155 297
4241 297 -33 -328 17 28 -2 -153 -165 3 250 139 -65 -157 -279 -149 -9 546 226 -206 -406 111 51 328
4263 328 107 -214 93 134 221 173 -162 -317 225 488 -86 -256 -221 -169 -85 227 239 -107 -92 -153 90 350 139
4286 139 -183 8 31 479 141 -306 -260 -73 248 200 -173 -528 26 8 255 -38 -421 -266 94 147 238 -37
4308 -37 -171 -109 241 -23 2 -9 -109 -177 248 392 -265 -6 -120 217 356 356 -240 -208 41 144 330 -165 -86
4331h6l30N76N8l29K6j74NO06k79m4k7O3J22j38o8M1nN7M1K9j58j52J57M5l6m53
4357d53K62L91j43j8j06Mj02K58L73n41l88P8M44J80l04M3k25J18J9K76J52o79
4379c61l8M41J07j26L8l67R1Q1M34j69k53l6j11N78m75q0J41j25N8M71k54p6k05
4402b36j01N98n2j56Nj45K55p2k47k36M46k79P6K23k89k6k53Q33l21n7o7j31K74
4425D2N32q51J82j42M1L85j78l51j88N62Mq2l7j50M0J5J78J11j96k4j85M11j06
4448A3k85R7k84O64m3k48J16l14K43J61on2k83k4K68K05j18l12j83P5M94K27m78
4471f7m0j75M04O1m34J67j87M03j09J89q2r8j29k71O50n2k2m05r2L21M76k00q51
4494e43L46K45L65k58k32l65O30j36lk25L8M6J40l04M5L24q1k57M7K32Pj76P6
$$ plain form
4331 -86 -416 160 218 -111 -85 -259 -254 352 73 29 2 65 187 49 -19 22 17 74 115 144 -14 -166 -9 36 0 -453
4357 -453 -191 200 57 39 -67 -63 -165 93 466 -75 -463 -385 59 239 -65 -22 -247 -129 -110 166 318 -361
4379 -361 -399 42 149 23 61 -306 -215 -134 300 131 -122 -158 -269 309 -166 -246 -105 -230 -172 299 45 -31 -236
4402 -236 -337 261 209 53 58 -87 168 96 -151 -387 59 -220 -144 79 -210 -236 -489 344 23 -34 -101 -232 42
4425 42 574 -277 -95 -237 -196 189 11 -340 -528 34 38 -44 -81 -231 -191 -176 2 113 -83 -107 -292 119 13
4448 13 -272 -175 -459 205 162 -86 30 -284 -41 120 114 62 -221 -245 23 228 110 -202 -385 -310 184 411 -67
4471 -67 -107 -282 122 183 -251 -84 -271 132 23 212 130 32 -97 -368 282 230 208 -197 -289 32 508 308 -543
4494 -543 -197 48 413 155 -77 -442 188 52 49 -176 -138 -92 48 -256 -211 113 32 -225 -178 54 61 -115 -39
4517c9K8j76J7J05j92K09j60R8j60J39K52M23n85n46J91P15K87m80l32k14K74
4538a46O40j15m46K02q2l92M12Q2N50r37k37O4Q33P2l97m93k18N37Q16o59o98
4559f12P2P04L20l69j03J07Ol59r7L98j11n6o5m53Q60J27K7q88k81J032k59m1
4581d1M9l4J67k8m59J81O78l81m68j94M47N39m1o28n89N99L92L44n31l80O4K09
4603a05K2M67J36l07l56q91Q52P73%q74m86J66J222n9m77o43rP22K59l5p35J66
4625a92K08k83K88L57m2m56p62P48Q82kq05q30N72J023J7o37m70K32J92m2k33
4646b35N87n7m68m26N0R17N78q39o59k40P03O87k57r12K33K26L52k6Q3Oo3q00
4668e60J37Q27O28r67j090o9J358J164n42j523l67R17Q99l05n98j49J13n2m0R47
$$ plain form
4517 -39 -11 -187 -170 -65 -257 -48 -208 -110 -270 -131 121 544 -41 -587 -396 319 606 126 -206 -420 -146
4538 -146 494 379 -67 135 53 -339 73 155 705 -232 -469 -405 428 500 103 -390 -608 -71 745 86 -612
4559 -612 -540 164 484 115 12 119 125 -234 -331 67 -44 -100 -165 -618 242 369 396 -492 -773 259 0 -41
4581 -41 8 -26 141 113 -346 -165 513 132 -336 -530 -83 456 415 -213 -802 -203 189 533 2 -378 -314 -105
4603 -105 -83 384 520 213 -143 -1034 -182 591 591 -283 -769 -603 619 560 83 -560 -569 153 412 377 -358 -192
4625 -192 16 -267 21 378 336 -120 -882 -134 748 746 -59 -889 -317 706 723 86 -384 -152 40 -2 -235
4646 -235 352 295 -173 -599 -549 368 946 107 -552 -792 -89 598 341 -571 -338 -112 240 214 297 303 240 -560
4668 -560 -423 404 1032 65 -1025 -1094 264 1428 886 -637 -1004 -87 812 507 -91 -240 -127 -179 -219 728
4688G28J95j114p04L2J237P45o12j013m76J514J95k34j012j83M84P12k78l35K41
4707A22k57Nk54O59M45l74r23m31O77J075l22o50n46L29R19M3n71J17l4j60j53
4728b84K43J083m40r39p00M44J210J92q89q75M42R24L83o16m65r8N58J69k51L69
4748D60o2p08k20P13O09J1j179m97R1J494L24r44j004K32J009J79k03n64j20L70
4768ij48k00P39j42m79m97L91Q10N10p54q41q7R14O01r44j18Q2L65mq4L25oj46
4791B78q75PP39P06n82p64n92J155O60l85o21l58M07L21P5L13j47m02k08k63P71
4812B35O75p27r32j47R24Q76j50j093n26P13R24K0q96m17K56J69J83N15m86L5
4832A51o24l3P55N73m44r10j63N73R14l07p09J3j61O90m2m89K07Q8j08j15N6K99
$$ plain form
4688 728 923 -191 -895 -863 374 1119 507 -506 -982 532 727 493 -519 -702 -218 494 216 -119 122
4707 122 -135 -130 -384 275 720 346 -577 -1008 -331 744 422 -228 -774 -445 474 517 -54 63 29 -131 -284
4728 -284 -41 1042 602 -337 -1037 -593 617 809 -80 -955 -513 411 794 178 -287 -385 173 342 91 460
4748 460 398 -310 -530 183 792 803 -376 -873 -782 712 1036 92 -912 -680 329 508 305 -259 -379 -9
4768 -9 -157 -357 382 240 -239 -736 -345 465 975 221 -620 -707 207 808 -136 -254 -172 193 189 105 430 424 278
4791 278 -597 -590 149 855 273 -491 -1083 72 732 347 -274 -632 -225 96 171 484 337 -65 -273 -536 235
4812 235 910 183 -749 -896 28 904 754 -339 -865 -152 772 792 -104 -521 -265 -96 87 602 116 151
4832 151 -473 -506 249 822 378 -532 -695 -122 792 485 -224 -211 -372 318 276 -213 -6 82 -26 -141 -85 214
4854B14M54j043L2J26P75r8n75l17J33O65k65j72J52l93J42j43K02M39P1m98p70
4875h69L07J015L73r94r27M02J063P46q35o28K18o3M35l41K03J6l83l53M32O89
4895E06r2l44r21L82R47J13n06m54j04O78O5j87j61j19K31m6k58L20L70o41J52
4916f9l23M25N57m51m55j63N08M84m13l08j3L97l49J46J42J10N6o30o1K68R33
4937G91m86n53p1RO81k50n50J48O1J28J87K46m71J43l13L85J62k91M74q21m36
4958h27J000K01j66l72k71qP00K64m60k32j19j7K12j98L09p1p7rl4P8N00m62k23
4981b82K88o7M21l09l22j4L15J31m76L88m5J29r1k79L90Q8l12j65k64N83K32j47
5003A92l90K1K21j99J10J64o1J5j94L52j84j54j14pQ5L34J15N6q02J23L19K0j21
$$ plain form
4854 214 668 -375 -343 -217 558 460 -115 -432 -299 366 101 -71 81 -312 -170 -313 -111 328 399 -99 -869
4875 -869 -562 453 826 -168 -1095 -693 370 1116 281 -347 -129 -192 243 -98 105 121 -262 -615 -183 506
4895 506 414 70 -851 -469 478 591 85 -369 -473 205 270 83 -78 -197 34 -12 -270 50 420 -221 -69
4916 -69 -392 33 590 139 -316 -479 29 513 100 -208 -221 176 -173 -27 115 225 281 -349 -410 -142 791
4937 791 305 -248 -319 -310 371 121 -429 -281 -220 -92 95 341 -130 13 -300 85 247 -44 430 -391 -827
4958 -827 173 374 208 -164 -435 -443 257 521 61 -171 -290 -307 -95 -293 16 -55 -132 -141 -175 -97 403 -59 -282
4981 -282 6 -61 360 51 -271 -285 30 161 -315 73 28 157 66 -213 177 265 -47 -212 -476 107 339 192
5003 192 -198 -177 44 -155 -45 119 58 73 -121 231 47 -107 -221 -228 -143 191 306 362 -440 -317 2 22 -99
5026i9L2j32L1K90Q2k02n3K2n5O0J39P4l35j7L80l1o0j09j99j18K26O8Kj13r9
5051b16J63j96L42k30J38J3m2j79M50m67L4J58pj71j36M11q2M17k01l04k1K15
5073H9n3k3J40k16R8o7L48m69J8J75k93L69l2j60k37K73M05l11J83k92K9L54k44
5096H4L13m35p7M5J69N6Rm64J57K15K11m10Q4l02K24K56k30p6k6k3J31J31M9k12
5120a21k04N12m03N06l03j45K2K25O4j27j85J1P3KK14o6n54K78R1K22K7j03j07
5143g1n0K47q0n2K87j10l70L46j58l1r9Q7M7J13j50J38l1L16l72j27P3k07K34
5166b0J48j10j0j02L16o4q5P2j21j72K30K11j73j16q5jM53l8m41p3R2J38q2q8
5190a21o7K70n11N10m36K43J54j48K91k76O8O0j19K6j3J37l59q9J30N35k05L3
$$ plain form
5026 -99 -67 -199 -168 122 204 2 -51 -29 -84 -24 115 189 -146 -163 217 186 126 17 -182 -300 -74 -6 -4 -117 -216
5051 -216 -53 -249 93 -137 1 14 -28 -207 243 -224 -190 -32 -39 -210 -346 65 -17 400 199 -105 -126 89
5073 89 36 13 153 -63 35 -32 316 -153 -135 40 -253 116 84 -76 -313 -40 365 54 237 -55 -26 328 84
5096 84 397 -38 -115 -70 99 155 164 -300 -143 72 283 -127 -43 -345 -121 135 -95 -171 -197 -220 -89 42 91 -121
5120 -121 -325 187 -216 290 -13 -158 -136 89 153 26 -159 -148 -75 -73 141 75 -479 -201 -110 112 139 36 -71
5143 -71 -121 126 46 -6 281 171 -199 147 -11 -42 -141 -54 -7 106 -44 94 63 379 7 -120 -47 -254 -20
5166 -20 128 18 8 -94 222 158 73 145 24 -148 82 293 120 4 -81 -82 371 333 -108 -181 -89 49 -33 -121
5190 -121 -188 82 -429 81 -355 -112 42 -106 185 -91 -23 37 -82 -56 -69 68 -291 -380 -250 285 80 113
5212A13j04j58K49J50k85J53l44J95n8R5K61l12Qj11J68J91k26r8J94j10j73O5
5234a37O9r7J56k46N61j79k33M0Q2K00L6l71O8j2N54n26mj69K26K16j64L3j53
5257e0J28L37l83L16l30O1l29p8M87l13m4N0L79n1N6m14L38O8k6k57K3k49N06
5280B25m2r0j03j50k05N48p3l08n5k92Q32j05P5k03K95m57P1L00l19r5k3K68K31
5303C25j04J14m28J09K05m0r1m45K49Q4j17J56k14J86k44Q9J59K1K30l90L2J63
5325D9j5J3l05P4N6J0K06K01l08L60l90q6k61L73L62K96q04m7j73N18J97m58l28
5348d60M65K23J01m39nm3k28K71K89J10k49l39k66O28M65l61m24k1j35N41J49
5369B72n4n13l1M19M1j53L9rJ5o6R7L3J70m31j24J3K86J19Q0o92M51j33N13k16
$$ plain form
5212 113 9 -149 100 250 -35 118 -226 -31 -89 6 267 -45 -37 -148 20 211 -15 -113 81 -29 -202 -137
5234 -137 -68 -165 -9 -255 306 127 -106 -66 16 216 252 -119 -51 -63 491 -35 -39 -208 18 234 70 103 -50
5257 -50 78 415 32 348 18 79 -250 -328 159 -154 -198 -148 231 180 236 -178 160 228 202 -55 -32 -281 225
5280 225 183 93 -10 -160 -365 183 110 -198 -253 -545 287 182 257 54 349 -108 -37 263 -56 -151 -174 94 325
5303 325 221 335 -93 16 221 181 90 -355 -106 -22 -139 17 -197 -11 -255 -166 -7 14 244 -146 -114 49
5325 49 34 47 -258 -184 -128 -118 88 289 -19 341 -49 -135 -396 -23 339 635 -169 -216 -389 129 326 -132 -460
5348 -460 5 228 329 -110 -115 -158 -386 -115 174 284 35 -304 -570 58 523 162 -262 -283 -418 123 272
5369 272 218 -295 -326 93 134 -19 20 11 26 -40 57 90 260 -171 -295 -282 4 123 203 -489 -38 -171 342 126
5393A26n81L42L21k11Rn8L90m32k49M06j13P44n98n83J06L92L38R5l15k92%M04
5415B41k63K0K46m42k93M9N44M60l13o82m99J182L70j79p83j46K29M10N20p31
5435f0q1l17M04J90j07K52m54j79j45O46M94m96p01o9N10K16L76p25J73N4M8K5
5457E4J34l58JJ39m28O13L69j78p06j38L41L41K79l04q11L18O94K2p1l59l1kr
5480i0K15K12J8m97m21q1J097K00l72j093K49O47L20l10m97L47J27J75k51M1J54
5501A90m36j61lQ94k37m80m69K33O27L43k60n48j21M65L27n24J85l47L00Q9Q8
5522A55j33L63m43k36j61R93j80o8o75l34R42K45j12l73j06m5N68l38N8R7l86
5543a69j78j75M40P35o59p6n85N77O77j68p38k24L60L78k98K60j68k19m15N53
$$ plain form
5393 126 -455 -113 208 -3 6 -52 338 -94 -343 63 -50 694 96 -487 -381 11 349 444 129 -163 -163 241
5415 241 -22 -2 244 -198 -491 -442 102 562 249 -433 -932 250 620 441 -342 -488 -259 151 671 -60
5435 -60 -141 -458 -54 136 29 281 -173 -352 -497 149 643 147 -554 -623 -113 103 479 -246 -73 -19 29 54
5457 54 188 -170 -169 -30 -458 155 524 346 -360 -498 -157 184 463 159 -652 -334 360 382 311 -48 -79 -81 -90
5480 -90 125 337 355 -142 -563 -644 453 653 281 -812 -563 84 404 94 -403 -56 71 246 -5 36 190
5501 190 -246 -407 -410 484 247 -233 -702 -469 158 501 241 -307 -428 37 364 -160 25 -322 -22 67 155
5522 155 22 385 -58 -294 -455 538 358 290 -385 -719 223 468 356 -17 -123 -168 400 62 120 217 -169
5543 -169 -347 -522 -82 653 -6 -82 -667 -90 587 419 -319 -543 -183 195 -103 157 -11 -230 -645 -92
5563i2K36L97k84q95K56N21O00l50p01j78J65P44J75o99k49J0L32J3J69P0k68
5584b8l39j58N47L07j7n81m35N86M19J65o60m5J36M16j57k89N0J86L1l51m4N51
5606B90J61m06p70M11M81M32l48o11J28L19K06P7p4k39k67l6M8M95k44Jo77N13
5628a10K49N81o42o62J35O41K77j60n31k77O63J25q3k76P0j53J13j32L66J39n00
5649a67l54J50N47K55j72q10N5O15L83j34o77M23j5k54l62R60k68J07o80L87q2
5670i3M92k6p32J22J32K55p0k09J09P8J82l93J81J50k33m04K46M76K04l42m49
5691c24j40J37O96j26k99m19L23J81J03J72m68On3M60j40k0K45o08j15L92L54
5712C57J05m07m21M35J59Ol70J05n80M51L60o6j54M9k23J54k8n6J07k55M7J29
$$ plain form
5563 -92 144 541 257 -638 -382 139 739 389 -312 -490 -325 419 594 -105 -354 -344 -12 1 170 240 -28
5584 -28 -367 -525 22 329 312 -269 -704 -118 301 466 -194 -239 -103 313 156 -133 -83 103 134 -217 -261 290
5606 290 451 45 -725 -314 167 599 251 -360 -232 87 293 370 296 57 -210 -246 -198 297 53 54 -623 -110
5628 -110 139 720 78 -584 -449 192 469 309 -222 -499 164 289 206 -70 0 -153 -40 -172 194 333 -167
5649 -167 -521 -371 176 431 259 -551 -496 119 502 368 -309 114 99 -155 -517 443 175 282 -398 -11 -93
5670 -93 399 373 -359 -237 -105 150 80 -129 -20 58 240 -153 28 178 -55 -459 -213 263 467 125 -324
5691 -324 -464 -327 369 243 -56 -475 -152 29 132 304 -164 -158 -211 249 109 89 334 -274 -389 3 357
5712 357 462 55 -366 69 228 234 -136 -31 -611 -160 200 134 -20 29 -194 -40 -68 -124 -17 -272 -225 -96
5734i6O17k79n91K91k88L97J13J37k99l3P5m08K31L12L34o98j07J27K31j5K86
5755C37m99m5K15n9K21q5K52n91L7K67J11R5k15j85J11L33J5K08p78M02k4l5j34
5778d6m8Q6Q5j00J55j49j13O7l9M3OJ81k55r4J92N9J28j95p7K17P9k17k88M30
5802A07j91r4P0J06L1k24L81l39k2M0L46j35j23M1p5R5J86l08J16j9m5j01K44
5825H7K82l64P2n60L31J42K35k23j91l2K07K04k36j52K16Kn9J48l1q0r0K28j57
5848b1q6k21M89r1o7j49Jj33N64l30J86qj42J56k74O14o54K8P3K32J85k55j50
5871e3j05L13m5J55l65Q2r7K15J64R6k94Qj05P5J06k70J80k98j65O80j57k4l23
5894b27J38k54J73K9M8L05Jm1lj53jl0J30L39k72o59N25N0J32l71k23N67J8j50
$$ plain form
5734 -96 521 242 -349 -58 -346 51 164 301 2 -31 44 -364 -133 179 513 -185 -292 -165 66 51 337
5755 337 -162 -207 8 -51 170 85 337 -254 -217 50 161 256 41 -144 -33 300 315 523 -255 147 123 88 -46
5778 -46 -94 -8 77 -23 132 -17 -130 -63 -102 -59 -53 128 -127 -221 -29 30 158 -37 -114 103 182 -35 -323 107
5802 107 -84 -178 -108 -2 29 -195 186 -153 -175 -135 211 76 -47 -6 -81 14 200 -108 8 -11 -56 -157 87
5825 87 369 5 77 -483 -152 -10 225 2 -189 -221 -14 190 -46 -198 18 20 -39 109 78 -2 -92 136 -21
5848 -21 -107 -328 161 70 3 -146 -145 -278 286 -44 142 134 -8 148 -126 488 -166 -138 -65 167 352 97 -53
5871 -53 -158 155 110 265 -100 -18 -115 100 264 360 66 74 -31 44 150 -120 60 -238 -403 277 120 96 -227
5894 -227 -89 -343 -170 -141 -93 212 213 172 169 16 15 -15 115 454 182 -477 48 98 230 -141 -364 203 221 71
5918G1k60J24k12K42J0j76K49O6j34j47K04P7j77l5j01L84l85K25p3j97M50k50
5940d5k3K30l40j25K8L39L05j68K76o78L73J34k5j8l66R4KJ31m6l01L88R6ql96
5964a43k15K84J47J3l12M81o11L05R8K7O7k17R4J74k50J63q6pj40OL94k47j78
5987a53L71j89L8k61L3O3KL92k77Pj15K02j07K5j45J62j47L70k52k06J24m6J72
6010F3J0j13j45J53p3J34J69j86K05j67l31N04j36O6K6k84J91k12J94m08M07m0
6032B7k40L80o1O9k76m4K39q1j18J71k22K21j99J33Q7Rr8r2K00l11M11k14o8j01
6056a78K37k23J75Q4l25J82Q2m1J9J79k12n8N5L00r4m85M18R1j87k11j71M29j74
6079a08J46K66l34kk71K45p3L14Q0m41J3K44R3J19m68k55O37M4j78P1k25j22J86
$$ plain form
5918 71 -189 -65 -277 -35 -25 -201 48 114 -20 -167 37 114 -63 -98 -199 185 -200 25 -48 -245 205 -45
5940 -45 -68 162 -178 -303 -275 64 369 201 477 -201 172 306 281 263 -103 -9 -7 124 78 -223 165 261 253 -143
5964 -143 -358 -74 73 86 -226 255 -356 -51 47 74 141 -76 18 192 -58 105 19 12 -128 -122 272 25 -153
5987 -153 218 29 67 -194 -161 -98 -96 296 19 26 -89 113 6 31 -114 48 -99 271 19 -187 -63 -109 63
6010 63 73 -40 -185 -32 -105 29 198 12 217 50 -281 223 87 153 179 -105 86 -126 68 -340 67 27
6032 27 -213 167 106 175 -101 -145 94 13 -105 66 -156 65 -134 -1 86 95 -3 -95 105 -206 205 -9 -77 -178
6056 -178 59 -164 11 95 -230 -48 34 -7 12 191 -21 -79 -24 276 182 -303 115 206 19 -192 -363 66 -108
6079 -108 38 304 -30 -32 -303 -58 -131 183 263 -178 -165 79 172 291 -177 -432 205 249 71 142 -83 -205 -19
6102a9K89j92L71m04j02r9J90L50m96L8j02K23M84k64m86k2j0M71r8j2l59K55
6124FJ72J21P6n57R4K81l4o6M8q1m4k71K34J00r5j4l77L30Q1J65J17k24J37j2
6148A87k49rK36K83o57j54J53L18q9J49m43l8N33K04l38k77R0j84N89k56K98j9
6170C27l56k33J65L76J59m88k73r7L28N41j96n81K12J06N2Q4j45K9k95M75k14
6191b4K91q1m86K80l19P22J50l75k63o11N60K95m7j16q3L1K96r4p9o9O4m01K5
6214c34M87jJ43m41J27lN35j55l85l61K31L63J87n55J67j37N8l14N83K66n55o0
6236a54k04J86N72N6n55k12K68M52J04m82n95K55L17O8R9n3k21j79l1L42L57j89
6258B01q2r06P63N41j63m00n0j69L49N00k44m10J01l86J14J06K29K60l75m45J17
$$ plain form
6102 -19 270 78 449 45 -57 -156 34 384 -112 -74 -176 47 531 267 -219 -241 -251 220 122 110 -249 6
6124 6 178 299 375 -182 -88 193 159 93 141 60 16 -255 -21 79 -16 -30 -407 -77 4 169 286 62 199 187
6148 187 -62 -71 165 448 -209 -363 -210 108 19 168 -275 -313 220 424 86 -191 -101 -285 304 48 346 327
6170 327 -29 -262 -97 279 438 -50 -323 -420 -92 449 253 -328 -116 -10 42 126 -19 10 -285 190 -24
6191 -24 267 186 -300 -20 -339 383 533 158 -105 -716 -156 139 92 -24 -107 -76 220 126 47 -22 42 -359 -334
6214 -334 153 152 295 -146 -19 -22 513 358 -27 -388 -157 206 393 -162 5 -132 -74 -388 195 461 -94 -154
6236 -154 -358 -172 400 456 -99 -311 -43 409 513 31 -564 -309 8 76 175 122 -99 -278 -309 33 390 201
6258 201 119 -787 -24 517 354 -46 -96 -265 84 584 340 -70 31 -355 -241 -135 94 354 -21 -466 -349
6279c49M55K74k26m83M0M65O5O2l36k11J79k35P7J00N51l82n08L44J62L21k31
6300A34n27L9M64L62n42N3l56J76J71J32k84J89j28l4j7N02J23l67n29L5O63J77
6322D36j21n81k75O82J13O2l27P0P0j6r5j05K57j61l66j23O66M15m05p07J12L37
6344f2N17p0m62k94K55K41k67m4M68j73k73ML17K96k45l09n03N39N37j4m55o37
6366f34L47M44Q8k86R8k50J90j72K64K60m09j2l69K40O76j55j85k33n2N43P0l55
6388A08l72o6L73N2j9o3k22L77o45M48N25l97m14j6J80N00K49n67k35J40M92l12
6410A16k14O5J70n9j82O0m4O89p48j34K10J73L00l61j66j82J30N46l82k94J99
6431a08l2q4L5M10j78q7J48m75N30N21n63l51l59N40O99m83k19p3n7M57p3l05
$$ plain form
6279 -349 106 380 154 -329 -289 176 241 303 -33 -244 -65 -300 -223 -123 428 46 -462 -118 44 365 134
6300 134 -393 -354 110 472 -70 -17 -373 -197 -26 106 -178 11 -117 -151 -168 334 457 90 -439 -404 259 436
6322 436 315 -266 -541 141 254 316 -11 59 129 113 18 -87 170 9 -357 -480 186 601 196 -511 -399 -62
6344 -62 455 385 -77 -371 -116 125 -142 -186 282 109 -164 -160 157 453 208 -101 -604 -65 472 458 3 -634
6366 -634 -287 157 245 -41 57 -193 -3 -175 89 349 -60 -72 -441 -201 475 320 135 -98 -150 393 463 108
6388 108 -264 -330 43 95 76 13 -209 168 -477 -29 496 99 -315 -331 -151 349 598 31 -204 -64 428 116
6410 116 -98 -33 137 78 -104 -44 -88 601 -147 -281 -71 102 402 41 -125 -307 -177 369 -13 -307 -108
6431 -108 -140 -224 -189 221 43 -44 104 -371 159 680 117 -234 -593 -53 646 163 -56 -129 -186 271 198 -107
6453a07K8l0o7J48L00k5l73q2j46N71J27j32l87P4nK02J24k40j6r8J30o3K11K28
6477C72j07k60m30O30K90k54o15N2M09n4P5m18j3J10J43Q3J1J08j78j99q3M42
6499A14K26k58l94j5L0M96j14j38JJ09P8K06j09k93Ml36L19l3K38k02J11k92N98
6522C46k81J36j67l99m2N27j3p3lJ34o9j42L95n9n67K03j37O0L64N2m16m2K47
6545E4Q5O2k43J47J05k61R9r6R1k67J64qo0J06K07j42L5l50K03J00j8k27jJ99
6569a6J2J51l18K6J3N2n5L01j52n7j66q1J12L51j13l71QN17j87J9j64nJ74J60
6593B11R9j29m5m05J36J98j51M20k37p4lR9j56l4M8K0J42m19L01N1j80K86m6k41
6617a09J03J70j50K92k36k09K74l62J97Q5P6jj58J2M6j82o9J66Q6K01k17l3oN1
$$ plain form
6453 -107 -79 -109 -176 -28 272 247 -126 -208 -354 217 344 212 -175 -101 -106 96 220 -20 -36 -134 -4 -67 144 372
6477 372 265 5 -425 205 495 241 -374 -322 87 33 108 -310 -323 -213 -70 13 24 132 -46 -245 -328 114
6499 114 340 82 -312 -327 -297 199 85 -53 -52 57 135 341 232 -61 -57 -393 -74 -107 131 -71 40 -252 346
6522 346 65 201 34 -365 -407 120 107 34 31 165 96 -46 349 290 -277 -74 -211 -151 213 265 -151 -193 54
6545 54 139 201 -42 105 210 -51 48 -48 43 -224 -60 -68 -128 -22 185 43 78 -272 -69 31 13 -214 -215 -16
6569 -16 -4 147 -171 -145 -132 -80 -135 166 14 -43 -209 -290 -178 173 60 -311 -303 214 27 46 -118 -123 51 211
6593 211 310 181 136 -269 -133 65 -86 334 97 23 20 119 -37 -71 -23 -3 139 -280 21 72 -108 178 132 -109
6617 -109 -6 164 14 306 70 -139 135 -227 -30 55 131 130 -28 -16 30 -152 -221 -55 31 232 15 -18 -24 27
6641B7r5J70m25PM87j32j61K1K18L1k28R0o7qn1j46K85r4Q1O4p8k94K00K91l77
6666a84j53L34J55l15J38j50L04j36P1j06j7M65o52N50k08j38j69Q0K51K0j86
6687d6l1k11N30l74J01O2k0m1L27l03J62j56r1J99j5j39J17k29j81K42M25j94
6709A34r8l13J86J40j00L07l95R8q0J26L5R6l16L93l3j76l5J95j26j01J63L9r6
6732D3K01l50J15j06J10m0L65l79K4O7j25j07J84r8LN6p8J48N4M32j066L28K88
6755F9k70K56J06m32K10n7J33j4J95j01l62J95k1N8j67J57L4k52L78k21j10j08
6777c24L51O1j65n9Kq9M19p6q0j07m3j35K57j53K46K7k96K11j71L83q7m73J22
6800a79L22k02J33k42L21j19j05K0R8k00L48k97LQ1J8o9J25j82j38L52P0j82j79
$$ plain form
6641 27 -68 102 -323 -316 171 39 -122 -101 117 148 -80 10 -57 -65 -116 -262 23 -71 10 74 -4 -298 -98 193 -184
6666 -184 -337 -3 152 -163 -25 -175 129 -7 64 -42 -59 406 -246 304 96 -42 -211 -131 120 140 -46
6687 -46 -77 -288 242 -132 -31 31 11 -30 297 -6 156 0 -91 108 93 -46 71 -158 -339 -97 328 134
6709 134 36 -277 -91 49 -51 256 -139 -41 -121 5 40 136 -180 213 180 4 -31 164 38 -63 100 139 43
6732 43 244 -106 9 -97 13 -27 338 -41 -17 50 -75 -182 2 -96 -93 -37 -115 33 87 519 -547 -219 69
6755 69 -201 55 161 -271 -61 -118 15 1 196 95 -267 -72 -93 -35 -202 -45 -11 -263 115 -106 -216 -324
6777 -324 27 88 -77 -136 -134 -223 196 120 40 -67 -110 -245 12 -141 105 132 -164 47 -124 259 172 -301 -179
6800 -179 143 -59 74 -168 153 34 -71 -51 47 -153 195 -102 -99 -18 0 -69 56 -126 -264 88 158 -24 -203
6823b03K67J33l70J69K33n37L04m4K5L72l18j10P2J83k26J11P9m25K84P6L00m86
6845a11K48l08K32J92l54K70k36m57P38kj87j29oJ59q2L65o60N88n80N88J7j65
6867A20j20j68K9K51J17k56K7k61L08J89l75j9L59n22K27p9j43M57J2k68J69m0
6889A4J51n1q3m77J87L20m3j71J68k01J17r3k2M09n7l53n3L09jo3j03j2K54j63
6913a7l0K70k05j95%P7j6K49j64M0j79M77k60K18m63L2K98J39Q7l43m12K88K85
6936A76l8J8n09J28J56l8L84j40M7k61j2K01j23J23l91J2Q0O6J08Oj45J43j30
6959a39p1m3L09p2p5l18M16J38K34l72k91P0M64%J06l52l83N44L3j64k82Q7K00
6982C9kl5K28k9j12n21K01Q5L68k23o7j68L18J97L6n45p0L81j24J78j92J80J3
$$ plain form
6823 -203 64 197 -173 -4 229 -308 -4 -48 -23 349 31 -79 -7 176 -50 61 140 -285 -1 75 375 -111
6845 -111 137 -171 61 253 -101 169 -67 -524 214 212 25 -104 -110 49 -33 332 -328 260 -320 268 285 120
6867 120 0 -168 -139 112 229 -27 0 -261 47 236 -139 -158 201 -321 -94 -173 -316 141 153 -115 54 14
6889 14 165 114 31 -446 -259 61 18 -153 15 -186 -69 -162 -184 225 168 -185 -238 71 70 7 -96 -108 146 -17
6913 -17 -47 223 18 -177 -177 -100 -116 133 -31 9 -170 307 47 265 -198 -166 132 271 358 15 -397 -109 176
6936 176 138 156 -353 -225 -69 -107 277 137 184 -77 -89 112 -11 112 -279 -267 -187 -121 -13 -7 -152 -9 -139
6959 -139 -210 -253 56 -16 -91 -409 7 145 379 7 -284 -214 250 250 356 4 -379 165 198 34 -248 -161 39
6982 39 37 2 230 201 89 -432 -231 -146 222 -1 -68 -236 82 279 315 -230 -300 81 -43 135 -57 123 136
7005A36n15J38K89L16m20m34J92M97K79o28r3L6K44N06m65J09l05N4K47J82k80
7026H5p0qk13k29O27J49O2l33m28N10k60M84o95K32Q2k16K82J12K41l31j39o4
7048a20L26N2J45n01m31K18P61k78J75o08J79k56M87l6j77J70m3j18j95L87k77
7069a40k46l6L12O77o7n83k1m84R29l42q4J02N2K0l5j2J5l8J41n23M4N16kj57
7093C8l09P5P77j60k52k01Q8m17K89J39l16K71k80J02n4M60K2p8k75k41M98L68
7115E44l83k60j46M47L5l19J90k82j18p5N43J16j17M5o32J13N81J96n35m14oM56
7137b1K79M5n33m0K31K94l02j06L88o9l19J69J50Pk79l0k06J08P95l60m44J44
7159i9O5j12jn3J19R4L4Nk11J82k5J5p3K06J65k73l92K86L6L68j74j11qj08j36
$$ plain form
7005 136 -379 -241 48 364 -56 -490 -298 199 478 -150 -243 -207 37 543 78 187 -118 -64 183 365 85
7026 85 15 7 -206 -435 192 341 403 70 -358 152 -108 376 -319 -87 -5 -221 61 173 414 83 -56 -120
7048 -120 206 258 403 -98 -529 -311 450 172 347 -261 -82 -338 149 113 -64 106 63 -55 -250 137 -140
7069 -140 -386 -422 -110 567 500 -83 -104 -588 341 -1 -85 17 69 89 54 42 57 19 160 -363 -319 197 195 38
7093 38 -271 -196 581 421 169 -32 56 -361 -72 67 -249 22 -258 -156 -210 250 272 194 -81 -322 176 544
7115 544 161 -99 -245 202 237 -82 108 -174 -292 -367 176 292 175 220 -412 -299 282 478 -57 -471 -477 -21
7137 -21 258 303 -230 -270 -39 255 -47 -153 235 166 -153 16 166 173 -106 -136 -342 -234 561 201 -243 -99
7159 -99 -34 -146 -147 -200 -81 13 47 52 -159 23 -2 13 -60 146 311 38 -354 -68 -32 336 162 51 43 -65 -201
7184b01L77j15P1J15n45K63J37J68q8k15j88J87L26j86K03o09K80M7J95O4k07
7205G9j80J81k46J27L58j48k59j22K42Q4q8q7k58J03M03n6oK02l31j19l0K86k16
7228h1J08L19n87K36L7M12j66l64r9K40K75p7k85j23L28j06K0Q4k63K16j95j63
7250b34M10j20p9j43N9M11J20n44N8Q9j07L51o45L84j43M47k97J38J37n45L56
7271A03j99O1J83O3j89k49Q1J82R9j8m70K37L29k03J07l88K92J36j56l6J32r4
7293CL14k73k09J18r7K18j02J29j38l6O9j07N0K78j85k56N9L57k62j49M56k74
7315c7j1K58m50L35m40N10k3j16Q8r7k3k20J42K21n2n31L34Q5J07Q3j85q3J74
7338F9M9L18m99Jj59J70L8j63L44k62M1k3J20m21L59J98m22m1o2N05j68oK31k65
$$ plain form
7184 -201 176 61 132 247 -298 -35 102 270 182 -33 -221 -34 292 106 309 -300 -20 27 222 286 79
7205 79 -101 80 -166 -39 319 171 -88 -210 32 116 28 -59 -317 -214 189 133 127 329 -2 -121 -151 135 -81
7228 -81 27 346 -241 -5 32 444 278 -86 -185 55 330 253 -32 -155 173 67 87 171 -92 124 -71 -234
7250 -234 176 56 -23 -166 -107 304 424 -120 -62 27 -80 271 -374 10 -133 314 17 155 292 -253 103
7271 103 -96 -35 148 211 22 -227 -146 36 135 117 -353 -116 213 10 117 -271 21 157 1 -35 97 3
7293 3 317 44 -165 -47 -144 74 -28 101 -37 -73 -4 -111 -61 217 32 -224 -165 192 -70 -219 237 -37
7315 -37 -48 210 -240 95 -345 165 142 26 114 17 -6 -226 -84 137 85 -446 -112 -27 80 163 -22 -105 69
7338 69 118 436 -63 -62 -221 -51 -13 -176 168 -94 -53 -76 44 -377 -18 180 -242 -283 -345 160 -8 -14 217 -48
7362d8J31j07J51j75J18J0j37Q0k67K13j52L73j39R3j17j43J3N4rJ23j94J02K28
7385B01k34QO7%J76l24L64l06j41M29l96K45M3j07J11K52k67Q6q6m66M49m26K12
7408a10m9Q2k0O6j49M78j73Q4j37l78M72j29r3K23k51n8K93K11l16J97k61K45
7430B27k22J7q1m7JK20J00m10J24N4J99k09K96j98k34N4J85k8M0k91R1n3J7O5
7454h3j60K10L3k67K72q7P1j29M0j19L35L03k08j32n1k07R2K94l51J84j36%K40
7477A44k60L00m7Q9l00J29l34M10k19j36K94L21m77O0J56j06P4j49J24J1n83M30
7499f9K19j63J20jn6k89J43k6K08m7J89k86nK77m00J14m55N74J5p7L7j94J23Q7
7523C8N1M5p8l9KJQ3l5l05l1o5L67q8J83j39o3J46K00k15r5J93k57K09k23q8L67
$$ plain form
7362 -48 83 -24 127 -48 70 80 -57 23 -244 -31 -183 190 51 144 27 -116 -103 -49 -58 65 -129 -27 201
7385 201 -33 -25 42 42 218 -106 258 -48 -189 240 -156 89 132 25 136 388 121 207 121 -345 104 -322 -110
7408 -110 -159 -77 -97 -31 -180 298 125 209 72 -306 166 37 -56 167 -84 -142 151 362 46 243 -18 227
7430 227 5 22 -59 -106 -105 115 215 -195 -71 -17 182 -27 269 71 -163 -109 76 48 88 -203 -112 -165 -148 -83
7454 -83 -243 -33 0 -267 5 -82 -11 -140 -100 -219 116 419 211 79 28 -179 -87 207 -144 40 -96 -96 144
7477 144 -116 184 137 226 -74 55 -279 131 -88 -224 70 391 -86 -26 130 24 98 -51 73 84 -499 -69
7499 -69 150 -13 107 106 50 -239 -96 -122 86 39 228 -58 -63 214 -186 -72 -527 47 62 -15 22 -172 -49 38
7523 38 89 134 56 17 19 20 103 68 -237 -268 -333 34 -54 129 -10 -73 73 273 58 -37 156 -101 108 -115 -203 164
7549A64j49j2n0L64l44J22j65J50Rk15l8L01O4l56M16n56J83K12o1N4J30j78Q5
7572A30j5l0q6j07J29j84K56k93o9K58L45j44p5k80j18M8M69J85m80p9m4J93j2
7595cK33l26q5K43L7k76k3J71J20k4jj07Q1j03j70K59Mj12M17k94K1O6q2k09J6
7620a47L31oO7l40j02J64m8J62k88K05lK39l16Q9J11O3k16m5j94K33J41j35j20
7643a55P3m8K7J3r2L12N2k78k16J56N8L25Lm88j56L80J86n5qj49J41p6P3l7Q8
7668A29J18k24N1J06m76J27R6K01k22R4j36K32m09R6L2%QP6L74l57r2Q8J87q8
7692A1N9k42M83j99k03r9J30J81j73J15j52k00L86k57K76j64J62j77N4k78M95
7713B08L8k82j43O0L86k70Ol5k81P6L97j80L8l93M26k9J30k69K28k19N05m85J23
$$ plain form
7549 164 15 3 -47 317 -27 95 -70 80 89 -126 -164 137 201 -155 261 -295 -112 100 39 93 223 45 130
7572 130 115 85 -1 -108 21 -163 93 -200 -269 -11 334 190 115 -165 -283 -235 234 419 -61 -140 -184 9 -3
7595 -3 230 -96 -181 62 99 -177 -200 -29 91 67 66 -41 40 -63 -233 26 30 -82 335 41 62 128 46 -163 -147
7620 -147 184 178 245 -95 -197 -33 -81 81 -207 -2 -5 234 -82 7 118 181 -35 -80 -274 -41 100 -35 -155
7643 -155 -82 -130 -103 -90 -182 130 182 -96 -312 -156 -98 227 230 -258 -414 -34 152 97 89 -60 81 5 78 41 129
7668 129 247 23 74 180 -296 -169 -73 128 -94 0 -136 96 -313 -217 -185 -185 -177 -101 273 -84 -176 -88 99 11
7692 11 70 -172 311 112 -91 -190 -60 121 -52 63 -89 -289 97 -160 116 -48 114 -63 -9 -287 208
7713 208 246 -36 -179 -119 267 -3 3 -32 -313 -237 160 -20 18 -375 51 22 152 -117 111 -108 397 -88 35
7736C5L49j01l99k0K50J50k12j92L1j9K95k05qk44L75Q8l93K0L77N9m44L19N3
7759A64O7j87p6J13j07K13j25L1PQj91J07J2j4k24k2J50J35M8K14m83J31N3J15
7783A39Nl38l1K74R3Rk05J42k87R5p3J02J06L1k29L7M9K54k9j20m90L46LL21j46
7808E8j40L84m13L81l70K77k58J50Lk54P30l63Ml43J90L55o4k26k67j09N00j12
7830A13k64J66K44l73k4J74Q0k05K00k16O4o4M80j23m21k10K92M08l82J0MP1j49
7853a25K51k08M7N5j36l1L64j06kk74j3L12m6K79m70K4q7Lj1N90p90M2L12j81
7877b01J80m0n4J39q1J0J8M7l13k47O48J17K20l51j75n7J67J7K03k27L48l16j74
7900a22R4N2K59k16j6l6rK61m43o8k7L38J34l34j78M40j04j16j13L22J91l59j57
$$ plain form
7736 35 384 283 -116 -136 114 264 52 -140 -109 -128 167 -38 -46 -290 85 173 -220 -200 177 236 -208 111 164
7759 164 231 44 -32 81 -26 187 62 93 100 108 -83 24 36 22 -202 -224 -74 61 109 323 -160 -29 24 139
7783 139 144 -194 -225 49 142 151 -54 88 -199 -104 -177 -75 31 62 -167 -130 -81 173 144 24 -466 -120 -117 204 58
7808 58 -82 302 -111 270 -100 177 -81 69 72 -182 548 185 189 -154 36 391 327 101 -166 -275 225 113
7830 113 -151 15 259 -114 -138 36 116 -89 111 -105 -41 -105 375 252 -169 -379 -87 321 -61 -51 -47 24 -125
7853 -125 126 -82 -35 20 -116 -147 217 111 109 -165 -178 134 88 367 -103 -79 -166 -163 -174 416 -374 -332 -20 -201
7877 -201 -21 -61 -115 24 -57 -47 -29 18 -295 -542 106 223 443 92 -83 -140 27 44 247 20 368 52 -122
7900 -122 -28 24 283 67 51 15 6 267 -176 -244 -271 67 201 -133 -311 129 25 -91 -204 118 309 -50 -207
7923b07m2K75M26o34N5J83l0qq0J81j46m5J50n9R4J05k37k23L84rQ6o4m98M58
7947A15J91R5k23k04k81K2L42m8K6j28L72o5m10K70K8l34L5R1J73O1k34l43K79
7970a70j81K32O3j02L78l40pj54N95l53K68n53K23J67r2Q7K3m56M73R0l03J17
7992EJ14j85J09j43k1R0oRl24J77L7L10k47k72R2M44J9j90j29K39j69J24k49K26
8016F0l32L71j12J2K13k22k41L40k58K35o6O6j28p6j71M31k0r2J16r5jj34J73
8039F9o5n5K22j8MK55n29J10J51j54m6J75r3j89J08j49J95R2J02k21j72L74j69
8062cK37l11L76m31K53R8k47J90l51J18M1J35j42k35L89j25J98q8m41K33q2Q5
8084a03L91R4m62k40K76j22J13O0K5j11J84Nl48O7J76J40m65K60N3O7K11k19j27
$$ plain form
7923 -207 -249 26 452 -182 -127 56 26 18 -62 119 -27 -72 78 19 113 218 -19 -242 142 133 219 155 -343 115
7947 115 306 401 178 -26 -307 -285 57 9 35 -93 279 214 -196 74 102 -232 -197 -106 67 128 -106 -449 -170
7970 -170 -351 -119 -56 -158 220 -120 -127 -281 314 -39 229 -324 -101 66 -26 61 84 -372 101 191 -112 5
7992 5 119 -66 43 -100 -121 -31 -37 -28 -352 -175 -138 172 -75 -347 -255 189 208 18 -111 128 -41 83 -166 60
8016 60 -272 99 -13 -1 212 -10 -251 89 -169 66 0 66 -62 -138 -309 122 102 10 126 31 30 -104 69
8039 69 4 -51 171 153 157 412 -117 -7 144 -10 -56 119 26 -163 -55 -204 -9 83 185 -36 -208 166 -3
8062 -3 234 -77 299 -132 121 219 -28 162 -189 -71 -30 105 -37 -272 117 -8 190 102 -339 -106 -188 -103
8084 -103 288 382 -80 -320 -44 -166 -53 7 32 -79 105 110 -238 -171 5 145 -320 -60 -7 60 271 52 -75
8107g5j13L13m5L3J87n70m3N35k97L05L7k57o6k18K10J9K27j66P9l5k5j34J64
8130F5k50J23J3j6M2j5M6m07M91r5k4R4l11J33k7P8O5L32k76j32K11l99K12j67
8154b14M9L49k59J01m0M8k9k45L06n4j27R6K99k89J90j86J98j08j95J89O4k67
8176a24M93l81l3J77m3nj89j13K3K74j93L04L8k09p0
$$ plain form
8107 -75 -188 125 80 113 300 -270 -313 222 -75 230 267 10 -56 -274 -64 -45 182 16 95 60 35 -99 65
8130 65 -185 -62 -49 -65 -23 -38 8 -399 92 -3 -27 67 -244 -111 -138 -60 5 337 61 -71 140 -259 -47 -214
8154 -214 -165 184 -75 26 -14 34 5 -240 66 12 -115 -19 280 -9 181 -5 193 85 -110 79 143 -124
8176 -124 369 -12 -45 132 89 84 -105 -218 -195 79 -114 190 228 19 -51
8191e1
$$ Imaginary data points
##PAGE= N=2
##DATA TABLE= (X++(I..I)), XYDATA
0@%%%%%%qJ6j6J6k4L2m0M9n7P2q8J04j26J50j71K00k34K67l07L54m02M57n22N88
30C10o60P44q34R30j038J160j291J431j587J762j950K155k387K644k929L250l610
47a900M020m493N043n689O465p418Q618j0186J2330j5454K0454k9743N2767k12474
61a77660m06993L46797M15977q844m10865k04422J75082K60635J7727q4413Q01
72g6178M4212p1969m7950J67786K54219l9747l33388j78680K68251L60548m6713
83C00391l93900j96086K25132K77161n8520k41788m6784J60666N3021j29874l6036
94h6617J90243J35041j65951k40509P6439L31393J29542k57107k79686O7197K70701
105A70686P4218j86765j54376L5271N2362o6798m1203J11806P7996j75445k51019
$$ plain form
0 0 0 0 0 0 0 0 -8 8 -8 8 -16 16 -24 25 -32 40 -48 56 -70 80 -91 109 -125 142 -165 189 -213 244 -278 310
30 310 -350 394 -440 490 -548 612 -679 752 -835 927 -1023 1132 -1255 1389 -1540 1710 -1900
47 -1900 2120 -2373 2670 -3019 3446 -3972 4646 -5540 6790 -8664 11790 -17953 34814 -177660
61 -177660 -584653 -237856 178121 169277 -241588 -446010 -270928 -10293 7434 -76979 -76178
72 -76178 -31966 -103935 -151885 15901 270120 230373 -103015 -281695 -13444 347104 300391
83 300391 -93509 -289595 -64463 212698 154178 -87610 -134394 26272 79293 -50581 -86617
94 -86617 103626 238667 72716 -167793 -91354 240039 369581 112474 -167212 -100015 170686
105 170686 244904 58139 -96237 -60966 -8604 -75402 -116605 -4799 73197 -102248 -353267
116c53267O1298L62445J83336k75784l69183N8916M25668K38209k16764l23171
126b08297j168K60419J54188p5376j09375j6031j2003n0689M2492J66164N5895
137B06219k17385k50383Q0675L45885J48378k63260l16406O0332L37208J52870
147B84133j90765k14127M8314J74399K6654j02153j6275Q3209j4608j47741n7213
158a26173J50600J38794j13680k39268m0196K00833J42181j08577j76421O394
168a65513J36170M0087p4416m674J05661K8542j31500q4053J51508K17286l3360
179A85738k66325j33010J95423K60152k4368k60099j46419J21371J79850J3364
189A25677j08197o5348K838j051J2565Q8951Q5591p3211j90234m6814K09220K14711
$$ plain form
116 -353267 -291969 70476 253812 -21972 -391155 -332239 93429 331638 114874 -208297
126 -208297 -209465 50954 205142 129766 20391 4360 -7643 -58332 -15840 150324 206219
137 206219 -11166 -261549 -180874 165011 313389 50129 -266277 -205945 131263 284133
147 284133 93368 -120759 -72445 101954 128608 26455 10180 93389 78781 -68960 -126173
158 -126173 24427 163221 49541 -189727 -229923 -29090 113091 4514 -171907 -165513
168 -165513 -29343 10744 -63672 -68346 37315 65857 -65643 -149696 1812 219098 185738
179 185738 -80587 -213597 -18174 241978 217610 -42489 -188908 -67537 112313 125677
189 125677 17480 -47868 -45030 -46081 -33516 55435 141026 67815 -122419 -169233 39987 254698
201B54698p7776k83194j13730K01502K33644m1597k35987j12421J11363J32328
211F8830j7074r1592k5700K1553j8472k8414N3008Q9237j9442j28469n3343J23460
223b6418J45316k7962j48545m7134J15385J02054m5987r3952J2319Q0260l234
234F2102r0327k2497R8083O6542q8474j33476J5109J47298P3627r8148j28658
245i8819R276J12851O0956l8984n4865r977O095O24L1447N8704j889j04796r0869
258a20246O0982J54890L7717j51373j54071M1788J77790P7399j12628j43591K977
269a28366J18512P6421l0643o4145k1120J6518K6937L7375L4186j7231p1549l8351
281f1456O2382R5251j050j05627p2071N4933R9740N021q9569n5339M5068O3992
$$ plain form
201 254698 176922 -106272 -220002 -18500 215144 173547 -62440 -174861 -63498 68830
211 68830 51756 -39836 -65536 -43983 -62455 -90869 -37861 51376 31934 -96535 -149878 -26418
223 -26418 118898 90936 -57609 -104743 10642 112696 66709 -27243 -14924 65336 62102
234 62102 -28225 -50722 47361 113903 25429 -108047 -92938 54360 127987 29839 -98819
245 -98819 -89543 23308 84264 45280 -9585 -19562 -13467 -12843 18604 77308 75419 -29377 -120246
258 -120246 -59264 95626 133343 -18030 -172101 -130313 47477 124876 12248 -131343 -128366
269 -128366 -9854 66567 35924 -28221 -49341 -32823 -5886 31489 65675 48444 -23105 -61456
281 -61456 926 96177 95127 -10500 -82571 -27638 72102 77123 -12446 -67785 -22717 41275
293D1275j0610n5249q960M4923K1739l4444k9807K4452M2737j716m0259j8756
305b4675K1293K1999m993j2773k532p078k1165l593L5189L0667k9936o7482j3444
318g8523P1929O9606k6192r0141l4808O9019Q6729J738p5156n2280K7438O6786
330C6145L1167k6817m9021k5933J7292M4903K9276k3140n9990l2061L7768O6518
342D6107J1274o1717n9469J7854P1541L4736m1684n9610k206N0567L7409j6306
354B8496m1874j6518K0207K7716M869k0636k4246m404J9119K0569m269k8451j9465
367c8887J7468L4946O953l1197k8946J6315M3564J6701l0012l5437O874M1119
379A9461K6100j8690l8564j2691K5477L3390L102l1383l2893n5L4473L0418j2818
$$ plain form
293 41275 30665 -24584 -33544 11379 33118 -1326 -31133 -6681 36056 34340 -5919 -24675
305 -24675 -3382 18617 13624 851 -1681 -8759 -29924 -33517 1672 32339 2403 -65079 -78523
318 -78523 -6594 63012 36820 -53321 -88129 -19110 67619 69357 -5799 -58079 -30641 36145
330 36145 67312 40495 -8526 -34459 -17167 27736 57012 33872 -26118 -58179 -20411 46107
342 46107 57381 -4336 -63805 -45951 25590 60326 18642 -40968 -43174 7393 44802 28496
354 28496 -13378 -29896 -9689 18027 22896 2260 -21986 -26390 -7271 13298 9029 -19422 -38887
367 -38887 -21419 13527 20480 -10717 -39663 -23348 20216 36917 6905 -28532 -21658 19461
379 19461 45561 26871 -11693 -24384 1093 34483 37585 6202 -26691 -26746 7727 38145 25327
392B5327m5447k5625K6434M9283J0601m2480m2883J1186N0568K8116k6965m5800
404b7685r575L4829L4995m125l4719k6467Q663L1364K0831j4944l6044j7712K3117
417a7472L9462Q210l6532l7368J1107M9651K6375k9555m6711k108M4962L5609
429D5630j6732m3453j5791K7765L4523J757k9141k6422K593K5698K1135o503l0019
442h960k2782J2023L6328J7395k6051m1267l634M1794L4998j6680m7979j7148
454d1963L5164M2289l921m2160k6498J9141L7000J0125k5013k8852j785K3685
466b788K2863j597k4796k1930O146L1218K1473j5712l5897j1889L1147L7599l221
479C2616m1058k6611K2635M2863R119l5165l4196P129L5718K0356j8324l2909
$$ plain form
392 25327 -20120 -45745 -19311 29972 40573 -1907 -44790 -33604 16964 45080 18115 -27685
404 -27685 -37260 -2431 32564 28439 -6280 -32747 -24084 7280 28111 13167 -22877 -40589 -17472
417 -17472 21990 30200 -6332 -43700 -32593 17058 43433 13878 -32833 -34941 10021 45630
429 45630 28898 -14555 -30346 -2581 31942 33699 4558 -21864 -19271 6427 27562 21059 -8960
442 -8960 -31742 -19719 16609 34004 7953 -33314 -36948 4846 39844 23164 -24815 -41963
454 -41963 -6799 35490 31569 -10591 -37089 -17948 19052 29177 4164 -24688 -26473 -2788
466 -2788 20075 18478 -6318 -28248 -22102 9116 30589 14877 -21020 -32909 -1762 35837 32616
479 32616 -8442 -35053 -12418 30445 39564 4399 -29797 -22668 13050 33406 15082 -17827
491a7827j0435K1158K6377K873k3954k4271K899K7683K1365j0520l1740j4263
503c0655K2679L2842K172l1692k7097J2865L6042J4429k4533l3457j972L0785
515B408K5931r947l3557j8319J8953L4696J0498k6875l3349M88L6566K9567j2292
528B4768m1020j9641K6555M0774O576l4548l4451M991L6200K5152j4183l5798
540a4625j9084J6872L4854J4345k3461l6589q726L2366L6272l828m0222k7582
552c9408K0217M2124J1703l1231l2223O737L2812J4747j7944k1968J22J5981Q429
565A0098n851p637j947J745L059L733R56o993p347O317J6757J723k2037j6913
579b4337J8328L4840K012m1994l0982K6487N2952P951n0201m4081J9066N5200
$$ plain form
491 -17827 -28262 -7104 19273 22146 -1808 -26079 -23180 4503 25868 15348 -16392 -30655
503 -30655 -7976 24866 27038 -4654 -31751 -18886 17156 31585 7052 -26405 -28377 2408
515 2408 28339 18392 -15165 -33484 -14531 20165 30663 3788 -29561 -29073 7493 37060 24768
528 24768 -16252 -35893 -9338 31436 38012 3464 -30987 -25996 10204 35356 21173 -14625
540 -14625 -33709 -16837 18017 32362 8901 -27688 -36414 -4048 32224 28396 -11826 -39408
552 -39408 -19191 22933 34636 3405 -28818 -22081 10731 25478 7534 -14434 -14312 1669 10098
565 10098 4247 -3390 -5337 -3592 -533 3200 4156 -2837 -10184 -3867 12890 14613 -7424 -24337
579 -24337 -6009 28831 30843 -11151 -42133 -15646 37306 45257 -4944 -49025 -29959 25241
591B5241K0739l4723m2801l399L0830K7290K552j8050k7001j5765J7697M3787
603B6397K2590l5635o1115q468O4650N9456k4351q0619l2510N5591O8409m902
615D9493o2624l5672K7064M1289O000j9767j1954j577m235J76K0939K1294j5176
628A5250m0946j1668M0082L9708j7314m8787j0249L9102K5558k4100k9445J4745
640h064L2352r886m2200n466M9711L4385l8399o2782K616O7253L9589l8200n9651
653c8742m433M4281K9067r891j8403q210j1521r467K2818M7791P005o5417o3890
666g9012L3699J01809L7703q5442r9614J7032J09212N6334o0451q6913n670O1798
678D85M0881j3313k6449j0844r931r418K3081M9150Q428o4738o2820L1986R5110
$$ plain form
591 25241 45980 11257 -31544 -34943 -4113 23177 25729 7679 -19322 -35087 -17390 26397
603 26397 48987 13352 -47763 -56231 8419 67875 43524 -37095 -69605 -14014 54395 49493
615 49493 -13131 -48803 -21739 19550 25550 5783 -6171 -7748 -11983 -11807 9132 30426 15250
628 15250 -25696 -37364 2718 42426 25112 -23675 -33924 5178 30736 6636 -22809 -8064
640 -8064 24288 14402 -27798 -33264 16447 50832 12433 -50349 -47733 19520 59109 20909 -38742
653 -38742 -43175 1106 30173 20282 1879 -6331 -17852 -27319 -4501 43290 50295 -15122 -79012
666 -79012 -45313 56496 94199 8757 -90857 -73825 35387 91721 31270 -55643 -61313 485
678 485 41366 28053 1604 -9240 -19171 -28589 -5508 43642 52070 -12668 -75488 -43502 51608
691E1608L0331p7408q0698K3880Q6357K7903n6778m7131K2962L8838j0560l0671
703b1367J5240M1074r279o0993k1312O2357O2879k9431q2711k1947O3932N4961
715E3403k1203n0782q245K4764K912j2601J8705L5479j8345p3098k5150Q0794
727F633R0360l2129j25029n1845R4588J15165j3661j13829o1061N4683Q0445R259
739E3579m3546k7292l391n588P314M5484L9534m0288r4403k1503R9525R8667l9772
752F8320j31844m8205R6212J05780k0753j00917l8590N4652N0046j4977k7867
763h143J2806J3817l3097l4228L6303P3282r00q8900n6712N8125R3941Q25q4777
776a7658m6400M4243N3339j1824l4616J0405K6855k4320n0673J6369Q5717L1835
$$ plain form
691 51608 81939 4531 -76167 -52287 34070 61973 5195 -41936 -18974 19864 9304 -21367
703 -21367 -6127 34947 25668 -35325 -56637 5720 68599 39168 -43543 -65490 -1558 53403
715 53403 32200 -18582 -26827 -2063 849 -11752 6953 42432 24087 -49011 -74161 6633
727 6633 96993 64864 -60165 -112010 -17422 97743 84082 -29747 -90808 -36125 44320 53579
739 53579 10033 -17259 -20650 -26238 -18924 26560 66094 25806 -68597 -90100 9425 108092 68320
752 68320 -63524 -111729 -15517 90263 69510 -31407 -69997 -15345 34701 19724 -8143
763 -8143 4663 18480 -14617 -48845 -12542 60740 59840 -29060 -85772 -27647 66294 67119 -17658
776 -17658 -64058 -19815 33524 21700 -12916 -2511 24344 24 -50649 -34280 51437 83272
788H3272q7039r6944L3267J26472N0488r2212j06730J4545R9731M8397m4263n4218
800b5234o020J5982M170J7072L9370J671p2701o6059M7463J21737L4135j14015
812b429j16973L7335J41185N7841r2530j07143J1735Q9090L9479l6351l5318M537
824i542K307j8766Q965N5145K4985o4002q0338K2076J07072M7616p9208r6130
836g9820J6529R3309L6626n5729m9615K1396L5544j7319k9339K8158N1798j9470
848C2068q2512k6293Q3912Q4262l6199j10551l4390Q1348Q0466k0161p3273k4946
860d6269L1554K4057l943Q366J8898k2163o2246j2907Q2102Q0333m2940j25397
872g0555m1204J04675J13683k5791j24005n6332O9785Q8541k09n9753l1802J2080
$$ plain form
788 83272 -3767 -100711 -67444 59028 109516 17304 -89426 -74881 24850 73247 28984 -25234
800 -25234 -31254 -15272 -11102 5970 45340 47011 -25690 -91749 -44286 77451 111586 -2429
812 -2429 -119402 -82067 59118 116959 24429 -82714 -70979 18111 57590 21239 -14079 -9542
824 -9542 -7235 -26001 -17036 38109 63094 -908 -81246 -59170 47902 95518 16310 -79820
836 -79820 -63291 30018 66644 10915 -38700 -17304 18240 921 -28418 -260 51538 32068
848 32068 -50444 -76737 7175 91437 55238 -55313 -89703 -8355 72111 51950 -21323 -46269
860 -46269 -14715 9342 5399 13765 32663 10500 -51746 -64653 17449 97782 54842 -70555
872 -70555 -111759 -7084 106599 80808 -43197 -99529 -29744 58797 58588 -1165 -32967 -20887
884b0887J1306M061K4762K6971k7751p1226j8195P9290Q1158l3118j10014l9732
896i3375Q2790Q8701k1065q6813l0020N1036M2155j9550k7649J5823K0525k7933
908e375l8877K3431O7560J1438p2183n9595L9594Q3319J3595o6358m8888K5935
920b6404M6445K529k3635K077J3148k0706l4519J9117O7505K0702p3328p7438
932h4507L0806J05993L9855p9052r1209J3592Q8276M4632m1486n6944o565K6378
944a0231J6467P711J2490o339m2422l3769L5006P5794J5303p8672p3688L1724
956e0626R7293L3310o9356p3533J5005O8277K5334l4678l1625R351J4481r262
968f029n633K4554K0167k7659m6113M773N6977L1707l9160n5103M635N0702K1379
$$ plain form
884 -20887 -9581 -5520 19242 46213 18462 -52764 -70959 8331 89489 56371 -53643 -93375
896 -93375 -10585 78116 57051 -29762 -59782 -8746 33409 13859 -13790 2033 22558 -5375
908 -5375 -44252 -20821 46739 58177 -14006 -73601 -34007 49312 62907 -3451 -52339 -26404
920 -26404 20041 22570 -1065 1012 14160 -6546 -41065 -21948 45557 66259 -7069 -84507
932 -84507 -53701 52292 92147 13095 -78114 -64522 23754 68386 26900 -30044 -36609 -10231
944 -10231 6236 13947 26437 20098 -22324 -56093 -21087 54707 70010 -8662 -82350 -50626
956 -50626 46667 79977 10621 -62912 -47907 20370 45704 11026 -20599 -11248 3233 -6029
968 -6029 -11662 12892 33059 5400 -40713 -35940 21037 52744 13584 -41519 -36884 13818 35197
981C5197k8933k5936J3066J8152j4006j8374J9965L5826j0528n4759k1483N1139
993f74N8249j6729p1241k9873M7706N7016l995m8284k6686J6672K3960O941P94
1006A3856q96j6647k7194K319M5651L5821k9849o7144j5227O2337N9779k1277
1018D1529p2067k8235M6106N3402m523m3242k2037J5312J9608K954j485K154q391
1031A085j9944l037K8826K6781j6178m1712j0728L5861L2007j4081l6465o392
1043b3977K7022J5675j6278j6515J1827J8357r818k5336J021L0519J5911k4035
1055D373l1481M877L3583J5654j8831k3825n37J5304Q319p68rk507j3509j0755
1069b0112J4375K9736M197l4943l1369J6214M6831J6154l6252m1442N865M2308
$$ plain form
981 35197 6264 -19672 -6606 11546 -2460 -20834 -869 34957 24429 -30330 -51813 -674
993 -674 57575 40846 -30395 -60268 -12562 44454 40459 -7825 -34511 -17839 6121 13062 13856
1006 13856 12960 -3687 -30881 -28562 17089 52910 23061 -44083 -59310 3027 62806 41529
1018 41529 -30538 -58773 -12667 40735 36212 -7030 -29067 -13755 5853 8807 7322 9476 1085
1031 1085 -18859 -21896 6930 33711 17533 -24179 -34907 954 32961 18880 -17585 -23977
1043 -23977 3045 18720 2442 -14073 -2246 16111 6293 -19043 -18022 12497 28408 4373
1055 4373 -27108 -22231 11352 27006 8175 -15650 -16187 -883 7436 6668 6659 4152 -9357 -20112
1069 -20112 -5737 23999 28196 -6747 -38116 -21902 24929 41083 4831 -36611 -30746 11562
1081A1562K3140k0180l2030o426J9122J7472J295q356j0566q305J515J5809J5926
1094A9978o431k5570j3382J8601K8267R10k8336j9229J5001K6049K432k1665j3062
1107a6437J0767J5871k112j2803l103R446N497o065p007K488P279L58m334k368
1121b523J785p1j261L449N563l426j1285m207J2538J5344m602k1266j0487J5993
1135d456K2977m95k3067j6540J0784K2853O477j4657j7389o58J3895J2175m90
1148A1409j1363j1234j18J1709J2961j213j5986j2971O897J9514Q508j4087j8845
1161a4819m20J8927J3229p709j8133o079J2948J3316q95j2897q356M702J0889
1174D703M415n664q962k545P076P739P58q815q039L383J0689N884p185j2024j292
$$ plain form
1081 11562 34702 14522 -17508 -23934 -4812 12660 13955 5599 -4967 -13272 -11757 4052 19978
1094 19978 13547 -12023 -25405 -6804 21463 22373 -5963 -25192 -10191 15858 18290 -3375 -16437
1107 -16437 -5670 10201 8089 -4714 -7817 1629 7126 1061 -5946 -3458 3821 4179 -155 -2523
1121 -2523 -738 -809 -2070 1379 6942 3516 -7769 -11976 562 15906 11304 -9962 -20449 -4456
1135 -4456 18521 18026 -5041 -21581 -10797 12056 18533 3876 -13513 -14171 -276 11899 11409
1148 11409 46 -11188 -11306 403 13364 12151 -3835 -16806 -9909 9605 18113 4026 -14819
1161 -14819 -15239 3688 16917 9208 -8925 -15004 -2056 11260 10365 -2532 -10888 -6186 4703
1174 4703 9118 3454 -5508 -8053 -977 6762 7520 -1295 -9334 -5951 4738 10622 3437 -8587 -9879
1189i879J1317J0440m584j3552o185R495J2899P23j2294j0105M061J2821O621
1202A1778p361j2231l118R550J1270l32j1589r109L523J2601P036p123j2940l556
1216a1601J0241J2335p48j2859r639N073J3111O305q705j2758j653J1092J0518
1229A0712k468j1915p927O219J2470L844q880j1689k5J1257R444l653j2525n850
1243a0986P307J1428K783j0207j0631J971J1853P559n989j1711l799Q657J1052
1256I287m10j0629p972L138J1610N634o981j1357k111R150J0085q06j1451q312
1270a1125M871J2737N136q565j2785j265J1909J1118l464j3798p523Q174J3467
1283H887K883j0863j1379J242J1759Q480m181j1549n577N501J1144L706o986j0829
$$ plain form
1189 -9879 1438 11878 7294 -6258 -12443 -2948 9951 10674 -1620 -11725 -7664 5157 11778
1202 11778 4417 -7814 -10932 -1382 9888 9556 -2033 -11142 -7619 4982 12018 4895 -8045 -11601
1216 -11601 -1360 10975 10227 -2632 -12271 -7198 5913 12218 3513 -9245 -10898 194 10712
1229 10712 8244 -3671 -11598 -5379 7091 10935 2055 -9634 -9659 1598 11042 7389 -5136 -10986
1243 -10986 -3679 7749 10532 325 -10306 -8335 3518 11077 5088 -6623 -10422 -1765 9287
1256 9287 8877 -1752 -9724 -6586 5024 10658 3677 -7680 -9791 -641 9444 8638 -2813 -11125
1270 -11125 -6254 6483 11619 3054 -9731 -10996 913 12031 8567 -5231 -12754 -4580 8887
1283 8887 11770 907 -10472 -9230 2529 11009 6828 -4721 -10298 -4797 6347 10053 3067 -7762
1297g762k109R580J0499j278j2417q389O261J3238L459j0317j0855K523J1750
1310D183N631p148r280k02Q611N002l966o323j434M483L982j78l651l446k48M600
1326F16N103p32q112o227N441J2055L413j2363j3006L683J7936Q652j2511j8199
1340a4251k53J8179J2663p379j7160o149R960J2812K460p941r675l472N362J1284
1354F440O860p635j6506n887J4855J8983j142k1909j5315J1839K3325M433j8397
1367e6j5734N495J6576N013r174p438J825M015p48o90M333J688o540o696M057
1382d074J0963J469j0173o649O532Q490l507r037J975J0840J476j3714q949J2472
1396a886J8674l338k3805j1040J7228K3357k073k3052j3619J1463J7851L526r994
$$ plain form
1297 -7762 -9871 -291 10208 8930 -3487 -11876 -5615 7623 11082 765 -10090 -7567 4183
1310 4183 9814 2666 -6614 -6816 1795 6797 2831 -3492 -4926 -443 3539 3361 -290 -3736 -3984 616
1326 616 5719 4987 -3125 -9352 -3911 8144 11557 -806 -13812 -10129 7807 16459 3948 -14251
1340 -14251 -14504 3675 16338 8959 -8201 -14350 -4390 8422 10882 2941 -6734 -10206 -4844 6440
1354 6440 13300 5665 -10841 -16728 -1873 17110 15968 -5941 -21256 -9417 13908 18341 -56
1367 -56 -15790 -10295 6281 11294 2120 -5318 -3493 522 -226 -916 3417 5105 -1435 -8131 -4074
1382 -4074 6889 8358 -1815 -8464 -1932 6558 3051 -5986 -4011 6829 8305 -5409 -14358 -1886
1396 -1886 16788 13450 -10355 -21395 -4167 19190 17117 -5935 -19554 -8091 9760 13286 3292
$$ [...]
8191A04
##END NTUPLES=NMR FID
##END=
