##TITLE=1H_CA-8570-46
 CDCl3, 32 sc, 
 7.3.2019
##JCAMPDX= 6.0         $$ Bruker NMR JCAMP-DX V2.0
##DATA TYPE= NMR FID
##DATA CLASS= NTUPLES
##ORIGIN= UXNMR, Bruker Analytische Messtechnik GmbH
##OWNER= root
$$ XWIN-NMR		Version 3.5
$$ Thu Mar  7 11:48:49 2019 Russian Standard Time (UT+4h)  she@DPX200
##.OBSERVE FREQUENCY= 200.1316
##.OBSERVE NUCLEUS= ^1H
##.DELAY= (6, 6)
##.ACQUISITION MODE= SIMULTANEOUS
##.ACQUISITION SCHEME= undefined
##.AVERAGES= 32
##.DIGITISER RES= 18
##SPECTROMETER/DATA SYSTEM= spect
##.PULSE SEQUENCE= zg30
##.SOLVENT NAME= CDCl3
##.SHIFT REFERENCE= (INTERNAL, CDCl3, 0, 15.7039)
##AUDIT TRAIL= $$ (NUMBER, WHEN, WHO, WHERE, WHAT)
$$ ##TITLE= Audit trail, XWIN-NMR		Version 3.5
$$ ##JCAMPDX= 5.01
$$ ##ORIGIN= Bruker BioSpin GmbH
$$ ##OWNER= she
$$ F:/spectra/data/she/nmr/H-F/1/audita.txt
$$ ##AUDIT TRAIL=  $$ (NUMBER, WHEN, WHO, WHERE, WHAT)
(   1,<2019-03-07 11:47:40.37 +0400>,<she>,<DPX200>,
      <continue with go, POWCHK disabled, PULCHK disabled
       configuration hash MD5:
       00 E9 B6 7A A2 85 ED C7 34 08 36 98 17 FE 4E 26
       data hash MD5: 16K
       34 52 20 8A A0 EE DD F9 FE C8 3E D7 70 DE 67 B3>)
$$ ##END=
$$ 
$$ hash MD5
$$ 06 5C 5D E3 71 E1 B7 72 EB 8D 06 1C 0E D5 C2 FA
##$RELAX= 
##$RELAX= 
##$RELAX= 
##$RELAX= 
##$RELAX= 
##$RELAX= 
$$ Bruker specific parameters
$$ --------------------------
##$DU= <F:/spectra>
##$EXPNO= 1
##$NAME= <H-F>
##$PROCNO= 1
##$TYPE= <nmr>
##$USER= <she>
##$AMP= (0..31)
100 100 100 100 100 100 100 100 100 100 100 100 100 100 100 100 100 100 
100 100 100 100 100 100 100 100 100 100 100 100 100 100 
##$AQSEQ= 0
##$AQ_mod= 1
##$AUNM= <au_zg>
##$AUTOPOS= <>
##$BF1= 200.13
##$BF2= 200.13
##$BF3= 200.13
##$BF4= 200.13
##$BF5= 200.13
##$BF6= 200.13
##$BF7= 200.13
##$BF8= 200.13
##$BYTORDA= 1
##$CFDGTYP= 0
##$CFRGTYP= 5
##$CHEMSTR= <none>
##$CNST= (0..31)
1 1 145 1 1 1 1 1 1 1 1 1 1 1 1 1 1 1 1 1 1 1 1 1 1 1 1 1 1 1 1 1 
##$CPDPRG= <>
##$CPDPRG1= <>
##$CPDPRG2= <>
##$CPDPRG3= <>
##$CPDPRG4= <mlev>
##$CPDPRG5= <mlev>
##$CPDPRG6= <mlev>
##$CPDPRG7= <mlev>
##$CPDPRG8= <mlev>
##$CPDPRGB= <>
##$CPDPRGT= <>
##$D= (0..31)
0 1.2 0 0 0 0 0 0 0 0 0 0.03 0 0 0 0 0 0 0 0 0 0 0 0 0 0 0 0 0 0 0 0 
##$DATE= 1551944744
##$DBL= (0..7)
120 120 120 120 120 120 120 120 
##$DBP= (0..7)
150 150 150 150 150 150 150 150 
##$DBP07= 0
##$DBPNAM0= <>
##$DBPNAM1= <>
##$DBPNAM2= <>
##$DBPNAM3= <>
##$DBPNAM4= <>
##$DBPNAM5= <>
##$DBPNAM6= <>
##$DBPNAM7= <>
##$DBPOAL= (0..7)
0.5 0.5 0.5 0.5 0.5 0.5 0.5 0.5 
##$DBPOFFS= (0..7)
0 0 0 0 0 0 0 0 
##$DE= 6
##$DECBNUC= <off>
##$DECIM= 24
##$DECNUC= <off>
##$DECSTAT= 4
##$DIGMOD= 1
##$DIGTYP= 9
##$DL= (0..7)
0 120 120 120 120 120 120 120 
##$DP= (0..7)
150 150 150 150 150 150 150 150 
##$DP07= 0
##$DPNAME0= <>
##$DPNAME1= <>
##$DPNAME2= <>
##$DPNAME3= <>
##$DPNAME4= <>
##$DPNAME5= <>
##$DPNAME6= <>
##$DPNAME7= <>
##$DPOAL= (0..7)
0.5 0.5 0.5 0.5 0.5 0.5 0.5 0.5 
##$DPOFFS= (0..7)
0 0 0 0 0 0 0 0 
##$DQDMODE= 0
##$DR= 18
##$DS= 0
##$DSLIST= <SSSSSSSSSSSSSSS>
$$ [...]
##$SUBNAM2= <"">
##$SUBNAM3= <"">
##$SUBNAM4= <"">
##$SUBNAM5= <"">
##$SUBNAM6= <"">
##$SUBNAM7= <"">
##$SUBNAM8= <"">
##$SUBNAM9= <"">
##$SW= 24.9336934301222
##$SWIBOX= (0..15)
0 0 2 0 0 0 0 0 0 0 0 0 0 0 0 0 
##$SW_h= 4990.01996007984
##$TD= 16384
##$TD0= 1
##$TE= 0
##$TE2= 300
##$TE3= 300
##$TEG= 300
##$TL= (0..7)
0 120 120 120 120 120 120 120 
##$TP= (0..7)
150 150 150 150 150 150 150 150 
##$TP07= 0
##$TPNAME0= <>
##$TPNAME1= <>
##$TPNAME2= <>
##$TPNAME3= <>
##$TPNAME4= <>
##$TPNAME5= <>
##$TPNAME6= <>
##$TPNAME7= <>
##$TPOAL= (0..7)
0.5 0.5 0.5 0.5 0.5 0.5 0.5 0.5 
##$TPOFFS= (0..7)
0 0 0 0 0 0 0 0 
##$TUNHIN= 0
##$TUNHOUT= 0
##$TUNXOUT= 0
##$USERA1= <user>
##$USERA2= <user>
##$USERA3= <user>
##$USERA4= <user>
##$USERA5= <user>
##$V9= 5
##$VALIST= <valist>
##$VCLIST= <CCCCCCCCCCCCCCC>
##$VD= 0
##$VDLIST= <DDDDDDDDDDDDDDD>
##$VPLIST= <PPPPPPPPPPPPPPP>
##$VTLIST= <TTTTTTTTTTTTTTT>
##$WBST= 1024
##$WBSW= 4
##$XGAIN= (0..3)
0 0 0 0 
##$XL= 0
##$YL= 0
##$YMAX_a= 155700
##$YMIN_a= -279311
##$ZGOPTNS= <>
##$ZL1= 120
##$ZL2= 120
##$ZL3= 120
##$ZL4= 120
##$ABSF1= 10
##$ABSF2= 0
##$ABSG= 5
##$ABSL= 3
##$ALPHA= 0
##$AQORDER= 0
##$ASSFAC= 0
##$ASSFACI= 0
##$ASSFACX= 0
##$ASSWID= 0
##$AUNMP= <proc_1d>
##$AZFE= 0.1
##$AZFW= 0.1
##$BCFW= 1
##$BC_mod= 2
##$BYTORDP= 1
##$COROFFS= 0
##$CY= 11.3945322036743
##$DATMOD= 1
##$DC= 2
##$DFILT= <>
##$DTYPP= 0
##$F1P= 18.9103706918063
##$F2P= -1.10871071338519
##$FCOR= 0.5
##$FTSIZE= 0
##$FT_mod= 4
##$GAMMA= 1
##$GB= 0.15
##$INTBC= 1
##$INTSCL= 1
##$ISEN= 128
##$LB= 0.24
##$LEV0= 0
##$LPBIN= 0
##$MAXI= 10000
##$MC2= 0
##$MEAN= 0
##$ME_mod= 0
##$MI= 1.114404
##$NCOEF= 0
##$NC_proc= 0
##$NLEV= 6
##$NOISF1= 3.799351
##$NOISF2= 2.8
##$NSP= 1
##$NTH_PI= 0
##$NZP= 0
##$OFFSET= 15.70392
##$PC= 1
##$PHC0= -8845.218
##$PHC1= 10.00014
##$PH_mod= 1
##$PKNL= yes
##$PPARMOD= 0
##$PSCAL= 0
##$PSIGN= 0
##$REVERSE= no
##$SF= 200.130013532006
##$SI= 16384
##$SIGF1= 3
##$SIGF2= 2
##$SINO= 400
##$SIOLD= 16384
##$SREGLST= <1H.CDCl3>
##$SSB= 0
##$STSI= 0
##$STSR= 0
##$SW_p= 3612.71676300578
##$SYMM= 0
##$S_DEV= 0
##$TDeff= 0
##$TDoff= 0
##$TI= <>
##$TILT= no
##$TM1= 0
##$TM2= 0
##$TOPLEV= 0
##$USERP1= <user>
##$USERP2= <user>
##$USERP3= <user>
##$USERP4= <user>
##$USERP5= <user>
##$WDW= 1
##$XDIM= 8192
##$YMAX_p= 0
##$YMIN_p= 0
$$ End of Bruker specific parameters
$$ ---------------------------------
##NTUPLES= NMR FID
##VAR_NAME=  TIME,          FID/REAL,        FID/IMAG
##SYMBOL=    X,             R,               I
##VAR_TYPE=  INDEPENDENT,   DEPENDENT,       DEPENDENT
##VAR_FORM=  AFFN,          ASDF,            ASDF
##VAR_DIM=   8192,          8192,            8192
##UNITS=     SECONDS,       ARBITRARY UNITS, ARBITRARY UNITS
##FACTOR=    0.0002004,     1,               1
##FIRST=     0,             0,               0
##LAST=      1.6414764,     0,               0
##MIN=       0,             -279311,         0
##MAX=       1.6414764,     155700,          0
$$ Real data points
##PAGE= N=1
##DATA TABLE= (X++(R..R)), XYDATA
0 0 0 0 0 0 0 0 0 0 0 0 32 -32 32 -32 32 -60 64 -65 94 -97 124 -131 160 -188 210 -241 275 -316 356 -397
30 -397 451 -509 569 -637 711 -791 882 -980 1089 -1210 1339 -1477 1636 -1815 2009 -2224
46 -2224 2472 -2755 3076 -3445 3886 -4407 5049 -5850 6892 -8303 10337 -13534 19350 -33422
60 -33422 155700 18968 -195947 32855 67213 32458 3606 -38885 -26569 78785 -19364
71 -19364 -90928 17642 15433 -90955 -443 34678 -66723 -29127 53311 -23040 -45401 -7390
83 -7390 -12253 41794 58961 -74110 -49037 111824 49120 -77200 -4060 50123 22459 25672
95 25672 -17884 -43286 54673 49672 -53772 -7915 41936 -23219 -1643 38005 -43914 -43860 40944
108 40944 11259 -21272 4966 -28758 -24625 32966 -24807 -56219 51270 43593 -58861 -26256
120 -26256 21356 -4921 16213 8431 -40450 21847 66018 -19364 -31691 21099 -6472 9258
132 9258 56631 -14815 -46239 33718 24086 -25720 3881 -5405 -22994 31044 8142 -52359 8952
145 8952 33968 -40706 -20386 26727 -12038 -5668 20826 -27851 -16080 36443 -7885 -24380
157 -24380 24893 -1961 -18294 33999 -1800 -47727 19677 37730 -15890 -1094 7712 -20220
169 -20220 16141 21210 -33361 6035 48884 -13815 -23575 22303 -8843 -15291 28772 3058 -17071
182 -17071 18746 -8109 -32646 16213 4605 -31010 13392 13832 -36551 -1093 25257 -22713
194 -22713 -16505 9586 -10631 13392 30391 -27912 -19944 37288 4067 -17505 24791 6348
206 6348 -16243 23400 13540 -16614 11131 3343 -24020 19147 23392 -27119 -5411 15389 -25996
219 -25996 -9076 24822 -12186 -16872 10951 -15459 -13688 20065 -13525 -23114 27293 9209 -27287
232 -27287 6974 7791 -17123 16700 18755 -15875 10473 17979 -19704 2870 25739 -12602 -1969
245 -1969 28864 -7304 -13061 16925 -8608 -17248 20293 -499 -20197 12109 -3142 -26285 11668
258 11668 7811 -31527 -3409 14220 -11169 6477 11564 -27838 -9899 23086 -3875 -872 22319
271 22319 -9589 -13192 24290 4360 -12350 17228 4482 -13199 21252 12682 -21519 2944
283 2944 9333 -15272 11381 18664 -21458 -11247 10145 -13925 -3702 18280 -14386 -16581 14979
296 14979 -7602 -17950 12842 -1092 -14335 16234 3997 -20391 9513 10654 -14695 7861
308 7861 15216 -13464 6196 21236 -10691 -2498 15460 -11566 -2498 23606 -2197 -10665 13554
321 13554 -6022 -15905 14394 2743 -18638 7883 4420 -15646 6461 2001 -26312 -1085 17197
334 17197 -9286 -265 7938 -19192 -6565 20717 -1495 -5858 13966 -6680 -8792 20435 2434
347 2434 -12537 14259 7549 -10345 12929 7571 -17103 4609 11958 -10492 4062 11121 -18810
360 -18810 -6100 14258 -10908 -9914 10375 -9347 -10321 14210 -5185 -17064 7974 -769 -12527
373 -12527 13282 5564 -15055 7401 9248 -13683 4369 13182 -8516 6665 18554 -8450 -4743
386 -4743 12605 -7219 -2676 19634 -1841 -11163 10277 -2712 -13769 10416 1132 -16366 7735
399 7735 6500 -15290 129 1332 -17931 3800 15592 -12111 -6436 7653 -10950 -1718 17877
412 17877 -5114 -8435 12650 -135 -4932 15980 510 -13284 11825 8742 -7479 9740 6531
425 6531 -15153 2504 10525 -9151 986 9443 -13209 -3879 11881 -11444 -11331 8661 -5609
438 -5609 -7533 11575 -4975 -15619 5898 194 -10481 11029 6761 -12231 5909 8758 -12275
451 -12275 3066 13924 -5596 4270 13571 -8522 -3717 14762 -2513 -3255 14562 -4508 -10836
464 -10836 11849 1303 -13424 4783 -1115 -13354 8033 4943 -16725 -2145 4083 -12985 3134
477 3134 11490 -12866 -6562 11676 -4366 -1502 13247 -6547 -6502 16493 4452 -4850 10894 -1159
491 -1159 -12291 11988 11209 -7420 4862 3523 -14475 2165 9678 -10873 -1292 10190 -9684
504 -9684 -5213 7391 -10690 -9685 10598 -2013 -8411 7929 -3409 -12502 8459 2698 -10961
517 -10961 7460 7214 -8131 6143 8414 -10526 2323 13741 -3647 1471 10990 -7458 -3418
530 -3418 14516 -1628 -7353 8531 -4535 -8073 11833 296 -14860 1065 223 -10264 7530
543 7530 5588 -15428 -2750 5757 -8686 1800 10551 -9505 -3623 12955 -3609 -5649 9479
556 9479 -4042 -5028 16179 4176 -9113 5746 40 -9145 10447 8943 -10579 2415 6211
569 6211 -9747 1964 8486 -10416 -2122 11583 -6254 -5305 7220 -7272 -7951 10041 -1479
582 -1479 -9598 7095 -744 -10301 7040 1992 -12773 3900 7066 -8134 4433 8495 -9907
595 -9907 -258 11887 -3618 447 11570 -4320 -3610 12009 -1660 -8111 9481 1952 -5586 9207
609 9207 -1283 -14839 2667 5661 -8237 4420 3288 -14822 -1965 7604 -8061 -2676 7710
622 7710 -7674 -3636 11190 -3404 -7492 7358 -848 -3713 13989 3142 -9428 5484 4391
635 4391 -6379 8396 7059 -10403 2841 9865 -6377 263 6970 -9761 -3238 10690 -4841
648 -4841 -6410 7431 -5225 -9743 6638 -2045 -8860 7405 1409 -11222 3158 2674 -10324 4319
662 4319 9359 -6902 2203 7459 -7481 698 12211 -2908 -1180 11329 -1853 -3687 9863
675 9863 -2846 -8137 9394 4640 -6926 4429 -2571 -13016 4268 6399 -9276 -894 2567
688 2567 -11445 -783 8203 -7805 -5555 6758 -3998 -1418 11049 -2971 -7729 7666 520
701 520 -4319 10863 4507 -8372 5974 6797 -6488 4225 5726 -7119 3572 9787 -7606 -3184
715 -3184 6078 -6993 -3687 9097 -4270 -7310 5850 -4103 -9471 5507 -1153 -8230 6527 2585
729 2585 -10771 1523 4185 -7115 5251 8477 -7240 423 8875 -3984 1126 10990 -4349
742 -4349 -3760 11003 850 -3058 7147 -2982 -8134 8532 3714 -8547 2968 90 -10398
755 -10398 2710 4985 -10674 -2444 4442 -6134 136 6468 -9039 -6223 8164 -1316 -1775 9024
769 9024 -2479 -8383 6702 3611 -3838 8208 3239 -6716 6169 6380 -7422 1858 6278 -5407
783 -5407 2060 7588 -7916 -4398 6013 -4131 -2955 6911 -5116 -7222 6462 -1632 -8424 4250
797 4250 624 -7647 4969 2367 -9224 2907 4766 -6607 2550 7254 -5784 593 9620 -3373
811 -3373 -716 7313 -3832 -2077 12067 468 -6227 4898 -1953 -6258 7737 3088 -9010 2536
825 2536 2673 -8096 1621 3389 -10587 -1903 7629 -5138 -3120 4165 -8372 -5030 9411 220
839 220 -3980 5862 -2830 -6644 9233 4111 -6231 5095 3632 -4534 5541 5657 -7938 1635
853 1635 7209 -4890 1098 7459 -6950 -3000 7588 -3599 -5093 5647 -3314 -6307 5577 -2392
867 -2392 -9408 3812 1198 -8030 4117 3625 -7878 1634 4998 -5576 1178 6850 -4572 709
881 709 10354 -3466 -4539 6748 -777 -494 9989 386 -8152 4486 998 -5660 6478 1917
895 1917 -9215 1862 4094 -6945 -128 3238 -8532 -1432 7044 -5311 -3844 2991 -6656 -3451
909 -3451 9755 -725 -5948 5262 223 -3975 7586 2916 -7333 4361 5904 -4213 4345
922 4345 5455 -7118 72 7068 -4356 -274 6950 -4268 -5009 5805 -3599 -6048 5857 -1292
936 -1292 -6617 5459 -1687 -9277 2692 2159 -6912 3609 3960 -7919 1046 5777 -5875 -553
950 -553 7207 -3108 1386 8535 -4067 -4921 8105 944 -2288 8515 -97 -7556 5784 3196
964 3196 -5268 4119 1231 -8152 2463 5397 -7233 -2722 2247 -7729 -1212 7168 -5083 -5757 4642
979 4642 -3308 -4398 6757 -1732 -7110 7055 3231 -5963 4321 2308 -6095 5505 7475 -4088
993 -4088 2708 5648 -6172 96 7962 -3493 -1775 6617 -3483 -4074 4715 -3762 -6726 5268
1007 5268 27 -6571 2834 -1426 -8988 2911 3805 -7321 749 3907 -5569 1220 6365 -5572
1021 -5572 -1522 8486 -839 -924 7855 -2308 -3798 8271 2083 -3855 5212 1103 -5340 6003
1035 6003 3399 -7473 -11 2210 -5849 2191 6077 -8353 -5161 3621 -4430 -1510 6442 -5282
1049 -5282 -6696 5790 -1138 -5091 5830 21 -5593 7379 4031 -5465 3332 3844 -4618 4306
1063 4306 7265 -4446 256 5814 -4519 -674 7494 -3638 -3423 6393 -1579 -4858 4421 -2037
1077 -2037 -6557 5091 797 -6632 2642 1162 -6542 1968 2961 -7722 535 6388 -3567 -146 4958
1092 4958 -6084 -2342 8540 -276 -2036 6524 -1369 -4310 6651 2020 -4404 4639 1860 -4484
1106 -4484 4751 3423 -8094 -395 4772 -3974 1500 4757 -7669 -4584 5467 -3336 -2703 5039
1120 5039 -4245 -6142 4792 -183 -5733 3508 615 -5398 4944 4386 -5214 2046 4210 -4438 2813
1135 2813 6123 -3578 315 6494 -2434 -1821 6331 -2815 -2731 6786 -298 -5275 3776 -733 -5869 3581
1151 3581 1135 -6908 1878 2191 -7119 -590 1884 -6943 -76 6700 -3994 -2567 3938 -3587 -1846
1166 -1846 8267 -247 -3097 5413 1022 -2907 6904 2274 -5722 3690 4145 -3382 2507 2281 -7459
1181 -7459 -248 5235 -4487 -1839 2642 -6536 -4238 5044 -3227 -5816 3201 -2546 -4524 5071 160
1196 160 -5976 2539 2230 -3912 4241 4518 -5021 2266 5732 -3703 1051 6760 -2901 -255 6216 -3335
1212 -3335 -3570 4459 -2014 -3129 4826 -427 -6238 2389 -182 -6571 1992 1047 -6352 1355 3600
1227 3600 -6075 -1646 3335 -4778 156 6164 -3758 -3520 4584 -460 -1794 6513 -970 -3984 5612
1242 5612 2073 -3090 3709 1211 -6244 4115 5011 -4042 816 1884 -5700 261 5066 -4039 -2868
1257 -2868 3400 -3624 -2318 4781 -3062 -5438 3702 -96 -3631 4663 -45 -6532 2484 3571 -3326
1272 -3326 2725 3787 -4347 727 4556 -3037 -91 5934 -2123 -403 5665 -1690 -4098 5122 57
1287 57 -3622 4525 9 -4970 3114 1595 -5341 956 1632 -5170 1330 3041 -5751 -2001 3062 -4104
1303 -4104 -1258 4646 -3450 -2667 4896 8 -2393 4221 -739 -3729 6054 3694 -3481 2409 2171
1318 2171 -4492 3982 5036 -3981 -39 2573 -4012 -27 4964 -3898 -2935 3478 -1809 -3812 3177
1333 3177 -2737 -5620 3497 932 -4333 2412 551 -5838 2637 3641 -3319 1682 4306 -3294 1553
1348 1553 5377 -2799 -608 5466 -869 -1522 4259 -1517 -2864 4778 -189 -4107 2945 365 -4126
1363 -4126 2724 1265 -6513 -197 2869 -3617 965 2750 -5527 -2240 3715 -2535 -1047 4163 -2664
1378 -2664 -2317 5597 429 -3393 2782 756 -2114 5474 2935 -4377 1284 2163 -3143 3036 4443
1393 4443 -4179 -1108 3742 -2921 -957 3857 -3237 -3584 4047 -1825 -3276 2552 -1090 -4546 3846
1408 3846 1119 -4190 1663 1031 -4691 2079 3174 -3779 820 4460 -2947 -89 4121 -2448 -937
1423 -937 4941 -111 -1585 4677 -632 -2963 3478 283 -4480 2657 1256 -4223 1417 1674 -5111
1438 -5111 203 2975 -2687 -130 2813 -4391 -1231 3887 -1821 -2120 3543 -1574 -2444 4518 -131
1453 -131 -3394 2278 1461 -1676 4156 1794 -4213 1067 3436 -2510 1377 3648 -3544 -568 4230
1468 4230 -2344 -1874 2643 -2823 -2842 3905 -1332 -4074 2666 -1020 -3986 2976 837 -4451 1979 1968
1484 1968 -4018 927 2980 -2705 1423 4922 -2276 -910 4062 -2550 -1092 4699 -409 -1885 3809
1499 3809 -183 -2362 3054 627 -4046 1953 2250 -4416 675 970 -4222 553 3174 -3396 -1604
1514 -1604 2187 -2691 -908 3967 -2193 -2725 3366 78 -1977 3654 -78 -3442 2834 2373 -2115
1529 -2115 3224 2126 -3894 1965 3753 -2008 -468 2699 -2104 -196 4457 -2087 -2669 1835 -2307
1544 -2307 -2367 3176 -1265 -4725 1023 22 -3598 1834 725 -3833 1215 2854 -3533 -43 2745
1559 2745 -2567 590 4721 -1657 -1383 3977 -32 -387 4304 -144 -1884 3253 644 -2720 2441
1574 2441 682 -3467 1716 1808 -3557 -12 1191 -4100 -539 2024 -3899 -1889 2679 -1921 -1099 2905
1590 2905 -2541 -3090 4028 1890 -1498 2521 493 -2748 3185 2498 -2726 1991 2693 -2483 1782 3392
1606 3392 -3064 -997 3064 -1674 -726 3185 -3067 -3452 2278 -625 -2418 2608 -1619 -4800 1620
1621 1620 1051 -3232 1109 1383 -2980 1272 3096 -2659 37 3013 -1879 -352 3593 -1387 -1325 3574
1637 3574 -168 -1992 2942 -267 -1799 3738 786 -3944 947 787 -3267 1706 1476 -3575 -111
1652 -111 2007 -3846 -1498 2215 -3457 -1845 3558 -897 -2336 2523 -1396 -2419 4092 1031 -2643
1667 -2643 1315 669 -1758 3203 1965 -3605 643 3139 -2168 939 3227 -3496 -1941 2358 -1761
1682 -1761 -1210 1895 -2204 -2589 2758 -581 -2842 2335 -105 -3145 1123 678 -3219 495 1625 -2160
1698 -2160 706 2959 -3337 -667 3273 -1383 -561 3096 -1129 -865 3391 -735 -2226 2739 740
1713 740 -2057 2854 809 -3100 1524 2247 -2371 1181 1890 -3243 -24 2258 -2577 -1098 2377 -1971
1729 -1971 -1811 2407 -1624 -2836 1760 -752 -1945 3456 352 -3355 1487 1611 -1471 1977 2113 -2730
1745 -2730 994 3158 -1565 349 1469 -2570 -1042 3127 -645 -1108 1684 -1646 -2608 2179 -578
1760 -578 -2702 1616 -33 -2639 896 885 -3535 517 1725 -1504 418 1937 -2014 -777 2179 -1286
1776 -1286 -954 2862 -164 -781 3327 -292 -1798 2756 1767 -1980 1889 731 -2623 1224 1649 -2474
1792 -2474 30 1387 -2773 -224 2491 -2358 -2092 1844 -1700 -1451 2206 -1036 -2822 1713 -127
1807 -127 -2368 2116 169 -2313 1712 2190 -1616 456 1633 -2654 1315 3289 -1529 -1093 2293 -1825
1823 -1825 -676 3073 -1106 -2105 2343 -389 -2589 1651 -233 -3071 539 856 -2509 534 607 -2763
1839 -2763 639 1737 -1677 -865 2039 -1504 -906 2829 -964 -1397 3224 -39 -856 2591 435 -2089
1855 -2089 2120 1430 -2033 905 1191 -2018 1695 1037 -3046 -771 1314 -1844 -623 1483 -2564 -2564
1871 -2564 1543 26 -977 1785 -873 -1777 2287 998 -1646 2692 1116 -1690 2143 2578 -1898
1886 -1898 543 2094 -1453 971 2810 -1483 -1110 2147 -1210 -431 2321 -1156 -2458 1540 53
1901 53 -2378 644 -611 -3125 1315 703 -2712 12 1678 -2908 -130 1824 -1729 -539 2622 -513
1917 -513 -519 1525 -669 -1711 3376 2 -1401 1701 476 -2192 1592 1718 -1732 1482 1250 -1719
1933 -1719 615 972 -3234 -340 2169 -798 -629 906 -2174 -1378 2223 -91 -1360 1772 -482 -2021
1949 -2021 2274 1046 -2356 985 1377 -1606 1257 2049 -1907 7 2837 -294 435 2552 -1041 -1247
1965 -1247 2506 -561 -906 2175 -447 -1668 2057 580 -2525 775 -212 -2370 1154 1378 -2798 189
1981 189 1648 -1962 -872 1692 -1763 -357 2142 -662 -840 1420 -134 -1059 2441 544 -1367 1842
1997 1842 972 -1504 1083 1046 -1741 1600 1229 -1750 -199 1139 -2471 -710 1589 -1391 -1043 915
2013 915 -1504 -1408 2171 -814 -2320 1212 168 -1237 1258 -37 -2008 974 1775 -1763 879 1239
2029 1239 -2166 389 1640 -447 78 1974 -884 -468 2295 -662 -2045 1751 -125 -1544 1749
2044 1749 38 -2385 623 744 -1883 607 537 -2318 400 1339 -2004 -232 1339 -1062 -332 2263
2060 2263 -726 -1340 2241 17 -1362 1614 285 -1829 1948 1011 -1875 955 891 -1541 921 1400
2076 1400 -1954 -608 539 -2375 -804 1866 -1594 -1633 1609 -903 -1420 1447 -629 -1795 1576 1343
2092 1343 -1058 864 -290 -2592 931 1743 -469 98 1540 -1018 73 2089 -758 -986 2096 -905
2108 -905 -905 1975 -494 -2009 1072 320 -1114 1377 215 -1959 274 1420 -1925 -315 233 -1846
2124 -1846 -417 1558 -1939 -1449 1486 -1062 -697 1812 -180 -875 1564 259 -1026 2071 402 -1274
2140 -1274 1327 1473 -1796 53 1150 -1295 766 1860 -1585 -647 807 -1243 -474 1290 -1073 -1171
2156 -1171 1404 -187 -2039 933 -67 -1933 1059 1544 -1584 1072 603 -1944 930 1673 -1062 -58
2172 -58 1205 -28 441 1908 -279 -954 2060 17 -1311 1445 -319 -1605 1053 337 -2045 28
2188 28 323 -1716 -154 784 -1731 -713 1062 -2156 -360 1525 -647 -569 1780 -281 -746 1200 -236
2205 -236 -639 1292 313 -1186 913 457 -1115 1686 979 -2313 512 1109 -773 122 1359 -1715 -853
2222 -853 1724 -965 -1372 741 -1185 -1306 1020 413 -1351 464 -501 -1020 874 1147 -1043 323 215
2239 215 -1191 -385 2451 -1281 -330 1813 -144 124 1788 -357 -864 1828 424 -761 1218 443
2255 443 -1465 610 107 -1520 136 574 -1576 83 666 -1399 -420 1111 -1384 -169 1644 -1142
2271 -1142 -734 1550 -338 -448 1802 103 -1377 2057 629 -1112 815 952 -1355 861 1349 -1785
2287 -1785 98 496 -1050 -855 838 -816 -160 1301 -408 -1353 310 -243 -752 1577 167 -1853
2303 -1853 -22 513 -1187 1032 71 -1031 64 1179 -433 179 802 -430 -304 1744 -118 -798
2319 -798 1127 -308 -895 1824 40 -521 1153 289 -773 384 817 -1137 439 727 -1172 -605 756
2336 756 -1471 -54 1027 -769 -1384 668 -294 -719 1466 33 -1319 880 710 -383 634 447
2352 447 -780 1050 1583 -855 -87 1019 -712 196 1644 -766 -773 603 -713 -563 783 -355 -1295
2369 -1295 16 -72 -1272 1147 201 -877 571 606 -626 392 615 -706 333 1574 -660 -70 661
2386 661 -535 -191 1715 -283 -736 1440 244 -647 1012 -204 -969 531 722 -1436 -127 466 -1379
2403 -1379 -4 997 -1023 -800 627 -845 -446 840 -653 -655 786 -650 -899 880 -655 -565 759
2420 759 740 -563 623 510 -1446 1197 684 -611 256 1111 -713 -224 1233 -872 -712 1542 -502
2437 -502 -350 816 -341 -1446 1327 -595 -949 770 -431 -1422 841 715 -1227 -9 1394 -624
2453 -624 568 844 -846 135 1225 -224 -68 1175 72 -142 1306 272 -639 1123 265 -1001 528
2470 528 31 -1324 65 242 -829 259 308 -1037 -309 1010 -980 -669 1089 -397 -550 1191 110
2487 110 -943 1052 -61 -248 958 447 -901 409 236 -1230 882 1201 -526 -65 1089 -1007
2503 -1007 -390 1194 -137 -745 1091 54 -755 508 -368 -1192 154 -44 -921 -461 926 -1066 280
2520 280 368 -858 821 456 -491 -471 1022 -1153 -505 1203 224 -205 904 -239 -210 375 -191 -1150 308
2539 308 22 -1173 1380 2 -888 -30 536 -692 -291 748 -900 -490 712 -767 -855 574 -259
2556 -259 -546 1139 -299 -1098 588 199 -662 954 378 -994 1236 973 -917 448 -33 -327 -686
2573 -686 1466 -303 -570 968 -964 -878 969 493 -976 620 -472 -1013 183 -82 -1422 308 658
2590 658 -815 227 942 -1628 203 1197 -818 -383 125 -271 -64 1517 189 -716 730 7 -1054
2607 -1054 575 -140 -1204 781 452 -608 18 1123 -563 401 169 -550 -355 492 -333 2 670 -513
2625 -513 -738 1255 118 -316 394 -221 -1216 546 -101 -281 524 363 -867 -131 1427 -708 308 542
2643 542 -678 240 1641 -459 -286 384 -88 -454 51 131 -1308 177 -76 -1066 443 75 -872 518
2661 518 739 -11 343 578 -732 -322 1068 -228 -262 1143 10 35 502 -278 -619 -5 599 136 969
2680 969 277 133 658 309 -1135 221 572 -749 108 528 -655 -3 905 -622 -740 340 -514 -316
2698 -316 674 117 -899 774 -475 -590 631 760 -689 623 625 -774 842 465 -992 -150 647 -39
2716 -39 102 565 -599 -575 464 80 -561 393 -218 -963 469 264 -760 761 -105 -441 471 784 -465
2735 -465 -382 393 -884 -243 443 -307 -992 926 -449 -163 1028 296 -153 657 695 -797 665 -176 -549
2754 -549 154 425 -168 235 757 -724 -717 -57 -601 -42 116 -696 -637 185 -778 -203 1216 63 -443 667
2774 667 -14 -395 849 35 -725 689 417 -900 508 721 -819 92 907 -105 -582 406 -712 -834
2792 -834 727 107 -443 436 236 -422 528 -45 -769 138 21 -754 -565 1475 -542 394 182 -532 122
2811 122 195 -325 -44 920 -124 -655 564 159 -312 1374 36 -1133 532 795 -979 337 375 -685
2829 -685 -51 717 -568 -149 456 -355 -508 1107 443 -316 654 -307 -707 479 -230 -977 422 -117 -406
2848 -406 555 186 -1118 399 851 235 185 748 -572 -24 889 -543 65 405 -672 180 1149 -796
2866 -796 -1026 76 -332 -707 154 -473 -1755 -143 594 -1008 35 485 -909 681 188 -50 104 663
2884 663 -602 -436 1248 -274 -621 603 -10 -529 598 278 -726 600 470 -588 310 231 -1083
2901 -1083 89 789 -1198 -394 143 -705 -773 749 -399 -870 410 87 -617 692 -92 97 876 742
2919 742 -1008 -23 282 -605 -418 911 -613 405 870 -563 98 809 -721 -516 1180 -602 -201
2936 -201 -36 -616 -317 568 -214 -923 396 -43 -335 447 631 -1083 -5 595 -1002 139 885 2
2954 2 -727 860 -154 -123 1079 -279 -547 1000 -103 -609 946 728 -957 233 1138 -1199 -61
2971 -61 618 -900 288 1326 -466 -186 520 -190 -452 790 -135 -1057 327 242 -830 1030 -446 -797
2989 -797 441 538 -1011 -77 152 -339 -8 721 -219 -91 36 -311 -540 1048 -39 -385 849 187 -599
3008 -599 402 -68 -988 42 261 -841 11 232 -571 413 269 -862 -64 181 209 246 654 -683 -47
3027 -47 667 121 -620 517 136 -535 1026 -49 17 128 864 -349 -89 331 -738 16 466 -542 263
3046 263 125 -702 -52 339 -532 -564 906 -579 -907 350 441 -859 -9 575 -398 977 774 -445 396
3065 396 756 -185 151 996 -239 -209 481 -486 -34 559 238 -154 231 448 -980 422 -470 -1107 384
3084 384 578 -1330 -188 44 -463 -74 546 -726 -616 330 -490 -73 532 -288 56 674 127 -279 572
3103 572 618 -57 188 695 -1012 473 704 -716 116 953 -937 -418 455 -34 -574 -36 -70 252 494
3122 494 -346 -714 559 56 -252 70 175 -871 412 408 -570 667 198 -444 586 979 -658 -70 602
3141 602 -372 -326 637 325 -591 952 -38 -85 371 87 -663 425 325 -1011 225 89 -787 218 166
3160 166 -481 -498 695 -209 -207 529 -11 199 182 -39 -348 693 -121 -731 886 778 -873 528 62 -765
3180 -765 -40 1067 -229 375 816 -115 11 304 -904 -486 877 -74 -464 524 -78 -921 -80 297 -852
3199 -852 714 419 -802 593 286 -709 -134 731 -573 292 143 280 -701 524 -584 -18 800 -636
3217 -636 -298 477 215 -418 332 -793 -453 2 542 -205 75 138 -317 -443 169 5 449 921 -167 -236
3237 -236 394 68 -705 108 315 203 320 -268 -156 74 814 -356 307 -300 -865 234 1276 -737 59
3256 59 376 -234 58 295 -210 -410 -73 -498 -146 150 -142 -403 310 -224 -790 316 542 35 43 111 -464
3277 -464 936 346 72 -464 662 -660 -837 370 -267 554 19 367 -312 391 -24 -123 497 10 -557
3296 -557 130 77 -259 503 162 -344 503 49 -1066 -511 882 28 -467 496 -125 -310 428 55 -436 209
3316 209 -49 -414 450 231 -482 551 685 -141 17 326 -1230 75 653 57 -114 331 162 -592 740
3335 740 114 -518 612 -105 -398 499 1067 -438 -267 262 -507 111 590 -407 -90 729 -360 346 208
3354 208 -103 -531 64 78 -133 288 70 -544 443 231 -338 88 153 -355 795 275 -468 178 229 -231 -618
3375 -618 215 -201 109 60 -162 -351 290 170 70 389 457 -393 502 -123 -862 86 129 -732 285 296 -1062
3396 -1062 396 526 -315 240 524 211 -71 -31 -126 -893 439 -162 -918 221 -94 -373 -3 386 -794
3415 -794 47 234 -90 -12 205 -162 323 575 5 -317 266 -204 123 370 265 120 -406 47 -212 658
3435 658 184 -1050 186 872 42 -76 333 -184 -518 -70 364 -389 120 -335 135 354 476 -963 -223
3454 -223 102 -468 366 132 -384 657 703 210 -104 429 297 -120 314 -314 -417 194 -354 -200 703 -200
3474 -200 -340 -90 -448 -645 -159 -200 90 358 593 -408 352 215 -202 410 225 -309 7 -125 -367 -38
3494 -38 621 -46 119 288 225 -84 578 245 -379 492 126 -253 586 259 -556 379 812 -345 -995 -248
3514 -248 -412 52 -38 -467 -259 65 -151 -179 395 248 -793 263 570 -230 129 -21 46 251 592 -291
3534 -291 152 70 34 -10 119 94 376 252 -457 -192 180 -343 -603 -25 -387 7 -97 223 220 95 -109 -882
3556 -882 -202 381 -536 -152 -111 -89 -50 552 -328 -216 428 307 -101 673 231 -493 -127 -175 -17 678 34
3577 34 -578 203 -205 -256 -19 147 -488 -140 780 -110 -560 -59 -317 -584 -26 179 145 631 -160 -484 -520
3598 -520 543 -446 470 213 -175 -257 201 -412 -80 217 -458 -194 -484 654 -133 431 98 -284 418 -59
3618 -59 -242 -128 305 -171 -362 107 -784 113 -97 -1073 212 362 -324 -561 501 -82 -425 1019 -265
3637 -265 -404 490 -707 441 451 245 -579 245 -126 -93 148 16 -547 -76 387 -256 155 -21 -111 -856
3657 -856 603 -450 120 85 39 -378 236 348 -172 340 -242 -132 554 253 99 502 36 -548 -117 590
3677 590 84 104 618 -127 107 683 -325 165 -23 -54 -111 600 130 -455 411 -184 160 -71 588 -58 154
3698 154 -62 -402 313 -208 228 614 -659 -218 -20 -125 -237 -203 474 200 -108 548 222 79 131 89 118
3719 118 318 -593 -297 345 161 -443 -622 227 282 -273 486 -351 -257 28 -708 80 450 117 -457 292 -139
3740 -139 226 366 129 -210 347 -185 489 327 -262 -167 -559 314 241 -450 -159 436 51 -362 124 -102 84
3761 84 -264 462 -300 21 152 -7 419 28 -244 -306 218 -244 138 -261 -139 287 481 43 60 -650 -326
3782 -326 453 -450 -309 26 52 -423 465 224 331 -124 383 -291 214 645 359 -24 100 -160 -240 52 -208
3803 -208 -361 767 38 7 288 95 -151 -153 580 -113 343 425 -210 668 -104 -296 172 7 -46 -659 -297
3824 -297 -497 -81 461 20 -194 -257 -177 104 -329 4 -372 -674 350 534 726 155 317 -251 36 79 431
3845 431 378 -49 206 639 -112 98 -10 462 146 25 94 -309 330 -348 -7 -22 -46 -283 447 365 -711
3866 -711 252 -154 428 -36 151 45 -238 188 525 -216 18 -319 26 275 81 -30 176 87 -432 -275
3886 -275 -532 -136 -289 874 -237 503 16 -49 -98 387 -75 -19 725 -334 142 -192 -132 144 406 -20
3906 -20 351 74 16 -255 273 48 -242 -357 53 -535 609 235 -545 128 79 -228 -402 -46 224 -420 391
3927 391 90 28 466 138 -320 577 -4 548 213 232 103 177 -122 -532 -203 -487 141 435 50 68 50 -265
3949 -265 -150 -113 -146 -374 145 -187 -35 -23 821 252 -388 -44 -277 60 -86 22 -217 706 -5 59 -407
3970 -407 438 -103 -463 224 111 -669 -220 -180 54 440 248 36 -236 -163 124 121 -271 121 485 684 48
3991 48 132 151 -319 809 267 -66 -111 541 227 359 299 -356 -157 -577 -514 371 78 -235 -511 256 575 -118
4013 -118 2 545 -134 125 109 161 -313 -112 -222 89 152 -327 344 416 -201 -824 92 873 -600 352 -102
4034 -102 667 -248 -32 104 -768 547 -292 206 -72 -187 -704 746 -451 -772 -61 -295 -216 180 -297
4053 -297 -32 -218 -106 105 558 -344 -355 287 -267 -218 -45 87 -356 -421 392 -141 -27 -572 91 -305 381
4074 381 372 -8 -102 390 227 117 573 -184 78 113 257 448 55 91 -430 -25 -413 131 42 -492 -63 -245
4096 -245 292 240 -109 -135 -40 163 238 -152 332 -27 289 -185 -292 -596 -368 -82 -388 112 -162 -505 -524 -179
4118 -179 73 -521 -2 -414 220 -74 -306 -86 -214 -58 110 900 42 -239 222 14 6 99 131 -146 152
4139 152 -108 320 -54 93 -346 -133 280 847 -661 186 967 -401 295 297 -142 63 522 -16 375 398
4159 398 9 235 595 -154 217 139 386 -505 -34 -23 196 181 -124 467 490 391 317 200 454 -524 354 -105
4181 -105 291 -161 340 -5 65 37 159 362 319 -317 -587 408 38 -225 330 -105 -344 -16 -57 88 396
4202 396 346 -34 163 -70 -174 15 338 -507 191 -392 -274 377 384 675 250 -40 76 -239 549 -178 -956
4223 -956 343 -342 -1011 276 141 -471 4 337 -711 177 -346 -338 -69 377 -271 -553 -98 -103 -221 -159 -56
4244 -56 -367 154 11 238 -141 -487 -63 -55 -34 -397 354 135 -340 154 -40 -634 132 245 -133 -312 30
4265 30 -26 -169 224 -78 -90 534 267 -540 263 285 -357 -145 506 -37 238 496 -297 47 318 -516 592
4286 592 -70 -165 51 -292 6 -953 127 206 127 298 -117 29 178 204 -281 387 4 -475 -86 -362 317
4307 317 192 -27 136 -404 -109 -22 -75 670 346 325 226 -36 182 -92 -398 -446 425 58 348 -107 56 -680
4329 -680 -388 -131 55 468 103 -108 -5 390 -327 -19 279 143 -137 340 -62 -23 503 -332 -115 -305
4349 -305 -22 -38 188 351 -159 283 148 -46 -375 476 -113 241 244 518 -406 479 106 -558 -136 196 -139
4370 -139 -231 95 -367 384 634 -102 -162 1004 265 411 922 -271 -443 523 -177 -21 -229 165 -177 -106
4390 -106 187 -235 29 194 -830 34 334 -446 -200 -364 -187 153 751 -259 -434 297 149 -527 -228
4409 -228 169 -416 819 96 205 662 -377 83 330 256 -178 521 205 -29 287 644 -680 -566 154
4428 154 242 46 730 142 0 -440 13 -256 -99 -444 -580 -236 266 165 635 678 397 252 220 -49 -61
4449 -61 65 -517 -270 -107 34 -466 642 603 -213 520 50 -137 397 343 -393 902 -22 -700 -219 165
4469 165 -80 151 276 -870 63 23 -403 -228 55 -124 -767 368 -66 -282 -8 97 -553 56 -7 -155
4489 -155 -637 689 -66 -19 771 154 -53 -394 -387 -402 190 -429 -453 256 -199 303 -41 -4 20 86 451 -355
4511 -355 2 623 -342 84 537 -358 84 -264 -118 215 785 -181 -339 139 135 -459 0 311 -139 -69 -280
4532 -280 214 85 97 -239 -150 419 -720 -318 101 -498 -214 426 -96 -46 555 -854 -516 -231 153 -800
4552 -800 -221 -374 -426 -391 140 24 -23 292 -187 259 587 -902 246 -12 -423 180 138 102 -143 379 201
4573 201 -322 -216 201 -260 248 -246 362 -56 76 -1137 -393 437 -230 554 704 -459 -137 115 -256
4592 -256 628 641 163 283 151 -226 147 546 435 -823 -248 508 -175 -233 245 -528 332 190 -729 505
4612 505 443 -740 -808 -227 -556 -376 306 217 -371 -484 138 -166 314 265 -633 483 695 108 446 627 -843
4633 -843 -321 438 -860 252 484 80 -132 572 138 -183 255 167 -125 595 119 -334 613 232 -418 263
4653 263 165 -591 -114 247 27 363 290 -72 -395 237 67 -399 -18 -839 -438 -232 -26 -662 105 551 161
4674 161 104 -266 -404 14 938 -275 -32 150 -239 69 647 -449 -75 349 171 -519 279 162 -462 -339
4694 -339 -46 -606 693 602 -754 332 -72 -15 248 263 -547 -322 950 -658 59 114 48 -502 -277 230
4714 230 -184 766 16 -166 108 66 -392 -465 209 -103 -224 89 -242 -356 424 -217 537 122 26 -245 532
4735 532 313 -203 46 -743 -22 -48 361 -1001 211 -313 -285 88 824 -289 380 -36 -310 -182 96 -519
4755 -519 -127 -11 -215 -304 342 -287 -515 317 -238 -337 -76 330 -7 11 -129 -406 181 280 -460 248 23
4776 23 360 -53 1123 -239 -20 454 -222 -688 593 18 233 232 -148 -247 349 -176 -99 100 186 -338 -902
4797 -902 2 8 95 -512 -777 -855 23 -4 -130 209 41 -565 -185 135 -227 -258 -1 -550 320 732 -486 56
4819 56 417 -192 350 288 -752 399 317 -562 -597 530 123 71 -61 -174 -63 363 115 -304 900 227
4839 227 -723 182 97 -957 -296 791 -607 715 183 -83 -136 -10 182 396 153 31 -195 732 246
4858 246 -661 438 164 -560 -39 -274 -649 36 -228 -285 -190 305 56 -448 124 131 -250 -131 280 -517 726
4879 726 379 -351 765 722 -287 936 563 43 -486 317 -16 354 108 -215 235 285 -562 -359 162 19
4899 19 -421 147 27 -85 283 68 -599 52 608 -336 -82 -485 -291 -68 590 -528 237 555 -326 79
4919 79 -41 -334 -516 219 529 -328 10 301 -191 -40 134 -441 318 547 -334 138 142 -180 89 237 -570
4940 -570 -500 547 -203 -809 542 -208 -149 203 -242 -390 254 316 -247 275 546 -262 179 386 -490 569
4960 569 908 -186 -48 323 -370 419 580 -673 -390 465 -102 -290 243 -398 -401 -97 257 283 -55 -99 -780
4981 -780 -70 836 -260 228 720 -814 -246 1066 -64 -431 619 124 -311 405 -297 216 538 -125
4999 -125 -390 130 114 -144 115 -183 -660 -70 265 6 -323 -293 -650 112 284 339 341 461 -589 -100 164
5020 164 287 -823 796 178 -161 -272 320 -585 277 65 241 115 359 -271 119 280 -126 101 567
5039 567 -91 444 -29 -940 -482 -699 -72 70 -497 27 -6 419 237 -218 -135 337 -176 -267 307 -194 -176
5060 -176 39 25 -410 278 -400 -219 289 182 89 -118 811 -492 74 582 -561 21 340 181 62 388
5080 388 -352 -23 410 -611 -187 367 332 -586 379 -127 111 198 76 -281 57 -124 -553 540 16 500
5100 500 -102 -7 112 -427 360 -156 284 580 -145 -349 -236 -165 -635 481 417 -47 -437 11 224 -51 -628
5121 -628 198 137 167 -848 -119 -68 -300 -277 -318 -472 -549 367 -298 -361 255 -171 -12 257 695 70 442 179
5143 179 -136 65 145 -384 -231 49 -154 497 174 -263 232 305 -359 177 -153 -70 -234 -207 -7 -435 249
5164 249 -337 -261 -436 183 -251 807 271 -378 -130 516 -35 142 760 24 521 -129 -281 873 109 -948
5184 -948 -644 543 21 -98 503 650 95 599 122 -235 145 453 -376 -298 168 -286 -504 159 -776 -294
5204 -294 -131 -818 -36 29 183 -528 557 -129 -533 -64 86 -787 333 -2 -170 -313 318 -346 -214 -191
5224 -191 -379 -806 122 112 -174 -212 -472 16 346 -459 -160 167 231 -553 316 862 -1074 -10 501 -16
5244 -16 540 93 -279 -92 42 241 256 998 -477 -710 471 -52 140 321 457 -475 376 -133 -940 193
5264 193 150 -646 325 418 -692 319 -153 100 -313 400 -384 152 218 408 -255 535 370 78 420 -52
5284 -52 -167 -493 763 136 -267 58 -415 -31 575 228 -400 342 -93 -433 527 -293 156 93 274 -642
5304 -642 78 67 -539 82 -21 -144 305 459 -77 -33 568 34 288 228 -177 -268 546 165 -897 609 129
5325 129 -521 880 201 -760 35 560 -270 -54 57 -722 95 -210 -328 303 347 -526 -202 638 -128 16
5345 16 -155 -94 105 291 -262 -426 -113 755 61 308 -419 -98 -291 329 -157 459 452 292 -277 380 -319
5366 -319 -54 -275 -317 -152 472 -557 -397 367 4 30 -21 -630 -508 -53 455 -213 270 -119 -920 -308 -43
5387 -43 68 -68 442 183 -308 144 353 -85 -141 95 -18 -220 263 -143 154 358 -266 -660 375 -52
5407 -52 -155 -107 -612 342 469 -324 -586 705 -88 -427 546 518 -223 -35 -257 13 342 16 -106 91 458
5428 458 -728 -186 332 -338 -488 395 -326 -431 -22 78 -364 25 -196 -669 173 421 -384 23 438 -463
5448 -463 -278 -438 192 -90 -6 250 -215 78 -371 -333 -82 -171 -76 -60 -202 208 283 289 -159 317 -162 -318 698
5471 698 188 129 107 108 463 0 289 -715 -65 -67 -900 -465 -141 -70 -876 -188 141 -630 699 128 -212 236
5493 236 -364 -478 -56 484 -456 -8 546 -483 -113 1172 -339 -19 -121 197 -56 742 -134 -303 155
5512 155 108 -627 263 -186 -203 432 -374 188 132 162 -351 252 -70 -279 118 215 230 -303 90 -158 -472 306
5534 306 -508 -235 -207 -115 -381 331 344 -61 15 85 284 -7 454 -99 -337 46 9 -569 491 343 445 119
5556 119 141 189 645 -318 225 164 -169 57 278 241 -46 23 -221 70 -446 448 108 264 106 -596 250 83
5578 83 183 -159 39 -13 -398 -680 -169 -827 -189 16 -128 108 -396 -690 140 62 -439 119 911 -76 910
5599 910 460 -260 -125 550 -188 -138 278 397 -600 64 -269 -122 439 378 -40 366 760 10 -80 -71 -417 55
5621 55 648 52 -195 440 -386 -83 475 -61 -112 197 -303 -88 347 -96 -681 40 426 -692 304 481
5641 481 87 514 598 -760 160 313 140 -395 171 -228 -233 335 -34 -632 481 -109 -449 357 398 -79 -326
5662 -326 405 128 -574 492 -154 99 592 -285 -507 466 -278 375 41 -534 -217 174 1034 -674 -180
5681 -180 -109 -224 377 469 -26 311 1042 -301 -231 -365 -553 -323 590 -271 -732 -219 0 -181 249 433 21
5702 21 384 -72 -78 87 114 -624 310 -23 -245 7 -39 -713 468 878 -185 -592 159 -674 -159 615 128
5723 128 -407 -337 425 -43 653 443 -37 206 94 -447 67 241 -301 159 781 -543 -391 282 -186 -400
5743 -400 751 631 -227 386 445 -346 -28 178 -403 539 418 -799 236 96 -629 385 -133 -694 -156
5762 -156 660 -389 -406 201 -406 -453 269 252 443 461 163 -521 122 93 -144 -223 594 -92 455 887 -242
5783 -242 -781 -34 -487 79 257 -345 -119 402 466 -77 135 659 -393 723 413 189 -221 592 -741
5802 -741 -138 -57 -523 215 582 373 -305 427 -879 -468 149 334 -77 895 -459 -140 426 -259 147 580
5822 580 547 222 84 -307 -671 191 393 40 -334 217 -189 200 -133 -479 -626 388 -550 -698 76 75 -192
5843 -192 -314 248 -893 -398 456 -833 -61 406 -489 -15 179 -631 153 442 -52 -156 -95 -797 -59 990
5863 990 -49 18 116 -339 -231 478 99 -393 218 594 -160 204 912 -16 -59 643 -231 -240 724 -488 -322
5884 -322 282 226 610 -150 -619 64 514 -469 -233 174 66 -129 533 271 -1050 -70 55 -327 -54 -42
5904 -42 190 -235 356 -285 -368 -37 -315 -189 -116 -15 42 381 640 -134 258 865 -659 -125 856 -246 125
5925 125 -33 -18 -229 729 -210 -117 351 -120 -27 192 -71 -759 317 -76 70 371 -554 -650 -161 295 -451
5946 -451 -213 103 -662 142 625 -483 335 605 -381 18 639 -57 -227 -92 113 -355 -45 -180 -506 158
5966 158 166 234 390 -155 -1113 -288 438 -239 -683 607 505 -184 442 186 181 568 -204 -286 189 310 39 -37
5988 -37 24 35 354 602 -103 143 610 -438 -312 978 -312 -137 563 110 -181 -172 -118 483 599 802 -123
6009 -123 -326 -127 -290 -173 -9 -373 -81 369 -508 -5 309 -859 -35 -93 182 324 569 -333 -347 204
6029 204 266 315 847 270 210 758 536 -783 -167 773 -317 981 651 -767 65 582 -213 -108 591 -126
6049 -126 -760 650 -184 -519 335 -432 416 -151 538 -1219 474 251 -264 270 274 -77 216 100 -274 -335
6069 -335 70 -209 -333 496 54 -33 317 368 155 387 -113 -297 489 365 -312 -70 870 -713 35 490
6089 490 -142 186 -47 -162 -639 662 -571 -842 15 -613 -817 -14 400 -468 729 347 -413 54 103
6108 103 -440 428 37 -762 -65 648 -39 -172 1 -371 -144 215 86 -864 -372 -363 -1048 99 91 -182 -42
6129 -42 -38 -88 578 98 -189 533 396 -225 300 -125 -518 -501 346 -254 -565 237 842 -513 435 80 -406
6150 -406 -213 32 -175 -91 -6 -139 470 -168 -81 -27 491 -382 -149 411 192 158 830 3 -199 669 -97 -146
6172 -146 301 403 -359 280 387 241 489 799 -756 374 767 -494 -52 -78 -313 166 646 -465 -255
6191 -255 43 208 -1037 24 339 -613 497 589 -1056 43 -364 -376 50 -375 -755 -697 426 -184 77
6210 77 636 -162 -576 518 365 -321 18 28 -669 740 647 -321 841 775 -209 293 168 36 15 128 -665
6231 -665 -334 -103 -486 -194 -142 -592 -231 585 293 -377 -141 208 -259 654 864 -308 230 448 -34 836
6251 836 575 218 -129 -12 -76 -34 -256 210 -413 295 -283 264 31 -256 -1435 260 100 -376 413 198
6271 198 -578 28 87 -267 -241 632 -24 267 376 122 -362 -151 441 -135 384 124 -22 238 121 -241 -131
6292 -131 688 42 261 -171 -540 -111 547 77 117 851 -985 -223 60 242 -672 521 337 -14 407 -759
6312 -759 -546 103 365 -452 1155 -255 -251 -240 96 -567 184 918 -117 -407 205 -91 113 312 -78 -213
6332 -213 692 323 -496 -133 -538 -137 208 -47 182 506 548 -373 -214 102 290 -391 -394 -414 192 137 -49 -443
6354 -443 105 244 98 -68 -511 -76 134 297 -428 204 -436 5 -32 267 -771 352 268 -707 456 671
6374 671 -175 -556 397 -409 -299 -247 156 -295 188 325 306 140 487 123 295 124 -913 298 101 -4
6394 -4 -511 452 -485 -167 353 -103 237 187 64 -492 222 366 336 1 465 -623 -183 -55 -492 -376 64
6415 64 -560 500 220 -539 -475 176 360 -261 401 -276 -373 322 348 -157 235 199 100 593 67 -96 -261 143
6437 143 -491 154 324 -198 -401 59 114 -186 243 331 -342 148 -236 -368 251 189 -900 526 384 -731
6457 -731 304 910 -339 24 50 14 217 376 -266 -69 95 37 -334 -6 214 -766 801 9 -117 446
6477 446 103 -649 125 254 -210 402 -31 -195 174 516 -189 -41 -551 -303 -124 95 -7 -18 168 -416
6497 -416 -170 226 -182 25 613 321 -917 191 253 -176 -128 206 100 152 625 -596 -291 266 -605 -526
6517 -526 510 328 -712 493 -129 -129 42 74 -26 405 -332 -156 -98 774 -276 237 419 284 84 -518
6537 -518 -76 -234 -113 289 285 270 53 -661 -1001 29 -116 -1 441 -597 439 275 -412 -368 92 88 224
6558 224 62 -77 -556 341 200 -273 40 -122 -312 685 292 -727 -263 125 -800 374 135 -665 497
6577 497 263 553 177 -231 -723 -125 422 -594 -179 361 -34 -421 316 -275 -173 -219 757 -346 44 93
6597 93 -382 138 173 -584 29 -35 -251 11 804 224 373 159 440 -557 191 -157 -452 275 -4 -198 -305
6618 -305 53 -227 440 97 -624 68 -340 -168 225 134 359 551 -384 -247 -113 20 -4 -212 17 180 -215
6639 -215 723 -801 -194 -150 334 22 -273 669 -870 77 234 -28 -48 342 238 490 272 -177 -66 -607
6659 -607 -365 -321 534 -461 57 119 327 332 -8 666 -441 -131 100 -184 129 282 -843 110 206 95 48
6680 48 423 -13 443 717 -536 -496 -36 -151 6 616 139 -613 -213 434 -140 -213 293 -295 -617 -405 -370
6701 -370 328 390 -764 97 676 -386 -45 264 -30 -368 -670 -28 -365 185 -104 -34 -70 321 -618 -470
6721 -470 520 -141 -587 491 -240 245 620 -156 110 -62 -140 -396 -136 168 -337 216 390 -788 352
6740 352 -325 75 73 138 -414 -687 398 -109 343 584 -161 281 500 -136 -764 256 -46 -6 109 -176 -442
6761 -442 462 -75 -14 109 -354 -350 484 583 -231 93 383 -345 161 799 198 186 413 -562 -629 -193 469 -118
6783 -118 -43 -153 -474 -121 55 -391 338 39 43 530 440 -4 267 48 -157 103 103 489 -873 689 -160
6804 -160 -577 108 -11 84 -211 296 -162 541 499 -187 261 398 -384 -44 -277 289 -194 91 178 -370 92
6825 92 -43 -448 -120 -250 146 371 761 -591 -89 -83 310 -31 403 -148 -26 -21 -679 -374 199 201 -303 321
6847 321 -387 -157 362 -468 -398 173 340 367 383 710 391 392 -56 -443 449 389 27 -662 294 -510 -503 571
6869 571 173 -365 595 248 -165 239 -229 73 1 36 -405 13 995 39 -202 324 -840 -424 691 -470
6889 -470 136 285 -166 -54 487 -48 -431 87 161 -382 300 181 -167 143 205 307 -228 69 -813 130 580
6910 580 149 -645 -441 -52 -15 188 395 -747 310 363 -253 246 180 -283 -308 366 -161 149 -343 -192 -270
6931 -270 167 274 201 472 -117 -91 -258 423 624 919 10 -21 76 -159 -76 84 -264 13 322 -160 129 407
6953 407 44 -634 5 51 61 9 464 1 67 141 444 383 235 -255 -83 98 83 -247 -516 -369 -390 157 127
6976 127 384 381 351 -499 326 398 -242 -413 -191 -202 499 180 267 -254 392 452 -337 -206 -206 -214 314 -12 159 353
7000 353 286 436 -69 199 123 380 398 -40 648 3 -146 -159 82 164 3 189 -88 -568 208 108 -331 78
7022 78 -244 -310 271 151 -382 433 382 86 -462 545 333 -59 436 456 63 184 43 -204 231 392 227
7043 227 317 50 -714 147 -705 -173 32 -417 -385 46 -81 197 -188 346 2 -140 55 85 -431 50 447
7064 447 123 -135 512 -885 220 176 30 -239 164 42 23 301 15 21 289 327 -327 413 -513 -261 519
7085 519 -687 -342 379 -348 -251 40 283 -343 -104 -129 -59 13 78 18 -520 211 -682 35 715 238 -61 98
7107 98 -156 -272 102 298 -56 495 -9 158 288 555 -734 259 302 -492 -175 292 60 -310 301 -14
7127 -14 -119 601 -28 213 648 -544 -233 865 -345 283 388 407 36 -300 121 111 72 767 -133 594
7147 594 216 -457 -160 292 589 78 -551 -451 -1045 230 -512 -174 434 -268 -436 -536 198 -321 -313 -406 538
7168 538 -83 625 -641 -85 19 -443 -442 18 163 -745 701 20 -253 -61 85 -240 304 -411 127 260
7188 260 -123 -348 374 -99 -59 -1 383 -705 -203 217 -67 -53 248 689 -220 58 -293 -321 31 -410 373
7209 373 -171 -129 237 -234 399 -308 -305 -341 -472 154 569 -66 79 366 262 -29 -83 -34 -533 -126 -359 -103
7231 -103 65 -29 -414 -164 -72 -15 276 196 -4 -166 -91 185 -569 458 -241 -147 138 -318 119 23 199 -47
7253 -47 163 76 132 805 376 -23 90 298 -400 437 522 58 266 -73 -466 -425 105 -330 -214 607 158 -333
7275 -333 -227 26 118 247 -51 -496 286 482 268 282 242 58 97 678 25 -272 619 -109 -313 -313 -89 -125
7297 -125 121 -112 -310 583 -168 -341 383 265 -139 -195 -122 -465 79 279 -375 -695 226 269 -359 418 -1021
7318 -1021 -317 464 294 405 557 682 339 301 33 -36 396 57 -18 102 399 -118 -82 518 259 21 75
7339 75 -772 -185 346 -359 34 254 -421 -631 242 -463 191 389 280 -370 36 -185 257 -331 225 -355
7359 -355 -637 -225 -204 165 -41 393 220 471 274 -388 442 216 -399 151 348 -307 -133 -5 -249 28
7379 28 -697 -269 -108 -141 82 179 10 -234 48 -555 -302 -461 204 251 185 507 319 -539 414 -45 75 409
7401 409 183 138 -439 239 -314 -538 234 516 -455 -239 -295 -227 -133 96 -221 -154 -5 -52 -177 304 -277 26
7423 26 143 346 12 -7 -160 -17 -170 140 -172 563 -577 -240 -49 -44 -149 581 507 -777 629 558 -95
7444 -95 -8 207 -264 536 -152 -128 450 602 -36 6 -118 -309 -180 -387 -28 -711 345 169 -359 375 280
7465 280 -498 159 -106 -103 -87 676 -737 -434 388 59 105 68 -87 -211 53 213 -96 -178 -477 -275 588 98
7487 98 -298 -149 636 8 414 119 -82 -468 -14 -495 202 148 -106 -912 806 -100 -186 271 359 -124 650
7508 650 180 -82 95 250 234 50 223 -141 -140 397 329 106 785 -222 -101 -287 -378 -190 77 177 -241
7529 -241 466 121 -588 420 346 -620 123 54 -490 145 -57 -564 -219 103 72 -342 526 475 -14 780 -717
7550 -717 -296 468 7 -191 -358 50 -427 -525 392 -311 -228 136 286 152 443 -13 62 -9 -178 -26 -112 55
7572 55 -656 -70 -301 -195 100 -377 348 -105 596 109 326 131 -365 -156 405 16 130 351 -258 -251 -171
7593 -171 -145 -731 87 -102 -115 638 -73 -189 -93 85 -986 236 8 -180 251 90 472 510 302 -92 413
7614 413 128 -26 484 238 -31 -474 -661 -148 107 436 -831 409 727 85 -333 887 -123 221 57
7633 57 -433 -681 -283 235 -106 361 213 -182 -328 105 -441 -136 182 216 -493 -395 370 -466 525 -57 -36
7654 -36 -390 45 -460 537 536 -772 190 100 86 261 760 -414 -76 175 258 159 372 -72 345 321 -405 -281
7676 -281 12 439 318 -121 17 -64 16 504 -140 14 -374 -321 -61 661 -513 -577 296 312 -137 32 260
7697 260 150 140 -328 -421 791 465 -470 -304 -7 -231 28 71 -230 94 13 -660 374 161 150 135 13
7718 13 46 355 320 175 -323 -206 -319 248 -175 122 -299 53 369 196 -210 448 -102 7 -259 -52 6
7739 6 -53 -137 -267 282 -83 -80 -310 -567 -8 -257 -113 248 252 764 -313 343 289 -598 -245 -71 -35 81 85 -435
7763 -435 -223 240 -13 -375 -295 -296 113 -52 -230 -130 14 724 -1164 276 -99 -325 -434 249 -569 221
7783 221 -14 -38 -500 -355 88 278 587 119 -130 -311 393 -182 365 -208 255 -76 113 -256 662 -273
7803 -273 -443 -277 396 -350 -530 101 84 -225 602 -10 136 394 183 88 -96 538 58 120 73 -86 -17 260
7825 260 -281 -373 564 -454 -362 64 -260 -47 295 297 -107 -273 45 -83 67 189 -664 -7 262 -136 -412
7846 -412 -161 -458 27 619 -539 -32 72 262 37 96 266 -240 440 -860 217 38 -221 -12 674
7865 674 397 -58 15 667 93 -64 703 -887 299 519 -467 -89 -18 5 -307 -52 -768 -264 330 186
7885 186 -368 411 534 -339 235 175 285 211 -544 -531 183 231 -289 578 574 231 -237 -91 197 398 28 -608
7907 -608 -178 -139 284 -592 -58 626 -690 -164 537 -427 172 560 -23 341 63 -256 -370 172 33 -497
7927 -497 304 60 -602 -141 -169 323 242 194 -292 535 121 -242 341 -76 -429 163 65 -902 -362 196 81
7948 81 502 99 176 376 414 -369 -7 287 -118 -612 193 108 -564 80 477 9 -355 756 -34 235 409
7969 409 315 95 -83 -453 -133 339 75 -272 -96 247 -380 403 -35 -316 -29 659 -272 -522 125 -463
7989 -463 -222 235 -146 -155 292 88 235 167 -210 -264 301 -43 -150 137 -411 -570 -158 264 277 174 -23 -198
8011 -198 137 152 51 -183 48 -280 -250 -380 -335 -484 406 -50 285 528 368 -368 -638 214 -292 -176 -296
8032 -296 -584 -90 479 196 212 458 -271 186 -296 -406 -84 57 26 -694 340 128 468 319 -412 24
8052 24 287 -143 -465 -36 89 208 355 222 -413 -147 269 258 -513 13 -815 -157 233 -240 -20 729 -301
8073 -301 -195 430 63 -134 -71 -221 347 -189 333 -366 -281 176 -229 -500 548 165 123 268 901 -152
8093 -152 -164 246 -26 490 -398 142 -68 -201 -286 473 588 31 -12 161 -165 -398 339 -202 -28 1009 -727
8114 -727 122 573 -236 -854 507 2 -522 392 277 97 112 -223 -690 -348 347 -262 24 401 -153 302
8134 302 79 305 -107 191 -185 168 254 526 -481 405 -52 -121 375 -523 -159 168 225 -46 72 45 -187
8155 -187 -132 34 28 105 308 36 -757 500 -220 241 228 82 -1 52 360 -223 230 771 -90 14 -218 -325
8177 -325 415 149 -166 -209 194 273 135 -40 54 -101 507 -226 80 822
8191H22
$$ Imaginary data points
##PAGE= N=2
##DATA TABLE= (X++(I..I)), XYDATA
0 0 0 0 0 0 0 0 0 0 0 0 0 0 0 28 -32 32 -32 32 -32 55 -64 64 -71 95 -98 121 -130 153 -168 191 -219 245 -273
33 -273 304 -341 376 -418 468 -515 572 -631 697 -776 857 -951 1057 -1174 1310 -1468 1649
50 1649 -1868 2131 -2461 2882 -3442 4227 -5401 7360 -11204 21561 -106498 -279311 19665
63 19665 113347 -11797 -56709 -60370 -52726 42494 -13286 -102780 5028 50385 -62580 -4913
75 -4913 68463 -36175 -36851 65628 8476 -34411 33792 35916 33125 44826 -55331 -51873 105607
88 105607 62046 -89728 -18659 69808 12212 -12121 -22171 -46928 27763 43841 -58262 -30269
100 -30269 50284 -14400 -35218 19901 -33477 -49361 45233 29196 -35479 -3810 -6439 -20607
112 -20607 32335 3202 -46461 42423 57287 -51373 -26687 50732 14604 310 12469 -26625
124 -26625 11633 63003 -18246 -49795 23466 14128 -7705 31834 -17417 -62767 20427 33214
136 33214 -33732 -9407 9332 -22692 10529 11160 -49463 -998 47329 -25187 -26769 38599 4128
149 4128 -17295 19248 -12512 -20470 37858 11378 -26235 23128 13967 -26095 16138 8001 -41385
162 -41385 17425 51611 -16193 -19191 12718 -13468 2123 23061 -25905 -8238 44787 -9782
174 -9782 -38181 17975 2903 -27542 15777 6732 -26791 8416 3620 -31050 9502 17314 -27099
187 -27099 3940 23858 -27000 -5987 36466 -7687 -17768 22458 5565 2888 24474 -17039
199 -17039 -22052 39945 17529 -27814 11408 11297 -24413 8702 14182 -24849 -3170 9743 -21750
212 -21750 5703 22359 -31157 -23203 18307 -13690 -12136 29573 -2171 -24225 10606 -748
224 -748 -13779 22093 3967 -19932 26088 21465 -25811 2212 20977 -11684 7900 23466 -14193
237 -14193 -1478 20929 -16414 -10054 23262 -10147 -17253 21625 -5247 -26561 10358 -296
249 -296 -22265 11595 4736 -26624 3616 8562 -20563 8446 18630 -24247 -6007 25766 -2502
262 -2502 -1381 16278 -15202 -8338 31828 7822 -9565 17217 -4336 -19375 20776 11843 -17368
275 -17368 9437 9789 -19369 5541 10747 -25848 -6896 15167 -11574 -1197 15974 -21396 -20105
288 -20105 14888 -4138 -9767 17231 -5252 -18440 16582 4668 -18806 11325 10525 -11764 13791
301 13791 14048 -17484 5041 19302 -11352 801 18135 -11041 -3624 19494 -8774 -13155 13973
314 13973 -6767 -12762 17119 -2368 -21281 7398 495 -18873 8863 7172 -20886 1303 10995
327 10995 -14470 858 10506 -16156 248 24908 -4463 -9201 10491 -8765 -4859 26371 6512
340 6512 -11585 9969 578 -12506 15363 7951 -16972 6640 11201 -14289 1721 6766 -19968
353 -19968 -4815 13940 -9266 -5857 10504 -15796 -13024 14718 -4292 -13639 11504 762 -11395
366 -11395 13667 3411 -16017 7996 10732 -9368 9502 12508 -12464 3605 15780 -11047
378 -11047 -1075 15895 -6730 -3029 15332 -8881 -13995 10820 -1661 -9435 13601 -2333 -20221
391 -20221 3481 1985 -15002 6448 6306 -16452 1689 10263 -13762 -3252 9732 -8879 3015
404 3015 20055 -6441 -10455 12286 -706 -3555 17795 810 -12164 12367 6265 -9625 9363
417 9363 3056 -15546 6507 12393 -11574 -723 6437 -15551 -5090 11864 -8223 -7179 8266
430 8266 -9187 -8265 12049 -6280 -14459 10210 3565 -9498 10510 3202 -14119 6684 10670
443 10670 -6226 8292 11759 -10872 2279 13550 -8455 141 16507 -3921 -5394 9729 -7921
456 -7921 -9980 11887 -287 -12550 7176 -3013 -16694 6006 3772 -16174 -235 5797 -10387
469 -10387 3737 9606 -14819 -4643 12062 -4207 1864 16254 -6298 -7959 14495 2445 -5159
482 -5159 11713 -159 -8421 14430 8605 -10856 2742 1397 -13787 6058 11833 -11153 -4397
495 -4397 3481 -13318 -3545 10927 -9024 -6607 10633 -5525 -10347 8415 -3050 -9806 11986
508 11986 4235 -10105 6451 3910 -9566 8579 11165 -8424 5134 11510 -7591 761 10622
521 10622 -7734 -2863 14180 -3039 -5871 8294 -6226 -9977 10291 -677 -13032 4862 643
534 643 -10980 6136 3281 -16689 -757 8453 -6050 5015 8656 -12614 -4067 12601 -1823
547 -1823 -1038 13213 -3910 -5452 13933 1233 -8860 8262 1650 -7474 11801 5189 -14533
560 -14533 430 4710 -9177 5149 9744 -12418 -4774 8537 -7928 -2403 9193 -7538 -6309
573 -6309 11150 -3550 -10190 7127 -1187 -8644 9448 3329 -11013 4649 4998 -9227 5137
586 5137 8294 -8959 2924 12194 -5822 -1090 9763 -6727 -3651 13384 -1140 -5795 8595
599 8595 -2763 -9341 8133 -247 -11739 5258 4467 -9329 2405 973 -14777 717 9608
612 9608 -6791 -1516 6235 -10818 -3405 12600 -1956 -4982 10357 -1757 -5054 12186 1707
625 1707 -8631 7761 4338 -5290 9111 4930 -12679 1301 7937 -6976 1642 6679 -10945
638 -10945 -3744 9710 -6409 -6995 6492 -6260 -6655 9792 -2258 -10468 5604 -422 -9156 6799
652 6799 5031 -8512 5226 5875 -9873 3127 8953 -5679 3551 12388 -4611 -2874 9142 -3253
666 -3253 -3473 11671 -1322 -6734 7876 -1020 -9262 5024 -615 -11090 5570 5437 -11140 -2528
680 -2528 365 -10710 2724 9657 -8335 -4545 6405 -5496 -1463 11810 -3077 -5986 9057
693 9057 2330 -2378 10241 1025 -9345 6835 6113 -5046 6453 4870 -10006 764 7260 -6868
707 -6868 -1422 5954 -7501 -2433 8005 -8082 -9045 5782 -2779 -5939 8082 -1558 -10093 4868
721 4868 776 -8496 5768 5760 -6705 5219 6870 -8777 975 9580 -3021 2616 10199 -5147
735 -5147 -3338 9232 -2294 -3508 8720 -2914 -8573 7388 1364 -9274 2581 -669 -10201
748 -10201 4664 4308 -10707 -1859 3433 -7754 1532 7501 -7500 -4781 8536 -2077 -1684 8286
762 8286 -3792 -5298 10680 4885 -3808 6357 1479 -8886 6773 7506 -6035 3166 3560 -9073
776 -9073 548 6684 -8054 -2689 6935 -5567 -3848 5105 -7541 -8762 6971 -381 -5951 5938
790 5938 -2201 -8883 5904 2555 -8802 4061 5654 -5827 3349 6264 -6555 1270 8854 -3324
804 -3324 -198 9631 -4143 -3124 9713 -1217 -6186 6036 -1392 -6011 8332 1476 -11090 826
818 826 1054 -7404 3364 3863 -10577 -1736 4972 -6554 -900 5880 -6592 -1996 9922 -1928
832 -1928 -5084 5541 -2177 -3217 11414 3749 -5894 3606 1594 -6242 6984 6663 -6501 1392
846 1392 5794 -5357 1017 5336 -8080 -2990 7415 -3679 -4454 4978 -6029 -7301 6450 -737
860 -737 -7688 4109 124 -6960 5259 2764 -8286 3062 5326 -5143 3536 7648 -5625 3
874 3 8382 -3526 -1163 9059 -2162 -1532 8648 -2011 -7504 6162 2046 -4952 5512 -162
888 -162 -11175 954 3988 -6404 1446 2753 -9500 -976 7256 -6092 -3259 5879 -4506 -2144
902 -2144 9272 -1623 -6321 4893 -355 -2241 10483 3403 -7457 4129 4601 -4167 4687 5613
916 5613 -7294 1158 7572 -5139 -1014 4809 -7509 -3453 6926 -3703 -5264 5067 -4278 -7682
930 -7682 4061 -898 -6973 5722 2366 -6533 3016 2038 -7806 2945 7696 -3949 1110 6098
944 6098 -5027 -32 8145 -2719 -2161 8761 -554 -3314 6337 -2485 -6768 6491 3118 -6151
958 -6151 3213 398 -8678 2441 4096 -7005 -1236 3264 -7746 -922 6615 -6065 -5350 5496
972 5496 -2675 -2530 8450 -1838 -6483 5569 1625 -4291 6976 2351 -5921 6277 6597 -6086
986 -6086 1428 4843 -5638 2344 8086 -4908 -2459 5396 -5618 -3624 6965 -3144 -6652 5173
1000 5173 -2235 -7706 3265 170 -6701 4197 3086 -7949 970 2603 -5933 2733 7828 -5072
1014 -5072 -785 7588 -1902 -317 7785 -2769 -3231 9328 843 -4626 5075 -550 -6650 5143
1028 5143 3196 -7795 1359 2141 -6878 1242 3194 -8926 -2880 4452 -4570 -1309 5469 -6509
1042 -6509 -6266 6136 1038 -2544 7005 -1289 -6318 6293 3791 -4680 4120 3864 -4919 4529 6279
1057 6279 -6142 -499 5239 -3976 857 7021 -5349 -4111 4840 -3624 -4186 5817 -2481 -6963
1071 -6963 4656 175 -7440 2783 1014 -6678 3687 4211 -6409 543 4477 -4519 844 5705
1085 5705 -4875 -1203 8250 -1094 -3353 5031 -2283 -3153 8389 1585 -5418 3218 517 -5147 4413
1100 4413 3137 -6431 1124 3077 -5921 -105 2589 -7924 -2634 6874 -2521 -2099 3876 -6238 -5795
1115 -5795 6654 825 -3463 4177 -1006 -5557 5657 3166 -5546 3216 4231 -4232 3152 6679
1129 6679 -5114 -461 6108 -2889 -426 6181 -3404 -3652 5571 -2185 -5286 4494 -1556 -5858 4462
1144 4462 347 -7576 1607 1171 -6501 1815 4101 -6905 229 4882 -4486 -1049 5602 -2856 -412
1159 -412 8348 -1513 -3903 4702 258 -2200 8066 2024 -6052 3843 2896 -4802 3843 2434 -7704
1174 -7704 212 4080 -5055 -2150 2023 -6421 -2956 6085 -3838 -4896 3554 -3103 -4045 6002 39
1189 39 -5424 3995 2474 -3425 4957 3618 -5309 2573 5323 -2619 1889 5453 -4726 -682 5988
1204 5988 -3085 -2445 5325 -2270 -4463 4133 -2652 -7099 3163 341 -5598 2927 287 -7544 767
1219 767 3099 -5653 1367 4320 -4575 626 5855 -4530 -1775 6060 -1191 -771 7379 -1582 -4189
1234 -4189 5279 1317 -3214 4906 1006 -5944 3347 3256 -4792 742 2281 -6550 275 5377 -4538
1249 -4538 -2888 2643 -4228 -1984 5912 -2942 -5011 4023 -461 -3849 3922 -234 -5061 4206 3595
1264 3595 -3234 2371 2206 -5666 1928 6091 -2741 350 4839 -4034 -932 5667 -2164 -2776 5527
1279 5527 -540 -3373 3697 -1260 -5494 3941 1520 -4966 1932 495 -6670 698 2552 -4631 -418
1294 -418 3307 -3519 -291 4836 -4074 -2613 5550 -86 -1898 4871 -514 -3142 5302 2610 -3855
1309 -3855 2550 2001 -3358 4740 3757 -5727 -983 2645 -3866 200 4426 -4885 -4280 3008 -3012 -3154
1325 -3154 3451 -2483 -4593 3717 324 -4458 3165 774 -4121 3999 4383 -4203 1044 3244 -4032
1340 -4032 2228 5898 -2042 -605 4572 -2406 -1354 4751 -1942 -3307 4769 -675 -4502 3016 -984
1355 -984 -5261 2486 1472 -5747 947 1762 -4233 -41 2512 -4612 -919 4869 -1640 107 4095
1370 4095 -2961 -2225 5459 73 -1843 4541 511 -3633 4787 2499 -4206 2394 2705 -3188 2102
1385 2102 2640 -5700 -1801 3337 -2721 328 3500 -4343 -4091 3497 -1180 -3124 3332 -1466 -4369
1400 -4369 4021 1015 -4059 2177 1291 -3592 3459 4054 -4247 596 4152 -2247 596 4770 -2499
1415 -2499 -431 5168 -1362 -2117 3249 -1701 -2838 4166 324 -3935 1804 676 -4246 1271 1159
1430 1159 -4980 15 2372 -4170 -387 1927 -4005 -636 4866 -1474 -1939 3057 -1515 -2635 4687
1445 4687 844 -3238 3311 1213 -2704 3610 1879 -4098 1770 3028 -2150 1028 2312 -4290 -324
1460 -324 3747 -2542 -1174 2586 -3324 -2872 3565 -1842 -3983 2278 -738 -3267 3728 839 -4451
1475 -4451 1475 1699 -3577 1820 3376 -3291 766 4009 -2743 579 4187 -1549 -512 5228 -1304
1490 -1304 -2802 3458 -1288 -2863 3115 388 -4210 1777 611 -3821 814 816 -4151 493 3107 -3780
1506 -3780 -1815 2853 -2816 -197 4032 -2302 -2235 3389 -334 -1570 4478 -116 -3482 4156 2475
1521 2475 -2478 2305 1681 -3750 2154 3258 -2257 137 1908 -3697 -382 3443 -2715 -2834 3039
1536 3039 -1023 -1883 2995 -2020 -4155 2244 769 -2781 2963 315 -4260 1369 2212 -2884 1133
1551 1133 3457 -2603 848 3224 -2452 -799 4088 -951 -319 4393 -949 -2715 3013 238 -3034
1566 -3034 2624 402 -3845 2446 1038 -4571 328 752 -4589 -354 2170 -3914 -1783 2550 -2289
1581 -2289 -1419 2700 -1862 -2241 4247 457 -1729 3254 500 -2550 3884 2932 -2038 1401 1393 -2640
1597 -2640 1956 3658 -2457 -293 1990 -2646 -899 2623 -3032 -2786 3108 -656 -2296 1790 -1923
1612 -1923 -4109 2635 1688 -3084 2212 404 -3444 1737 3729 -3084 1199 3455 -2245 803 4045
1627 4045 -1202 -1284 3562 -407 -1041 3812 -597 -2147 2538 -146 -3080 1124 487 -2997 1361 1147
1643 1147 -4269 11 1402 -3019 -477 2426 -3545 -1652 3118 -1874 -1494 2533 -1130 -1746 4593
1658 4593 528 -2731 2497 595 -1503 3277 1893 -3876 721 2460 -2537 1194 2426 -3131 -502
1673 -502 2408 -2098 -2108 3203 -2472 -2602 2677 -442 -2671 1666 -1163 -2758 2547 1312 -3190 775
1689 775 1982 -2719 1450 2639 -2744 404 3430 -1441 -49 2968 -2240 -1082 3668 -465 -1691
1704 -1691 3218 138 -1979 2213 362 -3360 1512 1749 -3132 425 1279 -3821 -686 2037 -2606
1719 -2606 -184 2375 -2281 -1447 2751 -1572 -2095 2400 -457 -1306 3327 473 -3186 1320 1534 -2271
1735 -2271 2456 1293 -2883 899 2821 -1701 209 1829 -2654 -1661 3067 -1630 -2507 1795 -1595
1750 -1595 -2262 2939 -151 -3065 1441 -77 -3151 1183 1147 -2917 1105 2128 -2707 661 2493 -2617
1766 -2617 -282 3378 -852 -1135 3062 -1103 -1010 3041 586 -1255 2959 192 -1998 1485 1082 -3152
1782 -3152 1415 2119 -3164 -161 735 -3266 -473 1873 -2640 -1601 1764 -1484 -1230 2769 -1370 -1567
1798 -1567 2152 499 -1376 2731 270 -2679 1592 2107 -867 1540 1678 -2922 2005 2351 -2293 -439
1814 -439 1910 -1799 -888 2879 -1325 -2381 2295 -1150 -1979 2230 -842 -2094 1930 508 -2382 1497
1830 1497 512 -2799 310 1284 -2356 785 2219 -1614 -211 2834 -1144 -597 2663 -76 -1078 2552
1846 2552 -149 -2398 2445 815 -2254 1352 241 -3240 1236 1245 -3022 -134 1687 -2369 -736 1942
1862 1942 -3111 -1878 2335 -587 -1064 2240 -1044 -2486 2565 782 -1170 1785 442 -2057 2101
1877 2101 2206 -1725 897 1692 -1431 285 2201 -2092 -611 2094 -1663 -975 2081 -1545 -3130 1691
1893 1691 -112 -1387 887 -325 -2755 344 1122 -2546 44 1151 -2177 550 1879 -1514 29
1908 29 1846 -1040 85 2487 -824 -773 2708 -311 -872 1511 -351 -1203 1739 952 -2444 871 1163
1925 1163 -2447 530 1318 -2406 -200 1668 -2147 -883 1236 -1938 -1106 2217 -767 -1965 1958
1940 1958 -625 -1557 2816 1251 -1565 1205 1078 -1770 1862 2180 -2629 220 2676 -1385 607 2405
1956 2405 -1590 -565 2126 -910 -848 1219 -846 -2065 1473 104 -2365 931 157 -2907 804 637
1972 637 -2911 601 1067 -2097 690 2172 -947 -929 1978 -847 -37 2531 50 -682 2346 -237
1988 -237 -1771 2120 791 -1961 1528 164 -2824 1112 759 -1420 -110 1228 -1819 -574 1077
2003 1077 -2145 -1725 1662 -1601 -973 1779 -1584 -1803 1694 65 -1555 2378 352 -1492 1278 1317
2019 1317 -1117 1528 1432 -1626 768 2364 -617 56 1702 -1888 -1335 2423 -672 -1919 1152 -796
2035 -796 -1807 1173 31 -2628 1284 833 -2254 718 727 -2120 -180 2080 -963 -2 2125 -1431
2051 -1431 -944 2143 -572 -861 2488 140 -697 1486 -226 -2053 1408 778 -1653 1314 1053 -2010
2067 -2010 453 1413 -1710 -217 1056 -2175 -459 1970 -1758 -1489 1004 -1278 -100 2202 -563
2082 -563 -1774 932 1081 -1667 786 -70 -2190 1679 2098 -1326 -56 1484 -1258 453 2882 -903
2098 -903 -1007 1683 -1255 -999 2131 -202 -2137 1311 -126 -1231 1130 140 -2928 578 1312 -2016
2114 -2016 -286 366 -2102 -479 1903 -1781 -565 2320 -876 -415 1722 -183 -976 2209 -41 -1427
2130 -1427 1481 253 -1623 1740 1723 -1748 924 1182 -1182 112 1818 -2361 -721 1746 -1514 -632
2146 -632 1050 -1444 -1959 1507 -763 -1810 1149 -14 -1597 1499 989 -802 935 591 -1413 1589
2162 1589 1765 -730 -544 1176 -638 -51 2134 -1268 -839 1546 154 -501 1369 -376 -1954 1134
2178 1134 635 -1670 495 -163 -1602 452 1099 -1710 -564 652 -1735 -273 1737 -1104 -461 1533
2194 1533 -31 -784 1415 -18 -1229 1832 629 -954 1338 1012 -1620 824 586 -908 446 1609
2210 1609 -466 695 1501 -2540 -445 1596 -724 -890 1262 -1234 -1993 1306 186 -1711 1160 346
2226 346 -1166 1459 1434 -1651 712 1623 -303 455 2019 -1262 -287 1705 -818 -485 1400 -555 -323
2243 -323 2009 175 -735 623 -507 -1297 954 597 -1388 114 287 -1908 -134 662 -1288 120
2259 120 1073 -1200 -894 577 -813 -444 1924 -348 -127 1293 -168 -639 1559 795 -750 1286 857
2276 857 -861 734 1077 -1086 647 1203 -783 8 940 -879 -418 1160 -1032 -1003 506 -230 -919
2293 -919 1246 344 -1544 800 325 -972 1172 875 -1479 561 1144 -780 228 1721 -1122 92
2309 92 1613 64 -431 1160 -530 -643 1056 -231 -1930 306 304 -1112 826 124 -2019 -272 1253
2326 1253 -1462 -120 953 -1506 -141 545 -1387 -1336 1173 -33 -912 1365 -136 -1230 1580 736
2342 736 -776 1181 623 -759 1260 1037 -1073 224 1037 -1446 -285 857 -1037 -839 427 -585
2358 -585 -1081 1356 -789 -1197 998 -183 -940 924 -305 -1613 740 878 -411 596 205 -1054
2374 -1054 316 1000 -844 -93 556 -937 -371 1363 117 -379 913 -649 -316 1148 -34 -1179
2390 -1179 477 230 -661 751 -184 -1607 346 355 -1328 -213 537 -1117 -37 1385 -1236 -467 871
2407 871 -626 -624 1374 131 -1257 518 501 -1218 558 295 -1319 389 1305 -850 13 865 -1468
2424 -1468 -108 1074 -1330 -684 924 -517 -951 346 -409 -883 685 240 -774 391 -510 -556 716
2441 716 744 -1313 172 95 -844 -177 1109 -686 -276 1260 -335 201 1430 -234 -503 715 250 -991
2459 -991 980 -503 -1089 820 -34 -1666 155 417 -1508 -266 507 -747 -59 954 -750 -424 1250
2476 1250 -291 -1101 1540 -60 -655 914 657 -621 997 518 -1229 754 817 -61 541 1392 -1083
2493 -1083 540 1200 -860 -22 1231 -850 -1055 594 -655 -502 899 -896 -1173 716 126 -484 94
2510 94 -197 -1063 311 643 -1174 90 213 -1022 300 858 -524 -553 1300 177 -7 904 -69 -274
2528 -274 1262 273 -929 664 -25 -1035 522 241 -1121 854 612 -1136 98 450 -792 -174 1228
2545 1228 -339 3 848 -578 -602 674 182 -1075 589 290 -556 662 306 -1714 139 656 -1056
2562 -1056 603 766 -937 -247 1363 -712 -1023 384 -509 -417 911 21 -1161 409 -535 -485 981
2579 981 211 -1372 352 244 -751 242 922 -774 347 1450 -330 314 793 264 -634 1444 31
2596 31 -515 1153 -249 -556 976 524 -502 557 408 -517 526 322 -962 238 775 -779 -514
2613 -514 1315 -1261 -108 474 -561 -402 653 -173 -991 838 -136 -1347 635 383 -657 677 860
2630 860 -433 223 786 -815 137 652 -900 -417 718 -831 -1045 714 -507 -791 741 -554 -1708
2647 -1708 462 -84 -540 313 -124 -1523 236 487 -1044 945 576 -805 -96 1202 299 -379 111
2664 111 76 -481 895 71 -209 836 355 -956 484 -89 -530 886 339 -652 -47 924 -661 -302
2682 -302 337 -967 309 1103 -323 -413 1143 -137 -325 381 -387 -636 447 168 -646 459 266 -456
2700 -456 413 304 -1003 193 1112 -1016 -504 1248 -219 -296 571 -884 -567 1140 344 -548 334 -243
2718 -243 -841 776 52 -551 113 -268 -940 392 598 -1066 212 38 -537 156 1444 -615 -603 609
2736 609 294 -172 1027 -35 -413 924 -208 -384 318 -34 -631 534 655 -905 346 622 -352 -76
2754 -76 380 -993 -153 1085 -794 -824 100 -259 101 746 127 -383 538 270 -226 1201 136 -1248 902
2773 902 -43 -578 185 591 -583 291 780 -500 -185 283 -984 -446 946 -333 -336 138 -224 -328 887
2792 887 24 -434 580 85 33 259 713 -1369 -323 427 -488 -285 337 -514 -601 568 293 -598 954
2811 954 -288 -42 758 -581 -697 657 185 -927 292 -68 -593 -59 -146 -470 -578 434 -661 -578
2829 -578 492 -582 -352 293 -290 52 996 337 -617 554 401 -442 358 218 -893 794 -19 -78 259
2848 259 185 -1045 -292 963 -530 -641 491 -440 -446 219 -188 -696 173 95 -714 473 41 -1175 343
2867 343 160 -620 28 487 -1323 385 1140 -191 275 699 -390 -644 1082 -545 47 941 209 -695
2885 -695 652 113 -827 934 22 -657 -47 326 -226 145 388 -79 -927 955 -1073 109 608 -278
2903 -278 -326 151 -824 -664 782 -368 -302 678 626 -548 475 -215 -45 872 369 -485 0 665 -751
2922 -751 -66 1052 -235 -592 740 -448 182 434 -396 -767 975 117 -833 527 -211 -954 455 300
2940 300 -475 -119 438 -604 371 741 -519 -427 761 -453 7 532 98 -586 591 401 -420 852
2958 852 119 -1281 127 701 -1076 65 1015 -552 542 624 -252 -147 1025 -168 -577 900 -1032
2975 -1032 -996 967 734 -240 593 -43 -648 325 526 -495 -193 649 -297 639 79 -909 -147 461 316
2994 316 -60 603 -20 -350 729 -103 -645 -220 -509 -902 434 284 -1046 298 244 -933 127 542
3012 542 -1140 -344 452 243 -49 665 -716 112 850 115 -849 1238 4 -55 962 471 -1102 589
3030 589 148 -242 237 758 -421 401 492 90 163 29 -451 -107 775 -401 -151 54 -357 -758 359 17
3050 17 -201 178 136 -909 -3 831 -1213 -276 490 -70 192 365 -1032 -620 548 -169 -539 774 -65
3069 -65 -440 504 -55 -1183 289 -7 -202 954 120 -671 -59 861 -853 133 490 -821 378 462 -514
3088 -514 -121 127 -192 57 577 106 -644 283 273 -435 593 79 -70 41 871 -964 219 -66 -907
3107 -907 185 -64 -583 177 43 -821 -293 345 12 -864 448 -14 -491 522 138 -852 300 305 -133
3126 -133 431 611 -689 340 709 -411 259 -129 189 -385 1073 -234 -101 -258 187 -531 41 -346
3144 -346 -724 845 -316 -699 281 784 -909 -84 182 -345 358 667 -336 -892 650 25 -803 370
3162 370 68 -688 17 214 -498 578 525 -1291 -380 408 -235 -5 712 -796 -41 36 -434 -300 593 -499
3182 -499 -24 313 -381 -795 616 -653 -420 177 -50 -245 46 179 -41 177 262 -385 -523 303 -205 140
3202 140 660 -395 -172 934 -210 -164 744 -88 -333 369 -274 -724 307 75 -623 313 940 43 372
3221 372 495 -1106 -4 478 5 -339 641 -232 -570 760 -381 253 849 227 22 213 197 -265 534
3240 534 550 -175 302 462 -645 452 83 73 -497 729 -406 211 850 290 -548 430 -695 -642 350
3259 350 423 -611 444 699 -803 856 -170 -13 396 423 -740 263 454 109 440 784 -187 -32
3277 -32 798 -505 307 200 102 -325 910 -263 -257 299 -321 -864 -233 661 -235 93 447 -139 -462 748
3297 748 -518 81 406 344 -165 457 224 -120 376 3 -113 436 333 -282 322 239 166 179 291 -22 -558
3318 -558 -29 -437 -191 907 -350 -442 162 386 117 155 -227 -527 378 -819 -305 481 -8 -851 363
3337 363 651 -417 -17 -53 -823 -48 1183 -297 614 -330 -746 22 579 -15 -461 354 51 -155 663
3356 663 -218 -421 -237 -70 -39 -149 -83 -627 322 210 -108 -247 629 -560 -736 475 -71 6 329 54
3376 54 -604 410 395 -313 492 123 75 -452 178 -239 -164 901 -493 43 578 -408 -178 646 -281 -256 -3
3397 -3 -293 -197 779 -279 -632 518 189 -170 536 335 -776 -59 229 -460 113 -250 -169 324 701 190
3417 190 72 389 135 -324 655 -237 -662 166 -2 -1067 925 -192 -355 45 -37 -5 -176 -297 -600 -455
3437 -455 423 -146 -290 555 -79 229 697 -3 -95 462 -483 -110 18 -92 -468 781 -180 -389 312 215
3457 215 -155 75 60 3 -8 91 -650 -105 246 -393 118 -177 186 -69 -274 -724 -695 325 356 227 23 -271
3479 -271 -589 374 425 -17 81 906 17 -144 -178 -286 -276 549 -495 182 -183 101 -531 -19 114 28 -260
3500 -260 -206 -472 99 721 -869 108 -453 -248 -323 -298 -276 -171 196 -97 -282 480 -115 -269 -48 -346 -252
3521 -252 311 209 49 163 497 -294 339 -255 -524 113 111 -1077 -46 173 -721 517 966 -191 -594
3540 -594 5 -86 -500 -209 -678 -639 -84 544 -109 -284 235 -330 118 493 -62 -173 624 -493 109 78 -118
3561 -118 80 46 296 76 317 -7 -82 9 -256 -655 417 8 185 232 -7 -191 404 112 -287 464 -253
3582 -253 -733 -861 705 -223 6 -148 -114 -673 1171 -394 -104 336 103 -173 302 15 -425 159 -270
3601 -270 -214 471 455 208 -406 724 -389 -41 412 -557 -200 973 324 -667 -135 -504 118 218 -238 -237
3621 -237 92 -235 -169 227 454 -43 324 -274 -383 -38 670 -64 -212 296 -28 -431 64 -770 -46 300
3641 300 -259 -773 -75 161 -120 -113 124 -299 -4 -121 -657 -254 219 126 107 421 -79 -802 -534 -402 13
3662 13 475 -114 -619 361 566 -81 188 -133 -462 -169 326 -187 -187 -62 -126 270 396 -375 -1035 473 -304
3683 -304 -295 65 71 -266 -208 -252 -500 498 714 256 -219 422 -669 421 367 347 -150 40 178 221 -120 -282
3705 -282 -37 158 505 -213 202 23 34 354 148 -463 -520 -330 -736 352 -76 10 452 472 -48 -82 351
3726 351 -421 -226 302 -820 -342 424 617 -102 -81 47 -244 111 -93 -321 -274 335 -105 38 230 -229
3746 -229 157 15 -239 -602 133 -408 -516 162 -17 -245 504 -410 -173 579 198 -765 -25 86 -810 40
3766 40 -166 576 102 748 236 155 280 319 107 -207 78 30 323 -76 -260 551 296 -408 -57 399 -96
3787 -96 601 351 -532 -389 -411 -468 -182 195 -575 -649 239 651 -466 351 393 -229 535 502 -232 -230 -461 -20
3809 -20 251 217 -221 205 272 32 -357 712 299 -250 8 -279 25 455 -99 81 125 31 176 -350 -735
3830 -735 -28 517 -283 121 -71 -715 -225 -12 41 -39 -32 505 1 -173 -31 41 451 156 294 82 153 207
3852 207 247 169 -158 -447 -104 156 149 -176 27 -50 -66 434 -222 -271 -53 -295 -168 88 -22 -188 -130 -234 -496
3875 -496 -181 -60 -51 330 -617 -609 133 -15 -59 -47 -77 160 -312 72 -600 -263 525 -219 -111 -68 186 63 -117
3898 -117 144 -594 787 -439 -157 45 -201 -355 149 -277 -113 232 330 -229 -8 206 -363 -51 -145 186
3918 186 -478 595 340 229 334 -170 -159 41 261 -475 -16 246 -292 295 181 151 -437 519 -735 -233
3938 -233 -382 -432 -53 323 -572 218 -24 303 -19 -38 86 -335 231 -54 -184 371 398 -251 -30 152 -422
3959 -422 219 224 -200 -438 -18 -64 356 227 279 265 324 -442 247 -213 373 8 414 315 -163 2 163 -434
3981 -434 306 55 -19 103 -481 -650 -45 173 255 -487 195 -243 439 274 141 355 -44 -236 -115 410 -348
4002 -348 87 -552 -38 23 -431 -94 -412 354 -600 -214 385 15 -401 310 -322 614 133 27 -97 -441
4022 -441 -73 -44 -137 -3 -445 -102 273 341 -23 -93 108 -255 -130 149 -113 153 163 -317 198 373 352 363
4044 363 528 385 -271 447 136 208 339 -293 -199 478 283 143 213 336 -369 140 -289 -24 182 621 -367
4065 -367 174 252 -507 -44 222 -42 -685 558 100 -91 -84 63 4 318 330 50 15 53 295 155 373 -214
4087 -214 105 538 -241 -68 572 352 166 796 -334 2 -4 484 429 -84 82 -256 391 -125 -58 -181 723
4108 723 -853 -106 306 -355 -483 -618 -85 -97 88 394 -70 -154 -25 -198 261 -40 247 289 -119 12 -74
4129 -74 475 41 547 442 124 -472 597 83 -466 338 -224 -93 59 65 -3 305 -199 -102 -35 -292 -175 84
4151 84 -389 229 -129 495 -18 -445 80 549 66 -49 325 42 198 -259 159 283 314 -110 675 95 151
4172 151 -388 32 160 103 244 -352 353 177 57 46 414 -90 -147 30 -432 60 114 -4 378 256 -41
4193 -41 -426 475 -361 -254 412 62 79 279 197 -154 665 -11 -27 -555 123 96 107 427 14 -102 32 135
4215 135 -523 429 -285 167 -411 -73 288 392 817 -116 -117 -91 -189 -157 909 165 -172 212 -189 -477 180
4236 180 344 524 511 -125 -408 449 -5 -186 92 -108 157 105 379 -804 163 -320 -1465 -769 52 -540
4256 -540 -211 293 164 -519 100 -833 7 386 -572 11 114 78 -83 493 65 -405 -35 -153 -251 395 852
4277 852 -117 264 -134 -133 -8 -161 -133 -20 86 259 -268 236 -14 12 -2 -185 -106 98 237 -286 -59 103
4299 103 -256 487 261 -513 -95 89 242 -615 -142 -554 -423 695 -337 -215 -273 256 -714 423 458 -181
4319 -181 252 -302 -206 -638 -178 -256 -488 407 -17 42 906 -1034 59 -34 190 246 345 -100 -593 726 265
4340 265 -477 615 443 -21 469 774 69 -37 601 -268 418 241 29 -815 433 -69 -775 317 25
4359 25 -125 335 -368 -318 162 27 -271 -257 7 -97 502 431 -301 542 663 206 9 937 380 -509 186
4380 186 -389 -70 743 237 -312 564 359 472 -226 413 -310 144 380 -260 -51 561 666 -495 912
4399 912 -147 256 37 -361 -537 1121 440 -37 -30 273 -477 677 474 -956 -106 199 -285 245 655
4418 655 -605 88 -109 -186 -71 438 -72 -778 -194 -646 -361 236 -116 -488 56 -428 -399 217 325 -58
4438 -58 -24 210 -487 205 440 -140 -95 663 622 -49 565 -26 -389 2 176 409 -279 -153 -49 -53 488 -571
4460 -571 340 431 -619 -625 -14 129 -227 265 -765 -349 209 65 -520 -25 86 26 457 -100 -381 426 294
4481 294 261 139 339 -455 131 -394 192 -288 221 -54 -437 251 -300 -566 303 256 62 -161 -436 -289 -398
4502 -398 -247 -609 -350 37 -559 23 23 -254 -219 573 61 -349 433 -531 278 332 -161 -253 361 504 -117 599
4524 599 118 -228 -51 363 -467 -22 -275 -413 77 314 -485 -123 320 -656 -241 402 -731 41 253 287
4544 287 251 273 188 -408 -68 248 -568 172 640 -360 152 881 -138 -71 142 -339 -370 679 -373 -566
4564 -566 872 -562 54 115 -106 -686 -90 -403 135 252 213 -265 -463 250 -828 394 306 -484 -180 -90
4584 -90 -174 -279 530 175 -66 662 349 -587 -211 -92 349 -449 -696 -467 -110 331 -113 376 151 129 75
4605 75 229 -317 543 -55 -501 -516 554 -230 -383 823 -272 -359 597 73 -181 376 -48 -119 414 469 39
4626 39 155 79 -39 201 350 -300 -486 398 -339 -188 95 244 -195 -122 -196 -223 -768 43 -953 266 818
4647 818 464 -707 -149 -804 -161 481 -537 -249 697 -459 -223 1005 236 181 184 -181 -447 857 543
4666 543 81 452 672 -30 -482 150 -226 307 474 -328 -47 236 -607 -63 495 156 -108 153 140 132 541
4687 541 191 61 785 285 -357 130 96 -406 158 184 333 -193 777 -555 -489 327 -312 -704 82 -294 -395
4708 -395 448 -305 -401 225 -201 -484 295 338 -515 -17 574 -651 211 574 -397 -78 20 3 -79 99 -17
4729 -17 -308 434 -595 306 601 76 -145 149 -328 -325 94 86 -56 298 672 230 74 290 -1153 21 -77
4750 -77 220 -250 -204 -172 -840 -45 -340 325 326 -68 -299 712 396 -637 292 32 -612 28 375 -246 41
4771 41 708 99 -275 387 597 -337 320 -101 -427 282 205 -288 292 -126 -635 6 95 -98 253 -204 -417
4792 -417 300 148 -513 -500 -322 -347 66 115 -7 -137 -112 -127 -55 530 94 -595 -164 420 -676 -114 75 -141
4814 -141 -87 362 126 -458 196 -423 -604 413 532 -295 176 178 -302 -595 638 -651 -365 -75 -519 374
4834 374 635 -289 80 169 -116 -207 456 -439 -421 623 -223 -673 737 148 168 524 -406 -148 -55 -181 -555
4855 -555 367 197 -174 113 569 -306 410 -200 -785 29 433 187 -205 500 -591 184 -158 107 -637 73
4875 73 197 -508 554 308 -643 268 157 45 -102 231 -540 -68 258 -734 635 634 -122 -890 677 47
4895 47 -236 -56 104 -443 580 -485 425 -3 26 -507 257 314 -494 15 276 -169 572 -139 -649 -520
4915 -520 865 229 -1074 158 154 84 190 -43 -583 752 317 -584 560 146 -329 -57 51 119 228 520
4935 520 -602 -446 444 -658 -311 458 -177 -49 389 398 -729 -525 359 50 -90 365 24 646 478 58
4955 58 -97 536 -864 -678 354 -558 402 151 173 -471 117 5 -599 29 177 -35 -200 34 -305 27
4975 27 -181 -221 -66 -136 -71 379 362 -122 -58 327 -72 -189 201 422 -43 175 278 -490 525 -229 -310 -133
4997 -133 152 -446 -52 515 -502 -33 59 -31 -223 952 254 -368 203 192 -103 504 726 -128 -271 32
5017 32 -7 -29 -112 -379 311 230 -226 346 257 -166 -234 391 -69 -274 152 -114 -433 343 -175 -181 -311 -340 -452
5040 -452 597 -252 -316 -389 201 106 -488 267 -15 -56 292 -34 -168 262 94 -343 152 -136 -146 435 313
5061 313 -443 195 -295 24 -88 -102 58 -185 443 -574 -15 778 -163 -57 384 -596 -30 372 61 244
5081 244 -26 -346 -107 397 87 -74 544 137 -420 135 118 180 -355 -88 -36 -306 427 -97 365 923 351
5102 351 -70 881 -154 552 475 -103 -34 -83 260 -563 21 -22 -424 -96 491 -518 -103 557 -213 -294 436
5123 436 -186 -62 71 -62 -598 1215 357 -411 317 -400 -216 343 306 487 129 586 -411 317 -279 -157
5143 -157 79 -78 -654 -334 -255 -504 -303 674 599 54 160 -318 -558 209 287 -43 -159 -347 130 -188 586
5164 586 -1131 -34 720 69 -166 355 270 332 909 36 -127 -33 62 251 164 -40 315 625 394 246 -519
5185 -519 159 -910 450 391 36 497 498 -957 166 310 -236 -475 438 511 76 908 131 23 100 229
5205 229 -730 845 521 -445 148 274 -697 -45 129 -946 -396 -318 -401 -276 526 -238 -319 584 160 -283
5225 -283 170 133 -79 -223 -332 -618 630 32 -630 -298 137 -396 627 332 91 851 388 -1061 -95
5244 -95 680 -74 -280 71 142 -443 497 247 106 -219 304 -408 192 -195 -404 387 -185 -802 141 267 -303
5265 -303 -148 451 390 -434 -112 -484 600 246 207 -53 153 182 -816 159 -85 -182 -50 300 -75 -219 103
5286 103 -668 -278 133 -113 33 24 213 295 -4 -147 163 174 -431 -410 357 437 -571 298 408 -145 320 636
5308 636 -412 166 891 -201 -252 503 -442 86 11 -95 -462 716 -173 -519 331 -183 -101 -564 -21 -668
5328 -668 -619 666 -114 -594 -471 -431 -413 179 -193 187 366 -393 396 504 262 -252 229 -445 225 64 426
5349 426 -356 -210 421 -268 -415 760 -768 31 411 -301 -949 287 117 -270 158 122 -399 786 -10
5368 -10 -332 -24 -190 16 445 402 173 211 90 -333 650 497 -223 64 516 -4 -68 525 29 -180 384
5389 384 -619 -506 348 -229 -453 72 45 -164 -214 390 -353 -355 64 -476 -561 287 -59 -298 816 227 -619
5410 -619 349 87 -550 512 408 -109 212 -384 -646 215 82 -182 81 142 -854 152 103 -540 398 566
5430 566 -120 -429 508 104 -214 311 -145 -199 -114 -648 -732 457 -163 67 -169 650 -371 -176 532 390
5450 390 -47 290 -375 -337 278 311 38 -328 -46 -234 403 -107 -1141 -252 131 -731 368 123 -775 -466
5470 -466 923 -116 -292 218 -131 -266 -436 -41 295 300 -39 -223 511 784 -369 612 -256 -365 1089
5489 1089 219 -381 544 565 -333 285 1020 -554 -142 354 -322 39 136 -386 -324 125 -281 -234 -483 -61 -730
5510 -730 -232 39 -356 76 349 -234 120 547 -509 419 157 -184 -226 335 645 -163 24 401 -416 -76
5530 -76 1 -716 338 -280 -362 236 40 -739 317 299 -88 -284 202 -926 -214 510 -57 -197 116 -852
5550 -852 -83 625 -98 -376 564 268 -431 194 467 -463 661 138 -111 -448 276 -605 -309 299 -491 -361
5570 -361 107 -438 -353 285 48 -1040 277 -18 -282 617 -32 -230 552 175 -362 -455 144 -847 104 601
5590 601 -378 183 68 -628 -132 693 -22 -73 213 -463 -593 -49 -237 -211 238 398 -477 282 604 -419
5610 -419 -131 578 -643 44 373 94 -298 32 -285 102 691 -236 -146 541 810 549 216 326 -544 254
5630 254 126 -325 -57 462 -89 52 -69 -767 95 491 -727 128 482 -18 -495 -9 -34 121 543 -656
5650 -656 -259 -179 91 -223 -110 79 -583 74 456 -443 244 789 -206 -116 714 -627 242 733 -432 -186
5670 -186 -350 315 -317 54 380 -611 275 -49 -613 102 1 -785 260 61 -371 183 489 148 10 174
5690 174 -266 -473 705 -107 -510 596 -220 -741 432 147 -821 476 278 -128 123 617 -101 459 263
5709 263 52 -68 -23 -583 207 467 730 -447 117 464 78 108 -718 -302 -437 58 -652 -364 284 30
5729 30 -91 229 -455 4 56 -334 159 353 49 -287 103 19 -238 73 79 49 184 472 2 -114 -99 -628
5751 -628 350 393 -68 -5 57 488 242 737 -608 -238 84 -201 -150 -63 -413 -497 885 -418 -292 -192 455
5772 455 -179 625 452 -633 -24 777 47 154 -33 -192 -81 808 -117 -179 298 -345 -420 282 -674 345
5792 345 -232 -123 -5 496 -32 -264 272 481 -538 177 1007 220 10 141 -325 -456 962 -300 -212
5811 -212 -139 146 -557 566 -108 -573 511 8 -315 493 190 199 -117 314 -307 512 583 28 -90 235 -144
5832 -144 -124 443 -213 -532 190 -500 -371 -438 19 -186 116 495 -582 411 360 -790 697 -336 -419 -267
5852 -267 334 -45 -269 587 -817 -224 132 -171 -573 527 -542 -548 178 450 -539 604 211 -329 -16
5871 -16 686 -824 391 139 -502 177 20 -321 -287 238 376 -505 632 114 -179 393 -414 -330 52 416
5891 416 8 233 223 58 -446 -393 -348 -225 845 -90 -418 -134 -324 -662 707 17 -494 -6 628 -419
5911 -419 132 566 -654 -155 681 -397 143 451 -446 227 955 -227 -64 541 -402 -319 554 -283 17
5930 17 173 -145 -721 618 48 -55 382 102 -213 209 301 -597 -548 417 -763 -664 116 39 -368 102 -325
5951 -325 -677 389 28 -264 -85 370 -1179 -105 -99 -80 1022 189 -198 -268 287 -547 -42 75 -423 -208
5971 -208 -14 -160 -380 193 -313 -422 693 207 -551 893 371 -466 464 182 -14 239 312 641 58 798
5991 798 383 -101 -241 -280 -120 110 351 -5 1243 105 -638 682 -125 -213 350 -375 -554 -26 310 -37
6011 -37 -543 169 -191 -76 18 -163 -87 28 172 42 -145 -258 50 -322 52 -251 24 316 -182 -81 237
6032 237 359 46 217 267 363 478 -229 -230 641 -32 -494 656 74 -332 451 396 -545 172 483 -209 548
6053 548 712 -538 97 691 347 216 753 -520 81 66 21 212 253 -183 -315 69 233 -278 82 500
6073 500 74 -26 -150 -405 -97 -203 -308 45 120 296 -14 -41 -296 -48 492 -7 -55 644 -366 -68 611
6094 611 210 -294 506 207 -521 343 526 -794 25 460 -866 -173 366 -273 -80 649 -199 -226 -344 -600
6114 -600 -707 265 209 -373 188 327 553 859 -70 -783 150 138 642 -37 462 151 135 345 28 -270 462
6135 462 -9 118 543 -260 -738 458 -393 -3 181 -71 -659 574 209 -788 -857 381 -309 -318 -83 28
6155 28 136 660 -28 -404 374 -239 -324 707 183 91 600 -48 -622 51 444 -492 403 344 292 20 594
6176 594 -203 -143 59 112 48 414 -543 -506 187 -392 -398 429 -56 -930 182 153 -179 164 -247 -682 -114 257
6198 257 -598 -50 428 -335 207 706 95 -688 -64 -283 430 179 362 176 135 186 -22 428 73 141 -722
6219 -722 -169 129 -236 27 -554 -415 30 -342 -107 734 -323 -49 399 175 0 212 286 -492 227 236 -677
6240 -677 451 229 -184 703 291 -365 -148 417 84 -242 800 467 -306 169 -85 -410 243 261 -34 143
6260 143 410 -888 674 124 172 515 243 -656 92 624 -214 416 269 342 -452 641 -72 -492 41 208
6280 208 -31 -371 11 -100 189 150 -356 229 188 -414 -203 244 -231 -226 125 -214 -108 634 -666 -83 343
6301 343 97 -62 625 -645 -318 630 399 551 -182 43 -143 -403 -139 -180 -225 327 -354 -161 145 -45
6321 -45 30 431 -728 188 -426 -213 -180 12 -145 -804 -328 -179 -87 -217 505 -395 48 -95 -233 517 369
6342 369 287 160 -479 21 -184 -95 553 235 225 571 -463 389 -24 -185 253 -182 -748 190 458 -494 152
6363 152 308 -802 -144 408 -658 23 -14 -1 -133 329 -166 -224 -269 -323 -655 199 346 352 -673 501 -320
6384 -320 558 307 -425 -195 213 -385 -303 514 -80 408 598 419 -446 334 -415 -101 209 -334 -488 -8
6404 -8 129 -38 -278 -530 -420 39 17 -653 29 358 -76 -27 228 -701 -473 40 213 301 137 -465 22 426
6426 426 -45 -456 73 189 -377 232 117 26 -48 332 -611 -60 215 -255 -271 -82 -78 -329 699 489 -349
6447 -349 -4 208 153 57 324 -654 -262 177 86 191 486 -9 95 -176 -81 271 357 -664 98 419 64
6468 64 -549 -30 308 -486 24 -607 -892 273 884 -452 -355 -118 58 39 245 -167 -363 144 1 65 242
6489 242 -273 -475 -154 93 -255 -176 700 -390 629 -57 -587 322 28 375 -442 97 -844 21 83 -240
6509 -240 -159 469 -280 10 232 -363 175 600 -635 168 849 113 -373 -186 211 697 238 1159 -451 -263
6529 -263 -185 93 294 324 316 171 419 89 297 145 -348 -443 463 -256 -438 -299 231 -328 429 674 -375
6550 -375 -120 -27 -222 -106 698 -104 -237 533 -53 -102 -618 130 -619 319 690 -1098 904 570 -262 105
6570 105 -51 -167 90 -61 -551 467 -53 -364 -290 300 -207 529 -285 -660 -375 326 12 0 606 31
6590 31 -445 338 -402 102 982 -83 -60 153 -271 -101 -73 170 -13 240 -100 -344 -190 312 244 -366 581
6611 581 237 -509 -698 -337 -918 56 -13 -132 -334 490 96 -190 552 13 -442 3 -152 -312 368 435 -493
6632 -493 -474 -308 -173 771 307 -78 303 209 -736 535 -67 -490 417 115 32 91 249 -217 -14 25 -16 123
6654 123 333 157 -175 -222 -320 -456 158 -602 -557 -42 15 -155 171 434 -871 845 164 -7 281 279 -72
6675 -72 -163 353 64 12 -271 -68 -103 209 341 -401 -353 -232 -338 685 37 -1079 182 486 -499 46 -20
6696 -20 -238 166 657 563 -1310 -98 -551 -130 208 -390 278 722 -57 -463 78 218 -895 354 521
6715 521 -427 -349 29 312 -634 263 -656 -63 193 261 132 -336 -301 -456 -382 -240 -404 -91 390 -349 -91
6736 -91 -266 -335 -179 -169 -150 -7 758 -590 -21 -551 59 -375 -106 -259 -372 804 -95 -540 106 337 -208
6757 -208 136 -379 -370 -156 -345 -460 -133 26 -504 -200 208 -539 -305 266 -234 167 -355 202 -567 217 -152
6778 -152 -475 421 83 -306 -272 267 -291 66 37 -19 -38 -14 -237 -369 701 41 -420 291 -77 -29 61 258
6800 258 -690 303 52 -28 -164 40 1 84 296 -84 234 280 -578 288 697 25 190 378 86 -367 460
6821 460 -70 -449 196 -14 214 -185 -237 -233 128 388 -165 -326 502 -247 -1027 524 -219 -540 180 5 73
6842 73 170 -437 -710 475 118 -160 515 547 -231 562 87 -676 -128 47 -104 19 -419 273 -82 25 101
6863 101 -435 273 -108 -68 519 253 -470 -63 -170 139 581 -442 -319 114 -380 287 196 251 326 130 554
6884 554 -582 50 810 -230 -80 481 -506 -360 284 313 -240 247 -10 -477 22 97 -187 -155 -361 -316 -446
6905 -446 480 -38 -182 62 -176 -607 552 231 -123 -32 233 -376 616 418 -204 702 52 -368 171 271
6925 271 -375 265 -196 121 -462 671 415 -278 55 63 -327 -58 -145 70 141 -81 -649 351 -674 -379
6945 -379 171 -4 -742 -597 80 139 -194 381 -158 -495 675 371 -330 -109 -485 -231 1011 310 -304 434
6965 434 351 -114 213 456 579 266 409 -503 469 -49 -160 352 160 520 -139 142 -146 -475 548 -14
6985 -14 89 495 70 -652 -55 -163 -86 -399 244 -178 73 -45 -479 61 349 -31 -631 131 20 -597 155
7006 155 205 282 703 -418 -100 -28 923 -403 135 -93 -527 34 582 -146 -193 -122 -36 9 724 -276 -403
7027 -403 116 -413 -140 485 120 -388 746 530 -474 366 439 -162 65 -296 -331 301 138 -268 -254 -274 -384
7048 -384 -437 204 -529 -185 495 352 -692 549 560 -408 -96 381 -201 137 471 -185 -632 528 -768
7067 -768 508 708 -88 640 104 -473 383 594 161 -120 141 -24 -275 -119 -256 10 407 207 14 413
7087 413 2 -13 785 383 55 57 628 -784 210 362 -45 125 235 -34 278 669 60 -34 142 766 -48
7108 -48 388 101 -270 246 471 288 -567 251 -187 -402 61 190 -636 641 -348 374 706 -85 -141 59
7128 59 493 43 276 -111 -385 326 514 -106 483 -84 150 54 275 -389 -675 485 -74 -451 118 -719
7148 -719 -609 191 750 -552 109 290 -359 -184 -777 110 598 256 -54 190 311 -377 -217 -361 99 40
7168 40 -69 272 87 537 -63 -328 -97 229 104 203 360 -235 378 -71 -893 -171 695 -519 -111 -94 -611
7189 -611 -112 -102 -499 -482 255 -279 -356 -136 314 -269 855 -128 -771 -216 -194 -369 575 -229 -346 -342 78 -400
7211 -400 81 23 -325 124 272 -124 -80 405 -399 -424 293 -382 -553 -360 491 279 -625 232 -763 -331 384
7232 384 -80 -143 -10 -482 710 485 -498 -516 779 -11 -51 202 -195 -570 248 77 34 387 -275 -345 248
7253 248 -25 -47 -519 242 -162 -78 -156 -39 334 452 -1 -333 199 -380 -341 -205 -8 -260 -133 6 107
7274 107 533 647 -197 18 52 -324 -162 822 -507 351 -177 80 -211 868 -114 -272 190 -125 192 225
7294 225 -897 -976 -274 147 -403 153 361 -488 -297 206 -398 -206 196 -369 -159 -53 9 19 -449 244 -315
7315 -315 168 -248 14 259 -197 -164 263 60 68 136 -66 -367 546 432 19 66 161 -72 -468 213 66 -861
7337 -861 203 443 105 77 123 413 74 -234 -498 -157 27 214 -144 -6 -368 -70 368 333 -240 136 -169
7358 -169 51 -248 161 -121 506 -228 -55 -362 186 -915 436 -146 -191 -278 407 -476 -932 433 -508 344
7378 344 -194 -248 94 83 -375 -470 609 -318 225 -469 -33 -118 464 572 -607 476 -62 598 349 987
7398 987 -726 124 26 -201 -159 802 420 -518 152 -174 -327 261 -275 -145 -79 123 1040 571 270 -565 -386
7419 -386 801 -513 447 279 133 96 -37 9 64 20 132 -166 590 158 -794 312 -87 -61 157 36 -416
7440 -416 291 62 -341 304 138 -381 -389 116 -17 182 588 -866 226 147 -324 -304 121 -235 -623 54 -159
7461 -159 -323 -79 -837 -358 -405 178 78 -198 223 -384 102 172 36 -3 -47 -128 -630 -53 -434 -284 117 413
7483 413 -746 88 -222 -430 422 356 -581 -120 217 -290 -331 344 76 182 -12 -636 435 417 339 -578 286
7504 286 29 -38 -248 238 89 369 570 -88 -84 221 -474 -49 -124 -605 281 274 -375 470 171 -378 -276 379
7526 379 -399 -226 151 -588 58 416 515 -392 406 231 -301 91 -85 -454 -659 36 279 -212 870 671
7546 671 12 -38 -293 -52 17 51 -520 249 -549 550 238 -586 83 -567 605 154 -33 144 -326 49
7566 49 320 163 -71 568 -238 233 779 28 -131 100 -569 -499 275 272 -288 -132 -72 -679 -157 198 -776 100
7588 100 -564 -622 -272 14 -26 -387 -23 -792 74 169 209 -190 -71 -363 54 518 1 387 134 -375 -336 54
7610 54 73 98 277 -160 -228 -409 -37 369 -539 -387 447 71 46 505 56 -163 117 -714 83 71 -119 -375
7632 -375 410 -3 -60 658 188 -125 -44 200 -125 316 -99 -295 719 -217 394 -6 -332 -234 372 285 -149
7653 -149 -773 -254 -384 -126 -139 -197 245 386 -833 -69 137 251 42 233 73 103 432 98 -94 -495 -386
7674 -386 -488 -211 156 -592 -423 560 -103 177 522 131 7 398 -74 -638 318 -55 -765 134 98 -168
7694 -168 10 237 -813 -199 411 -16 225 273 155 -359 261 -255 -521 366 45 -20 154 480 -204 389
7714 389 -64 -636 90 -308 -299 462 -337 -271 470 767 -167 -379 -235 155 413 26 201 -334 383 213 58
7735 58 32 -127 -195 -138 28 413 476 108 -285 -7 129 63 -547 665 -124 -247 141 115 -13 -102 163 -675
7757 -675 517 309 -140 133 -484 -629 116 573 -334 294 -23 -451 498 106 90 238 639 42 514 918
7777 918 176 -332 -167 -345 -185 392 -193 -283 -113 604 -444 -52 449 -7 -6 155 -786 -169 77 -486 -910
7798 -910 -249 -21 102 -701 -762 -492 22 113 -57 -124 -422 217 213 -77 -782 1095 -206 276 427 420 172 748
7820 748 414 -154 245 347 -232 199 725 -465 -206 -416 -65 -464 274 -114 -343 407 666 -269 17 52
7840 52 -399 -170 -198 -278 190 -321 135 133 -294 151 -53 381 388 -57 158 103 -642 56 188 -218 437 592 -271
7863 -271 400 337 -79 697 975 -259 111 -421 10 -296 -16 -389 135 27 188 -172 157 -231 334 -98
7883 -98 396 -307 -533 -18 -371 159 173 -87 194 411 -379 44 478 -112 -425 149 55 -414 71 446 -1050
7904 -1050 -67 78 -124 316 208 -637 372 -183 13 37 588 -270 571 66 -57 412 10 284 -106 397
7924 397 644 460 533 37 -436 647 -149 -720 -322 -202 -286 -311 446 -80 -125 274 -731 -176 285 -384 405
7945 405 367 84 377 160 -151 114 518 285 -459 260 4 506 -127 266 -220 150 51 -523 174 221 35
7966 35 34 401 -176 568 223 136 146 -51 -435 -461 237 -201 -229 -124 412 -181 403 195 -631 392 94 -344
7988 -344 -73 455 -218 -209 472 -244 -529 404 -82 -32 326 -46 -194 -208 4 65 -107 221 -134 320 390 -149
8010 -149 -27 175 -152 -60 335 -360 257 -303 -8 -49 342 262 -41 -245 -460 -162 -74 150 470 22 640
8031 640 -301 42 291 -25 -42 477 506 169 -117 -677 28 147 37 45 171 -476 -64 -274 -353 167 -185 245
8053 245 63 -567 -221 -117 -81 128 -462 -538 238 220 58 518 300 -630 263 307 419 270 262 104 -556 254
8075 254 -59 591 37 -312 -106 63 -216 3 -299 510 -282 245 -237 -454 87 2 -167 309 257 -923
8095 -923 361 926 76 -369 491 192 374 425 -571 185 -53 -730 30 291 -163 -477 115 169 -223 -48
8115 -48 -455 149 167 -197 -326 541 -216 -141 -529 43 -205 -757 -151 -44 -38 167 383 387 44 -190 -471 309
8137 309 -222 29 428 629 -771 -59 26 -91 242 210 -328 405 401 -199 -1049 -34 518 -347 340 272 -299
8158 -299 28 -134 -331 39 343 607 108 -51 -325 -171 320 -285 514 -378 -208 963 130 207 -481 -82
8178 -82 -126 -494 393 -64 -350 815 -529 -75 256 273 -384 61 -14
8191a4
##END NTUPLES=NMR FID
##END=
