##TITLE=1H_CA-8570-45
 CDCl3, 8 sc, 
 17.9.2019
##JCAMPDX= 6.0         $$ Bruker NMR JCAMP-DX V2.0
##DATA TYPE= NMR FID
##DATA CLASS= NTUPLES
##ORIGIN= UXNMR, Bruker Analytische Messtechnik GmbH
##OWNER= root
$$ XWIN-NMR		Version 3.5
$$ Tue Sep 17 14:32:46 2019 Russian Standard Time (UT+4h)  she@DPX200
##.OBSERVE FREQUENCY= 200.1315
##.OBSERVE NUCLEUS= ^1H
##.DELAY= (6, 6)
##.ACQUISITION MODE= SIMULTANEOUS
##.ACQUISITION SCHEME= undefined
##.AVERAGES= 8
##.DIGITISER RES= 18
##SPECTROMETER/DATA SYSTEM= spect
##.PULSE SEQUENCE= zg30
##.SOLVENT NAME= CDCl3
##.SHIFT REFERENCE= (INTERNAL, CDCl3, 0, 15.7039)
##AUDIT TRAIL= $$ (NUMBER, WHEN, WHO, WHERE, WHAT)
$$ ##TITLE= Audit trail, XWIN-NMR		Version 3.5
$$ ##JCAMPDX= 5.01
$$ ##ORIGIN= Bruker BioSpin GmbH
$$ ##OWNER= she
$$ F:/spectra/data/she/nmr/H-F/1/audita.txt
$$ ##AUDIT TRAIL=  $$ (NUMBER, WHEN, WHO, WHERE, WHAT)
(   1,<2019-09-17 14:31:46.06 +0400>,<she>,<DPX200>,
      <created by zg, POWCHK disabled, PULCHK disabled
       configuration hash MD5:
       00 E9 B6 7A A2 85 ED C7 34 08 36 98 17 FE 4E 26
       data hash MD5: 16K
       75 C6 F5 4E 4E 26 6A F5 3B C8 53 67 76 CF 30 B6>)
$$ ##END=
$$ 
$$ hash MD5
$$ 1E 8D 97 21 FB 98 95 54 F4 EE 90 99 AB 90 20 19
##$RELAX= 
##$RELAX= 
##$RELAX= 
##$RELAX= 
##$RELAX= 
##$RELAX= 
$$ Bruker specific parameters
$$ --------------------------
##$DU= <F:/spectra>
##$EXPNO= 1
##$NAME= <H-F>
##$PROCNO= 1
##$TYPE= <nmr>
##$USER= <she>
##$AMP= (0..31)
100 100 100 100 100 100 100 100 100 100 100 100 100 100 100 100 100 100 
100 100 100 100 100 100 100 100 100 100 100 100 100 100 
##$AQSEQ= 0
##$AQ_mod= 1
##$AUNM= <au_zg>
##$AUTOPOS= <>
##$BF1= 200.13
##$BF2= 200.13
##$BF3= 200.13
##$BF4= 200.13
##$BF5= 200.13
##$BF6= 200.13
##$BF7= 200.13
##$BF8= 200.13
##$BYTORDA= 1
##$CFDGTYP= 0
##$CFRGTYP= 5
##$CHEMSTR= <none>
##$CNST= (0..31)
1 1 145 1 1 1 1 1 1 1 1 1 1 1 1 1 1 1 1 1 1 1 1 1 1 1 1 1 1 1 1 1 
##$CPDPRG= <>
##$CPDPRG1= <>
##$CPDPRG2= <>
##$CPDPRG3= <>
##$CPDPRG4= <mlev>
##$CPDPRG5= <mlev>
##$CPDPRG6= <mlev>
##$CPDPRG7= <mlev>
##$CPDPRG8= <mlev>
##$CPDPRGB= <>
##$CPDPRGT= <>
##$D= (0..31)
0 1.2 0 0 0 0 0 0 0 0 0 0.03 0 0 0 0 0 0 0 0 0 0 0 0 0 0 0 0 0 0 0 0 
##$DATE= 1568716305
##$DBL= (0..7)
120 120 120 120 120 120 120 120 
##$DBP= (0..7)
150 150 150 150 150 150 150 150 
##$DBP07= 0
##$DBPNAM0= <>
##$DBPNAM1= <>
##$DBPNAM2= <>
##$DBPNAM3= <>
##$DBPNAM4= <>
##$DBPNAM5= <>
##$DBPNAM6= <>
##$DBPNAM7= <>
##$DBPOAL= (0..7)
0.5 0.5 0.5 0.5 0.5 0.5 0.5 0.5 
##$DBPOFFS= (0..7)
0 0 0 0 0 0 0 0 
##$DE= 6
##$DECBNUC= <off>
##$DECIM= 24
##$DECNUC= <off>
##$DECSTAT= 4
##$DIGMOD= 1
##$DIGTYP= 9
##$DL= (0..7)
0 120 120 120 120 120 120 120 
##$DP= (0..7)
150 150 150 150 150 150 150 150 
##$DP07= 0
##$DPNAME0= <>
##$DPNAME1= <>
##$DPNAME2= <>
##$DPNAME3= <>
##$DPNAME4= <>
##$DPNAME5= <>
##$DPNAME6= <>
##$DPNAME7= <>
##$DPOAL= (0..7)
0.5 0.5 0.5 0.5 0.5 0.5 0.5 0.5 
##$DPOFFS= (0..7)
0 0 0 0 0 0 0 0 
##$DQDMODE= 0
##$DR= 18
##$DS= 0
##$DSLIST= <SSSSSSSSSSSSSSS>
##$DSPFIRM= 0
$$ [...]
##$SUBNAM2= <"">
##$SUBNAM3= <"">
##$SUBNAM4= <"">
##$SUBNAM5= <"">
##$SUBNAM6= <"">
##$SUBNAM7= <"">
##$SUBNAM8= <"">
##$SUBNAM9= <"">
##$SW= 24.0689530833862
##$SWIBOX= (0..15)
0 0 2 0 0 0 0 0 0 0 0 0 0 0 0 0 
##$SW_h= 4816.95568400771
##$TD= 16384
##$TD0= 1
##$TE= 0
##$TE2= 300
##$TE3= 300
##$TEG= 300
##$TL= (0..7)
0 120 120 120 120 120 120 120 
##$TP= (0..7)
150 150 150 150 150 150 150 150 
##$TP07= 0
##$TPNAME0= <>
##$TPNAME1= <>
##$TPNAME2= <>
##$TPNAME3= <>
##$TPNAME4= <>
##$TPNAME5= <>
##$TPNAME6= <>
##$TPNAME7= <>
##$TPOAL= (0..7)
0.5 0.5 0.5 0.5 0.5 0.5 0.5 0.5 
##$TPOFFS= (0..7)
0 0 0 0 0 0 0 0 
##$TUNHIN= 0
##$TUNHOUT= 0
##$TUNXOUT= 0
##$USERA1= <user>
##$USERA2= <user>
##$USERA3= <user>
##$USERA4= <user>
##$USERA5= <user>
##$V9= 5
##$VALIST= <valist>
##$VCLIST= <CCCCCCCCCCCCCCC>
##$VD= 0
##$VDLIST= <DDDDDDDDDDDDDDD>
##$VPLIST= <PPPPPPPPPPPPPPP>
##$VTLIST= <TTTTTTTTTTTTTTT>
##$WBST= 1024
##$WBSW= 4
##$XGAIN= (0..3)
0 0 0 0 
##$XL= 0
##$YL= 0
##$YMAX_a= 112656
##$YMIN_a= -187641
##$ZGOPTNS= <>
##$ZL1= 120
##$ZL2= 120
##$ZL3= 120
##$ZL4= 120
##$ABSF1= 10
##$ABSF2= 0
##$ABSG= 5
##$ABSL= 3
##$ALPHA= 0
##$AQORDER= 0
##$ASSFAC= 0
##$ASSFACI= 0
##$ASSFACX= 0
##$ASSWID= 0
##$AUNMP= <proc_1d>
##$AZFE= 0.1
##$AZFW= 0.1
##$BCFW= 1
##$BC_mod= 2
##$BYTORDP= 1
##$COROFFS= 0
##$CY= 11.3945322036743
##$DATMOD= 1
##$DC= 2
##$DFILT= <>
##$DTYPP= 0
##$F1P= 20.1720416913024
##$F2P= 0.152960286110954
##$FCOR= 0.5
##$FTSIZE= 0
##$FT_mod= 4
##$GAMMA= 1
##$GB= 0.15
##$INTBC= 1
##$INTSCL= 1
##$ISEN= 128
##$LB= 0.24
##$LEV0= 0
##$LPBIN= 0
##$MAXI= 10000
##$MC2= 0
##$MEAN= 0
##$ME_mod= 0
##$MI= 1.114404
##$NCOEF= 0
##$NC_proc= 0
##$NLEV= 6
##$NOISF1= 3.799351
##$NOISF2= 2.8
##$NSP= 1
##$NTH_PI= 0
##$NZP= 0
##$OFFSET= 15.70392
##$PC= 1
##$PHC0= -9575.699
##$PHC1= 18.00096
##$PH_mod= 1
##$PKNL= yes
##$PPARMOD= 0
##$PSCAL= 0
##$PSIGN= 0
##$REVERSE= no
##$SF= 200.130013532006
##$SI= 16384
##$SIGF1= 3
##$SIGF2= 2
##$SINO= 400
##$SIOLD= 16384
##$SREGLST= <1H.CDCl3>
##$SSB= 0
##$STSI= 0
##$STSR= 0
##$SW_p= 3612.71676300578
##$SYMM= 0
##$S_DEV= 0
##$TDeff= 0
##$TDoff= 0
##$TI= <>
##$TILT= no
##$TM1= 0
##$TM2= 0
##$TOPLEV= 0
##$USERP1= <user>
##$USERP2= <user>
##$USERP3= <user>
##$USERP4= <user>
##$USERP5= <user>
##$WDW= 1
##$XDIM= 8192
##$YMAX_p= 0
##$YMIN_p= 0
$$ End of Bruker specific parameters
$$ ---------------------------------
##NTUPLES= NMR FID
##VAR_NAME=  TIME,          FID/REAL,        FID/IMAG
##SYMBOL=    X,             R,               I
##VAR_TYPE=  INDEPENDENT,   DEPENDENT,       DEPENDENT
##VAR_FORM=  AFFN,          ASDF,            ASDF
##VAR_DIM=   8192,          8192,            8192
##UNITS=     SECONDS,       ARBITRARY UNITS, ARBITRARY UNITS
##FACTOR=    0.0002076,     1,               1
##FIRST=     0,             0,               0
##LAST=      1.7004516,     0,               0
##MIN=       0,             -187641,         0
##MAX=       1.7004516,     112656,          0
$$ Real data points
##PAGE= N=1
##DATA TABLE= (X++(R..R)), XYDATA
0 0 0 0 0 0 0 0 0 -8 8 -8 8 -16 16 -24 24 -32 33 -40 48 -57 71 -80 96 -107 123 -144 163 -185 209 -235 267
31 267 -300 337 -376 420 -468 522 -578 642 -712 788 -873 966 -1070 1185 -1314 1460 -1627
48 -1627 1816 -2036 2294 -2605 2985 -3461 4079 -4917 6126 -8028 11474 -19703 79673 -326
62 -326 -173115 3747 65659 -24022 -20871 85162 21103 -71802 -18273 51876 -24815 -52436
74 -52436 56258 92464 -43226 -90578 18248 48301 -33269 406 72247 -11074 -88469 12122
86 12122 66114 -26633 -37155 48173 13528 -60206 899 59047 -13993 -50752 20794 33292
98 33292 -38537 -22308 58500 21837 -75862 -30798 67226 10036 -66366 24574 80901 -48067
110 -48067 -98830 31495 63576 -32470 -7571 64218 -22275 -101144 183 77630 2554 -31924
122 -31924 33009 15477 -78904 -48838 69426 57223 -41732 -19893 44569 -25745 -83203 23210
134 23210 86086 -11026 -42560 31579 -2500 -77387 4585 88651 3894 -60310 12319 31772
146 31772 -46181 -32781 60469 42580 -50237 -32754 44310 11927 -50053 7897 60609 -21020
158 -21020 -60324 35877 54480 -42482 -31808 51371 5254 -59429 17069 66757 -17845 -46456
170 -46456 27283 21246 -49106 -11918 73770 34856 -57973 -36817 29857 4075 -24404 41001
182 41001 56997 -41635 -62030 29020 27089 -39970 15996 81564 -10940 -84718 -3463 44573
194 44573 -13790 -4960 61505 16056 -74680 -38638 47124 27956 -23029 12258 39389 -29882
206 -29882 -59575 21914 47881 -23061 -14772 51008 -2893 -76503 1077 70733 -6584 -47279
218 -47279 25061 26928 -45525 -19756 50641 11539 -50952 -6882 44638 -2676 -40450 13953
230 13953 36323 -32717 -43243 36316 35768 -38436 -13144 46287 -16808 -69954 17452 67181
242 67181 -11118 -35552 21102 -1541 -57405 -3315 65332 18874 -41047 -11005 14241 -28803
254 -28803 -30681 42946 52753 -26836 -41206 15851 -1643 -45233 18804 72967 -7120 -60938
266 -60938 3976 19849 -36743 -3374 66472 14567 -60114 -18144 33297 -4668 -24460 28695
278 28695 35920 -30447 -38421 26489 25483 -32821 -8094 49856 1030 -55373 8576 51546 -19331
291 -19331 -36666 34853 22466 -44636 -4542 56665 2106 -51621 -1074 35819 -6309 -15765
303 -15765 31818 22848 -40907 -33054 32443 25072 -21072 10169 42380 -26257 -62655 18721 53349
316 53349 -11111 -12326 39092 -5004 -64282 -5374 54816 10435 -19126 20322 12850 -48206
328 -48206 -34741 41029 45036 -13710 -16560 14894 -16013 -42270 21725 57150 -14018 -41739
340 -41739 24055 21125 -47858 -18703 52370 17043 -36051 -1261 18058 -25608 -17925 38461
352 38461 20818 -40377 -23430 33600 16085 -31742 -7320 28007 -11746 -35661 23349 38689
364 38689 -30047 -32425 30781 7857 -47204 4871 56279 -4970 -46799 4200 15840 -29387
376 -29387 -8417 49908 21513 -44918 -30385 18030 2965 -19048 24798 43573 -25518 -56491
388 -56491 8190 29603 -18944 -1083 49164 145 -59959 -11834 33609 -2993 -8375 35076
400 35076 11193 -47145 -23263 31606 14936 -18486 8727 29241 -16880 -42111 11119 38289
412 38289 -8937 -19623 25158 8836 -39120 -594 45848 -6050 -39816 18466 33633 -24367
424 -24367 -19285 33702 11779 -36119 -6791 34410 5889 -21050 10608 22143 -25221 -32693
436 -32693 27743 39712 -15170 -16603 23132 -7702 -44840 13144 55840 -1524 -30530 13217
448 13217 4551 -41657 -4161 54279 19902 -31877 -9995 12480 -18846 -22216 31729 42671
460 42671 -15365 -34938 5939 5948 -25656 8613 50343 -1281 -48695 -808 25974 -19857 -14831
473 -14831 39011 16392 -38949 -15423 24250 -2104 -19832 15697 22417 -21096 -26647 17522
485 17522 20539 -20532 -14960 23169 3034 -32127 5559 36891 -13919 -37877 14311 21260 -24938
498 -24938 -5902 38183 -193 -44074 -5794 26317 -5116 -12544 24751 16276 -35446 -32243 19381
511 19381 23162 -10347 2070 25061 -17070 -48524 5841 41954 -2372 -15118 23593 1162
523 1162 -47936 -10738 41866 12111 -18292 10512 11123 -32326 -24174 29852 29948 -13283 -13255 14105
537 14105 -3630 -28838 6693 38551 -1844 -29031 11949 18688 -27171 -12509 38106 10737
549 10737 -34518 -396 30027 -7959 -20618 18498 16308 -23358 -12373 27729 15436 -20631
561 -20631 -7957 17947 -4612 -23075 16044 36209 -10779 -29036 10817 9243 -24961 5702
573 5702 44736 1710 -38322 -2677 15700 -15029 -4289 37878 17327 -33011 -23735 12370
585 12370 5819 -8595 17366 28192 -16648 -39109 3459 22570 -9498 -2565 33592 1645
597 1645 -46543 -10597 31576 1001 -15069 20881 12784 -33692 -19738 24780 12418 -17695
609 -17695 552 18964 -9866 -27607 7302 25278 -9599 -21466 14079 12692 -24012 -6809
621 -6809 29357 -2718 -35180 5456 28445 -11693 -17089 20327 6079 -32111 -9591 26912
633 26912 8493 -14598 3530 9761 -21503 -24249 19386 31079 -7783 -16968 9725 -4239 -31559
646 -31559 5407 42690 3434 -27619 3352 7077 -27717 -7635 39111 18239 -23935 -10490
658 -10490 8397 -12043 -13882 23404 29446 -12022 -25937 5053 9691 -14711 1164 32348 3711
671 3711 -32468 -1942 22886 -9627 -14633 25899 15797 -27311 -10182 24980 2797 -19126
683 -19126 8136 18677 -11876 -15418 17376 17747 -15580 -14895 14619 7887 -16085 5386 28840
696 28840 -7263 -32781 5590 22657 -10079 -4784 28881 2955 -36237 -8537 24133 3364
708 3364 -7241 17589 11585 -26730 -24174 14751 20576 -3349 423 14831 -11411 -34565 1935
721 1935 33836 3452 -15607 11335 4363 -32456 -11234 31489 11755 -17532 3210 10107 -21604
734 -21604 -18444 20762 20171 -13165 -12468 9819 -421 -19467 850 23990 -2295 -24170 4585
747 4585 17989 -14852 -15062 20652 7304 -27449 -3243 26397 -2363 -20745 7659 9801 -20412
760 -20412 -10301 23971 13975 -17719 -11506 8465 -3805 -15653 11554 27866 -5687 -26153
772 -26153 447 7814 -14743 2532 34035 4385 -32842 -8171 13700 -8053 -4553 28251
784 28251 14046 -26622 -18961 10961 5560 -6594 12278 21397 -10401 -28952 781 20089 -2319
797 -2319 -5154 20881 5784 -30368 -9012 26775 4162 -16751 12283 17107 -19356 -16298 19441
810 19441 13140 -14320 -3274 15341 -1225 -15008 5849 18279 -6053 -17877 7844 16127
822 16127 -8176 -5947 17154 -197 -25481 1423 25427 -1178 -11890 13020 4427 -25982
834 -25982 -7856 24870 10689 -10288 1581 5405 -17072 -16299 16585 24410 -4285 -13291 4059
847 4059 -3545 -22269 3486 33546 5417 -24741 -1859 8808 -18382 -9317 28808 15085 -21993
860 -21993 -11065 9615 -6625 -13106 14187 20569 -9863 -20515 2389 8175 -9554 -3134 18538
873 18538 2405 -24497 -3638 20650 -3916 -18653 10538 13210 -18397 -9649 20155 4336
885 4336 -19611 -1203 12490 -7728 -10868 13694 13302 -13792 -16693 6166 7733 -7190 3127
898 3127 19115 -4379 -27511 -2782 18057 -1712 -4331 19138 3627 -29133 -10849 19217
910 19217 6491 -4929 12303 7145 -21905 -17324 13480 15989 -2361 767 10552 -7412 -24113
923 -24113 677 25310 5447 -11575 7052 5935 -21883 -8806 26728 11716 -17307 -169
935 -169 14205 -10534 -14542 14868 16187 -10476 -8958 11024 4532 -12069 -1005 15942 653
948 653 -16336 2570 17896 -3582 -12246 9923 6491 -18389 -2845 24203 4300 -17331 800
961 800 7309 -12912 -5694 20936 11946 -13905 -10113 4678 -3206 -8987 11005 21477 -4254 -22141
975 -22141 -3235 7483 -7401 613 24379 4571 -27604 -10551 13549 -2641 -6968 18430
987 18430 12078 -21441 -17599 8800 6147 -5629 6146 12695 -8636 -20612 90 14338 -1602
1000 -1602 -7895 9907 5348 -19223 -9127 17478 3914 -15092 3769 12066 -12855 -11607 15589
1013 15589 7929 -17017 -5988 12605 1015 -9510 4522 9577 -9185 -14825 5786 13496 -4022
1026 -4022 -5032 10828 -1034 -22405 -2428 23359 4895 -11732 5605 4394 -20663 -9081
1038 -9081 22090 13183 -9192 -2115 4235 -11536 -12287 12702 20381 -835 -11401 334 20 -12589
1052 -12589 961 23858 8006 -17212 -4493 8510 -8820 -7095 20434 13702 -16078 -8523
1064 -8523 10708 -1471 -9794 10292 14894 -7353 -12266 5615 8210 -6323 -3873 11711 3317
1077 3317 -13917 -891 17043 -466 -15346 4855 11290 -10889 -6064 18746 5787 -18473
1089 -18473 -4693 10990 -2877 -5937 13217 10460 -13509 -15014 4686 8149 -2580 2835 12668
1102 12668 -3750 -21819 -4753 15205 2434 -4629 12084 3402 -24025 -11943 17019 8401
1114 8401 -6690 5877 5881 -16905 -15142 10103 12629 -3086 -2250 5226 -5265 -16515 -805 17050
1128 17050 3679 -11755 1175 6408 -12939 -9714 16104 8870 -15234 -3756 11960 -5169
1140 -5169 -12239 9220 9938 -11468 -8458 10208 5337 -8634 -1989 7562 -3063 -12003 3568 15239
1154 15239 -1257 -11819 3223 4314 -13241 -2611 20832 6358 -15616 -3043 6096 -9716
1166 -9716 -5228 18927 12334 -12437 -10078 3494 -1560 -5090 10404 16886 -3185 -17149 -3288
1179 -3288 7746 -2554 175 17289 6239 -19846 -9515 12719 1851 -6246 12976 11774 -15286
1192 -15286 -13480 10173 7579 -5345 3365 10320 -4657 -13100 2183 11816 -486 -6998 5826
1205 5826 6680 -9894 -5748 13644 4715 -13667 -815 12163 -4335 -8094 11236 6261 -14655
1218 -14655 -6412 11430 3229 -5644 4669 6157 -10024 -12274 5743 12242 -377 -3908 4770
1231 4770 -2854 -16719 -2364 18853 5936 -10462 1324 3217 -16556 -8629 18293 11848 -10211
1244 -10211 -4270 3943 -10041 -11351 10529 15961 -3082 -11543 -1057 757 -8437 -1261 15249
1257 15249 5838 -14324 -6084 7870 -4287 -8799 11860 10989 -13135 -9842 9610 1748 -9604
1270 -9604 3810 9180 -6559 -8908 6281 7065 -5681 -5516 5047 1709 -8167 225 13026 743
1284 743 -13826 -1039 8446 -4888 -3486 15136 5668 -17092 -7207 9973 358 -3998 11748
1297 11748 8851 -12579 -12836 4627 7742 369 4191 9267 -3940 -16830 -3130 13849 5244
1310 5244 -3401 7691 4280 -17113 -9899 15174 9701 -5807 3624 7082 -11637 -11866 10368 12034
1324 12034 -3227 -2769 5304 -2088 -10281 803 12895 3221 -9108 116 7326 -5610 -7253 10491
1338 10491 7422 -12031 -4360 12394 149 -10199 5234 7991 -9979 -7658 9985 7234 -5973
1351 -5973 -2867 3341 -3818 -8206 4475 12744 105 -10427 -1232 2531 -8543 -2113 16373 6670
1365 6670 -14241 -6326 4819 -6081 -4885 14834 10067 -12520 -10914 2783 -983 -4484 7807
1378 7807 11548 -4632 -14382 -3501 5695 -923 -1205 10298 4209 -15389 -9017 10287 2906 -7580
1392 -7580 6112 8922 -11339 -11347 8564 6399 -7290 -272 7719 -3313 -9162 3166 8515 -2753
1406 -2753 -7611 2429 5529 -4304 -3306 8971 2712 -12755 -2965 11447 576 -6112 8035 5132
1420 5132 -13746 -7329 11701 6466 -4157 3381 4845 -9515 -10310 6198 12397 1614 -3127 2070
1434 2070 -2039 -11607 -1205 16302 7927 -8298 -1362 3967 -10220 -7097 15694 12422 -8018
1447 -8018 -5232 4401 -5308 -7749 9312 12693 -2745 -8041 841 1593 -5051 -19 10927 4411
1461 4411 -10107 -4382 7719 -337 -6915 6603 7935 -9494 -6845 10221 3363 -9302 876
1474 876 7262 -5487 -6703 7946 7081 -6444 -6331 2858 1233 -4826 2004 10119 -315 -12873
1488 -12873 -3689 6807 -1262 -3054 10760 4616 -15467 -9016 8444 2216 -4029 8275 7010
1501 7010 -12214 -12942 4150 7043 -350 1926 5305 -4531 -13397 -3023 10269 4597 -3966 2572
1515 2572 2823 -12022 -8831 11007 8287 -6957 -586 5948 -7520 -9792 7703 9153 -5209 -4166
1529 -4166 4508 -727 -6804 1380 8032 -334 -7479 176 6806 -2012 -5489 5920 4421 -9912
1543 -9912 -4090 11985 3549 -8584 2154 5645 -8826 -6311 11512 8508 -5614 -3615 2717
1556 2717 -3616 -5778 6115 12225 765 -9044 -2681 2321 -3988 -269 13592 7360 -11274 -7426
1570 -7426 5076 -1379 -3447 11665 10330 -9483 -9841 3703 1726 -2674 6430 9320 -3706 -10469
1584 -10469 -1243 5509 775 -598 6452 3292 -9579 -5838 8336 3741 -6718 2571 7838 -7360
1598 -7360 -8458 8442 6505 -8103 -2864 6655 -1568 -6646 4222 6941 -5076 -7847 2030 5383
1612 5383 -1872 -2098 6163 958 -11932 -4853 9932 3587 -5721 3364 3857 -11861 -8749 9759
1626 9759 7686 -4044 82 2715 -8599 -9555 5174 10164 963 -3550 -890 -3364 -8292 -1036
1640 -1036 11149 6270 -6634 -3805 2055 -6608 -6014 10426 9395 -7592 -5751 4191 -3449 -7231
1654 -7231 6769 9992 -4445 -7476 2299 2525 -4224 -389 6977 1687 -7556 -2187 7769 729 -6947
1669 -6947 2561 6675 -5978 -5663 9853 5933 -9141 -2764 6740 -2230 -4825 7956 8073 -5785
1683 -5785 -7207 1690 2194 -1303 3785 8392 -292 -10440 -4325 6160 2671 -687 7887 4455 -11657
1698 -11657 -8596 7386 5175 -2004 6192 6103 -9717 -10348 5052 7365 151 2137 4460 -4300 -9795
1713 -9795 -655 8871 3707 -3315 1250 2725 -7445 -6312 8454 7467 -6355 -2545 5962 -3601
1727 -3601 -8179 5918 8080 -5851 -5275 5058 1564 -5563 556 5655 -1846 -7404 165 6490
1741 6490 195 -4721 1557 1701 -7854 -4033 9697 4838 -7630 -2062 3417 -6948 -6037 9617
1755 9617 8229 -5868 -5187 1018 -3933 -5448 5734 9936 -878 -8345 -3666 438 -2612 313
1769 313 9649 4786 -9856 -7583 4044 -184 -4214 7575 8455 -8151 -9619 3746 2738 -3804
1783 -3804 3746 7503 -3602 -8617 635 5366 -376 -1942 3746 2631 -6087 -4066 6814 4051
1797 4051 -6252 -1002 6476 -2492 -5910 6667 6066 -7684 -4532 6437 1716 -3890 4277 5786
1811 5786 -4875 -6993 2352 5586 864 511 3990 -749 -9333 -2844 9292 5645 -2855 1847 2959
1826 2959 -9083 -6828 9931 8995 -3453 -623 3219 -6820 -8181 6328 10267 431 -3704 83
1840 83 -1985 -6278 279 9572 5036 -6037 -3936 2671 -3014 -5115 7162 8353 -6175 -6603 4304
1855 4304 340 -5988 3246 7453 -3893 -6777 2570 3076 -3225 -1418 3725 -182 -5584 -857 6128
1870 6128 1221 -6285 -1038 3570 -3889 -3696 7722 5051 -8595 -5135 4256 -1614 -4232 7160
1884 7160 6745 -7154 -8153 1337 1690 -1969 3414 6824 -2014 -10095 -4374 4810 2619 -616 4803
1899 4803 2916 -9849 -8511 6131 5729 -2828 2388 5296 -7257 -9443 4377 7156 -1472 -166
1913 -166 4014 -2822 -7505 -29 6995 2398 -3012 125 2281 -3628 -4035 6023 5528 -5412 -3329
1928 -3329 5773 313 -5691 3824 6489 -5669 -4950 5967 4177 -3716 279 4248 -2718 -5873 2142
1943 2142 7257 1487 -3120 200 658 -5306 -1942 9449 6468 -5413 -3321 2436 -3903 -4234 8807
1958 8807 8873 -5047 -5696 1350 -1903 -3878 5716 9064 -1093 -7170 -2367 813 -1222 1066 7486
1973 7486 3784 -7399 -6327 3453 1621 -3121 4677 6675 -6629 -8427 4223 3913 -4061 559
1987 559 5947 -2811 -7207 1426 4635 -1344 -3110 2004 1564 -4003 -2367 4994 2619 -6399 -2942
2002 -2942 4715 -256 -4245 4442 4465 -7842 -6710 5078 3274 -3226 2467 3825 -6005 -7700 1966
2017 1966 5365 620 144 2021 -2484 -7875 -2705 7084 5163 -2418 -334 977 -7156 -6454 7346
2032 7346 8453 -2704 -2367 2074 -5065 -6808 5327 8676 -1028 -3809 782 -1315 -4637 713 7282
2047 7282 3051 -4776 -2412 2661 -1049 -3562 4811 6403 -4731 -5529 4741 2820 -5053 1149 6381
2062 6381 -3024 -5504 4504 5157 -2906 -2491 2823 120 -3577 1626 6437 1459 -5145 -2220 2662
2077 2662 -643 -1430 6682 5202 -6568 -5701 3494 1102 -2137 6392 6503 -6032 -7455 1656 2609
2092 2609 -247 3812 5418 -2714 -8004 -2169 4501 2581 -176 3173 1797 -7329 -6440 5147 5663
2107 5663 -2450 479 4164 -5007 -7954 3990 6448 -2450 -1928 3332 -1874 -6153 701 5523 65
2122 65 -4140 -538 2174 -1887 -3032 3253 3122 -5287 -3887 4928 1670 -4441 1408 4146 -5716 -6006
2138 -6006 5270 4879 -3268 -1134 2283 -3915 -5798 2928 6861 576 -3754 -1410 -954 -4401 -1032
2153 -1032 7507 5529 -4991 -4623 1132 -2531 -3460 6933 8036 -4465 -6560 1291 -507 -3122 4545
2168 4545 7433 -1334 -6293 -1378 1295 -600 1222 5054 2386 -5432 -4529 3124 2625 -2163 2356
2183 2356 5163 -3583 -5957 4078 4404 -3624 -617 5012 -1244 -5054 3071 5232 -2201 -3409 2081
2198 2081 1851 -1891 263 4683 1181 -5701 -2719 4890 2365 -2098 3078 3510 -6380 -6122 5186
2213 5186 5013 -1888 1789 3542 -5501 -7396 2616 6442 1110 -218 1088 -2745 -6143 -1006 6376
2228 6376 4659 -1835 -1725 351 -4815 -4578 5787 7191 -2932 -3591 1579 -2996 -5798 4122 7323
2243 7323 -2093 -4604 837 -161 -3717 587 4865 681 -4809 -1896 2460 -241 -2883 2066 3426
2258 3426 -4196 -4676 4470 3130 -4702 -1290 3909 -2873 -5017 4176 5249 -3418 -3854 1192 -729
2273 -729 -2892 2268 5702 24 -5764 -3125 1508 203 -225 5234 3711 -6332 -6389 2646 2223 -1579
2289 -1579 4410 5528 -5385 -7427 1732 3353 -608 2792 4821 -2687 -7122 -991 4287 2416 121
2304 121 2029 1174 -4878 -4243 4305 5046 -2123 -753 3848 -2301 -6071 3361 6220 -2267 -2645 3528
2320 3528 482 -3802 1576 4733 -719 -3596 620 2969 -126 -1229 2119 1452 -4290 -2563 5356
2335 5356 3740 -2947 -97 2893 -4287 -4642 5646 6329 -2344 -1950 1564 -3195 -4546 3715 6780
2350 6780 489 -3332 -1518 -1355 -2959 472 6410 4439 -4320 -4839 576 -733 -2383 4970 6401
2365 6401 -4216 -6493 987 565 -2905 3049 5994 -2209 -6199 -512 1727 -1107 146 3441 657
2380 657 -4589 -3300 2828 1940 -2750 -245 3142 -2459 -4860 3126 4019 -3984 -3032 3337 -353 -3970
2396 -3970 2527 4389 -3503 -4591 1056 1859 -1034 849 3290 -683 -5422 -2981 3655 2659 -611
2411 -611 1823 1907 -5753 -5754 4337 5650 -1429 446 2783 -4725 -6390 2915 6413 708 -559 1218
2427 1218 -2275 -5240 301 5793 3830 -1736 -1602 466 -2780 -2976 4477 6196 -2097 -3617 1990
2442 1990 -195 -3962 2899 6381 -1688 -4129 2136 1755 -2505 639 4155 151 -3711 -84 3271
2457 3271 989 -1861 293 2062 -2203 -2448 4378 4066 -3474 -2464 2690 -1466 -3599 4583 5812
2472 5812 -3252 -4776 972 -86 -2114 2975 5260 -611 -5269 -2726 1170 623 480 3990 2411
2487 2411 -5326 -6002 1896 2822 -1057 2644 4219 -4619 -7475 1422 3948 -849 848 3421 -2759
2502 -2759 -6037 -554 3411 1037 -767 982 243 -3621 -3167 2882 3567 -2576 -2286 2470 -824 -4337
2518 -4337 2090 4605 -3251 -4253 2972 1553 -3151 848 3443 -2429 -4583 915 3189 101 -1054
2533 -1054 898 -518 -3904 -1794 4726 4072 -1941 -1612 1265 -3202 -4016 4687 6417 -1984 -2975 909
2549 909 -2374 -4132 3736 6831 192 -3542 -1324 -1001 -1642 1498 5465 2926 -3385 -3804 340 451
2565 451 -1243 3720 5495 -2647 -5618 1504 2365 -2090 1789 5453 -1583 -5027 937 3085 -795
2580 -795 -517 2541 397 -2788 -708 3015 1743 -2252 -932 2507 -567 -2512 2903 3847 -3436 -3823
2596 -3823 2976 1611 -2314 2476 4138 -3382 -4980 1360 2466 -57 1390 2648 -1746 -5281 -1965
2611 -1965 3256 3249 -201 364 572 -4584 -4836 3406 5170 -1226 -1119 1917 -3761 -5991 2416 5601 -339
2628 -339 -1816 620 -1982 -4486 414 4581 1773 -2295 -1678 -218 -1844 -2131 2440 4073 -2436 -3976
2644 -3976 1724 1067 -3443 519 4368 -1997 -4579 1645 2594 -2197 -777 2275 -1114 -3266 775
2659 775 3279 594 -2303 -986 311 -1535 -1017 4127 3935 -3148 -3716 1443 -84 -2085 3971 5156
2675 5156 -2989 -4860 764 582 -1484 3481 5258 -1370 -5047 -1546 1666 1182 1397 3420 1786 -3939
2691 -3939 -4659 1735 3879 -75 1229 3497 -2829 -5397 1832 4548 -759 56 3293 -1038 -4724
2706 -4724 642 3982 538 -1029 940 672 -1947 -1196 2284 2569 -1864 -2062 2178 1303 -2088 993
2722 993 3184 -2970 -3811 3194 3058 -2227 58 2868 -2743 -4433 1542 3968 504 -727 -141 -1512
2738 -1512 -3381 -843 3953 3465 -1853 -2625 40 -2142 -3223 3511 5560 -2032 -4034 174 -1348
2753 -1348 -3436 2742 5737 -763 -4144 -1029 -862 -1808 1388 3943 1182 -3243 -3212 91 558 -1043
2769 -1043 1584 3289 -2223 -4721 1168 2519 -2183 -106 3748 -1267 -4684 1079 3191 -1521 -1750
2784 -1750 1599 112 -2243 156 2639 520 -2737 -1552 1475 607 -1013 2218 2862 -3527 -4573
2799 -4573 2203 2751 -1229 1621 3598 -3058 -5319 1086 3345 361 1373 2472 -1848 -4617 -987
2814 -987 3237 3190 680 136 -49 -3098 -3395 3195 5221 -375 -1599 1583 -1691 -4179 2184 5533
2830 5533 -93 -1763 999 -848 -3184 983 4233 983 -1849 -705 423 -267 -796 1723 2470 -1758
2846 -1758 -2748 1983 2223 -2145 -489 2925 -1613 -3567 2542 3585 -2147 -1850 1518 -1123 -3049 1649
2862 1649 3929 213 -2495 -1606 -397 -933 -228 3178 3001 -2971 -4394 96 810 -1502 2681 4370
2878 4370 -2901 -5700 79 1516 -1271 1988 3808 -1843 -4996 -1431 1185 687 770 2263 491 -3549
2894 -3549 -3737 1088 2827 -141 -105 1836 -1994 -4659 1150 3977 -1307 -1964 2181 -402 -3545 502
2910 502 3374 -616 -2100 575 626 -974 -198 1985 803 -2290 -1960 2112 1978 -1187 281 2002
2926 2002 -2153 -3649 2568 4072 -1066 -704 1886 -2442 -4058 2285 4762 783 -916 -13 -1356
2941 -1356 -2612 645 4038 3462 -999 -2507 -427 -931 -1639 3243 5477 -770 -3899 -24 333 -2050
2957 -2050 2446 5341 -339 -3941 -295 610 -1208 1159 3323 759 -2513 -1727 621 1014 -288 775
2973 775 2011 -1241 -3308 1121 3010 -1562 -1521 2464 -143 -3378 1425 3491 -1520 -2866 894 575
2989 575 -1745 1064 2892 -404 -3225 -2077 854 1005 -66 1393 1662 -3018 -4343 1088 2952 -666
3005 -666 592 2596 -2774 -5633 636 3481 274 160 1405 -2085 -4317 -773 2768 1875 88 -285
3021 -285 -743 -2686 -2714 1831 3822 -320 -2190 336 -607 -3448 1017 4523 -778 -3003 1115 463
3037 463 -2740 255 3369 -12 -2377 -224 1271 -156 -495 927 988 -1422 -1733 1827 2880 -1238
3053 -1238 -1561 1728 -801 -2864 2275 4404 -1397 -2613 736 -439 -1896 2319 4252 96 -2397
3068 -2397 -1127 -667 -417 1285 3451 2247 -2268 -3728 104 1698 7 2131 3851 -1573 -4970
3083 -4970 26 2436 -401 1612 3880 -1225 -4604 -501 2230 767 782 1775 -22 -2312 -1975 1102
3099 1102 2435 19 -641 1072 -486 -3006 794 3518 -794 -2557 1416 707 -2594 457 3057
3114 3057 -1221 -2969 657 1624 -719 65 1234 -230 -2437 -1667 1723 2040 -346 -682 524 -2272
3130 -2272 -3535 2009 4206 -776 -1794 819 -2014 -4015 1581 4695 217 -1893 -669 -1694 -2584
3145 -2584 276 3569 1812 -1289 -2416 -1279 -901 -877 2199 3778 -805 -3964 -349 857 -1709 861
3161 861 3996 -672 -3944 -124 1301 -1255 85 2561 -44 -2509 -576 1411 666 -709 -102 924
3177 924 -498 -1787 1182 2963 -1103 -2148 1541 733 -1854 1558 3864 -1124 -3447 516 1215 -451
3193 -451 1780 2812 -543 -3077 -1342 1132 1722 1207 1521 846 -2251 -3364 1221 3508 635 358
3209 358 1717 -1926 -4584 753 4204 636 -347 1625 -1300 -3810 104 3205 1706 -369 -196 -578
3225 -578 -1738 -1305 1592 2895 -341 -2087 524 138 -2322 241 3537 -441 -3379 773 1485 -1841
3241 -1841 -475 2383 -568 -2607 148 1692 -72 -581 -137 -297 -1546 -863 1788 2398 -834 -2338
3257 -2338 117 -682 -1985 1628 3840 -1095 -3381 -131 -311 -1993 1859 3970 -418 -3480 -1698
3272 -1698 -331 -389 1337 2661 1188 -2487 -3309 -384 1502 325 1247 2548 -1394 -4549 -232 2702
3288 2702 -435 172 2697 -603 -4251 -472 2274 201 -393 1212 -125 -2109 -922 1335 1462 -470
3304 -470 -895 753 402 -1527 689 2568 -725 -2792 1201 2103 -1191 153 2652 -940 -3101 970
3320 970 2461 53 488 1285 -933 -2485 -503 2246 2432 345 -602 -79 -1581 -2311 1707 4346 247
3337 247 -1897 278 -806 -2932 1520 4522 684 -2137 -384 -837 -1992 893 3518 1495 -1462
3352 -1462 -2008 -808 -314 -23 1599 2331 -363 -3190 -456 1311 -893 96 2851 -186 -3502 -36
3368 -36 2129 -987 -920 1524 -113 -2222 -23 1685 -47 -1089 -664 -70 -358 -835 1193 1853 -1551
3385 -1551 -3143 231 1096 -1058 790 2769 -1553 -4088 -128 1607 -369 1026 2446 -1279 -3658
3400 -3658 -1436 1106 1408 1023 999 -166 -2716 -3086 682 3170 946 -657 558 -1499 -3774 185
3416 185 3667 651 -1030 948 -952 -3250 -100 3186 1121 -876 -9 -359 -1220 -503 1545 1882
3432 1882 -429 -1633 323 999 -1192 -36 2504 -180 -2649 757 2561 -885 -602 1640 -599
3447 -599 -2427 849 3048 185 -862 143 -242 -1119 252 2397 2421 -752 -2094 -368 241 -650 1886
3464 1886 3824 -534 -3329 -331 748 -885 1627 3858 -66 -3358 -1086 270 -95 1302 2645
3479 2645 583 -2337 -2483 56 1489 644 566 1539 -1033 -3507 -596 2570 285 -783 1735 -242
3495 -242 -3243 -375 2566 26 -1404 852 52 -1702 -293 1361 423 -1102 -902 281 560 -404
3511 -404 108 1206 -1162 -3003 463 2358 -502 -490 1382 -1326 -3657 57 2665 207 -349 821
3527 821 -1420 -2894 -427 2334 1812 -19 -1070 -965 -1684 -1625 1479 3493 398 -2208 -470 -499 -2280
3544 -2280 766 4143 728 -2426 -481 -239 -1780 545 3168 956 -1523 -1090 -118 -58 370 1210 1825
3561 1825 -393 -2070 -135 1770 -403 -523 1884 462 -2248 403 2892 -276 -1539 1120 485
3576 485 -1574 809 2610 305 -1539 -638 226 166 541 1474 1500 -1179 -2561 -61 1803 311 863
3593 863 2396 -1075 -3810 -308 2495 356 837 2129 -818 -3614 -922 1751 1485 980 674 -427
3609 -427 -2232 -1941 659 2679 842 -873 40 -912 -2791 -59 3173 776 -1886 569 130 -2444
3625 -2444 -395 2675 513 -1633 -215 -29 -993 -258 971 533 -1076 -1359 233 1040 -394 -623 818
3642 818 -375 -2381 364 2688 -588 -1816 365 -566 -2509 575 2987 101 -1658 -678 -872 -1431
3658 -1431 328 2369 1674 -1096 -2373 -877 210 -128 1435 2778 -362 -3406 -885 974 -519
3673 -519 884 3051 29 -3372 -1202 1046 41 818 2240 453 -2057 -1591 372 1221 795 420
3689 420 836 -302 -2037 -37 2292 449 -1101 1023 912 -2153 -205 2649 99 -1682 639 1141
3705 1141 -871 246 1854 198 -1453 -556 760 1077 446 497 582 -948 -2245 498 2701 451 -572
3722 -572 721 -898 -3002 346 3268 862 -545 529 -969 -2567 -109 2645 1581 -39 -825
3737 -825 -1370 -1473 -954 1175 2907 538 -2218 -934 -159 -1535 491 3292 139 -2824 -588 412
3753 412 -1192 41 2432 296 -2093 -865 422 -218 -325 324 561 -888 -1291 135 1378 -381
3769 -381 -1564 437 434 -1919 58 2466 -423 -2513 50 576 -1169 465 2347 -100 -2227 -1107
3785 -1107 113 37 916 1552 631 -1671 -2512 -352 1677 694 565 1532 -996 -3443 -469 2540 729
3802 729 193 1729 -833 -3341 -596 2263 1062 481 1088 -438 -1953 -1235 1110 2074 764 -557
3818 -557 -208 -131 -1469 -96 2597 1010 -1647 159 1121 -1356 -472 2380 459 -1533 206 1137 -481
3835 -481 -61 807 210 -1001 -351 893 1354 278 -848 50 -165 -1209 765 2601 308 -1880 16
3852 16 -170 -1714 923 3210 402 -2019 -582 -261 -1001 837 2399 1268 -1284 -1939 -895 184
3868 184 585 1159 2093 -482 -3247 -1213 1255 -93 293 2378 -77 -3182 -1171 1250 -13 160
3884 160 1403 132 -2205 -1078 644 587 15 -139 145 -475 -1124 -214 1584 -74 -1716 294 943
3901 943 -1280 -237 2030 -323 -2567 -7 1337 -562 7 1267 -507 -2155 -588 956 857 565
3917 565 170 -448 -1328 -1880 322 2639 943 -809 182 -880 -2725 199 3384 1151 -1127 159
3933 159 -582 -2300 -76 2911 1619 -506 -662 -751 -971 -152 1434 2208 350 -1556 -854 555 -204
3950 -204 183 2449 895 -2062 -465 1548 -534 -450 1880 485 -1617 -103 1072 231 -541 576
3966 576 270 -573 -395 773 1377 -179 -1237 -84 744 -575 460 2313 -218 -2464 -348 1056
3982 1056 -478 546 2191 -304 -2764 -853 492 263 1006 1245 -53 -1850 -1987 -213 1619 940
3998 940 122 435 -958 -2994 -775 2503 946 -601 815 -450 -2914 -851 2032 1014 -397 249
4014 249 -577 -1849 -780 908 1151 65 -704 -654 -110 -955 -173 1447 321 -1870 -258 1344 -568
4031 -568 -752 1553 94 -2137 8 1687 -107 -650 595 -673 -1535 -94 1245 1142 -50 -986
4047 -986 -655 -350 -813 802 2628 389 -2042 -806 191 -1123 616 3115 551 -2181 -693 87
4063 87 -680 863 2580 794 -1388 -1397 -547 401 1039 1358 1317 -102 -2064 -905 1511 651 -31 1657
4081 1657 515 -2223 -685 1934 326 -479 1362 572 -1631 -367 1363 529 -296 16 112 57 -108
4098 -108 326 982 -100 -1651 -35 1393 8 -82 1379 -265 -2590 -180 1965 394 -21 1205
4114 1205 -326 -2454 -666 1524 884 421 108 -684 -1535 -1301 529 2309 939 -1199 -556 -542 -1891
4131 -1891 -40 2927 1109 -1487 -448 -421 -2108 -90 2479 819 -1146 -550 -470 -1073 -3 1368
4147 1368 1073 -382 -1334 -847 405 -147 -357 1187 401 -2059 -568 1583 -588 -1247 873 343 -1791
4164 -1791 -128 1673 14 -995 18 -216 -620 342 1146 768 -438 -1670 -561 818 402 588 1597
4181 1597 -356 -2578 -864 1455 202 473 2199 18 -2865 -783 1154 536 943 1654 -5 -1794
4197 -1794 -1520 246 1521 1322 352 143 -597 -1969 -368 2253 1223 -636 568 269 -1964 -563
4213 -563 2270 926 -788 348 235 -1173 -368 1293 626 -318 -338 150 190 34 -78 736 178 -1461
4231 -1461 3 1633 31 -940 825 -113 -2236 42 2200 330 -946 213 -518 -1564 -21 1667
4247 1667 831 -380 -938 -1120 -539 -369 835 1831 297 -1881 -1182 -2 -482 239 2417 414 -2447
4264 -2447 -1099 370 -468 363 2006 545 -1885 -1263 -251 88 766 615 459 -462 -1548 -682 1009
4281 1009 704 -734 630 342 -1693 -822 1680 167 -1266 569 547 -1235 -144 1433 -75 -1069
4297 -1069 -125 243 -126 428 439 226 -627 -1554 -164 1577 502 -59 1100 -227 -2296 -291 2170
4314 2170 844 -318 844 -369 -2478 -316 1941 1242 449 381 -1047 -1386 -636 969 1924 1001 -727
4331 -727 -898 -297 -756 107 2500 1323 -1428 -713 359 -1040 -31 2576 961 -1364 -205 191 -499
4348 -499 139 1435 486 -479 -516 -277 527 290 -453 593 515 -1420 -255 1652 385 -1383 203 381
4366 381 -1258 -133 1843 44 -1692 -254 -70 -312 554 1254 444 -1009 -1459 -718 721 640 604 863
4384 863 -415 -2514 -1088 1284 408 84 1364 -99 -2763 -994 1243 424 294 1099 -313 -2037
4400 -2037 -1155 341 931 673 -21 -504 -819 -1284 -285 1677 968 -883 -385 407 -1239 -744 1800 856
4418 856 -1313 -90 570 -764 -361 1307 130 -961 -349 312 498 160 -115 -78 -283 -1027 91 1826
4436 1826 602 -1069 33 20 -1508 125 2415 710 -1066 -276 -407 -1461 506 2089 979 -605
4452 -605 -497 -884 -616 418 1342 1699 301 -1797 -1195 706 269 444 1949 663 -2100 -902 817
4469 817 147 137 1714 487 -1638 -854 341 177 520 769 146 -636 -876 -251 948 571 -516 25
4487 25 651 -868 -364 1439 176 -1736 -96 849 -776 -109 1246 -176 -1737 -393 548 170 418
4504 418 591 -425 -1193 -1073 -214 1182 837 -329 -89 -666 -2000 -580 2234 992 -929 144 -578
4521 -578 -2206 -392 1956 1008 -374 -158 -731 -1614 -397 907 1164 374 -784 -1162 -154 -481 -153
4538 -153 1810 725 -1502 -861 607 -614 -397 1719 611 -1598 -439 833 -272 -340 799 64
4554 64 -657 -373 250 627 112 -453 -138 324 -539 73 1626 428 -1554 -377 621 -633 278 2017
4572 2017 354 -1661 -478 407 -282 866 1641 303 -1070 -1123 -401 526 1111 639 702 -410 -1692 -845
4590 -845 1485 1143 155 1000 89 -1927 -834 1495 798 39 814 15 -1576 -653 883 666 469 148
4608 148 -493 -321 -479 -2 1164 623 -999 -578 688 -481 -765 1277 556 -1483 -399 1301 -249
4625 -249 -410 744 -153 -1545 -384 768 498 86 -158 -610 -848 -637 240 1490 701 -1039 -816 -184
4643 -184 -1162 -86 2030 783 -1582 -680 -278 -1270 48 2109 621 -1171 -868 -787 -587 397 1259 748
4661 748 -143 -1366 -1045 292 523 199 1119 314 -1770 -1082 963 231 -431 1077 554 -1542 -643 1003
4679 1003 173 -53 493 202 -597 -63 329 525 213 -731 -101 565 -12 -216 1054 422 -1559 -489 1176
4698 1176 64 147 1203 -32 -1689 -624 1164 471 677 768 -356 -1000 -757 276 1443 1423 -49
4715 -49 -384 -368 -1370 -299 1880 1433 -760 -223 25 -1602 -53 2006 1074 -419 -202 -125 -1122 -54
4733 -54 1305 1137 -108 -637 -765 -142 140 468 1012 490 -1169 -1013 661 28 -543 841 539 -1447
4751 -1447 -631 938 65 -548 165 -99 -1173 -127 801 370 -130 -707 -604 -316 -78 96 1098 176
4769 176 -1673 -985 563 106 -102 1463 302 -2025 -1208 496 -196 360 1439 203 -1428 -1102 -128
4786 -128 475 938 528 -3 -749 -1559 -789 928 980 -279 210 91 -1647 -898 1355 925 -366 222 116
4805 116 -1207 -575 1024 559 -221 -143 -94 -361 -41 185 655 177 -467 -275 717 415 -234 767 209 -1345
4825 -1345 -256 1504 589 -496 319 -20 -1475 -169 1350 836 201 58 -696 -781 -97 845 1517 783
4843 783 -959 -997 -174 -315 49 2188 1191 -1274 -1065 51 -510 124 1835 863 -1072 -962 -168 -301
4861 -301 387 1251 652 -557 -904 -656 397 675 164 491 398 -1338 -1085 981 314 -618 461 196 -1427
4880 -1427 -477 1197 358 -871 9 176 -616 -166 477 183 -324 -709 -471 489 339 -70 468 32 -1553
4899 -1553 -631 1213 542 -466 599 -70 -1966 -697 927 686 157 591 -684 -1463 -805 605 987
4916 987 712 -47 -697 -690 -1018 -174 1378 979 -619 -675 118 -813 -298 1907 1010 -834 -239 -4 -708 -397
4936 -397 1315 558 -553 -301 -342 -16 266 303 315 204 -822 -445 922 721 -673 310 556 -717 -164
4955 -164 1467 486 -637 47 178 -632 -21 1158 729 -414 -441 -442 99 629 881 991 162 -1259 -1071
4974 -1071 226 428 471 1245 115 -1803 -981 703 383 181 1258 139 -1513 -978 286 442 572
4991 572 738 -200 -666 -1002 -330 1067 982 -278 -114 209 -1135 -925 1067 744 -888 -232 314 -1002
5009 -1002 -567 1032 342 -781 -310 -3 -239 -96 247 -11 -405 -771 -354 700 490 -358 -180 -43 -1332
5028 -1332 -464 1245 448 -720 -198 -296 -1414 -464 1489 843 -298 -620 -562 -1006 21 1038 930 457
5046 457 -902 -1051 -237 58 484 1297 918 -1232 -1208 254 -220 -17 1485 649 -1308 -729 -5 -38 411
5065 411 935 582 -667 -739 -122 244 610 202 294 231 -654 -488 1180 595 -563 -102 816 -371 -399 1167
5085 1167 549 -895 -273 429 -140 112 887 336 -549 -576 -60 432 685 473 169 -131 -1314 -535 1223
5104 1223 1145 -74 436 -65 -1495 -777 1318 959 21 322 -424 -1540 -674 809 960 378 -178 -691
5122 -691 -581 -333 -62 1154 748 -652 -881 -23 -564 -417 920 774 -1143 -772 376 -377 -316 945
5140 945 509 -917 -444 64 -96 64 95 -348 -317 -496 -197 802 410 -818 -508 368 -696 -293 1265
5159 1265 409 -1227 -633 -35 -630 144 1431 558 -856 -771 -468 -210 623 794 471 -291 -1076 -1079 296
5178 296 843 113 728 200 -1545 -1041 885 705 230 1004 400 -1403 -939 704 658 343 628 -118 -680
5197 -680 -432 95 742 700 -135 -271 121 -209 -298 1038 675 -686 -291 671 32 -590 948 538 -776
5216 -776 -259 533 200 72 582 -46 -441 -196 250 800 585 -349 -206 -147 -840 -141 1580 805 -590 -585
5236 -585 25 -1059 -213 1630 958 -272 -478 -533 -852 60 1043 693 -49 -802 -963 -336 66 363 812
5255 812 305 -1047 -1151 364 192 -124 754 508 -1245 -933 353 -18 -142 467 44 -970 -549 248
5273 248 415 49 67 -239 -154 -237 -202 422 445 -809 -720 421 -85 -167 931 278 -1186 -661 406 54 219
5294 219 815 -32 -950 -712 28 420 896 581 -72 -471 -828 -608 833 998 24 27 -98 -1010 -729 1299
5314 1299 1053 -138 136 -177 -1118 -473 999 790 225 15 -401 -543 25 479 831 623 -396 -539 349
5333 349 129 -233 750 704 -937 -274 799 309 -348 702 438 -700 -126 589 266 52 -10 -186 -302
5352 -302 79 363 798 578 -637 -636 24 -16 -14 1156 726 -1142 -931 342 -246 59 1253 668 -1088 -781
5372 -781 -177 -20 412 1006 324 -342 -846 -829 323 845 294 242 185 -1210 -979 587 857 -228 362 256
5392 256 -1366 -948 675 433 -276 -23 -84 -670 -376 248 189 80 -112 -531 53 52 -315 479 469 -818 -507
5413 -507 570 328 -377 422 157 -1043 -409 743 234 50 454 -231 -1139 -172 187 730 730 -317 -619
5432 -619 -351 -491 -79 1019 1085 -644 -658 30 -419 -145 1446 1012 -760 -550 -90 -465 139 1315 790
5451 790 -324 -529 -703 -258 500 554 538 492 -489 -818 542 661 -168 509 473 -730 -808 729 513 -224
5471 -224 336 316 -506 -102 758 251 159 -215 -99 -2 293 162 429 240 -640 -846 336 312 -196 491 413
5492 413 -1129 -847 437 320 62 696 77 -1256 -845 217 366 711 457 -233 -494 -806 -294 491 945
5511 945 -64 -583 -191 -882 -760 985 838 -577 -343 -306 -954 -590 738 758 -354 -201 -353 -491 -247
5530 -247 157 208 251 -411 -574 134 294 -424 181 568 -635 -633 695 358 -391 -90 255 -748 -407 955
5550 955 399 -30 -359 -200 -710 -5 596 571 420 -519 -976 -86 323 406 1028 721 -1111 -939 294 233
5570 233 336 990 738 -892 -823 119 131 319 934 288 -599 -632 -297 261 780 524 154 50 -504 -548 696
5591 696 1010 -100 43 526 -817 -631 923 532 -236 195 126 -460 -95 453 542 -152 -233 -424 18 506
5611 506 7 -26 361 -626 -521 713 480 -435 75 125 -981 -484 731 623 -185 82 -257 -988 -333 204
5631 204 603 374 -195 -730 -681 -178 161 784 840 -426 -939 -188 -307 -250 1108 859 -517 -792 -245 -405
5651 -405 -73 790 389 -607 -527 -291 -311 157 431 208 84 -575 -634 361 521 -374 -174 316 -640 -617 479
5672 479 481 -544 -202 93 -490 -314 539 296 -504 -405 -338 38 241 491 412 13 -592 -634 371 688 313
5693 313 468 245 -944 -844 695 809 67 614 117 -1007 -617 539 616 229 438 -277 -793 -342 172
5712 172 645 842 -54 -463 -267 -257 -181 843 980 -300 -460 229 -455 -357 771 865 -435 -120 221 -338
5732 -338 11 488 300 -259 -48 -359 287 257 -166 -268 250 -158 -481 668 683 -559 -331 86 -629 -223
5752 -223 957 558 -418 -320 -233 -559 38 677 558 -234 -529 -873 -231 552 274 402 372 -1045 -1045 131 450
5773 450 -9 532 402 -1037 -887 211 136 156 467 144 -588 -597 -323 371 338 347 -251 -278 -433 -482 286 753
5795 753 -277 -444 131 -316 -613 532 352 -541 -250 295 -210 -115 651 43 -372 -270 -20 223 361 75
5815 75 -95 148 -292 -581 747 825 -216 -314 107 -554 -588 1049 990 -172 -76 -62 -583 -414 925 775 223
5836 223 -99 -712 -601 162 534 776 641 -331 -966 -10 266 -47 599 938 -543 -868 240 276 -85 711
5856 711 518 -598 -336 150 215 54 410 16 -128 -88 -142 168 670 -169 -498 114 43 -324 550 500 -551
5877 -551 -673 316 -88 -146 597 431 -772 -488 19 23 294 508 240 -491 -606 -556 332 691 72 51 1 -843
5899 -843 -807 186 841 -95 158 -35 -751 -867 391 525 221 13 -117 -503 -440 20 256 421 -21 -575
5919 -575 -451 -31 -396 358 590 -321 -627 330 7 -467 509 473 -610 -422 383 173 -133 287 28 -386
5939 -386 -483 295 184 344 51 -388 -164 -150 -70 646 814 -261 -564 72 -107 -194 924 774 -435 -528 -5
5960 -5 -240 136 788 303 -176 -467 -407 60 748 524 464 478 -681 -690 273 831 75 177 470 -730 -687 329
5982 329 500 219 324 235 -661 -586 404 200 127 442 -250 -326 33 -117 250 301 -259 -530 239 174 -376 308
6004 308 547 -598 -416 586 136 -204 387 55 -870 -280 64 315 139 270 -349 -568 -308 -269 572 786
6024 786 -191 -542 -206 -518 -424 491 723 -394 -446 -236 -668 -487 734 755 -208 -261 -332 -593 196 522 415
6045 415 230 -149 -719 -126 254 172 239 588 -458 -929 279 338 -218 314 546 -456 -304 333 390 -76
6065 -76 270 -51 -189 -11 255 116 470 -210 -444 139 236 63 294 594 -524 -661 441 382 -16 728
6085 728 400 -704 -745 331 216 315 528 156 -481 -596 -281 401 923 294 -167 -65 -319 -558 467 914
6105 914 43 -237 99 -472 -767 604 927 129 -73 119 -594 -77 626 299 62 -100 -322 -248 180 -177
6125 -177 128 397 -430 -612 254 140 -375 73 437 -453 -561 406 438 -205 136 18 -332 -120 382 259
6145 259 49 -254 -622 -457 49 144 504 578 -452 -916 -127 -70 -88 671 631 -638 -834 -12 -91 141 531
6166 531 343 -348 -399 -341 -35 484 590 -56 -73 -267 -545 100 513 77 -33 263 -530 -737 107 581 -66
6187 -66 -86 261 -371 -491 407 426 -52 -52 -169 63 183 313 -1 238 -59 -412 274 430 -90 151 346 -535
6209 -535 -582 399 629 -92 398 64 -585 -367 178 368 314 260 -124 -558 -15 248 425 811 -15 -473 -244
6230 -244 -160 -267 638 893 -270 -671 -178 -264 -346 892 808 -278 -389 11 -259 140 567 226 -249 -161 -397
6251 -397 -225 370 74 142 282 -184 -570 226 291 -257 -168 235 -315 -557 363 496 -334 -239 -2 -271 -156
6272 -156 404 25 11 -226 -485 6 326 159 166 285 -635 -838 144 319 -17 435 201 -753 -655 178 242 216
6294 216 371 67 -792 -519 15 163 560 319 -171 -114 -311 -329 207 698 -48 -283 -40 -193 -709 426
6314 426 582 -181 -205 253 -171 -274 402 310 -6 115 -71 -125 259 222 55 201 15 -405 258 611 -101
6335 -101 -127 262 -267 -406 748 683 -39 -144 33 -419 -11 624 536 132 -204 -350 -193 325 352 276 327 -232
6357 -232 -761 30 293 58 578 630 -318 -863 31 149 28 449 283 -341 -550 -64 14 283 336 -102 -159
6378 -159 -180 -270 -32 420 114 -236 157 -67 -575 218 458 -349 -210 -19 -327 -517 459 281 -594 -297 -76
6399 -76 -314 -41 325 -39 -365 -406 -353 -185 630 91 -266 -37 -658 -651 316 740 -170 -15 -64 -590 -441 393
6421 393 577 171 120 -367 -860 -425 351 554 489 4 -612 -420 -92 -99 480 678 -209 -425 161 -56 -146 454
6443 454 582 -220 -396 80 23 61 413 182 -122 -175 -65 104 364 289 -54 -22 62 -209 218 517 -147 -368
6465 -368 162 -154 -291 512 413 -352 -320 -72 62 37 534 415 -61 -293 -376 -145 363 411 -26 111 -250 -563
6487 -563 143 857 94 57 323 -528 -967 350 551 183 244 79 -735 -389 158 372 394 324 -135 -434 -39
6508 -39 -241 176 417 35 -646 39 -88 -331 193 498 -271 -482 235 -73 -344 81 345 -362 -481 17
6528 17 91 -87 120 -65 -294 -7 19 145 476 -176 -341 -1 -117 -315 647 578 -110 -530 -131 -218 -211 526
6550 526 544 -185 -213 -449 -281 71 331 434 317 -390 -630 -241 408 232 408 593 -423 -606 -5 283
6570 283 68 349 467 -260 -404 299 97 158 232 118 -310 -92 -105 204 99 246 -230 111 85 -344 271
6591 271 412 -114 -459 163 396 -148 313 323 -454 -394 130 158 -55 419 31 -376 -127 -145 0 506 376
6612 376 -24 -256 -271 -361 254 701 -72 -217 108 -467 -149 389 815 -16 -275 -209 -565 -304 545 170 232
6633 232 11 -510 -461 214 164 40 403 -189 -585 39 321 -197 132 529 -413 -531 -27 -3 -73 170 211 -271
6655 -271 -171 92 181 106 11 -197 -217 116 -320 1 239 -288 -531 -93 -83 -60 318 453 -340 -636 70 46
6677 46 -13 563 185 -331 -310 -99 131 431 618 -3 -99 -371 -443 108 808 244 -3 60 -264 -595 388 557
6699 557 -70 -129 154 -579 -494 420 490 442 154 -31 -272 179 216 351 367 -36 -250 44 520 39 205 402
6721 402 -165 -456 113 338 7 238 460 -264 -286 315 267 48 253 -79 -102 96 129 199 531 81 -417 -185
6743 -185 209 -193 295 478 -309 -641 -66 -93 -374 557 512 -309 -192 -248 -288 -51 384 346 -93 -127 -673 -207
6765 -207 419 234 73 97 -179 -704 110 324 31 -81 197 -457 -523 217 419 -202 39 16 -323 -195 403
6786 403 115 -3 -232 -350 -204 86 32 -62 267 -489 -587 48 340 122 169 146 -291 -378 99 140 98 423 109
6809 109 -497 -308 62 84 471 393 -317 -340 -241 -194 400 714 106 -305 20 -352 -322 611 700 -26 -368 -186
6831 -186 -464 -164 563 447 22 -201 -231 -270 285 143 163 203 92 -401 159 420 -51 -57 452 -79 -317 218
6853 218 193 -144 112 98 -299 -120 198 400 114 96 -213 -166 52 288 198 300 -131 -449 -135 234 150 196
6875 196 261 -332 -552 -43 36 -81 317 249 -375 -267 -159 91 266 191 103 -10 -277 -447 -26 549 341 -431
6897 -431 -77 -261 -548 192 501 -99 -176 115 -235 -527 49 403 -241 -17 -137 -203 -75 300 60 104 -30
6918 -30 -366 33 381 -181 -189 223 -87 -432 142 323 -11 33 17 -231 -361 170 540 179 172 -25 -544 -127
6940 -127 190 201 398 147 -448 -190 192 -166 362 610 -22 -492 -188 120 -111 432 571 -344 -416 -40 51
6961 51 63 373 314 -83 -252 -326 13 386 419 -9 46 -66 -291 225 533 -32 -75 207 -208 -493 347 419 -100
6984 -100 -59 129 -72 96 399 225 -78 -288 -259 -150 200 332 -34 207 -362 -495 55 644 49 17 186
7005 186 -267 -582 140 220 161 120 -214 -439 -474 8 136 368 85 -275 -323 -220 -130 295 487 174 -491 -217
7027 -217 76 -354 164 515 -87 -419 -92 -134 -161 271 296 -220 -163 -138 -248 45 274 146 -129 -59 -361 -169
7049 -169 313 58 -223 126 90 -294 142 365 -9 -273 41 -125 -257 232 386 -91 -175 -178 -164 132 411 117
7071 117 182 -179 -549 -166 312 223 92 354 -232 -853 138 371 239 233 316 -399 -484 -6 49 111 354 208 -446
7094 -446 -81 10 48 540 271 -77 -199 146 -290 149 574 54 -335 124 95 -246 128 457 -25 -114 111
7115 111 -146 26 175 35 -149 -184 -249 -15 345 60 -192 -29 -113 -212 203 381 -26 -243 -37 -323 -356 436
7137 436 434 -185 -177 -80 -353 168 451 365 239 -147 -484 -313 258 161 133 225 -131 -588 -195 53 -3 276 453
7160 453 -420 -626 -7 279 7 274 309 -230 -362 -132 29 187 65 -148 -127 45 -261 -58 460 19 -387
7181 -387 67 -42 -25 287 462 -262 -306 59 -19 -49 225 190 -354 -276 43 46 291 333 -108 -245 -244 -256 1 555
7205 555 330 -275 101 -194 -519 41 600 13 170 38 -590 -302 268 431 219 219 -232 -320 12 283 335
7226 335 351 126 -212 -126 157 161 192 445 86 -501 -12 203 -95 168 105 -189 -233 -8 91 59 239 14 -257
7249 -257 -33 47 -53 89 179 -389 -213 59 -153 258 295 -21 -283 53 -78 11 302 318 -267 -244 -87 -184
7271 -184 120 304 196 -230 -272 -448 -140 428 206 152 160 -190 -559 -94 292 -31 -105 208 -417 -398 277 319
7293 319 -91 80 -128 -356 -248 246 44 188 69 -316 -208 152 -30 40 241 60 -420 37 156 -82
7313 -82 241 202 -217 -297 281 61 101 269 73 -288 -100 53 86 337 358 -105 -234 102 -101 174 614 64
7335 64 -402 -59 -61 -310 230 679 9 -220 -173 -270 -88 452 627 -200 -213 -154 -235 154 382 96 100 -18 -544
7358 -544 10 404 152 53 269 -183 -412 -168 142 -12 19 252 -32 -251 223 25 84 20 -255 19 76 128
7380 128 74 327 -3 -443 -8 168 25 2 289 -42 -512 -43 67 -91 396 277 -231 -315 -10 268 146
7401 146 178 -115 -235 -75 -297 -109 432 195 -207 -130 -231 -279 63 471 49 -179 -218 -116 -383 292 331 86
7423 86 -58 -95 -277 4 377 196 84 -93 -301 -293 142 44 -216 406 -81 -371 46 292 3 -116 235 -166
7445 -166 -254 94 302 -95 142 -152 -187 -77 -14 207 394 139 -333 -293 58 44 144 562 100 -594 48 309
7467 309 -21 408 402 -214 -145 -206 -66 -99 396 186 -306 -314 -161 -108 345 418 -89 -66 -79 -370 23 546 133 -50
7491 -50 89 -100 -535 79 396 -47 -74 73 62 -153 105 135 5 209 -321 -323 110 0 28 84 48 -468 37
7514 37 84 8 -100 300 -124 -300 81 379 79 -25 220 -263 -374 4 86 -3 312 -234 -390 -130 77 57
7536 57 505 -218 -448 -169 -174 -59 191 537 -28 -347 -202 -134 -151 273 475 -134 -364 -213 -219 61 353 175
7558 175 -47 123 -306 -103 385 -72 -12 234 21 -352 110 478 90 -149 218 -208 -187 238 189 -138 -32
7579 -32 -36 -89 88 208 60 168 105 -268 -94 411 115 60 110 -129 -362 271 455 168 100 198 -275 -253 251
7602 251 206 218 166 60 -404 -161 -71 151 477 268 -132 -316 -72 -136 181 393 23 -221 -46 -29 -237 280
7624 280 236 67 -406 96 -180 -247 274 80 -160 -181 -372 -161 204 78 -154 -142 103 -253 -40 384 -16
7645 -16 -361 38 -195 -152 139 247 106 -157 21 -242 125 359 70 81 -6 -298 -193 48 137 2 193 -4
7667 -4 -646 -84 136 -83 286 292 -109 -667 -213 -53 -152 274 433 -170 -150 9 -119 132 310 -26 -201 97
7689 97 -241 41 404 188 -324 54 80 -302 149 499 9 -206 296 -41 -280 308 275 -109 49 -99 -80
7710 -80 44 272 -33 -75 -46 -4 76 225 21 -65 133 -125 -253 -79 544 -17 -133 20 -88 -37 239 291 248
7733 248 92 36 -378 7 252 145 250 97 -533 -123 397 -150 -31 676 -149 -336 -61 167 114 275 330
7754 330 -238 -294 -195 -24 110 280 148 -148 -124 -260 -272 282 86 -151 -166 -37 -185 34 278 33 -280 135
7776 135 -94 -144 133 164 -299 -219 -31 -134 178 363 193 -56 -110 -409 -57 368 123 -15 -98 -277 -490 14
7798 14 275 -19 160 111 -343 -483 39 236 281 77 18 -316 -399 29 103 128 161 -235 -86 -31 -39 -145 392 293
7822 293 -573 -94 93 -53 118 235 52 -50 -21 -16 19 384 158 -184 35 169 80 78 227 -194 114 36 82
7845 82 44 479 166 -125 21 42 51 362 469 -179 -98 -7 -1 -51 509 303 -37 7 -105 -172 283 202 97 180 -171
7870 -171 -650 29 246 159 17 276 -130 -330 -14 330 269 181 99 -344 -151 94 164 71 231 -194 -221 -139 -23
7893 -23 84 166 15 -343 -162 216 -231 -79 157 -164 -269 141 81 -81 148 279 -171 -154 159 46 235
7914 235 107 2 -309 -106 -101 -110 505 315 -283 -122 -149 -203 -21 402 24 -169 22 -273 -105 335 275 149
7936 149 -147 37 -288 -30 217 174 238 43 -411 -398 160 -25 -97 80 -12 -305 14 347 125 255 156 -73
7958 -73 -209 26 154 74 77 138 -311 -64 70 206 300 34 -38 -79 114 -8 -2 440 3 -354 66 187 20
7981 20 77 162 -108 -146 -122 -25 134 379 121 -250 -55 -210 84 252 273 -82 -76 -14 -478 85 363 86 -117
8004 -117 -37 -268 -525 268 221 32 71 -61 -190 -1 189 110 115 59 -41 -209 71 120 -2 235 -65 -208 114
8027 114 284 4 -113 162 -212 -249 146 107 -92 -266 -116 -208 -208 -86 109 -80 80 -87 -246 77 65 -7
8049 -7 299 168 -386 -236 -59 -127 51 418 -2 -300 -39 -5 94 91 369 -168 -175 -79 -110 45 237 -11 -258 -194
8073 -194 -376 -211 313 400 -51 169 144 -330 -155 508 44 -34 56 -81 -356 149 293 57 86 19 -183 -73
8095 -73 48 -51 152 26 -60 7 289 114 -128 258 -92 -192 67 280 37 -80 15 -192 -220 210 243 82
8117 82 158 111 -266 27 277 178 351 224 -208 -161 82 29 191 318 163 -314 -174 -292 -147 292 387 -15
8139 -15 -183 -61 -2 -51 339 105 146 -62 -263 -219 2 39 -59 179 -160 -245 -15 253 -66 -23 270 -110 -272
8162 -272 -29 148 36 -212 -11 -225 -129 80 242 -88 52 -97 -145 120 60 -17 24 105 -447 -96 218 86
8184 86 269 258 -75 -397 52 202 67
8191F7
$$ Imaginary data points
##PAGE= N=2
##DATA TABLE= (X++(I..I)), XYDATA
0 0 0 0 0 0 0 0 0 0 0 0 -3 8 -8 8 -8 11 -16 16 -19 24 -28 32 -37 41 -48 56 -64 72 -81 91 -103 115 -130 146
34 146 -162 178 -199 219 -244 269 -298 331 -366 406 -451 500 -558 623 -697 783 -889 1019 -1180
53 -1180 1386 -1663 2060 -2660 3677 -5726 11385 -55953 -187641 16282 112656 -19720 -47529
66 -47529 67617 29151 -82947 -39886 48772 1772 -32450 48579 61322 -69976 -98572 39401
78 39401 80084 -30089 -35428 49179 860 -77950 3843 64841 -23184 -42923 47084 20071
90 20071 -69969 -14239 66686 1931 -56629 4882 32359 -24763 -15745 50046 9419 -80919
102 -80919 -26032 83803 29043 -73156 -4643 70617 -31030 -86701 36516 76290 -30333
113 -30333 -26155 53427 -17311 -97980 9255 103605 16804 -53780 1059 10314 -54319 -19095
125 -19095 83388 51377 -61341 -39158 47692 -1888 -69302 22442 94108 -4396 -61154 12407
137 12407 8182 -55361 17743 98197 -170 -85420 -1630 51671 -19481 -28234 50115 35468
149 35468 -50058 -29863 48130 16732 -50878 3609 66147 -10341 -66443 22605 61259 -30354
161 -30354 -38823 43038 11680 -54462 16949 71896 -21213 -66814 19090 40339 -29390 -13468
173 -13468 57203 18389 -65280 -33063 43399 17781 -26583 24692 46736 -44942 -72101 27971
185 27971 50376 -22174 558 55173 -26155 -90452 7631 71863 -3986 -27727 35457 9555
197 9555 -70709 -33048 56003 35105 -27275 -3385 25351 -33354 -57564 29263 63420 -19700
209 -19700 -38800 28528 3393 -61805 3427 71391 -8437 -60190 19191 37636 -41289 -29419
221 -29419 47964 19447 -48384 -12626 41505 -113 -38715 11227 35262 -30205 -43140 39167
233 39167 46784 -37621 -32111 36398 -1607 -53502 21772 68712 -18027 -53391 17331 16855 -42175
246 -42175 -625 67003 17463 -52718 -21967 19700 -8602 -12778 45704 43549 -40813 -53802
258 -53802 21453 25568 -25853 12295 60800 -11349 -67197 3444 37570 -19576 -4137 60789
270 60789 10510 -69987 -22416 48251 14884 -21469 17575 26587 -31330 -34539 32117 33407 -30642
283 -30642 -16670 45904 8632 -53772 377 53173 -10471 -39850 28569 27112 -41975 -10512
295 -10512 56056 3751 -58950 -5122 46238 3575 -21783 16472 12983 -39725 -25619 41285
307 41285 31730 -28248 -9577 31312 -19322 -56319 20466 61290 -9727 -30484 21134 -5268
319 -5268 -58050 2791 67490 11579 -40491 -2100 10256 -35264 -21560 46257 40146 -27568
331 -27568 -32346 10455 -4900 -31985 20494 55111 -15700 -54410 11620 27315 -35031 -16163
343 -16163 52026 15203 -48860 -10919 27424 -12964 -19705 30711 19451 -38595 -22794 34138
355 34138 16887 -32751 -10189 30382 -4065 -34499 18118 40284 -25984 -39139 26690 19662
367 19662 -35869 3322 53238 -8874 -56402 4031 34021 -13895 -10328 40519 14964 -48336
379 -48336 -28208 29417 18421 -12320 16710 32047 -30163 -55937 16847 49730 -6486 -12675
391 -12675 32354 -2821 -56594 -4170 50395 7278 -18222 22036 9766 -44348 -19430 41061
403 41061 24675 -18859 -1409 20734 -16233 -35507 18019 44675 -8622 -30504 16687 15771
415 15771 -30825 -4673 42551 -2022 -40806 14768 37008 -23321 -26918 30980 17049 -35205
427 -35205 -10227 35601 8541 -25501 1348 17490 -20521 -26104 31010 39512 -23077 -33086
439 -33086 15702 4529 -32739 12240 51669 -7585 -45239 4279 13477 -29814 -2071 52900
451 52900 13724 -46973 -21606 17037 -4184 -12821 28641 31104 -27665 -43259 8082 20173
463 20173 -15342 2077 39341 -5481 -53812 -4601 35178 -8437 -17249 31555 13054 -44485
475 -44485 -19023 32188 8421 -21480 7342 19064 -19169 -24397 18636 21992 -19985 -17575 22788
488 22788 9289 -29088 41 35070 -9001 -38258 12869 29624 -18334 -11151 32963 370
500 370 -45179 -3153 38821 4483 -17518 13877 11710 -31550 -23383 29703 30937 -12214 -9394
513 -9394 16953 -11914 -38669 13156 51029 1175 -27601 10108 4453 -36784 -2125 50826
525 50826 14527 -30302 -1895 13609 -21809 -16105 34344 30400 -19194 -21557 11447 2987 -20839
538 -20839 8651 38069 -2735 -35854 4956 24351 -17600 -14194 33702 11536 -36519 -4606
550 -4606 33349 -4270 -26309 13606 19310 -20393 -14027 25357 13508 -23971 -12276 17863 615
563 615 -19980 12414 31451 -14990 -37106 7791 20038 -15223 167 34687 -5204 -45780
575 -45780 -4408 27130 -5337 -8484 27515 9360 -39379 -25051 20591 16430 -6683 7851
587 7851 15585 -22432 -38078 9228 33547 -4221 -12911 19448 -919 -43374 -7846 39637 7212
600 7212 -22519 10026 11365 -31322 -18469 30399 18315 -20294 -7178 15745 -7124 -23168
612 -23168 9359 26508 -9008 -23902 12024 17531 -19397 -10840 26545 2391 -32012 4349
624 4349 32379 -8569 -22381 16081 10884 -27553 -7168 32337 11864 -20074 -4242 9481
636 9481 -12759 -14276 24079 30283 -13245 -25939 7069 6452 -19106 7819 40848 857 -36374
649 -36374 -2499 16063 -14568 -3047 38602 14604 -33853 -17110 15410 1228 -7269 21249
661 21249 22861 -18613 -29200 7640 18642 -7629 -1563 25611 1745 -34591 -4730 28683
673 28683 -1560 -16660 18852 14526 -28183 -13140 27547 6870 -22240 2582 18878 -9676
685 -9676 -16540 14227 15624 -17284 -16682 15015 11852 -15348 -1243 22377 -7779 -33254 5022
698 5022 28884 -5929 -12994 18153 95 -36246 -6157 32053 7718 -15417 5512 6165 -25360
711 -25360 -19238 21281 24043 -7480 -10932 5650 -10109 -27305 7283 37332 2692 -26371 319
724 319 6695 -23404 -7087 34249 12568 -25418 -6200 11415 -14253 -14602 22684 20873 -16800
737 -16800 -17605 9139 4885 -14332 1925 22475 -2156 -25266 2703 21450 -9463 -16689 17773
750 17773 11533 -23967 -4651 27709 144 -24305 4946 15633 -13574 -8808 23879 13295
762 13295 -21337 -13945 12100 4629 -9319 10632 23087 -9605 -29490 2386 18947 -4409
774 -4409 111 25818 400 -35575 -7343 24419 2567 -5652 21028 9176 -29633 -18363 19444
787 19444 15337 -4914 5359 12940 -13477 -26697 6345 27192 1139 -11327 11679 4503 -27189
800 -27189 -7916 30298 8790 -20505 4428 16072 -17457 -17112 20759 15653 -16813 -8755 14017
813 14017 692 -14974 3671 15975 -6639 -18238 7391 17435 -8340 -12213 11336 1869
825 1869 -22277 1018 26588 -708 -19580 5327 5780 -21475 -5942 27431 10414 -18971 -7543
838 -7543 4718 -10692 -9967 18468 21330 -11256 -21796 897 2947 -13147 4999 29842 839
851 839 -31857 -7116 14826 -8118 -7352 25596 11830 -28227 -15691 14519 2343 -10127 11773
864 11773 16772 -13375 -22299 4647 13994 -5004 -4311 14609 2185 -22790 -3771 23249 1099
877 1099 -19526 6972 15930 -14284 -10781 20144 6961 -20227 -2359 16987 -2386 -10502 11392
890 11392 12111 -14313 -15273 10389 14180 -4294 -677 13293 -4985 -24779 1176 25804 3723
903 3723 -9492 9985 2445 -25453 -6453 26772 11493 -10500 3124 4535 -18906 -12259 19957
916 19957 19555 -5592 -7507 4629 -5917 -17439 5915 27670 4341 -18638 -909 7491 -14673
929 -14673 -6457 26427 11746 -22353 -7024 14898 -5931 -13948 14024 16280 -12822 -13226 9932
942 9932 6182 -11268 -2775 13673 480 -16641 628 17401 -3248 -16404 5746 8946 -14430
955 -14430 -4415 21927 2903 -22676 -3568 11394 -7275 -5643 17844 8263 -19648 -13681 7252
968 7252 3408 -5190 8566 14895 -9854 -24856 -1583 15192 -692 -2315 16010 369 -28989
981 -28989 -9658 20724 5180 -8627 11278 7983 -23073 -16950 15411 13438 -5543 433 7908
994 7908 -9158 -17948 4259 18316 524 -10719 5425 6029 -15359 -7592 19284 7635 -15969
1007 -15969 -284 13471 -8340 -11396 15252 10133 -16571 -6767 15769 4540 -10387 2147
1019 2147 9348 -6997 -11788 8860 15961 -3523 -9165 6836 1744 -16305 851 25505 5632
1032 5632 -17523 -715 6985 -13360 -4842 24444 12977 -15757 -8824 5326 -4974 -6561 15133
1045 15133 18377 -6481 -17303 -1249 5192 -5330 2705 20265 4302 -22199 -8294 12611
1057 12611 -1217 -6160 16420 10645 -19483 -12637 12591 3594 -9418 7012 12285 -9785 -14755
1070 -14755 5970 10149 -5763 -5888 8561 3106 -13223 -2633 15234 -198 -17275 1717 13398
1083 13398 -7959 -8895 14682 4988 -20322 -6465 14546 1239 -7869 7978 6882 -15549 -14307
1096 -14307 8664 12469 -2324 -2638 5908 -5831 -19269 -1060 20088 5135 -9796 3234 1456
1109 1456 -20320 -8281 22064 11779 -11336 -2200 4473 -13608 -11059 14660 15638 -5818 -8266
1122 -8266 2398 -3087 -11211 3421 18335 3227 -14702 -2219 8172 -7370 -7456 16020 10270
1135 10270 -15936 -6699 13715 -591 -11518 8341 11791 -10295 -8807 11680 7615 -8687 -3297
1148 -3297 8166 -239 -8868 4828 14925 -1814 -13958 1778 8388 -6891 -1795 18746 4937
1161 4937 -19050 -5483 11078 -2125 -3567 16713 9150 -16803 -12410 7570 5683 -1743 7738
1174 7738 11074 -7805 -18416 -622 13238 2484 -2117 10530 2468 -20417 -9132 16875 7439
1187 7439 -7954 6073 8134 -15952 -13819 12954 11550 -6803 -2041 6897 -5256 -12545 2954
1200 2954 12840 -855 -9482 2278 6146 -8422 -6754 11562 5083 -14493 -3674 12811 -2112
1213 -2112 -10831 7122 6476 -14370 -7081 13489 5019 -8612 -51 4436 -8811 -9978 8240 12982
1227 12982 -2733 -9148 479 -1041 -11303 789 19260 4716 -15792 -4402 5232 -9469 -5183
1240 -5183 19187 11018 -15150 -9540 5219 -3615 -6661 11873 14764 -7108 -15182 -629 5498
1253 5498 -2846 593 12962 3629 -15653 -6991 11035 1748 -7295 9295 10412 -12963 -10869 11936
1267 11936 6367 -8760 1647 9685 -5128 -8948 6868 8539 -5457 -6020 5498 4427 -5455
1280 -5455 66 11301 411 -13763 -932 12286 -558 -4788 10974 4285 -17090 -6453 14599
1293 14599 5377 -5478 6620 5826 -13490 -11402 9444 12075 -357 -848 3502 -5737 -14024 799
1307 799 17236 6056 -8086 227 2282 -13734 -7133 17663 11419 -10077 -3784 5010 -9191
1320 -9191 -9901 11970 13249 -6561 -8067 2926 -1005 -8241 1815 12158 1440 -11576 -2531
1333 -2531 7452 -3277 -7730 7940 7210 -11993 -6749 11696 1776 -11930 2093 8490 -8381
1346 -8381 -8295 10273 7190 -8863 -5943 3647 -967 -5540 4809 10490 -2820 -12985 -2264 5885
1360 5885 -3221 -1370 13134 3986 -17213 -8442 8931 938 -3436 11510 7091 -15309 -12076 6981
1374 6981 5445 -2199 5642 7860 -7392 -14346 162 10722 2874 -2239 5749 2009 -13699 -7117
1388 -7117 13532 7706 -7908 1852 8085 -9288 -10165 10588 9812 -7168 -2656 7690 -1746 -7949
1402 -7949 4187 9426 -2343 -7669 2946 7054 -2751 -3779 7034 3155 -11019 -2454 13533
1415 13533 3161 -8304 3546 5099 -11259 -5807 14406 8252 -7330 -1891 3472 -7127 -6989
1428 -6989 9420 12805 -1577 -8315 -875 -774 -6651 1723 15575 5479 -13051 -6121 4934 -4534
1442 -4534 -4455 14519 10506 -12839 -10191 4826 -642 -5414 8573 10635 -6703 -11619 513 4398
1456 4398 -2570 -57 8169 1748 -11489 -5609 8376 2185 -7431 3201 7187 -9065 -8384 9443
1470 9443 4947 -10166 -1907 7784 -3641 -7240 6631 6475 -7975 -7845 3940 3591 -3473 561
1484 561 6609 -2131 -12826 -2501 10243 1907 -4352 5873 2483 -14939 -7820 12578 6628 -5141
1498 -5141 3067 4624 -11788 -10770 8873 11365 -1043 -2455 1757 -4473 -10102 1374 13231 5504
1512 5504 -6597 -1685 2342 -7807 -5492 13224 10097 -8511 -4871 5812 -3842 -7513 9041
1525 9041 10680 -6095 -6641 4969 1689 -5109 1970 8336 -328 -7475 476 7875 -672 -5712 3895
1540 3895 5377 -7812 -3707 12086 4557 -10319 -1017 7010 -5339 -5291 11467 8341 -8651 -6745
1554 -6745 3629 149 -3440 6128 9710 -2906 -11805 -2949 5554 346 169 9502 3746 -13847
1568 -13847 -8782 8116 3758 -3226 7436 6458 -12247 -11557 6004 6234 -2205 3181 5703 -6540
1582 -6540 -11293 689 8179 1516 -2681 2355 805 -9155 -5471 8884 5227 -7500 -1157 6546
1596 6546 -5743 -9039 7683 7491 -8915 -5086 7179 13 -7185 2811 6354 -5242 -8036 3256
1610 3256 6812 -1721 -3939 3323 640 -9953 -3082 11565 4947 -8041 -1035 3511 -8617 -6237
1624 -6237 11766 9178 -6734 -4423 2019 -5377 -6013 8195 11112 -1699 -7286 -2227 -830 -3341
1638 -3341 2528 11253 4463 -9295 -6013 3929 -972 -3075 9698 8478 -9274 -8242 5563 1346
1652 1346 -4898 6450 9397 -5726 -8961 3300 5117 -2598 -435 6174 1305 -7143 -1958 8075
1666 8075 2135 -7242 1066 7226 -3968 -5833 8926 6124 -9626 -4455 8381 756 -5122 5932
1680 5932 6842 -7324 -8313 3730 5265 -225 1623 4369 -2799 -10506 -2522 9212 4778 -2661 2466
1695 2466 1630 -10934 -7159 10100 8016 -4010 365 2987 -9447 -9039 7690 9742 -2003 -2678
1709 -2678 1097 -4546 -7924 1831 10022 2915 -6070 -2695 1515 -5201 -4697 8403 7336 -7795 -5924
1724 -5924 5302 -1117 -7444 4764 7979 -6495 -7418 5170 2908 -5415 -671 5141 -1833 -6830
1738 -6830 1027 6969 -25 -6082 32 2768 -4935 -2818 9596 4721 -9423 -4372 4997 -2405
1752 -2405 -4110 9455 7733 -8240 -7654 2709 511 -2217 6215 8219 -3334 -9784 -2608 4354
1766 4354 1749 1415 6855 2237 -10819 -6866 7072 4856 -2724 4957 6520 -8652 -9628 6247
1780 6247 7000 -2661 1500 6090 -4155 -8539 2435 7761 599 -2902 2141 2341 -4905 -3296 6842
1795 6842 4712 -6052 -2294 6583 -404 -5833 4819 6208 -7320 -5333 7488 3818 -4648 1543
1809 1543 4547 -5085 -6459 4146 7188 148 -2510 882 -1718 -7062 -675 10223 5139 -6063
1823 -6063 -2883 1851 -6036 -4846 10406 9034 -6754 -5832 2192 -3983 -5680 7488 9976 -2977
1837 -2977 -7868 -1574 -351 -3090 2041 8587 2297 -8510 -5939 3309 313 -3475 5367 6720 -7524
1852 -7524 -8759 4826 3446 -5111 1660 6618 -4205 -7506 2954 4581 -3237 -2309 3046 86
1866 86 -5024 -458 5845 714 -6609 -1745 4741 -1110 -3291 6169 4309 -8910 -5728 6416 2304
1881 2304 -3519 4885 5237 -8014 -8256 4418 5569 -453 1899 4210 -3514 -9283 -1044 8478 4873
1896 4873 -1827 1093 1455 -7964 -5997 9071 8535 -3683 -1524 3599 -5623 -7593 6684 9626 -1791
1911 -1791 -3189 2352 -1862 -5801 2363 8153 1976 -4553 -1218 2587 -1656 -2479 5631 5355 -5582
1926 -5582 -4547 5943 2005 -5530 2299 6046 -4837 -5779 6411 5120 -4692 -1851 3603 -1646
1940 -1646 -4612 3130 7040 -191 -5623 -1351 1358 -2709 -711 8056 4528 -8191 -6257 3542 -316
1955 -316 -2896 7361 6498 -8141 -8688 2144 1568 -2133 4778 6630 -4279 -9222 -1791 3652 1080
1970 1080 859 4389 513 -8582 -6206 4889 4239 -2919 1660 4495 -6785 -8589 5058 6499 -4194
1985 -4194 -1849 4725 -2327 -7226 2138 6038 -1449 -4102 1267 1765 -3198 -1939 4514 2038 -6071
2000 -6071 -3069 5559 1720 -4451 2205 4136 -6847 -5827 6851 5447 -3703 -422 3004 -4764
2014 -4764 -6036 4531 7397 154 -2455 116 -2060 -4850 789 8872 5042 -4732 -3600 1095 -3379
2029 -3379 -3045 8725 8639 -4796 -5774 1666 -1514 -3772 6669 8865 -2919 -6558 628 1094 -1992
2044 -1992 1937 7191 1610 -6184 -3188 3515 1135 -2428 3808 5316 -4929 -6096 4955 4603 -4624
2059 -4624 -552 5776 -2174 -5896 3941 5614 -3790 -3994 2770 1321 -3005 886 4981 -92 -6479
2074 -6479 -2435 3902 1201 -1801 3882 3079 -7593 -6512 4907 3845 -2286 2751 3718 -7480 -8224
2089 -8224 3641 5565 -547 762 2507 -4562 -7819 -126 6477 3151 -1998 -348 -287 -6484 -4558
2104 -4558 6481 6546 -3693 -3251 2487 -3885 -6752 4790 7671 -3157 -4732 2128 -687 -5043 1356
2119 1356 5829 -369 -5117 -816 2744 -800 -2532 2578 2886 -4555 -3574 5048 3008 -4681 -285
2134 -285 4147 -3985 -4914 6018 5834 -4133 -3278 2349 -1512 -3530 4382 6996 -863 -5672 -1588 1096
2150 1096 -984 909 6819 3630 -6645 -5945 2987 1847 -1347 5892 6372 -6176 -8044 2592 3700
2165 3700 -1111 3513 6088 -3014 -7559 -312 4294 1301 1004 3313 403 -5680 -3630 4591 4286
2180 4286 -1863 98 3674 -3408 -5778 4148 5891 -3797 -2544 4477 -456 -4930 2397 5345 -2816
2195 -2816 -4299 2001 2604 -1701 -642 2840 -13 -5681 -1823 5439 2887 -3364 104 2214 -5450
2210 -5450 -5269 6193 5963 -3413 -1868 1847 -4797 -6123 4557 7541 -676 -3814 -957 -2492 -4121
2225 -4121 1181 6815 3090 -4671 -4015 80 -2154 -2343 5871 6522 -4718 -6262 1236 25 -3595
2240 -3595 4115 6672 -3569 -6707 1000 1738 -2380 729 4595 -219 -5113 -1729 3380 973 -2595
2255 -2595 1022 3334 -3163 -4103 4409 4349 -4559 -2584 4303 -631 -4302 4151 5355 -4126 -4725 2450
2271 2450 1805 -1441 2477 4631 -1331 -5912 -1659 3875 2591 270 3092 1789 -6294 -5163 5035
2286 5035 5231 -1248 1799 3395 -5504 -7002 3905 6688 1 159 2587 -3276 -6343 1193 6635
2301 6635 2902 -1531 -293 40 -3685 -2585 5011 5552 -2796 -3164 2541 -1084 -4797 3363 6748 -2681
2317 -2681 -4505 2838 1360 -3729 758 4397 -1311 -4456 824 3271 -495 -2181 999 869 -3622
2332 -3622 -1956 4962 3312 -4535 -2642 2457 -2421 -3658 5103 5880 -4348 -4975 1276 -1126 -3067
2347 -3067 3924 6125 -2169 -6060 -1935 341 -600 1534 5215 1719 -6346 -5956 1940 2090 -1090 3328
2363 3328 4348 -5452 -7505 2190 3792 -1556 1514 4436 -3236 -6978 477 4208 116 -329 2215
2378 2215 -100 -4412 -2088 3758 2906 -2457 -1119 2765 -1033 -3892 2947 4703 -3570 -3656 3835 1601
2394 1601 -3561 1871 4112 -3238 -4616 2537 3712 -518 -34 2009 -1037 -4468 -868 5393 3930
2409 3930 -1575 -668 1218 -4245 -3551 5790 6793 -2346 -2532 1491 -2870 -4531 4597 7440 -574 -3366
2425 -3366 12 -1451 -3177 2099 6273 2333 -3908 -3219 641 -388 -1237 4245 5171 -3484 -5391 1841
2441 1841 1774 -2753 2122 5482 -2393 -5672 1682 2949 -2279 -360 3459 -407 -3987 -342 3223
2456 3223 474 -2689 -649 1792 -1462 -2306 3467 3179 -4546 -3927 2974 539 -3024 3119 4351 -4739
2472 -4739 -6105 1691 2346 -1339 1943 3438 -2707 -6257 -1465 3079 2060 320 1477 214 -5574
2487 -5574 -4906 3498 4815 -1149 -205 2084 -4274 -6694 3003 6333 -942 -1570 1775 -2663 -5239 1099
2503 1099 5219 1004 -2202 -675 -116 -2532 -1781 3404 3771 -2346 -3054 2349 776 -3279 1640 4959
2519 4959 -2308 -4376 3201 3068 -2860 -254 3171 -1559 -3749 2044 4316 -1 -1983 209 -4
2534 -4 -2249 -258 4932 3570 -3325 -3326 1387 -690 -2111 5047 5951 -3245 -5095 1325 340 -2048 4023
2551 4023 6347 -1810 -5650 -1023 1293 348 2169 4372 933 -4801 -4055 1921 2774 -217 2335 3625
2567 3625 -3519 -6026 2055 4217 -1247 179 3919 -2054 -5800 966 3952 -662 -1395 1612 140
2582 140 -3153 -769 2802 1267 -2702 -1715 2159 226 -2804 1276 3096 -3639 -4456 3148 2839 -2774
2598 -2774 428 2969 -3599 -5314 2096 4078 -426 -670 871 -2401 -4471 -151 4483 2929 -1760
2613 -1760 -2024 -408 -3053 -2834 4331 5444 -2281 -3691 830 -1859 -4012 3371 6552 -1299 -4303
2628 -4303 -186 -624 -2716 1711 4971 899 -3693 -2354 763 53 -511 2507 3580 -2482 -4258 1958
2644 1958 2927 -2432 42 4131 -1276 -4365 2159 3895 -1992 -1315 2428 -191 -2581 1594 3760
2659 3760 -62 -2883 -734 1373 95 -206 3267 2599 -3748 -4213 2429 2579 -1031 2818 3838 -3929
2675 -3929 -5500 1705 3198 -169 2288 3480 -2846 -5711 -316 3832 2292 551 1159 -227 -4415
2690 -4415 -3551 3213 4962 -329 -1111 1783 -2543 -4937 2359 5725 -862 -2213 1927 -1275 -4422
2705 -4422 856 4449 -105 -2946 -79 346 -1484 -880 1987 1599 -2295 -2590 1897 1590 -2450 -121
2721 -121 2608 -2404 -3927 2884 3423 -2995 -1853 1970 -1907 -3971 2184 4402 -569 -2924 -1153
2736 -1153 -860 -1742 691 3922 2117 -3235 -3911 108 204 -1261 3438 4796 -3193 -5589 606 892
2752 892 -1734 2735 4925 -2320 -5565 -740 1565 119 1718 3130 -260 -3904 -2684 1491 2147
2767 2147 -57 735 2236 -2262 -4235 1912 4098 -1470 -1294 3096 -442 -4136 1415 4336 -1117
2782 -1117 -2458 1642 927 -1515 601 2910 271 -2742 -1019 2176 1675 -482 1105 1966 -2969 -3687
2798 -3687 3212 4613 -1144 -414 2488 -2633 -4536 2519 4852 233 -830 964 -1946 -3681 957
2813 957 4658 2695 -1105 -1916 -988 -1945 -1567 3580 5106 -1400 -3868 43 -337 -2945 2413 5634
2829 5634 -1051 -4048 140 74 -2328 1165 3854 -78 -3386 -1513 739 50 -611 1138 1535 -2227
2845 -2227 -3017 1604 2477 -2271 -1684 2165 -581 -3718 1800 3551 -2721 -3096 1575 55 -2465 1574
2861 1574 3428 -1015 -3943 -1476 908 527 595 2269 1306 -3546 -4224 1176 2806 -144 1243 2621
2877 2621 -3469 -5379 1415 3810 -373 665 2479 -2411 -5082 -9 3337 1668 404 672 -827
2892 -827 -3357 -2082 2523 3963 -10 -1485 706 -1090 -3197 1990 5036 -922 -3099 1766 726
2907 726 -2948 712 3805 -349 -2550 916 1480 -745 -155 1807 521 -1886 -1200 2593 2469 -1247
2923 -1247 -1045 1366 -1288 -2531 3061 4583 -1654 -2551 1552 -996 -2826 2990 5142 -589 -3324
2938 -3324 -561 -402 -1193 1626 3898 1694 -2867 -3369 -149 888 -49 2628 3914 -2289 -5434 137
2954 137 2048 -838 1551 3842 -1760 -5130 -274 2018 -75 549 2383 -544 -3551 -1748 1399
2969 1399 1503 -547 -344 943 -1441 -3079 1206 3134 -1620 -2653 1869 469 -3124 683 3304
2984 3304 -1956 -3458 1056 1329 -1328 467 2244 -1031 -3273 -1099 1979 1823 -152 23 114 -2669
3000 -2669 -3306 2107 4098 -431 -1242 1155 -2204 -4441 2043 5110 16 -1687 257 -1635 -3374
3015 -3374 1177 4321 1714 -1196 -1563 -779 -1324 -586 2628 3668 -781 -3386 137 599 -1628 1434
3031 1434 4510 -576 -3932 887 1762 -1684 300 3544 15 -2783 181 2022 303 -492 609
3046 609 966 -828 -1061 1785 2595 -1584 -2238 1325 690 -1873 1911 3926 -1914 -3941 960 1193 -1086
3063 -1086 1732 3466 -1110 -3782 -890 812 794 1447 2372 239 -3568 -3609 1105 3088 414 242 1807
3080 1807 -2591 -4910 770 4026 298 -311 1848 -2176 -4882 135 3695 859 -798 431 -785
3095 -785 -2700 -1132 1525 2348 -494 -1863 292 -655 -2442 504 3365 -811 -3298 846 1652 -2114
3111 -2114 -341 2521 -1261 -3208 950 2108 -871 -865 821 -464 -2315 -489 2064 2002 -1114 -1822
3127 -1822 -141 -982 -2111 2439 4288 -1099 -3648 338 -288 -2365 2312 4912 -541 -3660 -842
3142 -842 -148 -840 1502 3579 888 -2298 -2474 -362 1081 684 1947 2674 -1483 -4194 154 2759
3158 2759 -266 600 3326 -737 -4101 183 2848 -308 -61 2188 34 -2715 -142 2313 986
3173 986 -784 -391 851 18 -1333 957 2374 -911 -2443 1322 1965 -1506 717 2900 -1401 -3838
3189 -3838 1033 2732 -244 566 1483 -1807 -3418 -214 2381 1794 412 -493 -694 -2274 -2399 1913
3205 1913 3871 166 -1818 86 -1780 -3524 1492 4749 88 -2444 55 -1400 -3287 848 3894
3220 3894 943 -2003 -1482 -907 -1451 -523 2080 2313 -1029 -3016 -218 1144 -1467 78 2884 -635
3236 -635 -3885 52 2285 -1455 -1074 1949 -529 -2672 416 2064 -375 -1216 -384 -22 -805 -155 1834
3253 1834 1737 -1530 -2968 540 831 -835 1302 3028 -1671 -4166 212 1702 -527 1586 3299 -1416
3269 -1416 -4137 -779 1731 819 1440 1843 -248 -2920 -2264 1087 3178 1201 156 977 -1680 -3788
3285 -3788 645 4076 704 -833 1436 -508 -3602 3 3753 823 -941 802 -165 -1658 -177
3300 -177 1935 1508 -582 -1119 547 829 -928 170 2281 -513 -2821 1273 2551 -1212 -822 1843
3316 1843 -838 -2969 1350 3270 -59 -945 512 -1121 -2043 377 2675 1686 -959 -2011 -637 -543
3332 -543 -926 1843 3683 -968 -3854 -579 278 -1693 1586 4213 -723 -3950 -951 208 -899 1079
3348 1079 3147 47 -2909 -2335 -205 699 745 985 898 -1392 -3279 -335 2339 -226 -558 1723 -362
3365 -362 -3755 -66 2734 -495 -1543 1197 89 -2393 202 1984 62 -1679 -391 579 175 -241
3381 -241 792 1209 -1609 -2813 908 2593 -179 140 1931 -1431 -3817 982 3228 459 61 1340
3397 1340 -1511 -3420 178 2903 1655 192 -188 -1004 -1949 -1329 1932 3796 637 -1978 -301 -756
3413 -756 -2267 1311 4394 629 -2385 -13 -316 -2143 864 3674 887 -1875 -677 138 -691 171
3429 171 1630 1381 -638 -1528 210 1344 -473 -441 2155 -41 -2407 689 2605 -961 -1693 1446
3445 1446 9 -2026 858 2811 -448 -1975 -302 114 -493 812 1780 1001 -1632 -2762 -198 1325
3461 1325 160 1124 2154 -1603 -4161 -435 2290 -16 580 2379 -1307 -4328 -891 1805 893 955
3477 955 1336 -955 -3128 -1734 993 2125 516 -310 -229 -1250 -2908 92 3181 312 -1650 619
3493 619 15 -2891 -39 2992 51 -2066 363 383 -1501 -354 1523 308 -1239 -1039 651 958
3509 958 -437 -269 861 -755 -2264 896 2762 -331 -1580 1180 -450 -2670 905 3600 342
3524 342 -1475 -15 -924 -1873 923 2979 1726 -936 -1687 -932 -308 52 1962 3104 -293 -3114 -826
3541 -826 1038 -562 1099 3822 72 -3419 -894 1039 -316 828 2940 413 -2515 -1199 846
3556 846 758 681 992 761 -607 -1857 35 2368 205 -1104 1062 649 -2113 -188 2701 -298 -2327
3573 -2327 801 1052 -1336 323 2122 -356 -1989 -732 837 641 378 764 233 -1753 -2347 619
3589 619 2412 267 -540 688 -1154 -3768 445 3327 406 -742 426 -1281 -3497 -477 2833
3604 2833 1365 -547 -651 -1333 -2210 -971 1733 2532 210 -1940 -835 -470 -1565 591 3254 420
3620 420 -2736 -749 556 -1650 -88 2709 525 -2251 -572 666 -620 -228 1092 513 -1068 -902
3636 -902 614 1242 -311 -1057 670 41 -1612 606 2765 -385 -2405 388 606 -1196 911 3199
3652 3199 -77 -2606 -479 408 -200 1160 2344 699 -1804 -2165 -192 1608 1118 1086 1688 -1054 -3501
3669 -3501 -321 2569 936 214 2075 -366 -3665 -637 2469 1106 569 1336 -499 -2392 -896 1478
3685 1478 1823 729 -58 130 -543 -1556 326 2411 640 -1628 120 962 -1585 -369 2463 54
3701 54 -2184 130 1504 -668 -439 1148 -266 -1646 -521 1123 943 -7 -568 -152 -824 -1711 828
3718 828 2844 -133 -2101 -35 -358 -2301 599 3621 312 -2269 -690 -815 -1780 719 2917 874
3734 874 -1624 -2007 -1103 -383 468 1595 1752 -645 -3059 -1126 838 -320 430 2462 11 -3362 -1033
3751 -1033 1537 -440 92 2194 22 -2550 -1100 1180 184 -303 433 211 -667 -1072 217 1209 -349
3768 -349 -1531 242 1150 -1015 -24 2197 -204 -2530 196 1753 -557 260 1992 -398 -2449 -372
3784 -372 1361 869 988 871 -411 -1481 -1578 723 2795 1151 -361 126 -883 -2412 403 3667 1017
3801 1017 -1019 440 -761 -2725 116 3340 1418 -400 -11 -752 -1571 -73 2089 2054 265 -1406
3817 -1406 -734 -37 -618 205 2406 468 -2203 -465 1269 -840 -555 2186 431 -2119 -339 1547
3833 1547 -114 -801 541 111 -1105 -249 834 1045 -500 -1393 -318 105 -704 395 2235 -612 -2878
3850 -2878 -458 733 -952 570 2693 -496 -3315 -1036 593 -237 882 1905 1 -2286 -1932
3865 -1932 -74 1072 886 604 526 -1336 -3278 -692 2161 789 -525 1242 -190 -3216 -815 2273
3881 2273 783 -536 727 -152 -2265 -700 1500 972 -267 -309 -200 -288 -773 242 1642 234 -1779
3898 -1779 116 1691 -557 -709 1694 -93 -2328 250 1999 43 -439 1044 -402 -1749 47
3913 47 2083 1307 96 -551 -765 -1010 -537 1330 2678 648 -1763 -768 -188 -1373 851 3598 745
3930 745 -2390 -817 112 -1267 709 3087 829 -1666 -1153 -487 -202 672 1686 1290 -757 -2177 -860
3947 -860 918 309 84 1715 346 -2446 -836 1922 -95 -621 1149 359 -1985 -379 1434 82
3963 82 -872 145 203 -611 -221 591 655 -717 -1662 -114 999 -239 -262 1385 -383 -2802 -240 1763
3981 1763 -18 -131 1347 -818 -3114 -625 1622 736 333 512 -818 -2338 -1309 788 1993 1012
3997 1012 -794 -597 -937 -2060 90 2713 1094 -1535 -306 -366 -2226 -203 2798 1282 -1313 -494
4013 -494 -289 -1257 39 1674 1064 -333 -1085 -485 399 46 10 1369 410 -1641 -233 1719 -61 -1015
4031 -1015 1296 308 -1879 46 2267 147 -889 464 107 -926 417 1773 1032 -582 -1143 -483
4047 -483 635 214 1009 1896 -89 -2613 -751 1556 168 569 2578 -265 -2938 -990 1246 458
4063 458 1020 2137 -94 -2209 -1176 465 1127 1157 496 94 -900 -2121 -415 2027 1046 -481 501
4080 501 26 -2096 -512 2395 696 -1052 486 345 -1621 -596 1419 474 -873 -185 24 -265 12
4097 12 122 396 -388 -1375 -55 1500 -73 -830 601 -437 -2316 72 2327 217 -1133 200 -821
4114 -821 -2095 140 2021 812 -507 -847 -1097 -1068 -188 1251 1827 207 -2162 -1255 -175 -772 413
4131 413 2648 674 -2634 -1110 491 -880 671 2639 485 -2089 -1086 226 -86 731 1418 393
4147 393 -604 -1420 -369 1080 539 11 695 456 -1410 -423 1913 494 -1359 772 863 -1430 42
4164 42 1960 79 -1267 116 580 21 539 917 275 -738 -1073 36 1398 874 101 992 -486 -2543
4182 -2543 -368 2223 712 -244 1061 -439 -2540 -365 2304 1107 157 552 -743 -2116 -523 1042
4198 1042 1697 868 -615 -884 -599 -1067 4 2271 827 -1504 -521 166 -1294 -358 2137 710 -1526
4215 -1526 -450 372 -1051 -206 1264 367 -875 -715 -32 143 -130 -303 352 -67 -1181 -210 1590 -33
4233 -33 -1533 58 200 -1650 100 2006 46 -1818 -276 -70 -1001 492 1824 463 -1085 -1260
4249 -1260 -821 210 670 847 956 -550 -2546 -1079 1243 512 233 1686 -31 -2831 -1189 1443
4265 1443 459 522 1579 -136 -2384 -1015 762 784 864 573 -386 -950 -1036 -78 1681 941 -656 149 438
4284 438 -1058 -491 2018 729 -1378 242 859 -718 -52 1740 -1 -1322 -40 754 358 343 467
4301 467 -50 -581 -923 410 1820 897 -934 69 -66 -1590 217 2642 832 -988 -69 -282 -1760
4318 -1760 192 2534 1056 -633 -701 -784 -944 236 1341 1355 96 -1607 -1390 68 -54 440 1945
4335 1945 569 -2274 -1215 759 -265 37 1859 518 -2172 -1125 626 -53 194 931 -25 -994
4351 -994 -769 26 529 286 -622 -122 262 -922 -436 1454 251 -1956 -126 1021 -538 -311 1615
4368 1615 -224 -2019 -340 496 -118 462 958 -209 -1565 -1218 36 1014 981 40 -39 -839 -2117 -523
4386 -523 2162 1044 -562 355 -284 -2295 -528 2304 1147 -263 -19 -611 -1819 -96 1397 1423 481
4403 481 -554 -788 -607 -394 315 1726 954 -1475 -524 808 -413 -148 1652 805 -1742 -258 1209
4420 1209 -114 -388 1054 375 -990 -179 836 765 196 -259 -171 -159 -320 438 1526 514 -1512 -514
4438 -514 531 -701 405 2345 268 -1816 -653 352 -308 573 2345 392 -1533 -1056 -305 237
4454 237 957 970 681 -503 -1915 -947 1065 939 162 866 -45 -2451 -1067 1549 525 -277 755 -183
4472 -183 -1915 -782 976 615 -38 144 -128 -930 -670 182 865 303 -649 -351 294 -488 -536 1120 309
4491 309 -1899 -383 1379 -364 -415 871 -58 -1849 -365 1051 443 75 -37 -575 -1165 -407 600
4508 600 1440 556 -1000 -789 -398 -1130 79 2313 823 -1408 -689 -267 -1319 51 2450 1159 -1112
4525 -1112 -780 -407 -837 441 1563 994 -466 -992 -786 330 656 517 1154 628 -1552 -983 1052 587
4543 587 -419 1245 437 -1750 -485 1154 171 -492 549 262 -685 35 668 669 110 -543 -160 435 303
4562 303 110 1118 276 -1761 -451 1325 38 -10 1368 119 -2064 -528 1209 443 596 1131 -207
4579 -207 -1647 -590 384 952 1152 242 -391 -765 -1511 -175 1831 1293 -355 -260 -272 -1624 -714 2073
4597 2073 1051 -741 -142 -365 -1484 -337 1250 617 -319 -437 -820 -437 -135 37 650 312 -1207 -837
4615 -837 704 242 -748 796 591 -1590 -721 1102 -137 -941 353 -59 -1310 -131 1161 593 -410
4632 -410 -559 -805 -334 -75 445 1051 271 -1361 -1038 669 -138 269 1743 459 -2122 -916 672 -91
4650 -91 354 1859 208 -1816 -938 -76 229 999 1247 348 -847 -1362 -612 1051 1263 222 394 213
4668 213 -1500 -919 1704 895 -374 595 567 -1444 -539 1521 517 -308 243 183 -423 -81 540 471 105
4687 105 -495 -286 648 295 -259 660 134 -1238 -217 1482 468 -615 547 -193 -1589 -348 1711
4704 1711 518 -125 -92 -711 -1272 -190 901 1200 516 -802 -1070 -438 -514 289 2001 876 -1548 -1135
4722 -1135 57 -1011 -59 2068 808 -1582 -989 -99 -790 237 1413 642 -730 -1121 -871 -35 551
4739 551 106 368 60 -1402 -1036 989 484 -703 500 360 -1324 -668 1316 238 -885 68 57 -863
4757 -863 9 915 248 -424 -638 -348 91 405 307 504 -117 -1693 -790 926 530 28 1005 83 -1948
4776 -1948 -808 1466 731 232 1058 -145 -1741 -871 901 1337 885 245 -518 -784 -880 163 1629 1347
4794 1347 -537 -490 96 -935 -167 1667 1276 -947 -363 283 -984 -198 1492 783 -503 -290 -54 -152
4812 -152 175 501 351 97 -436 -171 865 498 -727 326 318 -981 -207 1628 628 -1179 141 216
4830 216 -1097 -6 1545 479 -659 -594 -700 -514 469 847 881 17 -1235 -1047 335 320 408 1110 58
4849 58 -2002 -1247 754 239 158 1371 259 -1913 -1179 290 196 398 697 -232 -998 -1024 -268 553 705
4868 705 -168 -169 -67 -1031 -850 1067 779 -943 -108 354 -921 -580 1283 488 -947 -276 424 -364 -54
4887 -54 743 -98 -467 -592 152 823 679 -150 123 -103 -1148 -421 1599 949 -707 6 22 -1403 -322
4906 -322 1802 1101 -439 -13 -500 -1058 -90 1286 1176 178 -407 -902 -191 7 604 1501 818 -1110 -1074
4925 -1074 216 -15 -5 1586 1031 -1388 -767 426 -48 161 1239 603 -784 -510 264 423 472 373 20
4944 20 224 -510 -289 748 614 -875 -194 543 -843 -386 1305 395 -1182 -431 505 -431 42 1168
4962 1168 306 -1009 -509 -381 148 687 609 143 -442 -988 -899 944 819 -35 125 -324 -1717 -800 1297
4981 1297 849 -216 483 -425 -1835 -787 1157 833 409 98 -812 -1215 -627 23 1059 736 -689 -738
4999 -738 -50 -638 -450 1128 710 -1026 -843 508 -342 -560 948 631 -1077 -362 342 -58 -25 210 -21
5018 -21 -621 -356 183 882 311 -649 -347 141 -583 -84 1484 824 -978 -499 139 -733 359 1695 582
5037 582 -830 -708 -201 -32 644 1115 704 -104 -1033 -905 351 1064 503 644 337 -1382 -1077 913 599
5056 599 199 1189 535 -1601 -899 813 632 88 838 252 -695 -565 374 607 581 239 -301 9 -390 -177
5076 -177 772 761 -896 -366 603 -127 -641 720 504 -1124 -344 558 61 19 497 28 -851 -661 188 666
5096 666 464 -255 -252 -307 -965 -402 1273 651 -720 -641 -426 -1242 -465 1695 936 -730 -408 -303 -1002 -43
5116 -43 1334 774 -299 -682 -927 -759 189 524 844 206 -1041 -995 158 130 -101 891 642 -1390 -944
5135 -944 718 314 -269 647 454 -940 -585 381 234 5 14 -265 -235 -163 67 727 339 -902 -535 572
5155 572 85 -115 1122 596 -1225 -582 542 45 239 1226 190 -1135 -685 141 505 935 595 94
5173 94 -429 -898 -307 1000 1325 296 78 186 -1058 -621 1284 1105 -117 235 -17 -1324 -515 1385
5191 1385 962 76 74 -400 -744 -145 555 571 647 -161 -701 140 27 -198 652 775 -1034 -567 861 -7
5211 -7 -454 638 370 -922 -394 875 344 -206 119 -404 -683 -64 579 707 368 -511 -761 -88 -432 46
5231 46 1113 683 -1244 -1133 211 -333 -176 1411 487 -1297 -990 -178 -246 381 1175 212 -795 -1002 -640
5250 -640 -15 813 517 161 -80 -1172 -983 495 816 -101 188 229 -1177 -862 894 612 -290 247 29
5269 29 -775 -551 481 413 -100 -144 -204 28 116 -150 533 550 -643 -424 592 315 -283 662 61 -1216 -460
5290 -460 1066 488 -7 421 30 -995 -401 779 873 552 155 -545 -709 -187 242 1508 1127 -378 -580
5309 -580 -51 -646 -318 1474 1071 -708 -755 -9 -501 -103 1188 799 -368 -436 -257 -289 185 860 577 78
5329 78 -733 -782 299 340 -213 335 546 -818 -681 497 259 -416 231 251 -615 -297 664 169 -145 -152 -276
5350 -276 -256 123 331 382 18 -774 -765 263 324 -131 687 192 -1531 -812 661 206 57 847 96 -1620
5370 -1620 -983 334 518 372 508 -408 -832 -895 -434 701 769 22 -613 -186 -888 -571 921 1108 -565
5389 -565 -508 -8 -801 -605 962 722 -241 -202 -131 -531 -135 717 165 -7 -61 -365 136 468 -46 128 440
5410 440 -627 -673 904 396 -542 223 321 -650 -107 1099 526 -393 20 -234 -609 97 974 688 208 -385
5430 -385 -808 -176 257 378 718 511 -1028 -1059 209 248 263 1316 691 -1012 -1014 124 -32 370 1121 456
5450 456 -759 -574 -315 312 798 396 45 -71 -721 -756 490 971 -105 -248 205 -693 -741 652 458
5469 458 -672 17 341 -598 -129 504 412 -384 -189 -154 91 268 126 -109 -153 -767 -549 630 562 -129 -12
5490 -12 116 -1102 -775 815 817 -229 21 -185 -1249 -572 748 600 79 -156 -770 -658 -168 214 613
5509 613 806 -573 -986 -238 -311 -155 1105 865 -774 -736 62 -297 -216 975 716 -476 -547 -211 -132 91
5529 91 759 225 -14 -252 -320 233 628 18 -28 352 -124 -480 914 616 -697 -52 498 -383 -191 1025
5549 1025 518 -555 -319 -5 -6 384 723 475 -121 -727 -466 276 893 402 568 315 -1067 -1034 532 931
5569 931 152 739 218 -1045 -741 687 570 488 511 -11 -1061 -383 54 539 530 -51 -528 -215 -578 -153
5589 -153 764 923 -404 -433 46 -488 -816 661 872 -385 -423 126 -392 -313 310 260 -268 -363 18 56 509
5610 509 -190 -298 -183 -485 -560 431 545 -576 -416 70 -320 -589 922 593 -640 -518 -316 -700 64
5629 64 805 492 -217 -547 -715 -270 378 507 484 369 -680 -830 198 508 142 712 654 -911 -1026 400
5649 400 446 39 573 426 -713 -533 195 371 245 430 -170 -204 -271 -311 370 738 -335 -262 227 -237 -546
5670 -546 698 668 -543 -405 497 17 -188 727 295 -873 -279 213 199 381 392 -155 -263 -248 -284 650 874
5691 874 62 -82 -5 -805 -460 1071 830 -87 -177 -104 -908 -445 927 894 112 -241 -516 -663 -51 429 727
5712 727 538 -282 -863 -184 42 -101 675 762 -625 -647 318 -80 -251 590 356 -717 -662 182 -85 -98 439
5733 439 -91 -554 -314 -138 300 255 -137 -600 80 -75 -305 525 479 -816 -637 251 -134 -237 750 467
5753 467 -924 -602 28 -10 218 730 335 -630 -661 -360 252 695 140 107 -17 -833 -844 616 863 0 103
5774 103 180 -940 -898 707 715 34 311 105 -981 -434 554 521 493 163 -418 -221 18 -64 303 744 -62
5795 -62 -586 175 290 -394 393 681 -453 -371 696 218 -104 645 66 -366 -130 371 210 364 88 -159
5815 -159 -53 -164 -86 623 742 -489 -669 18 -188 -249 970 810 -647 -688 -186 -225 -33 1035 703 -367
5835 -367 -403 -455 -208 423 499 324 130 -798 -891 -105 825 32 179 466 -598 -1031 203 329 -152 321 344
5856 344 -671 -616 249 189 170 118 -254 -228 -310 -154 84 391 -260 -662 178 78 -315 196 321 -765 -735 423
5878 423 397 -377 503 159 -902 -449 142 208 195 427 -249 -433 -434 -50 483 684 35 -472 -190 -274 -558 752
5900 752 663 -358 -560 -72 -491 -447 759 877 -66 -198 -59 -639 -11 687 602 281 -284 -523 -174 272
5920 272 169 292 459 -201 -606 303 400 -304 429 646 -428 -309 547 242 -118 308 349 -245 182 411
5940 411 138 179 -177 -338 12 285 164 383 445 -558 -758 292 232 -171 705 548 -875 -674 248 241 99
5961 99 700 202 -811 -397 -164 203 423 329 -211 -271 -606 -588 475 883 40 -210 196 -536 -762 607
5981 607 951 -414 -184 19 -594 -589 336 346 -58 0 -359 -313 253 57 40 256 -244 -421 41 355 -246 -32
6003 -32 281 -516 -594 625 400 -405 -21 103 -575 -328 504 464 99 82 -549 -443 -92 111 382 326 -461
6024 -461 -823 22 30 -67 695 729 -508 -722 53 101 -94 741 743 -378 -442 -323 -124 216 621 181 -57 -400
6046 -400 -432 290 703 217 98 343 -376 -503 337 637 -272 223 549 -324 -429 497 252 -55 58 140 -214
6067 -214 -3 255 69 -57 -225 -465 266 233 -33 -34 268 -431 -600 487 467 -76 276 271 -965 -475 540
6088 540 535 154 253 -231 -749 -363 77 404 475 59 -559 -443 -284 -388 563 900 -192 -737 -6 -418 -596
6109 -596 836 672 -501 -457 -63 -633 -220 462 454 -330 -212 -455 -88 341 92 -145 86 -73 -510 207
6129 207 419 -640 -105 360 -285 -377 653 457 -333 -245 87 -444 -140 568 113 -94 -196 -431 -175 320
6149 320 190 300 311 -474 -784 114 353 187 412 528 -639 -753 243 378 160 494 62 -852 -624 -40
6169 -40 303 338 612 -221 -247 -231 -127 385 822 114 -353 10 -131 -390 591 866 -232 -330 257 -88 -364
6190 -364 389 413 -332 -64 -28 7 78 111 47 95 -172 -449 186 575 -193 -137 85 -431 -500 553 587 -251 53
6213 53 -13 -566 -238 741 534 2 -91 -365 -620 -59 534 396 202 -397 -661 -183 337 39 503 585 -639
6234 -639 -1037 -20 143 -192 611 442 -431 -666 53 -164 -3 480 52 -377 -301 -310 -127 348 125 -234 20
6255 20 -290 -459 141 385 -285 -333 228 -228 -420 290 378 -498 -352 96 88 133 356 122 -135 -197 -243 89 520
6278 520 158 -113 -84 -507 -579 238 901 129 64 -12 -605 -485 552 575 229 -27 -226 -596 -294 329 543
6299 543 338 27 -385 -490 -69 -17 500 830 -179 -796 -76 95 -494 347 680 -288 -515 141 224 -148
6319 -148 538 365 -250 -136 -60 70 164 102 -62 48 117 -93 208 413 -225 -362 94 -162 -311 449 532 -477
6341 -477 -389 160 -54 106 613 346 -262 -255 -4 -30 278 508 201 -28 -554 -695 83 497 234 -113 305
6362 305 -657 -896 275 502 54 134 55 -787 -724 364 332 -162 174 -143 -540 -230 -115 264 456 -97 -497
6383 -497 -149 60 -298 331 357 -385 -455 160 73 -141 463 223 -554 -370 395 17 92 366 14 -435 53
6404 53 -33 292 538 166 -508 -33 -246 -302 499 677 -52 -483 -85 -394 -293 684 559 -133 -278 -154 -412
6425 -412 -10 795 290 27 -289 -528 -300 549 371 334 423 -165 -781 -47 425 -52 312 308 -347 -574 308
6446 308 378 63 102 176 -487 -105 111 48 417 -43 -367 43 197 92 254 532 -343 -527 76 270 -61
6467 -61 192 345 -487 -484 75 74 93 486 -9 -579 -374 -152 166 268 245 -185 -480 -156 -388 346 781 -55
6489 -55 -178 -23 -520 -550 536 794 -81 -323 -117 -551 -228 554 471 32 -139 -331 -413 -4 -9 -15 405 141
6511 141 -587 -56 300 -80 -18 435 -257 -625 203 75 -334 40 273 -355 -278 180 204 214 81 -273 -259 143
6533 143 195 267 586 -90 -489 -156 104 -63 448 408 -268 -449 8 44 -67 606 447 -220 -368 -137 -86 427
6555 427 610 209 -157 -311 -567 335 696 166 158 49 -151 -596 286 641 176 70 293 -357 -220 428 379
6576 379 -5 46 56 -277 34 17 273 156 -50 -245 5 193 -63 22 292 -325 -469 321 377 65 19 321
6598 321 -469 -474 291 236 108 100 -185 -450 -378 221 225 449 0 -558 -410 -60 -168 225 584 -288 -685 -241 -246
6621 -246 -327 602 556 -367 -368 -213 -304 -74 628 324 -272 -394 -458 -214 378 325 9 -52 -166 -568 123 328 77
6644 77 -18 197 -306 -592 282 259 -175 125 121 -327 -203 305 118 -50 40 -213 -267 307 184 238 240 -234 -349
6667 -349 204 581 100 429 412 -587 -670 222 306 251 279 249 -333 -171 125 391 444 393 -184 -423 -76 -269 338
6690 338 513 264 -236 -165 -32 -245 255 741 44 -201 13 -397 -228 630 353 100 -17 -26 -178 -4 356
6711 356 152 51 37 -443 62 169 -150 -90 250 -146 -543 286 391 -326 -51 211 -189 -152 331 61 -44
6732 -44 -40 -90 -267 -8 161 112 236 -115 -507 -246 382 89 328 424 -413 -768 -144 45 -63 360 138 -487
6754 -487 -423 -59 150 216 296 -26 -266 -292 -393 63 497 -10 -301 -129 -152 -432 225 618 23 -209 47 -188
6776 -188 -225 84 439 -150 -18 180 -283 116 575 94 -150 -3 -172 -166 559 274 -147 65 -222 -257 154
6797 154 325 148 -76 90 -126 -453 610 482 -42 100 -76 -383 -97 361 385 429 65 -347 -331 23 78
6818 78 357 558 -91 -509 -162 172 -3 309 617 -217 -571 21 -118 38 376 172 -282 -347 -255 -359 366
6839 366 321 -29 -134 -32 -235 -41 457 -109 -251 198 -73 -365 136 409 -443 -178 26 -135 -344 436
6859 436 112 -256 -150 -245 -36 96 186 -120 -19 -297 -491 33 491 81 75 128 -400 -532 143 455 -26 108
6881 108 54 -631 -427 136 221 64 227 -301 -557 -292 -43 98 404 -32 -355 -196 37 -257 129 415 -106
6902 -106 -483 12 55 -362 318 507 -179 -367 -21 -21 200 212 32 45 -157 71 23 489 12 -116 52 94
6924 94 -188 319 747 -168 -343 -27 -212 -274 474 615 -130 -389 -59 -339 161 635 381 280 -288 -505 -102
6945 -102 320 281 166 253 -154 -559 -5 503 103 279 355 -397 -400 115 288 317 367 170 -351 -207 94 170 527
6968 527 119 -304 -130 -172 -111 70 286 11 -406 73 -25 -217 -151 239 -215 -329 276 -87 -202 379 86
6989 86 -225 -175 -91 130 307 127 -238 -244 -51 -336 70 589 -97 -278 -86 -411 -302 437 466 -227 -116 -288
7011 -288 -343 -242 345 444 76 32 -401 -303 53 240 389 226 -297 -596 -124 236 -185 83 390 48 -412
7032 -412 63 81 -315 368 392 -143 -331 101 4 110 307 -76 -253 21 -113 138 292 -16 -191 34 151
7053 151 -1 273 464 -126 -252 76 -4 -167 402 350 -329 -170 174 1 203 279 -8 -76 -131 -195 39 774
7075 774 232 -189 -110 -207 -357 137 515 84 -193 214 -265 -372 328 535 249 203 -79 -544 -73 208 358
7096 358 329 38 -373 -153 46 -92 -77 364 14 -463 24 124 -55 167 415 -242 -399 19 55 15 142
7117 142 -125 -282 -125 53 -69 292 165 -455 -191 39 -22 -46 408 -209 -520 65 -72 -252 209 396 -193
7138 -193 -333 -170 -221 -9 559 158 -84 -288 -393 -208 146 146 170 -81 -73 -772 -38 446 27 122 261 -253
7160 -253 -665 349 478 171 70 201 -265 -162 106 59 231 295 -38 -220 41 58 -166 353 16 -188 147
7181 147 72 11 153 296 -169 -412 44 258 -85 217 241 -363 -51 133 54 295 379 -113 -116 -178 70 280 497
7204 497 264 -405 -41 -154 -416 293 502 47 -531 -107 -176 -341 268 537 247 -267 -243 -275 -81 251 34
7225 34 -2 -171 -476 -75 309 55 -176 84 -299 -604 -115 228 -85 90 325 -362 -308 150 58 -129 -59 104
7247 104 -323 -177 130 -68 153 39 -481 -151 114 7 244 293 -138 -650 -3 80 97 390 281 -191 -390
7268 -390 78 22 349 286 30 -278 -76 25 46 458 220 -103 -105 -185 -416 120 531 -60 -204 -109 -152 -415 143
7291 143 502 -64 48 -120 -468 -245 414 207 77 55 -408 -189 126 225 -132 535 43 -406 26 493 110
7312 110 -174 167 97 -299 253 342 -135 180 -10 -377 -59 375 -49 248 46 -94 -104 250 42 109 372
7333 372 -55 -596 -185 184 -178 219 401 -206 -473 -93 3 73 277 285 -265 -245 -264 -122 251 361 -36 -12
7355 -12 -120 -420 -209 476 216 -371 56 -21 -302 165 334 -88 -390 218 -205 -207 229 54 -27 97 -48 -283
7377 -283 65 117 -243 -208 -104 -320 -28 261 -107 24 89 -164 -463 169 375 -11 1 39 -436 -238 185 237
7399 237 251 30 -278 -366 -101 -38 175 310 46 -263 -12 86 -127 314 532 -139 -460 29 -268 128 370
7420 370 431 -51 -114 -153 -127 193 434 178 107 -13 -122 -13 205 142 -136 48 17 -300 88 449 -7 -192
7442 -192 243 -35 -94 172 400 -166 107 97 -92 -83 335 168 22 -106 -378 -123 286 201 -30 40 -209 -534
7464 -534 -11 351 0 162 162 -265 -544 141 288 57 304 6 -393 -136 -24 98 471 235 -307 -270 -70
7485 -70 -308 46 505 -128 -187 -39 -92 -369 140 480 -19 -217 105 -92 -199 249 18 -165 -20 -209 -140
7506 -140 37 10 -39 -61 170 -250 -100 346 68 -172 -16 -44 -422 247 244 -127 -155 -54 -325 -181 386 209
7528 209 -5 -43 -418 -298 151 336 -18 150 -133 -498 -222 215 61 19 578 -89 -572 -117 216 169 329
7549 329 235 -188 -198 -72 -114 144 306 -14 -224 20 -65 90 417 222 -114 -19 22 -202 340 268 24 -204
7571 -204 149 130 -34 278 178 -96 -101 115 -127 174 321 19 -222 -131 -320 -90 377 167 6 136 -42
7592 -42 -363 186 511 92 9 -17 -239 -245 211 143 63 10 -124 -174 119 230 197 136 -14 -344 -398 -158 -5 67
7616 67 524 -17 -419 -295 217 -60 188 325 -118 -293 -10 -36 -115 100 166 -174 -158 -193 -104 165 73 -131 -209
7639 -209 -246 -206 93 233 -60 -427 -68 -58 -279 167 304 -196 -171 -4 -6 58 295 255 -46 -151 -220 34 202
7662 202 270 -132 100 -135 -718 60 541 -118 98 134 -216 -473 89 312 208 115 163 -357 -91 -6 254 254
7684 254 67 -48 -239 -40 -17 166 284 46 -375 -112 165 -150 224 392 -67 -386 217 223 -39 125 353
7705 353 -153 -92 -73 -87 175 250 -79 -353 -49 -38 360 233 29 -253 104 -140 -117 380 405 -110 -260 42
7727 42 -200 -60 280 241 -114 90 -173 -322 69 349 94 110 -135 -385 -358 277 99 -43 54 -71 -406 -96
7749 -96 352 -170 98 131 -127 -336 -12 193 -47 -78 -66 -424 1 -150 -84 179 152 -395 -311 291 85 170 209
7772 209 12 -339 73 92 -254 103 243 -45 -191 -20 188 171 304 15 -499 -208 -205 78 337 249 -60 -222
7794 -222 -144 -262 62 307 167 -183 -116 11 -339 254 624 -60 -88 -94 -262 -217 129 299 121 94 -147 -236 2
7817 2 240 139 161 165 -130 -205 407 -56 159 146 -139 -244 -50 143 -29 101 284 46 0 88 -92 113 72
7840 72 -243 -41 193 34 -40 164 47 -401 -184 86 71 29 295 -231 -356 -56 63 -76 285 201 -131 -293
7862 -293 -221 -53 154 231 50 -232 -96 -440 23 296 174 5 21 -57 -534 -10 511 47 120 -32 -321 -162
7884 -162 66 129 -86 97 -210 -373 -110 -38 110 113 -78 -215 -271 126 27 -90 302 -78 -368 27 57 61 16
7907 16 236 -253 -102 145 222 76 110 -261 -465 -15 146 36 417 5 -394 -225 143 -27 249 395 10
7928 10 -283 -174 -67 -5 286 286 -59 -134 -144 -144 154 297 178 161 -137 -230 -286 351 217 -143 -25 -36 -264 -8
7952 -8 331 27 -14 89 26 -319 111 129 -135 158 86 -152 -26 32 162 40 117 -304 -111 358 92 -138 216
7975 216 -162 -391 15 182 -16 122 -91 -209 -446 150 300 -66 226 -1 -335 -266 16 -280 279 184 -260
7996 -260 -191 -246 -91 51 299 164 -294 -257 86 -227 331 372 -108 -291 -93 -216 -47 233 247 219 -120 -139
8018 -139 -117 165 175 175 78 210 -481 -40 205 -24 8 60 -2 -343 61 210 19 62 -15 -160 -45 118 112 261
8042 261 84 -122 -225 33 215 93 105 51 -377 -58 366 -4 121 431 29 -272 -5 289 108 187 152
8063 152 -213 -94 -79 -73 189 448 -37 -103 -156 -183 -33 494 328 -129 34 -184 -122 134 420 92 -46 -50 -17
8086 -17 -208 260 290 58 -16 -10 -263 169 62 44 -12 142 -287 -134 184 -73 -119 75 -42 -315 258 295 31
8109 31 -101 -43 -93 -262 184 -6 -86 -193 -114 -80 102 127 154 84 -61 -251 -312 100 3 12 357 -65 -197 -56
8133 -56 -63 100 131 363 -48 -103 -118 -73 97 230 128 -113 -117 -1 -57 203 197 -49 -150 -121 -155 -72 169 -239 -179
8158 -179 64 188 -106 70 293 -93 -164 11 21 -245 454 43 145 127 20 -349 198 195 -126 266 13 -166
8180 -166 -113 263 215 116 120 12 -312 114 308 27 15
8191A5
##END NTUPLES=NMR FID
##END=
