##TITLE=1H_CA-8570-4-2
 CDCl3, 8 sc, 
 11.3.2019
##JCAMPDX= 6.0         $$ Bruker NMR JCAMP-DX V2.0
##DATA TYPE= NMR FID
##DATA CLASS= NTUPLES
##ORIGIN= UXNMR, Bruker Analytische Messtechnik GmbH
##OWNER= root
$$ XWIN-NMR		Version 3.5
$$ Mon Mar 11 14:24:20 2019 Russian Standard Time (UT+4h)  she@DPX200
##.OBSERVE FREQUENCY= 200.1314
##.OBSERVE NUCLEUS= ^1H
##.DELAY= (6, 6)
##.ACQUISITION MODE= SIMULTANEOUS
##.ACQUISITION SCHEME= undefined
##.AVERAGES= 8
##.DIGITISER RES= 18
##SPECTROMETER/DATA SYSTEM= spect
##.PULSE SEQUENCE= zg30
##.SOLVENT NAME= CDCl3
##.SHIFT REFERENCE= (INTERNAL, CDCl3, 0, 15.7039)
##AUDIT TRAIL= $$ (NUMBER, WHEN, WHO, WHERE, WHAT)
$$ ##TITLE= Audit trail, XWIN-NMR		Version 3.5
$$ ##JCAMPDX= 5.01
$$ ##ORIGIN= Bruker BioSpin GmbH
$$ ##OWNER= she
$$ F:/spectra/data/she/nmr/H-F/1/audita.txt
$$ ##AUDIT TRAIL=  $$ (NUMBER, WHEN, WHO, WHERE, WHAT)
(   1,<2019-03-11 14:22:56.25 +0400>,<she>,<DPX200>,
      <created by zg, POWCHK disabled, PULCHK disabled
       configuration hash MD5:
       00 E9 B6 7A A2 85 ED C7 34 08 36 98 17 FE 4E 26
       data hash MD5: 16K
       EC F9 DC 18 91 CD 13 DD C8 61 C0 05 09 69 4C 74>)
$$ ##END=
$$ 
$$ hash MD5
$$ B8 70 A2 40 4E A5 6A 96 08 25 FC 3D 7E 7D F5 6E
##$RELAX= 
##$RELAX= 
##$RELAX= 
##$RELAX= 
##$RELAX= 
##$RELAX= 
$$ Bruker specific parameters
$$ --------------------------
##$DU= <F:/spectra>
##$EXPNO= 1
##$NAME= <H-F>
##$PROCNO= 1
##$TYPE= <nmr>
##$USER= <she>
##$AMP= (0..31)
100 100 100 100 100 100 100 100 100 100 100 100 100 100 100 100 100 100 
100 100 100 100 100 100 100 100 100 100 100 100 100 100 
##$AQSEQ= 0
##$AQ_mod= 1
##$AUNM= <au_zg>
##$AUTOPOS= <>
##$BF1= 200.13
##$BF2= 200.13
##$BF3= 200.13
##$BF4= 200.13
##$BF5= 200.13
##$BF6= 200.13
##$BF7= 200.13
##$BF8= 200.13
##$BYTORDA= 1
##$CFDGTYP= 0
##$CFRGTYP= 5
##$CHEMSTR= <none>
##$CNST= (0..31)
1 1 145 1 1 1 1 1 1 1 1 1 1 1 1 1 1 1 1 1 1 1 1 1 1 1 1 1 1 1 1 1 
##$CPDPRG= <>
##$CPDPRG1= <>
##$CPDPRG2= <>
##$CPDPRG3= <>
##$CPDPRG4= <mlev>
##$CPDPRG5= <mlev>
##$CPDPRG6= <mlev>
##$CPDPRG7= <mlev>
##$CPDPRG8= <mlev>
##$CPDPRGB= <>
##$CPDPRGT= <>
##$D= (0..31)
0 1.2 0 0 0 0 0 0 0 0 0 0.03 0 0 0 0 0 0 0 0 0 0 0 0 0 0 0 0 0 0 0 0 
##$DATE= 1552299775
##$DBL= (0..7)
120 120 120 120 120 120 120 120 
##$DBP= (0..7)
150 150 150 150 150 150 150 150 
##$DBP07= 0
##$DBPNAM0= <>
##$DBPNAM1= <>
##$DBPNAM2= <>
##$DBPNAM3= <>
##$DBPNAM4= <>
##$DBPNAM5= <>
##$DBPNAM6= <>
##$DBPNAM7= <>
##$DBPOAL= (0..7)
0.5 0.5 0.5 0.5 0.5 0.5 0.5 0.5 
##$DBPOFFS= (0..7)
0 0 0 0 0 0 0 0 
##$DE= 6
##$DECBNUC= <off>
##$DECIM= 24
##$DECNUC= <off>
##$DECSTAT= 4
##$DIGMOD= 1
##$DIGTYP= 9
##$DL= (0..7)
0 120 120 120 120 120 120 120 
##$DP= (0..7)
150 150 150 150 150 150 150 150 
##$DP07= 0
##$DPNAME0= <>
##$DPNAME1= <>
##$DPNAME2= <>
##$DPNAME3= <>
##$DPNAME4= <>
##$DPNAME5= <>
##$DPNAME6= <>
##$DPNAME7= <>
##$DPOAL= (0..7)
0.5 0.5 0.5 0.5 0.5 0.5 0.5 0.5 
##$DPOFFS= (0..7)
0 0 0 0 0 0 0 0 
##$DQDMODE= 0
##$DR= 18
##$DS= 0
##$DSLIST= <SSSSSSSSSSSSSSS>
##$DSPFIRM= 0
$$ [...]
##$SUBNAM2= <"">
##$SUBNAM3= <"">
##$SUBNAM4= <"">
##$SUBNAM5= <"">
##$SUBNAM6= <"">
##$SUBNAM7= <"">
##$SUBNAM8= <"">
##$SUBNAM9= <"">
##$SW= 24.9337183474449
##$SWIBOX= (0..15)
0 0 2 0 0 0 0 0 0 0 0 0 0 0 0 0 
##$SW_h= 4990.01996007984
##$TD= 16384
##$TD0= 1
##$TE= 0
##$TE2= 300
##$TE3= 300
##$TEG= 300
##$TL= (0..7)
0 120 120 120 120 120 120 120 
##$TP= (0..7)
150 150 150 150 150 150 150 150 
##$TP07= 0
##$TPNAME0= <>
##$TPNAME1= <>
##$TPNAME2= <>
##$TPNAME3= <>
##$TPNAME4= <>
##$TPNAME5= <>
##$TPNAME6= <>
##$TPNAME7= <>
##$TPOAL= (0..7)
0.5 0.5 0.5 0.5 0.5 0.5 0.5 0.5 
##$TPOFFS= (0..7)
0 0 0 0 0 0 0 0 
##$TUNHIN= 0
##$TUNHOUT= 0
##$TUNXOUT= 0
##$USERA1= <user>
##$USERA2= <user>
##$USERA3= <user>
##$USERA4= <user>
##$USERA5= <user>
##$V9= 5
##$VALIST= <valist>
##$VCLIST= <CCCCCCCCCCCCCCC>
##$VD= 0
##$VDLIST= <DDDDDDDDDDDDDDD>
##$VPLIST= <PPPPPPPPPPPPPPP>
##$VTLIST= <TTTTTTTTTTTTTTT>
##$WBST= 1024
##$WBSW= 4
##$XGAIN= (0..3)
0 0 0 0 
##$XL= 0
##$YL= 0
##$YMAX_a= 178098
##$YMIN_a= -240285
##$ZGOPTNS= <>
##$ZL1= 120
##$ZL2= 120
##$ZL3= 120
##$ZL4= 120
##$ABSF1= 10
##$ABSF2= 0
##$ABSG= 5
##$ABSL= 3
##$ALPHA= 0
##$AQORDER= 0
##$ASSFAC= 0
##$ASSFACI= 0
##$ASSFACX= 0
##$ASSWID= 0
##$AUNMP= <proc_1d>
##$AZFE= 0.1
##$AZFW= 0.1
##$BCFW= 1
##$BC_mod= 2
##$BYTORDP= 1
##$COROFFS= 0
##$CY= 11.3945322036743
##$DATMOD= 1
##$DC= 2
##$DFILT= <>
##$DTYPP= 0
##$F1P= 18.9103706918063
##$F2P= -1.10871071338519
##$FCOR= 0.5
##$FTSIZE= 0
##$FT_mod= 4
##$GAMMA= 1
##$GB= 0.15
##$INTBC= 1
##$INTSCL= 1
##$ISEN= 128
##$LB= 0.24
##$LEV0= 0
##$LPBIN= 0
##$MAXI= 10000
##$MC2= 0
##$MEAN= 0
##$ME_mod= 0
##$MI= 1.114404
##$NCOEF= 0
##$NC_proc= 0
##$NLEV= 6
##$NOISF1= 3.799351
##$NOISF2= 2.8
##$NSP= 1
##$NTH_PI= 0
##$NZP= 0
##$OFFSET= 15.70392
##$PC= 1
##$PHC0= -8855.889
##$PHC1= 25.60014
##$PH_mod= 1
##$PKNL= yes
##$PPARMOD= 0
##$PSCAL= 0
##$PSIGN= 0
##$REVERSE= no
##$SF= 200.130013532006
##$SI= 16384
##$SIGF1= 3
##$SIGF2= 2
##$SINO= 400
##$SIOLD= 16384
##$SREGLST= <1H.CDCl3>
##$SSB= 0
##$STSI= 0
##$STSR= 0
##$SW_p= 3612.71676300578
##$SYMM= 0
##$S_DEV= 0
##$TDeff= 0
##$TDoff= 0
##$TI= <>
##$TILT= no
##$TM1= 0
##$TM2= 0
##$TOPLEV= 0
##$USERP1= <user>
##$USERP2= <user>
##$USERP3= <user>
##$USERP4= <user>
##$USERP5= <user>
##$WDW= 1
##$XDIM= 8192
##$YMAX_p= 0
##$YMIN_p= 0
$$ End of Bruker specific parameters
$$ ---------------------------------
##NTUPLES= NMR FID
##VAR_NAME=  TIME,          FID/REAL,        FID/IMAG
##SYMBOL=    X,             R,               I
##VAR_TYPE=  INDEPENDENT,   DEPENDENT,       DEPENDENT
##VAR_FORM=  AFFN,          ASDF,            ASDF
##VAR_DIM=   8192,          8192,            8192
##UNITS=     SECONDS,       ARBITRARY UNITS, ARBITRARY UNITS
##FACTOR=    0.0002004,     1,               1
##FIRST=     0,             0,               0
##LAST=      1.6414764,     0,               0
##MIN=       0,             -240285,         0
##MAX=       1.6414764,     178098,          0
$$ Real data points
##PAGE= N=1
##DATA TABLE= (X++(R..R)), XYDATA
0 0 0 0 0 0 0 0 8 -8 8 -8 16 -16 24 -28 33 -40 48 -59 72 -81 97 -113 130 -152 172 -197 228 -259 292 -330
30 -330 371 -417 467 -522 584 -650 725 -804 890 -987 1095 -1211 1342 -1485 1646 -1826 2029
47 2029 -2260 2525 -2833 3195 -3629 4164 -4835 5713 -6912 8655 -11447 16646 -29678 132178
61 132178 165025 -88191 -31421 103039 178098 88703 -958 -33935 50514 130342 112540 -355
73 -355 -45171 736 73395 100183 70452 -29991 -94441 -23838 95650 61986 -80886 -125532
85 -125532 -13703 92887 95358 20256 -48445 -42942 39261 85463 27560 -42837 -28463 20217
97 20217 30626 12696 -21256 -68300 -59016 30098 81616 12633 -71012 -60421 -2043 19946
109 19946 -5883 -56983 -96696 -64545 8376 12984 -52451 -74604 -26729 7066 4351 -3011 -16220
122 -16220 -33744 -8300 34109 10602 -53454 -62411 -18065 8057 13050 11911 -15175 -41312 -11618
135 -11618 33444 17556 -22818 -25492 -13644 -18977 -14989 -5901 -28462 -42999 -2833 34457 9855
148 9855 -17470 2909 27340 29710 33312 27145 -9955 -23697 15173 41398 22969 8550 14085
161 14085 7391 12084 46641 54699 12210 -5749 25571 32401 -1713 -22652 -16332 -13072 -1375
174 -1375 16020 -2182 -34626 -16265 30197 34017 10045 3602 -3405 -19656 -3835 27650 9372
187 9372 -32692 -25100 12646 18728 6951 7633 8399 13517 36425 37434 -10566 -37917 -3783 23974
201 23974 -711 -28450 -30685 -33171 -22737 13172 23571 -13723 -31618 -658 17717 1220
213 1220 -12493 -17633 -28804 -18967 5881 -9438 -48421 -34124 20523 33880 7353 -6054 -4902
226 -4902 -1597 20535 37674 3013 -40753 -28787 5284 2261 -13450 -8623 -6646 -8136 12421
239 12421 27142 -909 -21072 6190 28338 6653 -19250 -24291 -28319 -17826 14758 19971 -16782
252 -16782 -28098 9378 30048 14830 7161 9858 -1877 -5315 10234 2914 -23845 -19631 8939
265 8939 7937 -8111 -2646 4431 -490 13832 35390 14471 -23963 -20145 5340 2770 -7763
278 -7763 -1735 -4288 -15032 -1484 18682 8326 -1230 17425 25170 5457 -986 8124 -3280
291 -3280 -15369 4113 18343 -5250 -20992 711 18918 18075 20542 17063 -8493 -14905 13261
304 13261 20774 -6613 -18568 -6118 -6561 -10748 2144 5264 -9817 1335 32971 25400 -10905
317 -10905 -17253 2747 8487 4881 2661 -18336 -35615 -8657 27681 16491 -11431 -6657 10075
330 10075 12152 14188 13517 -10715 -25117 437 15683 -15716 -42601 -21908 6511 15664 15528
343 15528 1499 -22411 -14376 27064 33551 -7808 -33145 -17430 -4592 -4792 -4440 -15148 -28556
356 -28556 -7315 31134 22988 -15445 -16743 14562 27150 16264 -2304 -29115 -37260 -2000 30169
369 30169 6764 -30132 -20327 10546 20289 18814 14029 -3508 -7301 18953 26335 -10993 -37060
382 -37060 -13892 11753 9665 -73 -10387 -19426 719 40192 38027 -5409 -22266 2275 15116
395 15116 4920 -2698 -12125 -22943 -9329 16254 6487 -19335 -7185 23896 25279 8915 739
408 739 -9200 -14118 4514 18676 -7018 -33273 -17133 5726 2839 -115 6891 874 -5810 8724
422 8724 15626 -5851 -16451 860 4668 -12537 -17184 -9829 -12030 -5273 18199 19327 -5317 -8592
436 -8592 11020 11826 353 4382 5768 -10169 -14546 627 703 -7943 4123 17300 5795 -2721
450 -2721 11640 16072 1815 1161 8963 -3159 -16882 -7112 -352 -9427 -2393 17918 12336 -7139
464 -7139 -820 16760 14996 10429 13504 565 -16581 -5574 12417 1813 -12236 925 13057
477 13057 6719 7228 15038 6630 62 14694 16623 -12088 -27354 -9926 580 -6932 -7987 -8339
491 -8339 -18674 -13162 12960 16630 -5349 -10041 4279 755 -13617 -13279 -13463 -20996 -11157 5973
505 5973 -6046 -25036 -9397 17980 17704 4558 1666 -4953 -10845 2403 10880 -12263 -30838
518 -30838 -14293 1306 -7177 -13327 -3934 1218 5625 18858 11814 -16676 -20255 8504 17010 -4589
532 -4589 -18025 -15588 -12553 -808 19287 14891 -5832 -212 25481 26235 8656 3892 4444 1425
546 1425 7870 12867 -8499 -26487 -2114 28845 21099 -681 -1028 5701 10108 21455 22697 -1096
560 -1096 -16809 -1416 9563 -2276 -7141 2375 3851 4151 18960 20384 -326 -4153 20409 26894
574 26894 4116 -10152 -9106 -8819 -3027 9429 2200 -17557 -11555 8480 6693 -5335 225 2498
588 2498 -11369 -14358 -4956 -12574 -28833 -19604 -1211 -4262 -14240 -10771 -7449 -4580 10964 18374
602 18374 -3328 -19689 -5142 5358 -5584 -9656 -952 -5262 -14142 -2134 11129 3711 -2327
615 -2327 7201 9151 -177 -1744 -4868 -18328 -17177 4482 4506 -20455 -24653 -1832 10733 7986
629 7986 9696 5280 -6557 -841 16979 12531 -7123 -7953 1856 -631 -1274 8610 7379 -197 15360
644 15360 34433 20674 -3189 -1200 10865 11816 9600 4291 -13579 -21150 803 15627 726
657 726 -9467 5180 14239 8210 8766 10550 -1412 -7501 4203 4239 -13934 -17800 -2150 6322 7254
672 7254 11838 4883 -9983 -184 25387 21815 -4668 -9693 1926 -1622 -13629 -14220 -13034 -11089
686 -11089 2542 10814 -3729 -13477 3753 15347 3672 -5495 -3148 -9005 -14379 -587 7540
699 7540 -9019 -19139 -4027 8239 5141 6233 11016 7952 8055 14698 2311 -20858 -16122 7309
713 7309 7233 -10205 -12646 -6158 -6853 -1815 9211 3141 -9416 -1931 8387 -2769 -14142 -8745
727 -8745 -6442 -13466 -8251 580 -5861 -8412 10893 21217 6979 -2909 3920 5210 2104 8658
741 8658 8245 -7742 -11595 2917 3498 -9573 -3524 14519 14173 3655 1141 -1794 -7508 -1109 6315
756 6315 -6571 -20094 -9176 2025 -6381 -8176 4449 6833 -1822 4335 13993 6204 -2522 5305
770 5305 7689 -4042 -9042 -4804 -3571 2587 17375 13821 -5304 -2471 17892 16332 -2520 -1977
784 -1977 9503 4298 -7973 -9528 -9005 -10152 1112 9448 984 -3869 8324 13516 4946 4840 9476
799 9476 -3719 -15093 -1471 9978 -3802 -15088 -3142 7393 2390 1080 2852 2546 9851
812 9851 19676 6151 -19457 -18594 -189 -289 -12029 -9948 -5678 -10442 -4851 8844 5188 -7699
826 -7699 -830 11228 5129 -5941 -7286 -9218 -11212 -668 2483 -14007 -21210 2358 20575 10679
840 10679 -802 469 809 -923 4995 2347 -13099 -14424 415 196 -15052 -13749 -574 4921
854 4921 7585 12790 4282 -10991 -3278 13773 7850 -10607 -11300 -3510 -2964 2064 8265 1547 -5380
869 -5380 9370 23050 11872 -1709 3536 10865 7484 4715 -733 -13942 -12374 10349 18807 622
883 622 -8023 4048 10806 6439 8096 6660 -4897 -6103 5150 1954 -13324 -12544 -327 3255
897 3255 3861 8001 1805 -7958 3660 20049 8257 -13433 -11105 1080 -1361 -5800 -2489 -4910
911 -4910 -8787 -120 6837 -79 -1574 8801 7747 -4829 -5548 -1606 -11491 -17372 -2098 6022 -7179
926 -7179 -13101 -1900 3716 1456 5638 7923 -330 -2961 2622 -2192 -12186 -5732 2495 -6423 -12363
941 -12363 164 8266 1928 3365 12478 8483 -1901 1129 4366 -4048 -5375 2381 -900 -10388
955 -10388 -5416 3371 1182 3283 15162 14314 -152 578 10251 4995 -5632 -2323 830 -7261 -6716
970 -6716 1816 561 -2663 7119 14425 4816 -218 7666 7919 -1408 -411 1333 -9211 -15249 -3816
985 -3816 2215 -5153 -2873 7926 5290 -2551 3173 8155 360 -2372 2250 -4114 -16083 -10266 -380
1000 -380 -4746 -7880 -111 1824 -4009 2275 11976 3743 -6269 1035 4802 -7779 -13670 -5723 -1992
1015 -1992 -3967 1261 2460 -5976 -3182 12689 14671 1424 -1035 4363 -961 -6171 125 322 -9548
1030 -9548 -6055 6587 4872 -4459 1500 11121 9011 6471 7031 -1784 -10087 5 9832 -530
1044 -530 -10902 -2928 3536 309 3783 10989 6013 895 9451 11838 -2410 -8525 581 3078 -3196
1059 -3196 -2504 -1813 -8004 -2640 12963 12330 -2542 -3571 6244 3341 -3881 -759 -2186 -11454 -9480
1074 -9480 -316 -3927 -10968 -1571 8831 4201 92 3735 439 -6133 -154 5199 -6761 -15258
1088 -15258 -6436 -2326 -8549 -5212 4854 2099 -3292 2793 7028 -1076 -2214 4161 -1077 -12779
1102 -12779 -9940 -3083 -6854 -6906 2563 3822 -2472 3545 12100 4780 -2350 6605 10980 -1113 -7870
1117 -7870 -4337 -4160 -4414 4260 6768 -3853 -3986 10516 14989 6291 4358 5941 -658 -3768 2550
1132 2550 -1307 -13782 -8754 6564 4630 -5797 -3321 4539 5999 10498 14038 2384 -9943 -2609
1146 -2609 7757 -402 -8971 -4509 -1480 -3051 3193 9452 1094 -2493 9982 15358 553 -7896
1160 -7896 -3129 -787 -2689 -706 -4900 -16550 -12337 6000 9313 -3314 -3936 4343 3036 -348
1174 -348 1587 -3151 -12015 -6439 4659 -2493 -14753 -8323 4502 5290 5045 6699 82 -4789 5902
1189 5902 13507 -142 -11524 -5264 -293 -4407 -2759 1675 -2689 -2380 9289 11432 -2527 -5773
1203 -5773 5309 6747 -739 -2665 -3860 -11180 -7658 5684 5235 -5700 -2304 8746 7086 2049
1217 2049 5671 5119 -2700 -1009 4165 -4706 -13577 -4262 6615 1070 -3472 1383 1283 -166 7396
1232 7396 10669 -2018 -8394 -112 1439 -9319 -10116 -1544 -2262 -4029 3000 5459 -1914 1486 12650
1247 12650 9528 -1793 -1951 742 -4987 -5015 3168 -145 -10393 -5178 6570 4465 -448 5884 9229
1262 9229 1912 603 3287 -4591 -10788 -3436 1528 -7318 -9346 368 1927 -1903 4752 11895 4515
1277 4515 -821 5850 6667 -2038 -2119 2828 -2842 -8411 -1559 3295 -707 3312 13155 8773 -795 3382
1293 3382 9103 901 -5172 318 -21 -8362 -8031 -2980 -5732 -5199 4511 5726 -2974 -1364 8385 4376
1309 4376 -4969 -2240 421 -8533 -11471 -3172 -895 -5280 -736 5871 -107 -2460 5787 6958 -253
1324 -253 1486 6060 -4109 -13040 -5292 1567 -5545 -8353 1070 3439 -424 2528 4880 -1236 -1198
1339 -1198 6437 2230 -10322 -8404 1240 -1001 -5361 186 1243 -4700 912 13819 10479 -245
1353 -245 1020 5054 523 -2557 410 -3572 -7136 2330 9664 -612 -6919 3514 11832 6727 4288
1368 4288 5088 -1690 -5495 2719 4774 -6702 -9477 812 3458 -668 3539 8371 2784 1652 9446
1383 9446 7359 -4374 -4327 3581 198 -5464 -3545 -3752 -8616 -996 11155 6501 -3986 402 6908
1398 6908 -193 -6078 -1990 -2953 -9197 -6390 -2249 -8462 -9222 1576 4724 -1640 368 7928 2895
1413 2895 -3889 1719 4654 -5701 -10881 -3814 -2571 -6384 -849 5321 810 -926 6010 5638 -725
1428 -725 2960 8398 -1480 -9898 -3469 606 -8389 -10178 -85 3963 1305 3797 5422 -64 2658
1443 2658 11262 5814 -7014 -5605 2974 -729 -4996 667 1427 -5070 -395 11555 9840 1988 4162
1458 4162 8082 4071 916 319 -7628 -10840 1680 9401 -2872 -11919 -1011 8919 5467 3362
1472 3362 4307 -583 -2324 4728 3742 -8883 -11125 -2071 -476 -4285 134 2192 -3198 48 11969
1487 11969 8259 -7779 -8007 3201 4274 -2573 -5002 -8456 -11254 -1711 7829 280 -7466 1775
1501 1775 11524 3831 -3430 -914 -2497 -5514 385 3802 -6782 -11775 -1386 6108 2339 1410 3590
1516 3590 219 1471 10651 8288 -7237 -10224 1904 3778 -5317 -6047 472 2164 5468 9789 3119
1531 3119 -5596 1468 12397 6562 -3197 -2022 -1787 -7192 -3635 3880 -1083 -7039 2605 11477 5910
1546 5910 -658 1891 1842 -583 3478 2067 -9351 -11547 1681 5540 -4333 -6941 1171 2921 3030
1561 3030 8603 7802 -2767 -4138 2856 -282 -9446 -7289 -1816 -4359 -3471 3078 580 -5796 760
1576 760 10250 4346 -3529 -28 597 -6203 -6789 -1193 -5720 -10277 -3531 3333 -376 -304 7262 6442
1592 6442 -428 1217 5076 -971 -4691 1055 131 -7576 -4834 2658 -361 -4169 4930 11521 5094
1607 5094 873 4619 2570 -2860 551 2096 -5571 -8055 -93 1419 -2799 936 6861 2162 -32
1622 -32 8683 9562 -1630 -4367 4036 2921 -5454 -6001 -2714 -2585 2071 8019 2599 -4394 2309 10016
1638 10016 2861 -3467 898 1210 -6652 -6154 93 -3963 -9680 -1970 5563 1810 -1022 2335 1526
1653 1526 367 5404 3660 -8233 -10862 1471 3288 -5855 -6167 2419 1841 -153 4864 6268 -200
1668 -200 -482 5599 1358 -6195 -4907 -2642 -5842 -4263 3021 -875 -7817 -199 10106 4804 -3298
1683 -3298 869 2952 -2487 -3511 -277 -3428 -6816 -249 2678 -2744 -1856 7212 7350 2681 5322
1698 5322 7871 -684 -4121 2293 1835 -6358 -5762 1322 -475 -3536 2064 5471 931 1993 6950
1713 6950 1881 -5120 -1004 2528 -4572 -8256 -2883 -3530 -7073 -851 6816 2295 -1527 5260 7817
1728 7817 514 -1299 3176 -438 -5734 -2267 -519 -6020 -4915 3192 3109 -1193 3862 8298 1521
1743 1521 -1538 4851 3974 -5197 -5979 -1350 -4398 -7345 -670 3228 -1231 -420 5998 5039 1301 5017
1759 5017 5704 -2072 -3822 2976 1 -8912 -5561 3535 2011 -2060 2819 4463 1024 3965 8694
1774 8694 2385 -5821 -2346 388 -3833 -4689 -208 -3134 -6644 1053 7522 1499 -2959 4930 8474
1789 8474 1205 -2161 -320 -3792 -5151 1070 1721 -6252 -5574 3976 5111 854 3291 4340 -1531
1804 -1531 -1958 4102 491 -10098 -7759 859 -1791 -7872 -4845 -770 -1212 3503 6999 -210 -6716
1819 -6716 170 4662 -1963 -6757 -2952 -3040 -4986 740 4646 -2218 -3399 7639 11649 3512 -851
1834 -851 2042 1347 334 3075 -523 -9177 -6602 4988 5530 -1591 120 4935 2788 2852 6951 2432
1850 2432 -6613 -2881 4292 -278 -8269 -5124 114 751 4144 7310 1987 -1076 7051 10978 2119
1865 2119 -3818 -188 -428 -4707 -1312 1940 -3450 -4609 4364 7369 441 -313 4811 3748 2
1880 2 1089 -1572 -9387 -7635 272 -1671 -8046 -4262 2490 731 -456 5083 4530 -2155 -410 3618
1896 3618 -2076 -7615 -4056 -1455 -5686 -4130 753 -1675 -3535 4001 7835 1291 -1723 2650 879
1911 879 -6131 -4397 -58 -4148 -7568 -1638 631 -2127 874 6372 3470 -179 5051 6380 -972
1926 -972 -3274 1857 185 -5024 -1450 2018 -2094 -2248 6452 8808 2278 1382 4961 2443 -265 2679
1942 2679 928 -7246 -6007 1541 697 -4689 -1221 3501 1832 2116 7056 3508 -3799 -851 5224
1957 5224 -168 -6641 -3926 -1039 -1991 1363 4870 433 -2932 4335 8641 2075 -1685 1047 -648
1972 -648 -5242 -2035 -612 -6948 -8092 1581 5046 -1769 -2479 2124 1724 889 3191 312 -8079 -6319
1988 -6319 1314 -1522 -7308 -3514 1398 -1000 -450 5993 5206 -1304 1251 6210 1556 -4963 -3519
2003 -3519 -1839 -3543 -528 2514 -2603 -5097 4571 9280 3146 -300 4568 4173 -1699 -1334 183
2018 183 -4640 -6273 -247 1396 -2387 -225 4732 2684 1690 6785 6039 -2356 -2838 3621 1727 -6377
2034 -6377 -5167 -1551 -2958 -2352 3136 3482 -84 3531 7118 1912 -2716 1106 586 -5300 -4547 331
2050 331 -2991 -7966 -2826 3152 1162 -273 3446 3360 -15 2678 3377 -4095 -7098 -1734 -469 -6461
2066 -6461 -4385 1338 374 -1893 3200 5171 -111 -563 4878 3829 -2361 -2594 -2230 -6197 -4808 1895
2082 1895 1120 -4413 -322 7083 4798 -276 1980 3453 -723 -88 2443 -2944 -7354 -1708 3114
2097 3114 -1620 -2947 2720 4025 1834 5829 7493 -2 -4022 1142 2635 -2699 -3461 -132 -1520
2112 -1520 -1632 3521 4318 -2172 -951 7556 7487 270 -1608 -482 -3365 -3659 130 -2511 -7665 -2157
2128 -2157 5512 2866 -2135 1360 3055 -828 460 3225 -1314 -7057 -3537 721 -3497 -5565 -1173
2143 -1173 272 33 5299 7555 147 -3592 2389 3915 -3721 -5057 -1114 -2064 -4628 -1741 182
2158 182 -3001 -973 4811 3806 -90 3112 4565 -2075 -4439 97 -980 -7229 -4926 2812 2159
2173 2159 -1228 1952 5115 2295 2804 5313 2577 177 2910 1490 -6468 -6337 647 754 -4808 -1427
2189 -1427 5512 4142 681 2488 3336 -761 -212 1493 -2069 -5237 -1684 -330 -4763 -3047 3241
2204 3241 2255 -1489 4045 9177 4158 -1331 940 1850 -2642 -3361 -1594 -3776 -3632 1687 1832 -3264
2220 -3264 -2058 5120 4435 -1089 800 2027 -3032 -5277 -1270 -2608 -7733 -4814 1120 261 -395 3200
2236 3200 3698 32 2869 6427 1333 -4230 -353 3603 -1103 -4207 -1655 -500 -738 4098 6327
2251 6327 787 -250 5322 5187 -2171 -3680 -388 -2120 -4554 -1067 -45 -4366 -3333 2966 4040
2266 4040 289 2112 3389 329 1051 3791 -539 -7699 -3802 2759 536 -3797 77 4244 2043
2281 2043 2897 4289 926 -1834 2095 3213 -3606 -6207 -2380 -2781 -5721 -1713 2488 -1425 -2513
2296 -2513 4264 5915 -270 -2217 601 -576 -3044 -1515 -2452 -6223 -2841 3678 1601 -3355 443
2311 443 5660 3289 845 2971 788 -4919 -3210 639 -3273 -6075 -2207 522 -961 681 4501
2326 4501 1614 -959 4427 6468 -184 -3694 5 180 -3136 -1418 1315 -1598 -1167 5236 6605
2341 6605 1654 2848 6449 3261 -628 1601 1872 -4042 -4028 -56 -857 -3844 -423 3211 721 612
2357 612 4707 3244 -2353 -1299 2055 -1334 -5521 -2948 -707 -4225 -3199 1705 1477 90 3934
2372 3934 5653 804 318 3564 764 -4676 -2627 436 -3458 -5992 -508 1939 -1530 -594 2970
2387 2970 2055 -487 1519 1340 -3784 -4218 -626 -3488 -7733 -3411 789 -1635 -2612 2755 3918 -426
2403 -426 415 4460 1382 -2586 -688 -409 -3277 -1884 1471 -778 -2775 2848 6684 2220 649 4897
2419 4897 4076 -933 -345 1352 -2932 -4917 -201 1445 -1843 -964 3005 1711 1050 4703 5144 -497
2435 -497 -983 3390 510 -4624 -2942 610 -2099 -2796 2450 3223 -464 1827 5849 2777 -1075 965
2451 965 624 -3491 -3472 -327 -2868 -5885 -1375 2156 -964 -1057 4067 4042 -614 272 2608 -1372 -5005
2468 -5005 -1670 -801 -4486 -3352 1218 -38 -1330 3053 4874 588 533 4524 1618 -3508 -1762 825
2484 825 -4163 -6510 -1195 658 -2010 -547 3561 1883 742 3359 3197 -2302 -2174 1630 -1400 -5326
2500 -5326 -2624 617 -2685 -1590 4314 4759 568 2477 6293 4056 196 937 333 -3045 -1356 1957
2516 1957 -2226 -4638 652 4415 1097 559 3827 2755 -1173 1433 3205 -2736 -6805 -2439 23
2531 23 -2905 -3162 -544 -1110 17 4783 4762 -1027 -960 3643 1850 -3616 -2773 -467 -3803 -3724 1404 1318
2549 1318 -3018 -254 4677 3649 690 1696 625 -2916 -1118 1169 -3183 -6816 -1625 2123 -915
2564 -915 -1890 2725 2997 509 2597 4412 -191 -2761 624 1257 -3441 -3371 -503 -1396 -827 3687 4159
2581 4159 -792 951 6438 3759 -2004 -1447 1430 -1249 -3188 -329 -827 -3679 -473 3978 2397
2596 2397 -97 2751 3971 301 447 2516 -2163 -5560 -1044 1847 -2858 -4460 1136 2845 656
2611 656 1932 3847 383 -972 2419 1719 -3800 -4294 -1368 -3315 -4341 -827 372 -2940 -471 5450
2627 5450 3449 -1809 -287 3063 -596 -3281 -1491 -2358 -5179 -2464 1680 -1029 -2445 2392 4209
2642 4209 1411 1715 4251 461 -3276 -46 1368 -3103 -5137 -485 1130 -1675 151 3698 1805
2657 1805 1559 4948 3583 -1483 -707 2256 -1144 -4805 -1815 289 -2783 -1661 3608 3321 -155 2661
2673 2661 5612 2006 -663 1314 513 -3216 -1834 488 -2700 -3775 821 3180 -410 839 4889
2688 4889 2944 -707 1324 2222 -2850 -3850 -169 -994 -4851 -2616 1201 95 -460 2967 3001 -627
2704 -627 511 3287 -624 -4437 -1400 298 -4130 -4504 24 436 -2280 888 4342 1360 -315 2222
2720 2222 2412 -1536 -1621 -221 -3356 -4292 487 1173 -3343 -1377 4402 3579 -588 1192 3762 141
2736 141 -1239 1365 -259 -4378 -2458 663 -1081 -1579 2521 2905 273 2661 6346 2321 -2893 155
2752 155 2723 -973 -3277 -1024 -1015 -2561 780 2897 -3 -639 4480 4864 178 315 1876 -2313 -5138
2769 -5138 -1234 256 -4070 -4159 1026 2130 -584 1494 2557 -541 -317 3662 991 -4589 -3037 358
2785 358 -2662 -5252 -1361 917 -1229 684 4994 2584 -669 1172 2406 -1298 -2761 111 -1650
2800 -1650 -5332 -1656 1151 -2137 -3496 1570 4273 1236 1710 3353 403 -1879 248 -237 -5042
2815 -5042 -3978 1374 845 -2415 567 4029 1502 384 4564 4323 230 573 2200 -658 -3298 -1236
2831 -1236 -1373 -3485 -72 4325 2211 -1135 2821 5545 1107 -1980 1061 1075 -2499 -1477 -172 -3083
2847 -3083 -3688 774 1637 -1165 1493 5507 2517 -1012 1935 2043 -3051 -4308 -137 -769 -3393 -1364
2863 -1364 632 -974 -1165 2681 1403 -1230 945 4172 -834 -5019 -1764 -391 -4146 -4291 -630
2878 -630 -406 -1424 1995 3381 -83 43 3475 1891 -2551 -357 1594 -2220 -4199 252 997 -2796
2894 -2796 -1591 3739 3550 1075 2615 2438 -967 -553 1493 -2072 -5398 -978 2133 -1382 -3226 1516
2910 1516 3134 -81 1574 4880 2229 -253 1476 1600 -2115 -2542 111 -1902 -2501 2387 4083 -554
2926 -554 -833 4906 4846 -288 -873 1523 -166 -2499 -645 -2383 -5347 -2588 1746 175 -2167 1602
2942 1602 3671 162 81 2594 -86 -4536 -2234 757 -1730 -4356 -1843 -343 -1120 2044 3839 422
2958 422 -1220 3623 4419 -1248 -3502 -690 -1582 -3788 -1188 214 -2810 -2380 2762 3375 -101 1077
2974 1077 3264 764 -1216 1601 231 -4860 -3449 1490 425 -2253 516 2876 1180 1802 4972
2989 4972 2243 -1281 1142 3284 -1317 -4085 -652 -82 -2918 -899 2050 1025 -44 2810 3192
3004 3192 -45 -177 2215 -160 -3835 -730 618 -3243 -3753 1311 1593 -1348 905 4366 2751 -328
3020 -328 1264 642 -2367 -1724 239 -2753 -4887 -200 1975 -1676 -2010 2725 2248 -1029 491 2583
3036 2583 -998 -3551 -843 -1055 -4780 -3055 -180 -1515 -1813 2464 3309 -673 117 4784 2407 -2130
3052 -2130 -1104 1278 -1438 -2633 35 -474 -2584 386 4157 1822 300 3365 3448 -554 -327 1476
3068 1476 -1162 -4659 -1334 1017 -1929 -2398 1286 1896 251 2469 3972 772 -468 2897 1638
3083 1638 -3206 -2936 -55 -1184 -2560 597 2312 -593 602 4400 2935 -1104 783 2532 -1125
3098 -1125 -2741 -84 -1502 -4749 -2279 1010 -313 -1936 1886 2902 318 613 2420 -329 -3488
3113 -3488 -945 320 -3583 -4289 -261 419 -2182 25 2854 1026 7 2785 2414 -1606 -1564 681
3129 681 -2138 -4396 -1255 218 -2274 -1463 3134 2269 -785 1596 4196 843 -1373 904 80 -2903
3145 -2903 -1426 564 -1627 -2328 1865 3274 555 1224 4767 2680 -455 1578 2362 -2003 -3439 158
3161 158 183 -2974 -1061 1693 83 238 3137 3299 -635 154 2644 -12 -3652 -1300 -650 -3520 -2915
3178 -2915 1523 1001 -1676 1164 3649 1536 -131 2112 758 -2546 -1293 316 -2359 -4327 -652
3193 -652 867 -1839 -378 2613 1561 -1035 1813 2948 -1163 -2834 -203 -564 -3852 -2507 14
3208 14 -1559 -1619 1962 2662 -372 870 3780 1208 -1553 251 867 -3099 -3193 68 -89 -2564 72
3225 72 3500 1370 677 3344 3010 -264 579 1926 -1533 -3311 -261 875 -2676 -1914 2022 1832 -291
3242 -291 2200 4114 998 -440 1916 1116 -2926 -2174 -233 -1786 -2692 607 769 -1784 747 4193
3258 4193 1729 -1189 1185 2416 -1264 -2617 -674 -1910 -4212 -1459 1338 -754 -1647 1705 2643
3273 2643 92 897 2193 -990 -2513 242 498 -4032 -3999 -52 -119 -2283 420 2610 560 541 3034
3290 3034 2058 -1709 -1078 886 -1769 -3422 -1020 -721 -2597 -373 3152 1373 -686 2153 4387 719
3306 719 -985 971 -161 -2404 -1143 499 -1805 -2278 1395 2292 417 1487 3582 1490 -29 2302
3322 2302 1949 -2584 -2414 600 137 -2893 -986 1876 491 373 3107 2453 -517 591 2610 43
3338 43 -2599 -976 -507 -3193 -1791 1369 -288 -2117 1243 4005 870 -683 1339 1072 -1402 -821
3354 -821 -572 -2842 -3769 -30 260 -2520 -384 2899 1510 -370 1889 2213 -1243 -1802 823 -502
3370 -502 -3842 -2336 29 -993 -990 1646 944 -221 2130 4208 356 -2253 813 1163 -2569 -2959 -83
3387 -83 -688 -2431 456 2568 544 180 3358 2832 154 1050 1548 -1799 -2738 494 92 -3082 -1533
3404 -1533 2259 1478 -177 2113 3219 635 507 2083 270 -3015 -984 473 -2448 -2665 -1 748
3420 748 -1002 819 3284 982 -710 2115 2018 -1701 -2414 -216 -1754 -3490 -1065 519 -1842 -1119
3436 -1119 2566 2864 -628 70 2139 52 -1049 81 -1026 -4281 -2164 847 -1053 -3074 327
3451 327 2475 679 327 2660 1355 -1755 -323 1178 -1648 -2891 -985 -231 -1394 246 2447 -171
3467 -171 -695 3215 4039 300 -484 1830 766 -2068 -1257 -141 -1674 -1357 1928 1925 -28 1510 3054
3484 3054 545 -326 2187 1314 -2363 -1861 1213 -352 -3323 -1836 1205 441 519 3074 1903 72
3500 72 1419 2281 -1412 -2717 -4 203 -2917 -1596 658 -919 -1880 1102 2783 697 -10 1923
3516 1923 721 -1688 -714 -965 -3539 -3639 18 220 -1995 -512 2704 997 -253 1318 1690 -985
3532 -985 -239 1416 -1170 -3341 -1527 -76 -1987 -1437 1824 2125 35 1738 3185 629 -985 406
3548 406 344 -2824 -1569 634 -1267 -2657 637 2016 -283 531 3644 3043 -100 715 1837 -692
3564 -692 -1902 -356 -982 -2642 275 2284 19 -816 2529 3515 491 434 2230 427 -2421 -1178
3580 -1178 -185 -2611 -2997 -411 -290 -626 1616 2278 -405 -579 2345 1951 -2492 -2222 474 -357 -2902
3597 -2902 -1962 -530 -1572 -547 2092 1232 97 2082 2130 -476 -1143 379 -950 -3863 -1803 1208
3613 1208 -784 -2827 -298 1947 791 931 1877 215 -713 1207 820 -2650 -2887 124 -301 -1892
3629 -1892 -98 2444 789 -258 2622 2951 402 66 1552 375 -838 -9 -613 -2820 -1050 2194
3645 2194 1341 -1014 1479 3714 1320 -289 972 741 -1989 -1064 125 -1421 -2239 39 1231 -800
3661 -800 399 2779 1380 -210 1890 2455 -1122 -2629 -594 -440 -2732 -1696 -204 -775 -805 2123
3677 2123 1552 -988 439 2339 311 -1978 -678 -287 -2487 -2577 -448 -813 -1899 146 2175 780
3693 780 79 2257 1547 -940 -145 1010 -1543 -2829 -570 419 -1815 -1493 1274 987 326 1889 2657
3710 2657 247 -421 1564 -32 -2369 -1485 180 -1028 -1544 606 1430 -257 1457 3171 1844 6
3726 6 1480 1677 -1049 -1679 501 -714 -2573 -754 1833 -45 -499 1864 2373 303 733 1793 -215
3743 -215 -1554 -71 -422 -2930 -2346 492 -80 -1790 637 2351 892 -389 1804 1068 -1606 -1339
3759 -1339 117 -1823 -2867 -588 -305 -2239 -573 2147 735 -712 1491 2769 -246 -1305 203
3774 203 -646 -2447 -1278 -382 -1976 -1390 1402 1631 -537 354 2519 744 -443 1132 831 -2162 -2108
3791 -2108 -18 -317 -1906 -445 1661 559 789 2445 1868 -369 909 1984 -568 -2093 -568 336
3807 336 -1605 -1000 1127 82 -475 1498 3128 942 201 1708 527 -1705 -542 246 -1925 -2354
3823 -2354 254 1007 -1375 125 2015 838 -215 1504 1571 -1471 -1790 214 -875 -3068 -1757 155
3839 155 -860 -752 1563 1430 -498 836 1841 168 -1620 40 -565 -2927 -2144 134 -935 -2252
3855 -2252 487 1778 346 -327 1848 1088 -279 130 423 -1549 -2435 55 -438 -2121 -717 1743
3871 1743 946 -106 1987 2782 428 -159 1718 669 -2146 -1114 166 -1055 -1133 965 789 -478
3887 -478 1245 2944 1098 -2 1433 1573 -1027 -1326 500 -1115 -2381 -383 1122 -156 -320 1970
3903 1970 1672 48 1257 1589 -634 -1834 480 -293 -3228 -1915 229 -346 -878 877 1830 26
3919 26 411 1748 686 -1551 -625 16 -1764 -2303 -240 -648 -2202 -498 1706 767 -622 1558 2007
3936 2007 -480 -696 674 -889 -2519 -771 104 -1650 -1665 908 1219 -102 1396 2545 572 -354
3952 -354 1564 601 -2020 -1478 433 -664 -2009 57 1519 88 605 2297 1698 -35 1335 1922
3968 1922 -525 -1567 -90 -477 -2236 -581 1179 72 -606 1892 2919 485 88 2117 1076 -1319
3984 -1319 -1032 -167 -1475 -2102 706 201 -1273 298 2283 704 -71 1931 1101 -1364 -1203 536 -1382
4001 -1382 -3085 -1555 74 -1008 -729 1147 815 -436 1442 1973 -386 -1550 520 7 -2175 -1812
4017 -1812 -210 -1734 -1712 972 1604 -197 -31 2135 1464 -414 228 331 -1617 -1806 382 -472 -2391
4034 -2391 -958 1796 472 126 1665 2072 143 504 1899 96 -1956 -328 725 -1015 -1590 900
4050 900 726 -180 1906 2649 655 -210 1888 1278 -1196 -1174 90 -1440 -2041 -267 888 -884 -249
4067 -249 2118 1556 -336 1064 1505 -470 -754 474 -762 -2890 -1428 724 -928 -1263 1065 1652
4083 1652 216 543 1763 233 -1445 -169 191 -1971 -2208 -617 -799 -1884 -153 1350 -307 -421
4099 -421 2363 1878 -999 -717 768 -990 -1964 -710 -188 -1425 -958 1430 815 -275 1466 2547 576
4116 576 24 1799 351 -2180 -1098 738 -866 -1986 104 1541 71 471 1709 1084 149 1496
4132 1496 1337 -1084 -1503 674 -448 -2319 -1074 856 -95 -660 1946 2160 462 482 1931 460 -1242
4149 -1242 -460 -387 -1872 -1213 423 -352 -1767 339 2253 618 -159 1629 1101 -747 -567 277 -1771
4166 -1771 -2456 -715 33 -1726 -568 1353 1012 -823 820 2046 -263 -1101 654 -209 -2275 -1557
4182 -1557 -535 -1550 -1482 768 1127 -206 447 2717 631 -814 196 1118 -1202 -1425 -128 -697 -1802
4199 -1802 10 920 -78 -158 2151 1852 26 676 2021 -280 -1830 -168 273 -1163 -1400 670 677 229
4217 229 945 1925 297 1053 2143 954 -1278 -531 605 -1496 -2304 -169 773 -511 -253 1785 940
4234 940 -121 843 1143 -634 -367 437 -988 -2557 -700 544 -1643 -1577 1083 1771 -36 641 1628
4251 1628 231 -977 270 -110 -2227 -1751 55 -822 -1917 91 1160 -541 52 1847 1570 -674
4267 -674 -259 1205 -923 -2031 -683 -357 -1518 -292 1466 583 -446 1419 2036 201 144 1618 223
4284 223 -1290 -135 433 -1179 -2039 502 1161 -339 991 2701 871 163 1778 1129 -1052 -1224 500
4301 500 -751 -1489 -351 813 -655 -518 2139 1428 -153 899 2345 143 -1598 -524 -99 -1776
4317 -1776 -1652 125 -324 -828 694 1192 -176 409 1842 514 -1160 173 609 -1718 -2900 -394
4333 -394 92 -1433 -841 821 367 132 1163 1174 -665 -239 908 -646 -2208 -898 -25 -1642 -1716 549
4351 549 1094 -352 587 2197 954 -376 565 282 -1091 -593 215 -1091 -1942 332 1274 -526 -407
4368 -407 2096 1837 351 1169 1988 -384 -1279 -13 -142 -1807 -796 731 -45 -286 1462 1804 -497
4385 -497 60 2071 962 -1071 -517 587 -1097 -1712 31 -40 -1207 238 1730 372 -116 1497 1365
4402 1365 -605 -933 392 -757 -2401 -797 230 -1395 -1026 772 876 -445 629 1661 235 -848
4418 -848 199 270 -2379 -1649 -91 -587 -1515 503 951 -650 271 2127 1164 -759 237 1457 -948
4435 -948 -1705 -302 -437 -1552 -587 1079 271 -123 1472 1642 -42 411 1174 83 -1418 247 434
4452 434 -1943 -1324 728 519 -500 134 2107 957 386 1554 1133 -996 -457 615 -832 -1687 157
4469 157 711 -514 -422 1560 1233 -181 826 1963 -174 -837 6 -277 -1782 -1131 -7 -961 -667 1075
4487 1075 1300 -561 24 1814 930 -1029 -220 178 -1537 -1732 -22 -648 -2024 -222 1329 4 -516
4504 -516 1218 1037 -454 -43 935 -767 -2103 -801 282 -1416 -1017 595 397 -404 1219 2247 334
4521 334 -481 1599 752 -1233 -834 620 -785 -1315 411 930 -622 -82 1814 1134 -96 783 1483
4538 1483 -709 -918 402 -322 -1877 -664 687 67 -1026 1093 1646 229 686 1552 341 -943
4554 -943 196 833 -1315 -1753 379 103 -1026 202 1813 474 32 1481 1125 -738 -570 330 -1039
4571 -1039 -1949 -312 45 -1577 -865 1110 318 -393 452 1473 -242 -704 528 -332 -1817 -848 -165
4588 -165 -966 -1538 416 786 -411 268 1750 997 -744 125 848 -669 -857 -10 -635 -1761 -89 1140
4606 1140 -31 -488 1538 1448 168 711 1356 -82 -1338 -214 77 -1145 -885 563 84 -368 749
4623 749 1715 497 253 1701 1208 -886 -130 388 -685 -1631 202 497 -823 46 1300 691 -83 1170
4641 1170 1594 -588 -561 494 -235 -1785 -545 232 -740 -1099 561 663 -284 376 1268 312 -771 444
4659 444 162 -1566 -1428 -121 -642 -1476 -27 894 -203 -294 1509 1229 -717 -91 844 -589 -1586 -178
4677 -178 -364 -1505 -763 576 6 -265 1378 1630 442 -46 1345 314 -1076 -277 471 -1173 -1532
4694 -1532 426 739 -558 288 1734 1057 193 728 953 -481 -453 706 -529 -1713 -560 495 -118
4711 -118 -583 1075 1306 8 670 1997 441 -1324 304 121 -1581 -1388 -58 -429 -736 680 1160
4728 1160 27 39 1538 1057 -906 -474 449 -677 -2023 -237 -268 -1688 -864 839 245 -383 605 1186
4746 1186 58 -98 522 -694 -2035 -694 330 -1313 -1336 213 785 -548 308 1755 490 -57 753
4763 753 620 -929 -1228 22 -604 -1078 99 641 -644 -330 2127 1468 15 340 1189 -45 -716 75
4781 75 52 -1285 -481 476 95 -428 918 1737 484 360 1477 309 -852 -8 654 -1109 -1663 -127
4799 -127 21 -677 39 1185 404 -34 981 1440 -720 -844 474 -483 -1616 -747 -222 -1175 -840 995
4817 995 716 -369 597 1533 445 -734 461 151 -936 -1065 -35 -1055 -1224 262 950 -164 179
4834 179 1384 663 -344 266 926 -767 -1218 -23 -141 -1333 -442 488 100 -257 1172 1147 -31 473
4852 473 1216 -133 -1302 -295 265 -1045 -852 451 716 -456 252 1399 481 220 1312 1199 -442
4869 -442 -137 186 -793 -1579 201 253 -612 -721 1274 1417 -146 642 1155 149 -605 168 -110 -1243 -1151
4888 -1151 218 -704 -1290 255 881 -50 321 1570 262 -967 -181 524 -734 -1162 -162 -103 -1486
4905 -1486 -401 351 -292 -451 1226 1236 -439 -334 783 -5 -1427 -476 -273 -1528 -830 931 384 -426
4923 -426 576 1303 452 -101 749 573 -510 -634 132 -701 -1343 -496 704 -104 356 1343 896 97 970
4942 970 1493 -546 -589 229 455 -1204 -737 393 49 -346 546 979 384 481 1083 794 -899 226 277
4961 277 -1192 -1408 374 30 -812 -381 865 301 -124 780 910 301 -47 472 -766 -1305 -585 -155 -1200
4980 -1200 -841 497 345 -424 234 1164 -17 -688 270 -117 -1037 -712 27 -872 -1335 -60 318 -523 396
4999 396 1392 512 -68 638 656 -693 -1050 -226 -426 -931 -335 536 -242 -168 1169 1156 190 525 1398 334
5019 334 -895 34 -60 -1092 -722 443 241 -715 832 1194 325 208 966 778 -338 40 417 -266 -1439
5038 -1439 -220 63 -616 -137 820 434 364 1080 1021 -277 -661 599 -25 -1136 -995 237 -633 -870 383
5057 383 564 -300 307 1106 340 -257 326 320 -1065 -1232 -102 -289 -1319 -218 589 97 -762 468 595
5076 595 96 36 495 -424 -1173 -186 -293 -1445 -1016 831 169 -915 371 1207 386 -17 731 508 -613
5095 -613 -567 151 -494 -974 88 -86 -752 197 1668 663 228 843 1319 23 -523 182 -128 -988 -44
5114 -44 247 -553 -505 868 895 298 510 1079 382 -636 309 417 -993 -1100 431 -254 -922 -38 664 176
5134 176 236 1239 688 -252 8 619 -822 -1040 -410 -147 -880 -691 663 207 -546 731 1128 -235 -323
5153 -323 735 205 -1297 -651 -123 -947 -992 363 389 -579 -66 1086 383 107 657 337 -860 -589 419
5172 419 -367 -1495 -162 973 -17 -515 764 1039 331 597 948 -172 -277 291 -387 -1293 -990 343
5190 343 -104 -493 637 1515 26 487 1245 1017 -504 -268 457 -435 -579 -133 -444 -834 225 1032 520
5209 520 86 784 917 116 -229 90 -678 -1052 -286 242 -564 -943 444 399 -325 329 1035 -279 -467 471
5229 471 357 -1091 -964 11 -339 -793 -244 325 -602 121 859 583 -613 27 749 -38 -621 2 -262
5248 -262 -977 -807 369 125 -438 635 1024 291 320 1015 247 -403 -88 12 -624 -831 435 402 -670
5267 -670 -42 1327 645 239 1107 984 -92 93 361 -299 -906 -470 435 -389 -564 647 781 97 568
5286 568 1291 -24 -190 399 78 -990 -747 168 -103 -988 230 312 -294 -147 726 492 -349 -92 277
5305 277 -423 -990 -284 -576 -796 -594 632 92 -414 621 935 92 52 374 -92 -1053 -39 148 -954
5324 -954 -628 1 140 -299 607 943 478 261 542 549 -741 -345 -22 8 -830 -202 287 -223 17 1073
5344 1073 637 -47 302 1030 46 -563 427 -39 -961 -141 56 -287 -436 566 1053 453 334 591 665 -73
5364 -73 250 74 -683 -1186 -312 -26 -824 -106 410 609 92 724 785 -394 -48 625 -364 -1299 -675 -324
5384 -324 -630 -559 -232 256 -267 482 1022 -196 -99 644 75 -847 -1089 -203 -546 -887 8 91 -614 60 857
5405 857 550 -246 167 643 -538 -495 358 -11 -1037 -476 365 -268 -845 523 940 299 424 850 73
5424 73 -526 -3 245 -566 -765 15 366 -588 228 864 157 -27 1208 731 -167 -346 441 23 -772 -388
5444 -388 -93 -1010 -137 999 549 -65 380 852 251 -273 491 -367 -854 -225 279 -553 -1214 -76 355
5463 355 293 -56 762 29 -125 605 417 -521 -791 -42 -38 -979 -276 343 -509 -9 542 511 -354 318 921
5484 921 123 -806 -341 -140 -880 -399 270 114 -324 442 1297 243 -29 557 548 -77 -332 153 -641 -971
5504 -971 14 413 -348 -44 885 619 15 916 572 -4 -388 463 67 -1012 -506 13 -44 -597 594 465
5524 465 148 525 1208 259 -108 95 -83 -476 -327 14 -593 -561 -144 880 -25 -289 953 779 33 69
5544 69 79 -274 -811 -148 -357 -827 -323 85 112 -626 560 776 -18 -342 517 66 -676 -742 -45 -497 -1038
5565 -1038 -236 22 -355 458 401 5 69 684 939 -425 -448 66 -220 -938 -501 50 -273 -193 914 656
5585 656 -30 233 774 74 -133 88 -291 -898 -456 606 -444 -830 159 1163 327 -203 728 776 -145
5604 -145 78 336 -571 -757 -184 -101 -557 -4 726 -81 -435 817 900 -20 -272 336 197 -742 -822 -148 -267
5625 -267 -360 -27 180 -317 330 716 312 -409 31 313 -696 -383 228 -446 -1148 -208 237 -337 -230 585
5645 585 699 169 -77 606 -244 -635 -104 448 -948 -802 471 -4 -339 474 576 142 59 532 571 -522
5665 -522 -133 356 -494 -603 153 -212 -243 5 732 145 -391 649 939 -317 -172 336 189 -836 159
5684 159 164 -574 -405 478 554 170 134 891 153 14 761 -335 -731 -606 246 -38 -984 -174 610 35 72
5705 72 525 409 -57 297 88 -652 -844 -120 -107 -882 -409 452 72 -528 397 458 -59 -54 481 133 -497 -525
5727 -525 -48 -854 -601 13 122 -341 114 1115 254 -142 647 384 -357 -160 324 -399 -1002 199 41
5746 41 -361 -172 398 438 115 600 820 -126 -402 212 172 -584 -316 237 -218 -78 122 604 20 -121 1246
5767 1246 430 -323 239 365 -543 -833 -231 -473 -361 -441 446 118 80 590 737 -65 -286 366 -229 -846
5787 -846 -99 77 -1027 -650 102 282 -165 -107 453 24 375 553 -61 -538 -639 284 -468 -1035 -226 192
5807 192 -653 -204 673 659 -177 116 946 -237 -296 -249 -432 -879 -310 249 -472 -307 795 825 -60 322 945
5828 945 502 -99 23 11 -607 -199 -63 107 -393 193 196 282 17 617 643 -179 82 532 -54 -867 -317 281
5850 281 -109 -399 290 306 79 560 665 245 -245 162 -121 -489 -295 -234 -492 -662 169 299 -296 106 693
5871 693 408 -8 340 195 -275 -633 -247 -255 -902 -78 246 -55 -264 331 420 -180 -82 335 -225 -459 221
5892 221 265 -1053 -941 -139 -201 -355 162 889 217 49 547 287 -402 55 392 -182 -561 -132 246 -361
5912 -361 -206 566 401 -72 640 701 356 85 342 97 -468 -236 220 -414 -539 277 534 -23 -87 637 471
5933 471 48 381 378 -525 -605 14 -4 -542 14 446 -266 -15 678 329 -75 113 408 62 -536 -187 45
5954 45 -561 -434 141 -155 -209 377 597 190 -106 -61 78 -171 -242 -78 -530 -850 -140 -71 -604 -90 614 312
5976 312 -130 371 357 -402 -404 341 -580 -641 -161 201 -316 -436 426 623 64 5 721 342 -459 361 188 -510
5998 -510 -625 -201 -168 -302 389 742 94 130 712 462 -194 13 187 279 -499 -295 -456 -569 -242 479 67
6019 67 -344 245 730 216 62 165 72 -717 -391 -64 -628 -778 198 181 -272 35 369 448 144 267 199 -265
6041 -265 -752 159 -211 -760 -127 -98 -247 -103 522 390 -30 371 465 88 -397 115 53 -362 -269 9 -148
6062 -148 -166 293 848 209 85 595 342 -496 -63 3 -827 -274 156 80 -412 -100 685 96 -15 525 756
6083 756 -20 -243 541 -201 -631 -421 337 -259 -256 199 373 -84 149 686 26 -174 268 164 -246 -350 251
6104 251 -310 -604 -123 127 -228 -111 378 96 -23 -62 642 -300 -339 15 -328 -949 -826 107 -18 -375 137
6125 137 510 -360 180 543 -120 -601 -29 70 -487 -640 104 118 -463 -1 425 185 38 477 360 -98 -443
6146 -443 172 -338 -482 0 350 -142 -1 409 -176 -122 295 1056 157 -358 73 78 -261 -12 307 -43 -146
6167 -146 344 453 174 43 469 430 -30 298 397 -310 -738 205 -242 -607 -326 -28 -68 -298 353 616 -169
6188 -169 -126 432 224 -509 -79 78 -418 -259 -207 125 -459 3 417 236 122 62 236 -271 -179 -5 -108
6209 -108 -803 -127 8 -373 -270 393 412 -250 325 291 3 -115 344 194 -788 -362 132 -294 -148 251 490
6230 490 2 117 295 272 -144 -6 372 -347 -427 -250 -197 88 40 450 128 -143 514 423 -78 -256 480 39
6252 39 -687 -275 73 -293 -230 190 30 -64 164 778 507 108 -127 -22 -324 -315 574 -328 -722 207 50 -232
6274 -232 -57 333 9 -718 431 438 -57 -615 -116 -77 -617 -450 -243 -77 -347 243 304 -133 117 532 -5
6295 -5 -269 -150 -13 -212 -491 3 -69 -340 136 467 210 251 419 252 -277 230 13 -296 -683 41 426
6316 426 -407 -326 197 567 112 13 234 98 -82 270 463 -144 -533 -159 -259 -154 -13 93 -184 -16 730
6337 730 223 -204 -184 268 28 -277 -304 -150 -154 333 313 -392 -241 67 279 220 -28 424 397 -559 -178 366
6359 366 -207 -367 183 503 -412 -229 178 73 18 -21 124 -461 -123 383 -485 -494 -284 123 -10 -103 438 -24
6381 -24 213 384 420 -289 -130 -11 337 -61 -56 143 -91 -279 459 356 -119 120 369 428 -109 108 -102 -479
6403 -479 -308 72 94 -397 314 350 58 124 269 427 -26 478 124 -83 -528 101 216 -656 -518 89 132
6424 132 -200 253 366 -16 -115 87 97 -236 -42 1 -453 -440 3 50 -436 -20 576 441 -371 194 -17 -262
6446 -262 -230 -237 -483 -410 -150 46 -493 -34 416 173 -154 -5 464 49 -185 -58 -135 -514 -368 -56 82 -23
6468 -23 230 151 -230 250 373 109 -315 -309 59 -195 -672 4 -20 -257 262 139 366 -31 201 268 187 -81
6490 -81 388 -82 -381 -141 248 -303 -133 100 123 -98 48 654 183 -102 190 367 -360 -324 120 -110 -462
6511 -462 -172 -93 -60 -350 328 454 74 269 210 -158 -419 311 90 -420 -360 -14 36 50 198 203 -241 -136 386
6534 386 223 -178 -105 12 -335 -611 43 -176 -339 -289 358 155 -195 132 268 -224 -207 -3 -103 -454 -185
6555 -185 52 -174 37 278 50 -353 349 778 -13 121 80 270 69 -88 -367 -80 -171 233 405 -231 -106
6576 -106 597 409 -185 211 282 -89 -480 1 -97 -593 -315 130 20 -130 185 410 240 76 84 -23 -479
6597 -479 43 -3 -557 -387 137 4 -65 75 283 288 -435 399 194 -275 4 -72 -2 -325 -223 150 -163 -211
6619 -211 487 333 -49 25 514 141 -612 -167 121 5 -142 -232 -71 -82 38 464 180 98 484 39 -98
6640 -98 161 260 -118 -280 118 -136 -422 -42 173 97 -130 110 327 456 22 521 -266 -436 -53 -73 -264
6661 -264 -497 233 56 -368 155 231 -74 -39 135 28 -179 -223 -26 -136 -390 -117 218 -187 -9 309 279
6682 279 -212 109 326 -49 -129 -32 -36 -591 -265 132 -307 -529 -138 -85 -26 -170 193 -71 -33 161 -178 1
6704 1 -354 334 85 -401 -84 -43 328 196 355 604 -21 -229 266 36 -115 -109 -60 -441 -69 304 207 -103
6726 -103 29 311 352 -22 178 12 -376 82 268 78 -407 133 -150 273 27 6 182 104 26 174 -37
6747 -37 121 51 118 -183 -244 165 -39 136 274 88 -35 118 155 307 45 -261 171 -243 -306 -327 201 -337
6769 -337 22 359 -41 129 -159 113 -186 -166 -136 81 -250 -40 -298 51 -332 -9 325 -37 437 141 -123
6790 -123 -84 -64 51 -227 21 -191 -99 -46 -130 179 183 506 442 -90 29 344 30 120 -168 -21 -82 -332 -140
6813 -140 370 296 -161 444 107 153 54 12 -48 -331 -107 108 -137 -188 -107 45 -401 48 326 -18 -238 252
6835 252 60 -137 3 -30 -142 -393 49 -196 -484 -178 487 41 53 537 55 -198 -129 71 -45 -223 -197
6856 -197 230 -149 -173 -94 97 -239 -10 334 34 -202 -147 -52 -104 -392 1 -23 -43 57 387 162 61 267
6878 267 270 61 10 -78 -66 -418 224 81 -206 112 37 331 -59 56 303 -292 -160 458 417 -2 -201 275
6900 275 -12 -90 -341 -167 10 108 -4 173 41 159 384 -153 23 -68 -19 -19 -99 -1 -85 -152 344 219 81
6923 81 -16 38 228 -64 -14 -162 -252 -431 -205 -312 -465 -104 375 158 -102 172 -95 -197 -143 177 -307 -170
6945 -170 -97 220 -385 -152 257 -32 202 142 317 -82 -27 37 -108 -130 -214 163 -480 -3 27 80 472 18 32
6968 32 169 112 47 168 -139 -185 236 -288 -297 -21 -33 -28 19 -30 166 172 76 444 -210 -418 -167 -219 -269 -305 150 -305
6994 -305 311 191 360 14 188 526 190 -177 -105 -327 -354 -270 -83 82 -311 -43 261 192 43 150 208 -155
7016 -155 190 481 -1 -141 -109 98 -444 -19 357 219 -104 -9 -107 7 520 288 135 -421 -216 40 -183
7037 -183 -348 -268 406 -277 227 460 111 4 -37 424 -123 5 35 -21 -647 -116 -77 5 134 326 412 0
7059 0 -176 119 144 -22 -194 185 34 -184 314 214 -231 -54 248 161 196 326 184 -162 56 228 -225 -530
7081 -530 -41 357 -129 133 211 19 60 184 84 -97 -150 103 221 -231 -205 -237 -152 -118 -121 142 -190 -117 122
7104 122 -42 -52 -248 -115 -105 -78 -312 -289 -138 -98 272 -165 -482 -72 93 -18 175 133 -89 -341 -189 -40
7126 -40 -81 -296 243 62 245 236 250 -102 -141 -10 124 17 -247 -2 -45 -3 60 -60 -355 -205 178 300 185
7149 185 -528 134 50 -38 195 265 98 297 -175 -208 -79 367 406 135 217 88 130 -226 9 170 -269 25
7171 25 -2 82 -143 -197 382 -185 -177 16 207 81 -64 -81 121 -179 -298 -272 -134 -37 116 13 -184 133 380
7194 380 134 351 -64 -261 -69 20 -167 149 -207 -104 287 37 176 133 285 -111 54 -197 51 -57 -66
7215 -66 222 -55 -52 9 158 -21 28 145 -248 -105 3 -240 -299 -495 129 -34 -261 270 307 -130 16 -19 116
7238 116 -191 44 110 -284 70 -115 -159 -391 -329 44 -326 -429 -80 -225 246 95 360 129 -118 -40 231
7259 231 -266 -177 -398 -49 -52 36 145 119 -79 148 38 169 59 265 -119 121 -44 -153 -243 -90 26 65
7281 65 201 -97 203 64 -113 97 80 -11 138 -192 15 -49 198 -180 51 -59 233 -112 128 262 -105
7302 -105 199 38 374 -191 -46 -73 -95 42 195 62 -16 -88 427 275 -281 -158 34 103 -291 -64 35 -122
7324 -122 26 -230 60 30 -139 104 227 40 39 151 -53 -25 43 -150 -403 -397 355 -73 -177 -168 43 -468 43
7347 43 105 69 -476 -123 -90 -259 44 83 86 -373 322 358 -12 -25 -162 165 139 2 21 -83 -106 -101 53 155 -109
7372 -109 92 390 52 85 226 -72 8 32 7 -66 -245 120 -307 -34 324 -109 262 -303 89 -10 -52 135
7394 135 30 -2 19 -229 -7 8 -152 236 -61 35 78 140 -17 557 138 -6 83 132 53 -118 -18 -214 18
7417 18 -305 159 162 -317 -76 -454 129 11 -202 -219 48 -41 252 150 -19 285 -69 143 115 93 -20 89
7439 89 -270 -30 -48 7 -174 261 4 -271 55 -153 268 122 137 -102 -27 -180 127 34 -66 -63 76 167 -10
7462 -10 281 -127 147 211 -12 -211 108 102 46 23 -271 -46 -107 206 119 -76 82 -159 166 -189 -323 111 281
7485 281 106 -59 -305 -332 -373 -98 -263 -139 31 186 51 -64 135 147 -341 9 133 65 -206 -251 -139 -161
7507 -161 -271 -12 291 18 -151 244 -318 -69 -196 -95 34 -4 -81 -67 -253 -184 -171 -128 -168 40 -43 120 -85
7530 -85 118 -94 -460 -166 70 -49 -258 -115 147 -114 -4 58 -162 -133 -106 -392 -120 -267 76 68 -225 -100
7552 -100 40 265 227 57 220 -145 -130 84 -30 29 8 323 -164 222 -117 -323 188 43 105 46 -121 -7
7574 -7 237 -118 234 328 -11 -46 114 -155 -102 228 2 -67 7 114 -102 155 43 54 -205 11 -311 -204 22
7597 22 194 -129 153 53 -361 67 -33 -251 -174 151 -257 14 38 31 -106 248 123 -208 33 223 -51 132
7619 132 165 -31 -206 -107 137 52 12 -25 155 -331 393 -101 -18 41 -73 80 -21 -69 112 -154 -98 -211 103
7642 103 -21 23 18 123 33 137 293 -30 -159 -83 202 -106 -56 132 -386 -149 -18 281 -16 11 94 -68 -170
7665 -170 -412 194 -424 129 111 311 -172 -134 -7 72 389 -71 -28 287 88 58 81 37 -306 -237 -17 60 56 185
7689 185 -83 -124 -42 170 64 220 152 149 -203 323 -174 166 -39 341 8 134 167 71 89 -70 192 -70 149
7712 149 24 72 -262 -131 -99 -324 -87 81 146 -33 55 16 -111 19 -212 9 303 -72 37 137 -178 -16
7734 -16 257 6 -171 -57 320 130 -293 68 165 217 -324 -223 216 -61 -20 21 90 63 352 -164 -260 -144 38
7757 38 136 -44 345 -35 -258 73 127 -29 -248 -1 340 11 -2 68 -63 -419 219 65 -60 130 -42 282
7779 282 -16 104 14 -29 -300 -63 -8 -205 -256 -76 14 12 16 -91 254 68 -11 -37 221 186 44 216 64 -315
7803 -315 252 -257 169 -310 21 -269 -97 339 53 -164 -48 49 170 228 -206 -240 -146 -38 -210 -177 115 -95
7825 -95 240 -111 -62 164 -53 157 -93 27 76 166 110 -62 -195 -12 -19 -121 -99 52 340 -84 140 57 -153
7848 -153 79 -49 -119 -263 -344 37 -98 121 139 195 224 -20 -86 -243 -328 -160 105 123 49 86 75 127 18 37
7872 37 59 -69 177 273 -564 -54 303 342 -60 -105 57 189 47 183 162 -198 -36 276 -41 -271 24 -122
7894 -122 -386 50 -252 -311 368 171 -84 -12 137 202 205 -155 255 83 78 23 281 -77 -160 -81 291 303 -209 -48
7918 -48 280 -95 -218 380 119 9 -49 -161 -32 127 -67 215 57 -67 242 -24 -87 -166 -128 246 2 -90
7940 -90 -239 -162 -456 -39 -75 -214 218 221 11 -72 178 -80 -74 -2 -132 -272 -328 -9 -126 -76 -200 207 96 46
7964 46 -14 482 44 -84 85 -280 -241 150 196 54 -25 173 -68 302 -57 -151 65 -148 -213 -101 -13 -43 7
7987 7 -97 210 92 28 -131 -34 -200 187 104 46 -161 133 235 -303 -33 77 -104 -67 21 67 273 205 100
8010 100 139 102 -382 258 56 -211 -409 -150 73 79 265 -122 172 -110 -106 173 -45 -215 286 -162 -132 -121 -264
8033 -264 -42 -105 -69 278 65 25 82 -131 -314 134 79 135 217 -312 -83 -150 -322 -9 -102 97 -48 122 -101
8056 -101 12 -11 486 -101 -386 230 -40 -55 -62 -3 -82 -122 68 114 7 167 -55 7 -470 7 -311 -33 82
8079 82 49 -9 -102 -82 379 -256 -47 311 135 -171 -17 88 -309 -180 42 213 117 280 439 139 160 -190
8101 -190 11 -158 -468 81 169 -291 -50 143 74 76 3 113 -44 25 43 -283 -109 253 -153 -188 -193 -32 67 -242
8125 -242 193 -87 180 -126 458 189 -10 219 219 -61 -25 -37 48 80 274 -136 -205 286 303 126 10 58 -35
8148 -35 234 -79 -92 74 94 12 221 56 231 -85 228 -44 111 168 8 269 -285 15 -157 -20 143 -69
8170 -69 -8 264 -15 -65 -66 129 211 -94 62 -284 -242 -73 79 87 -237 -269 -159 -138 73 -13 -66
8191f6
$$ Imaginary data points
##PAGE= N=2
##DATA TABLE= (X++(I..I)), XYDATA
0 0 0 0 0 0 0 0 0 0 0 0 -8 8 -8 8 -8 10 -16 16 -18 24 -26 32 -39 42 -48 57 -65 72 -82 92 -103 117 -129 144
34 144 -161 180 -201 222 -246 272 -302 334 -368 408 -453 502 -559 625 -700 786 -891 1020 -1181
53 -1181 1385 -1660 2050 -2639 3639 -5661 11357 -58109 -240285 -117120 79243 117949 7337
66 7337 -66771 -35219 69969 134644 86867 -17372 -29747 53714 119961 104137 40374 -38167
78 -38167 -59585 29100 124182 66875 -71361 -74896 63158 144665 86640 -16594 -61083 -22232
90 -22232 60727 84785 12926 -48493 -9953 56306 58241 26121 4851 -3864 26917 102226 122611
103 122611 33051 -44744 -9761 61295 63387 14539 -29534 -39010 4088 62200 46946 -28800
115 -28800 -46291 9808 39015 10864 -13883 -24309 -32000 -11956 16479 -9792 -64427 -52186
127 -52186 11084 36522 20455 4165 -13992 -27861 2368 37371 12123 -36686 -35385 -10356
139 -10356 -12838 -16754 -11351 -24814 -35955 -2787 22920 -12604 -47347 -26503 -812 -11852 -24318
152 -24318 -32071 -53147 -52018 -5781 22075 -3143 -20425 -5104 4267 8651 33091 34923 -6524
165 -6524 -20394 15334 27563 -6611 -20119 2584 16923 22430 29365 13221 -13031 5953 45191
178 45191 34229 -7779 -20075 -15153 -21010 -7689 17580 803 -35171 -18342 27649 30432 8009
191 8009 7129 14710 16201 25950 21224 -17773 -32435 10764 42318 12155 -16459 -4064 12475
204 12475 23160 43963 42137 -750 -18987 11872 27252 -1110 -21788 -19072 -18612 -9821 8539
217 8539 -2304 -32475 -13341 37769 37919 -5860 -23335 -10291 -2010 8953 13198 -18743 -50535
230 -50535 -25109 19725 16165 -6200 -1036 9439 6740 16262 22596 -5335 -25313 -58 19643
243 19643 -9341 -35512 -27656 -13520 -883 20473 19416 -16967 -24805 13646 30703 2492 -14524
256 -14524 -9096 -13212 -15858 -1778 -2351 -22219 -13367 17716 17062 -4660 -1947 11172 5858 8268
270 8268 18183 -4097 -38192 -26445 7854 6378 -10892 -6398 -1566 -8753 1114 17841 6141
283 6141 -9769 2729 9666 -12308 -21164 -6688 -7457 -16183 1989 17831 -3415 -15936 9524
296 9524 29605 17886 7518 2652 -14186 -15294 11613 18620 -10437 -20379 1152 8659 2718
309 2718 10929 16049 2113 6049 27154 13969 -24242 -25168 3964 10703 -766 -5594 -13819 -17958
323 -17958 10285 40357 22051 -11498 -5432 17130 14551 5692 1784 -14325 -21504 3660 19828
336 19828 -8130 -27011 2718 34853 29873 12375 -2475 -16974 -6059 26743 22950 -23460
348 -23460 -42421 -13275 8604 2799 -2025 -5580 -11034 8030 34736 18060 -23784 -22639 12372
361 12372 17480 -6932 -26246 -34701 -26258 9309 33245 3859 -31371 -12997 23847 24345 6914
374 6914 -2846 -14161 -15716 5228 10325 -23194 -39113 -5565 24482 14205 -3422 -6534 -5064
387 -5064 12180 37101 23136 -24027 -34718 -92 15365 -1628 -12414 -11549 -11631 3487 24630
400 24630 13348 -11949 -607 28887 21239 -6233 -14544 -13010 -10891 5130 15558 -7881 -27334
413 -27334 -3831 24389 17328 3841 7142 4144 -4242 4633 9697 -10964 -20829 -1964 5576 -11949
427 -11949 -15756 -1283 2492 4671 18019 13187 -13823 -18011 3515 5072 -10966 -10712 -4813 -14815
441 -14815 -15814 2637 7538 -2059 4586 16770 3634 -7694 4494 9547 -6365 -10547 -759 -7413
455 -7413 -17340 -4802 8066 996 2474 17102 9694 -11429 -6224 12538 7010 -5817 -5649 -11040
469 -11040 -20483 -6288 14596 6389 -7374 6445 21666 12970 6577 13407 8098 181 9422 12255
483 12255 -10860 -19066 6274 21750 10703 4753 8869 4473 8148 26316 23268 -4418 -12295
496 -12295 2827 649 -14487 -13368 -5237 -7615 -669 12803 2879 -14145 660 25910 16158
509 16158 -7231 -11892 -10642 -12532 -2203 5136 -13478 -26296 -4558 15329 4434 -5574 4239
522 4239 8879 5279 5650 -4137 -27831 -27385 1868 7369 -19262 -31229 -17046 -5946 2563 13104
536 13104 5241 -16224 -11873 11698 7925 -15348 -19595 -10354 -8276 -4371 1302 -11594 -19844 6780
550 6780 34095 18310 -9972 -8117 6005 8609 9635 5670 -15362 -24654 -4367 11627 9
563 9 -6332 6625 11388 8036 15257 14707 -4401 -7106 16300 20364 -4382 -15432 -1941 8201
577 8201 14166 22072 16127 469 7207 28468 23745 5504 6473 11117 -1346 -6339 4387 1419
591 1419 -11619 -2361 15883 9158 -6242 -3537 2686 2327 6698 6177 -15435 -28484 -10668 4702
605 4702 -6400 -13139 -1353 26 -6850 3652 16263 6553 -3955 3593 5641 -5854 -10005 -7534
619 -7534 -13165 -9950 8510 7592 -15541 -17787 7538 16322 2474 -5723 -9609 -18594 -15013 -301
633 -301 -6154 -25798 -23677 -6392 -4637 -6694 2368 4273 -2787 6700 19159 3030 -20355 -13115
647 -13115 6526 7330 -326 -3627 -11140 -9647 12975 26651 8646 -4864 9851 18928 6994
660 6994 -393 1242 -7806 -12878 -944 2520 -11164 -11464 8999 17565 11467 8716 3849 -6038 3100
675 3100 23898 15271 -13301 -15511 3134 4146 -6366 -2800 6039 9355 16609 19542 3123 -7534
689 -7534 7251 15752 -1190 -14937 -8980 -8012 -11067 -615 7076 -7530 -15786 2542 15811 7789
703 7789 2126 5710 2075 -1511 1697 -6002 -19887 -9553 16469 15626 -4431 -5366 7712 9076
717 9076 9091 14434 6546 -8029 -3621 5865 -5332 -17618 -9896 -3487 -8672 -6248 3049 -1702 -6826
732 -6826 6591 12184 -6230 -18267 -7687 -1632 -5498 -2420 -565 -11516 -11779 6206 10762 -763
746 -763 3246 19673 15658 -1574 -4725 -2432 -5224 -748 5925 -5105 -16209 -3298 10328 1205
760 1205 -5114 5103 6240 -5088 -4289 3263 -5262 -15370 -7875 -2944 -11993 -14365 -3153 3095
774 3095 6627 14851 9147 -7625 -5377 14819 12039 -8895 -8783 5643 2020 -10460 -7123 659
788 659 3230 10552 15886 6041 -2388 7144 11105 -885 -6001 -1004 -8182 -15485 -630 12219 -37
803 -37 -10372 4692 16842 9585 3854 7483 7329 8553 11769 -1672 -20990 -13617 10249 11157 -3121
818 -3121 -1083 6942 4490 5371 14761 8660 -6373 -2932 7508 -342 -14138 -12138 -7008 -6284 1219
833 1219 4952 -7197 -10669 11817 25264 7587 -10261 -6348 -1621 -3667 -975 -2249 -12829 -12290
847 -12290 4515 6038 -8160 -6300 9185 12137 5572 3256 -5061 -17737 -10609 5553 -2077 -21245
861 -21245 -17726 -3208 87 100 4220 -1231 -7293 4230 14365 348 -15065 -6855 3397 -938
875 -938 -5846 -6212 -9973 -4137 17570 21815 969 -8591 6446 14063 5271 1647 757 -6736 -7008
890 -7008 4538 3780 -8765 -5626 10374 12902 7217 6932 2419 -4794 3548 15784 2594 -18411
904 -18411 -11277 6545 5971 -1199 2793 4298 1278 7328 12886 5125 -63 7102 5156 -8206 -9401
919 -9401 -1635 -5497 -8942 5277 12521 -1203 -8525 4040 10151 3014 1183 1921 -6704 -11095 -4283
934 -4283 -5294 -13046 -6129 4127 -1851 -8076 4163 12399 2809 -1697 4705 667 -11313 -8109
948 -8109 -2186 -7236 -9322 -775 -405 -8116 -2261 8695 6408 3222 10398 6464 -8873 -9076 2097
963 2097 -1127 -11572 -6709 774 -2980 -2849 7616 8183 2645 8351 13404 2892 -5373 2618 4067
978 4067 -5633 -5913 -173 -5333 -8213 4758 12687 4750 3298 11897 8726 -1889 1588 7103 -1196
993 -1196 -7000 -1670 -3762 -11390 -3867 8816 5044 -1519 5243 7543 614 1842 7888 -694 -12137
1008 -12137 -5765 392 -9426 -14046 -2557 4453 232 1828 3356 -2968 -1839 9661 8592 -8032
1022 -8032 -11753 -3469 -4810 -9927 -3007 317 -6450 -3743 8579 7363 -3827 193 9472 4246
1036 4246 -4094 -4025 -7857 -12301 -1868 7884 -1616 -11315 -1221 8762 4309 3561 8883 3445 -4140
1051 -4140 2215 5095 -7280 -11646 964 6572 45 51 4066 2243 5150 16994 13057 -3812 -5415
1066 -5415 6424 4547 -4468 -2199 310 -5687 -2710 7820 5956 -1708 5721 14325 6782 -2548
1080 -2548 124 -922 -6910 -1902 3168 -6234 -12775 -849 6756 1018 1079 9244 6700 -2532 814
1095 814 4522 -3817 -7641 -1729 -4736 -14242 -9269 1407 -638 -2810 4413 5182 -2842 -822 5644
1110 5644 -2013 -10996 -3638 1122 -9872 -15357 -6542 -1151 -863 5320 7119 -2137 -2888 10616 12916
1125 12916 -1024 -5475 -1902 -4868 -7491 -618 -414 -8879 -2962 12286 10435 -3054 -1127 8059
1139 8059 7796 4630 3820 -6532 -15452 -5632 6265 -1206 -9690 -2477 5370 3828 6503 11296 3950
1154 3950 -1645 7964 11367 -4096 -11821 -2219 4354 731 1165 550 -5246 373 16793 16426 -334
1169 -334 -3831 4788 3447 -4379 -3558 -5292 -10646 -5253 5610 -339 -11349 -2917 10226 8458 1432
1184 1432 603 -3564 -7785 1055 6677 -6339 -16605 -5781 4083 512 -309 4702 2686 885 8692
1199 8692 8417 -5979 -9865 2308 4368 -5889 -8130 -4831 -6609 -2316 9090 7616 -4251 -1974
1213 -1974 8754 5586 -3119 -1315 -68 -6504 -4989 1076 -3299 -9132 2082 12740 5662 -1357
1227 -1357 3162 5785 1413 4608 5780 -5866 -12181 -1945 1837 -7195 -7504 3693 4710 -171
1241 -171 4220 6188 -1544 -1813 6689 2414 -10570 -9860 -2348 -4711 -4617 3385 2952 -5779 -305 12227
1257 12227 8954 101 3737 6542 -1759 -5639 -2206 -5262 -9585 -1393 4775 -2738 -5298 4676 7449
1272 7449 790 2576 6731 -1076 -8899 -2992 372 -8202 -8502 -1637 -2766 -6476 1242 8765 4131
1287 4131 4904 11603 6596 -4813 -1059 6030 -884 -6992 -80 3037 -3322 -2008 6082 5482 3619
1302 3619 9916 10253 -617 -1596 6269 2053 -8874 -6387 -387 -6646 -8357 1534 5536 -25 1938
1317 1938 7227 1873 -3192 3585 4650 -3759 -4393 419 -5833 -12380 -1862 7057 158 -3066 5359
1332 5359 8205 811 401 2665 -3358 -5188 474 -2365 -12998 -9338 2481 1602 -4790 -381 2807
1347 2807 -2390 122 9113 4223 -9214 -8306 -623 -3779 -7071 -2487 -2012 -3937 3719 10148 664
1362 664 -6376 4117 11965 3222 -3747 -2462 -5154 -7516 167 3926 -5722 -6978 5035 8920 2477
1377 2477 3306 7088 1485 -1709 4037 2752 -7882 -6574 3812 3271 -3210 72 4182 2047 7475
1392 7475 16073 9418 -3887 -367 7386 -39 -6597 -1628 595 -4410 -1928 3554 33 -1409 6852
1407 6852 9590 7 -1531 4112 -650 -8752 -4089 -223 -8811 -11988 -1824 2787 -995 2384 7911
1422 7911 2676 -1576 3397 3420 -4346 -2330 2389 -5092 -12801 -4688 2790 -4375 -5458 5100 8920
1437 8920 2396 1164 2287 -2911 -2983 2697 -2044 -13973 -10360 1296 -165 -5455 320 3820 -1497
1452 -1497 1255 10775 7936 -3047 -2090 2962 -951 -5428 -3671 -5125 -5447 6325 12870 18 -7693
1467 -7693 4292 14865 7284 -34 605 -1830 -3897 1511 1675 -8452 -8715 3330 7011 1386 3127
1482 3127 6226 1328 1728 9118 4573 -10684 -9180 4198 4883 -3947 -6347 -4253 -3159 4730 12107
1497 12107 2947 -6091 1940 9905 -149 -9232 -5517 -2791 -5000 -799 2651 -5515 -9357 2381
1511 2381 9802 2844 -1612 726 -1232 -2128 3422 617 -12805 -13094 2194 5577 -4195 -4795 3991
1526 3991 5704 5000 5688 -624 -7483 -990 8839 1857 -9407 -6915 -1137 -2997 -114 7285 4036
1541 4036 -2088 5576 12835 4331 -4936 -1589 866 -1998 -481 -27 -7566 -6991 6776 10575 -1204
1556 -1204 -3419 5875 8418 4026 5056 3340 -6541 -7791 295 31 -7538 -3662 4936 3425 1768
1571 1768 6308 5092 -1629 2325 9534 2269 -7395 -4730 -733 -6266 -6397 20 -1145 -5094 1513
1586 1513 8343 2906 -772 4202 2615 -6255 -5596 -547 -5253 -8997 -2419 -500 -6405 -3691 5178
1601 5178 3285 -1333 5439 9598 209 -5663 -1899 -1239 -6081 -3364 48 -4673 -6239 2549 6096
1616 6096 413 1657 6893 2054 -2271 3663 4416 -6625 -9134 812 1883 -6168 -5028 2510 4567
1631 4567 5724 9197 3719 -3572 2063 9204 1520 -6672 -1644 1885 -4256 -3714 4097 2252 -2902
1646 -2902 3263 10520 4182 -1565 919 1397 -1600 -320 -751 -9847 -9918 3376 6300 -3777 -4073 5075
1662 5075 5852 644 3127 4496 -2284 -3900 2302 -286 -7629 -4839 1496 -298 324 5962 3605
1677 3605 -3122 2427 10439 2641 -7733 -4510 -241 -5408 -7196 -2369 -2760 -5096 716 4551 -893
1692 -893 -1324 5807 5090 -2307 -2046 1201 -4866 -7924 -191 2252 -5153 -3369 5540 5459 1169 5014
1708 5014 8284 2772 327 3614 -493 -7058 -3323 2260 -3390 -6942 -115 2176 -942 3097 9324
1723 9324 2779 -3438 1668 3874 -4525 -6905 -1959 -2549 -6915 -2653 1573 -1723 -883 6835 6801 408
1739 408 2400 6157 -718 -5467 378 1197 -7468 -7765 298 32 -2556 2873 6956 1815 -213 4646
1755 4646 3236 -2775 -1150 230 -6233 -7691 490 -11 -6879 -2727 7629 6533 71 2993 5843
1770 5843 1452 892 4188 -1538 -8966 -4317 2121 -1238 -2570 2679 1739 -1279 4521 9795 1781
1785 1781 -4278 2603 5281 -3363 -7546 -3306 -2429 -2863 1897 3757 -2065 -1150 8400 8122 1365 1283
1801 1283 3355 -1442 -3251 2487 572 -7610 -4134 6175 4121 -3356 54 5407 3653 3541 4215
1816 4215 -3061 -9623 -2852 2184 -4733 -9606 -4063 -975 -3107 656 4256 -2012 -4123 4826 7318
1831 7318 -3183 -8467 -3298 -858 -3007 -1175 -1894 -7072 -2216 9385 8865 -537 -690 4752 2285
1846 2285 -565 1706 -1763 -8890 -4927 3818 -360 -7495 -2139 5090 4325 3776 5239 -173 -3986
1861 -3986 2578 5640 -3830 -9583 -2673 432 -2171 609 5374 1939 420 8319 10315 2291 -529
1876 -529 4574 3479 -1883 -1564 -2058 -6237 -3198 5564 4545 -2320 1344 8272 4917 827 3457 2650
1892 2650 -4677 -4381 494 -3369 -8262 -2878 1888 -679 -1034 4791 3112 -276 4558 7133 -1159
1907 -1159 -6182 -1563 -1511 -7474 -5541 659 -2045 -5337 284 3944 64 432 4129 791 -4978 -1398
1923 -1398 322 -6720 -8789 -1950 -1106 -4994 -1834 3894 944 -386 6870 7786 -699 -3186 1361
1938 1361 -127 -3081 -628 -302 -5895 -3612 5342 5134 -1435 1389 6358 3412 745 3316 40
1953 40 -6455 -3637 3139 -1093 -7318 -3029 3045 2604 3204 5858 1942 -1871 4196 7398 -599 -5306
1969 -5306 -1000 -67 -3080 -335 3310 -1180 -1917 6809 9327 1331 -1915 2682 2300 -699 -615 -2162
1985 -2162 -7956 -5383 2827 1231 -5491 -1403 4850 2116 -6 4078 2881 -4323 -3559 1324 -2835
2000 -2835 -8641 -4923 -354 -1024 378 3499 -534 -2562 5131 8905 317 -4904 -12 469 -5450
2015 -5450 -5143 -1076 -3255 -4046 2471 5069 368 962 5725 3433 -233 2399 1805 -5792 -6405 1613
2031 1613 952 -5877 -3930 2497 2487 2085 6158 5760 852 1877 4945 -403 -5825 -1658 506 -4033
2047 -4033 -3356 2519 1188 -3494 1997 7864 4136 364 3028 2568 -1945 -1069 -91 -5710 -7554 -232
2063 -232 2618 -2462 -1520 5105 3698 -224 2561 4084 -1699 -3778 1084 -252 -6663 -5533 -2072
2078 -2072 -3428 -2080 4750 3704 -2000 246 6575 2840 -4272 -1981 125 -3495 -3698 -431 -3235
2093 -3235 -6458 -228 5315 669 -1778 3412 4678 694 1143 1993 -4268 -7893 -1484 1779 -2729
2108 -2729 -3508 1775 2629 968 4576 4941 -527 -178 6680 4822 -3590 -5119 -781 -1611 -1734 2381
2124 2381 1788 -1959 2341 9300 5268 -1737 491 3241 -883 -1936 1134 -2350 -6996 -2184 3062
2139 3062 -392 -3149 2127 4471 2541 4041 4405 -2564 -6461 -160 2254 -4733 -6293 272 1057
2154 1057 -1788 851 3506 928 854 5273 3278 -2423 -1457 504 -5023 -7513 -1826 -528 -5785 -2559
2170 -2559 5094 4153 -1454 852 3677 526 -876 956 -1199 -4123 -1401 -1021 -5889 -4746 4209
2185 4209 5332 -190 1795 8055 5412 -1183 30 1385 -2410 -3013 -714 -3028 -4765 -802 1843
2200 1843 -1467 -363 5398 4179 -1002 2039 6305 382 -6129 -2950 -41 -3000 -2845 1019 957 710
2216 710 5193 5612 -197 464 6743 4821 -2370 -2106 410 -3861 -5912 -1101 -335 -4551 -1878 4499
2232 4499 3076 -550 1554 1423 -2940 -2024 1011 -3454 -7947 -2909 2409 -1997 -5204 -26 2707
2247 2707 2782 4900 6629 193 -2414 3083 2928 -4570 -5378 763 116 -2198 778 3099 -948 -461
2263 -461 5341 4677 -801 -666 1061 -2370 -3236 -182 -2852 -7762 -2684 5405 3140 -2200 1882 6243
2279 6243 3304 1226 2361 247 -2434 1079 2315 -3213 -4831 422 2616 -472 2695 5904 1848
2294 1848 -877 3796 4392 -3074 -5892 -1550 -1414 -3754 -2166 -1268 -3474 -87 6118 3608 -2395 535
2310 535 5687 1710 -3072 -1285 -1665 -6048 -3574 1236 -845 -3724 683 4301 1530 809 3552 397
2326 397 -3506 -2 1667 -5413 -8663 -3105 -1028 -3432 -1857 1761 -22 -120 4673 5494 -179 -1375
2342 -1375 2779 190 -3886 -1748 225 -2829 -2371 3141 3600 792 3677 6779 3940 1080 3992
2357 3992 1849 -3863 -2815 1220 -1546 -5139 -1263 2189 -499 -23 4508 4289 744 2729 3820
2372 3820 -1175 -3153 16 -651 -5363 -2599 2146 314 -1831 3784 6322 2201 985 4294 2580
2387 2580 -1353 -178 451 -3925 -4249 -110 -1165 -4461 -35 4614 1412 -1359 2543 2592 -2883 -3174
2403 -3174 84 -2177 -6381 -4334 -1668 -3294 -2075 1765 808 -1814 2569 5708 292 -2551 1066
2418 1066 1027 -4379 -3738 16 -2383 -3643 1130 4035 422 180 3906 3007 -122 1940 2371 -3205
2434 -3205 -3957 713 -337 -4617 -2194 2772 1742 7 4366 5344 556 1241 4708 1641 -3310 -1301
2450 -1301 492 -2420 -2001 1743 856 -1636 2621 6267 2470 16 3699 2851 -3002 -3134 -17 -3009
2466 -3009 -5810 -1608 677 -2010 -1283 3575 3170 213 2993 4279 -878 -2508 1053 -630 -5540
2481 -5540 -3516 745 -1945 -3526 1829 4512 1336 879 3872 1980 -1187 117 -103 -5029 -4824 -441
2497 -441 -1991 -5646 -2068 2353 136 -308 4124 4088 -1702 -1296 2841 153 -4688 -3075 -1379 -3406
2513 -3406 -1202 2751 717 -1393 3872 7368 3006 315 3395 2444 -1831 -657 1671 -3289 -6146
2528 -6146 -296 3730 278 -504 2432 2390 1667 4206 3135 -3578 -4101 1345 -47 -5365 -3960 33
2544 33 -809 -1329 3151 3754 -906 695 5086 2930 -1958 -1548 -903 -3379 -2415 630 -2049 -4825 469
2561 469 5300 1274 -991 2374 2557 -1322 -1025 816 -2851 -5931 -1854 298 -3382 -3369 1156 1468
2577 1468 565 3804 3897 -991 -1153 3486 876 -5453 -3623 762 -1250 -3065 998 1924 -495 1726
2593 1726 5735 2956 -876 1039 2140 -1426 -2507 -178 -2844 -4858 105 4139 -368 -1692 3831
2608 3831 5934 1504 1159 2640 -146 -2252 501 906 -4341 -3728 1186 697 -530 2512 4188 330
2624 330 964 5818 2935 -4104 -3368 1057 -1710 -4885 -2285 -916 -2572 -302 3570 1247 -1221 2498
2640 2498 4119 -452 -1726 298 -2161 -5799 -2261 687 -3279 -4233 1740 3731 459 1011 3626
2655 3626 1606 -621 1339 627 -4405 -3792 -50 -1461 -4953 -728 2962 213 85 4833 4015 -949
2671 -949 443 3345 -570 -3992 -1316 -632 -3467 -1597 1900 50 -1440 3299 5603 1330 -23
2686 -23 3884 1869 -2629 -1209 813 -2810 -3779 475 1418 -1322 -24 4588 3304 794 2889 2841
2702 2841 -1242 -1157 1081 -1863 -5259 -1608 1433 -1713 -2436 2567 3015 -311 1330 4340 404 -2695
2718 -2695 -394 458 -3948 -3847 -954 -2228 -2592 1788 3009 -1323 -749 4996 3288 -2220 -1408 1134
2734 1134 -1838 -4047 -1134 -1153 -4553 -1830 2451 1099 -135 2665 3418 -249 390 2906 -838 -5890
2750 -5890 -2267 1795 -964 -3661 331 1448 382 2617 4704 1310 101 3451 3564 -1977 -2442
2765 -2442 201 -1946 -4098 386 3236 -493 -1132 4331 4860 1092 832 2192 -891 -1873 1316 -428
2781 -428 -5591 -3754 1493 -427 -2876 1261 3863 1452 1597 4207 1395 -3094 -1627 725 -2874
2796 -2874 -4013 -633 -526 -2887 -81 3804 539 -1422 3102 5045 114 -1450 60 -2498 -4663
2811 -4663 -2383 -1213 -4461 -2871 2978 2388 -1511 37 3733 904 -1811 1561 1599 -3169 -3100 -186
2827 -186 -2129 -3970 -485 1291 -167 2049 5945 3226 -1329 1567 3847 -1123 -3580 -268 588
2842 588 -2452 -1647 1528 -771 -1023 2915 4215 597 1948 4259 1018 -3030 -653 628 -3495 -4102
2858 -4102 1275 2406 -874 414 3423 1789 870 3517 2725 -1190 -258 2137 -1941 -5932 -1528 1157
2874 1157 -2131 -2343 2197 2395 395 1592 2573 -1409 -2232 1069 -459 -4338 -2822 380 -2522 -3821
2890 -3821 765 2955 -724 -42 4442 3754 -650 -436 -154 -2837 -2658 -93 -1609 -4117 -145 3615
2906 3615 -79 -2365 2017 3875 59 -93 2050 -555 -3768 -1828 -705 -3293 -2680 806 907 65
2922 65 3897 4953 444 -833 3938 3644 -2123 -2462 939 -191 -2031 -309 308 -1402 1034 5464
2938 5464 3461 -475 2252 3492 -609 -2396 332 -1530 -5086 -2078 1985 -290 -2797 409 2759
2953 2759 1130 2180 3419 -278 -2552 1239 1561 -3772 -5545 -917 -54 -1955 48 2172 -200
2968 -200 -315 4117 3663 -998 -1392 869 -1588 -4074 -1505 -1174 -4692 -2567 2734 1997 -1153 771
2984 771 3530 885 22 1979 -85 -3576 -1513 1478 -2239 -4464 -70 2415 -180 867 4083
2999 4083 3007 387 2091 2543 -1517 -2548 673 -855 -3611 -1048 1876 -1185 -1581 3339 3892 30
3015 30 1069 4031 1666 -2190 -663 -271 -2884 -2126 864 -480 -1743 2803 5080 1151 -820 3341
3031 3341 3348 -788 -884 1107 -1842 -3943 -1425 -39 -2995 -1699 2008 1313 -243 2332 2417 -2167 -2558
3048 -2558 1626 -91 -5061 -3710 195 -1509 -2805 187 1071 -407 1317 4506 1676 -1216 1411
3063 1411 1415 -2264 -3086 -217 -1448 -3798 -374 2935 422 -1289 2996 3380 285 963 2011 -1048
3079 -1048 -2844 -192 -276 -4129 -3227 1572 992 -786 2366 3960 1046 602 3698 2105 -2362 -916
3095 -916 1271 -1326 -3106 -96 687 -1542 247 4176 2227 240 2684 3453 -59 -1700 742 -1320
3111 -1320 -4423 -1753 728 -2417 -2441 2254 3047 -284 600 3540 994 -1436 423 260 -3602 -3570 -100
3128 -100 -1934 -3320 -135 2324 -182 -129 3720 2066 -1791 -455 1999 -1277 -4266 -1778 -1147 -3128
3144 -3128 -2281 1325 -191 -1143 2438 4103 203 -359 2626 644 -2933 -1463 720 -2456 -3236 1152
3160 1152 2138 -901 565 3679 2137 751 2879 2492 -1922 -1441 1177 -903 -3863 -1399 1208 -776
3176 -776 -796 3169 3151 -497 815 3795 1157 -1812 -142 -30 -2696 -2033 922 -1094 -2204 1781 3294
3193 3294 551 384 3291 2088 -1577 174 1008 -2356 -4001 -802 199 -2528 -1150 1829 973 -307
3209 -307 2571 2402 -1000 -1216 1297 -701 -4059 -1993 -244 -2758 -2732 969 1445 -1107 768 3923
3225 3923 1383 -897 950 913 -2344 -2174 -313 -1921 -3428 167 2038 -1240 -506 3801 3437 164
3241 164 1195 2654 -775 -2476 -144 -370 -3341 -2077 1460 496 -417 2072 3047 518 1500 4096
3257 4096 1203 -2419 -591 1351 -1896 -3262 -307 216 -1664 641 3509 1720 -118 2893 3123
3272 3123 -330 -597 439 -1837 -3669 -372 656 -2846 -2533 2024 2529 -349 746 2871 699 -811
3288 -811 832 91 -3569 -2721 -173 -1215 -3109 -236 1236 -615 842 3637 1387 -1761 122 2078
3304 2078 -1246 -3435 -1341 -876 -2963 -1347 1020 -364 -1308 2681 3012 409 -43 1816 86 -2325
3320 -2325 -44 157 -3106 -3065 1490 1591 -1455 535 3340 2161 789 2612 1826 -1288 -739 1335
3336 1335 -1098 -3459 -558 904 -1146 -54 3817 2251 -454 1940 3999 222 -2233 186 407
3351 407 -2293 -1878 -58 -1443 -1279 2085 2483 -644 697 3579 1507 -1493 -107 986 -2741 -3465
3367 -3465 -90 -405 -2792 -1065 1883 991 -433 2026 1599 -729 257 2030 -1484 -4361 -1187 -8
3383 -8 -2862 -2722 781 1046 -742 1429 3515 429 -1088 1416 812 -2175 -1634 -330 -2455 -2622 300
3400 300 1133 -1552 -478 3584 2649 -205 1723 2609 -271 -1370 244 -890 -3415 -1216 1337 -443
3416 -443 -1103 2341 3216 536 1311 2880 621 -1721 505 1245 -2770 -3046 -365 -80 -1837 520 2545
3433 2545 863 353 3432 2979 -1128 -1023 591 -879 -2511 -872 -703 -2703 -957 2428 615 -1463
3449 -1463 1215 3504 517 -1170 657 -301 -3312 -2362 -234 -1731 -2738 -91 1152 -174 444 1967
3465 1967 0 -1235 1633 2498 -2166 -3440 -478 -182 -2696 -1722 752 -192 -162 2735 2609 5 346
3482 346 2046 -383 -1917 451 148 -2863 -2228 1892 435 -2248 299 3418 1968 1155 2192 1163
3498 1163 -1497 -291 684 -2063 -2868 476 1504 -1123 -230 2800 1743 -79 2250 3273 266 -1132
3514 -1132 909 -342 -2923 -1738 -257 -2092 -1626 2024 2680 -314 819 2909 987 -1687 -41
3529 -41 425 -2058 -2219 -68 -1393 -3082 -849 1437 -307 -312 2490 2413 -826 -55 1347 -1492 -3124
3546 -3124 -1186 -536 -2507 -1658 1196 39 -1621 1423 2891 186 -363 2277 1336 -2263 -2095 -232
3562 -232 -1638 -2786 -74 398 -573 1255 3270 1271 -134 2329 2829 -705 -1209 777 -90 -2542
3578 -2542 -1122 819 -527 -998 1999 2577 1191 1869 2402 -25 -1394 1339 726 -3215 -2991 710
3594 710 423 -1469 -309 1521 348 1021 2790 1617 -606 131 840 -2019 -2449 -430 -398 -3109 -739
3611 -739 2684 1004 -1475 826 2915 1351 -489 432 -876 -2035 -671 -844 -3471 -3203 777 1107
3627 1107 -1229 482 2965 779 -1195 775 1414 -1425 -2090 -227 -713 -2170 -721 117 -867 113
3643 113 3480 2248 -718 840 3232 286 -2290 -179 69 -1742 -1536 612 -378 -1115 1426 2547
3659 2547 901 553 2633 1751 -1068 96 1087 -2064 -3082 -264 1004 -995 -72 2013 1584 535
3675 535 2363 2312 -779 -407 1704 -675 -2935 -1393 -34 -1527 -1579 1366 952 -420 947 2798 607
3692 607 -1213 281 -195 -2677 -1996 -294 -1764 -2808 -193 1234 -702 -332 2295 2110 13 587
3708 587 826 -1726 -2505 -354 -912 -2977 -1481 743 252 -1062 1546 1993 104 702 2022 475 -1550
3725 -1550 -814 108 -2158 -2286 154 253 -1498 889 3368 1395 8 1924 2165 -210 -585 635 -555
3742 -555 -2007 -325 287 -1391 -577 2479 2374 366 1765 3260 818 -851 239 297 -2543 -1641 371
3759 371 -786 -1578 484 809 227 636 2917 1302 -947 588 1647 -1644 -3339 -711 -649 -2357 -928
3776 -928 1040 0 -218 2082 2101 -662 -764 1556 -482 -2354 -1050 -392 -2278 -2208 468 562 -1156
3793 -1156 189 2189 687 180 1392 754 -2112 -1193 564 -1451 -2719 -484 979 -663 -131 2000
3809 2000 1351 -204 1717 2341 -98 -1546 -71 -339 -2104 -874 885 -663 -706 1617 2625 395
3825 395 828 2779 1565 -771 491 483 -1891 -2242 443 137 -1674 -73 2214 1171 684 2150 1952
3842 1952 -381 -262 1045 -953 -2490 -961 5 -1880 -900 1021 515 -627 1371 2403 530 -660
3858 -660 899 199 -2027 -1878 -537 -2125 -2302 286 863 -1006 61 2386 1157 -480 958 1145
3874 1145 -1546 -2174 -261 -388 -2910 -1646 751 -287 -424 1750 1542 28 818 2371 214 -1764
3890 -1764 -23 502 -1755 -1992 404 -48 -1004 942 2827 1211 260 1875 1955 -464 -202 488 -1316
3907 -1316 -2145 445 805 -1530 -768 2090 1708 127 1816 2312 24 -527 597 -176 -2386 -1429 159
3924 159 -1040 -1589 893 1268 -332 798 2806 781 -1158 752 769 -1809 -2239 -563 -986 -2418 -799
3941 -799 941 -324 -676 1841 1752 -293 167 975 -866 -2050 -546 -329 -2671 -2053 735 -109 -1024
3958 -1024 709 2278 662 6 1850 410 -1545 -918 358 -1621 -2503 45 510 -669 351 2481
3974 2481 1188 -397 1498 2539 -630 -989 689 -185 -1844 -944 294 -546 -650 2087 1925 -62
3990 -62 1133 2641 1033 -570 749 536 -2115 -1885 281 -314 -1853 -24 2157 657 130 1977
4006 1977 1294 -170 524 1025 -1216 -2667 -723 93 -2136 -1098 814 323 -451 1328 2339 -94
4022 -94 -595 1168 572 -1816 -1540 -862 -1894 -1716 387 352 -1610 49 2537 908 -363 750 767 -1293
4040 -1293 -1655 332 -1299 -2897 -876 1029 -478 -410 1478 1449 339 1041 1911 -40 -1315 343 586
4057 586 -1797 -1875 496 -89 -1095 1308 2255 526 335 2606 1590 -680 -347 664 -761 -1675 98
4074 98 -284 -1656 -77 1960 876 -183 1526 2582 350 -344 1107 -188 -2049 -701 234 -1350
4090 -1350 -1650 406 1120 -70 795 1983 72 -820 1177 775 -2033 -2434 -227 -732 -2255 -752 660
4107 660 -39 -127 1124 945 -157 284 1116 -554 -1712 -150 -699 -2770 -1575 746 -144 -1122 1000
4124 1000 2225 760 -47 1321 494 -866 -370 205 -1998 -1997 416 92 -1111 260 2166 1079 62
4141 62 1954 2000 -248 -946 760 -507 -1983 -558 269 -839 -390 1904 1355 -103 1239 2699 924
4158 924 -535 657 767 -1591 -1493 108 -763 -1601 823 1928 44 263 2146 1077 -678 318 847
4175 847 -1300 -1824 -187 -467 -1772 -1088 153 -44 -416 1544 1851 -146 218 1270 -205 -2345 -1354
4192 -1354 264 -1573 -2025 115 75 -1020 395 1789 110 -89 1699 832 -1538 -1322 561 -1247
4208 -1247 -2372 -396 846 -736 -651 1547 1530 2 945 1480 35 -278 734 -662 -2375 -1179 724
4225 724 -398 -1710 1115 2122 560 671 2252 1135 -282 -120 709 -1006 -1064 351 -561 -1808 349
4242 349 1745 175 -400 2195 2764 76 -164 976 -379 -1955 -981 108 -1122 -1139 855 111 -493
4259 -493 907 1696 153 -506 1154 545 -1889 -1796 464 -1357 -2613 -775 302 -458 -145 1909 674
4276 674 -551 492 1061 -890 -1514 94 -183 -2103 -1090 1054 -826 -812 1218 1976 140 516 2073
4293 2073 463 -1094 -33 77 -1571 -1632 367 163 -1152 149 1602 398 360 2248 1577 -602 -57
4310 -57 1222 -510 -2240 -888 309 -829 -412 1587 1273 164 1346 2045 434 -276 854 240 -1618
4327 -1618 -661 409 -1332 -2010 663 1727 18 11 1383 1358 90 496 159 -1221 -1603 517 -743
4344 -743 -2346 -480 649 -872 -876 1411 1633 -384 -99 1475 266 -1869 -1319 -516 -1716 -1248 452
4361 452 -499 -1174 937 1951 142 -489 1498 956 -1357 -582 384 -1117 -2375 -18 217 -826 -42
4378 -42 1473 1187 130 1609 1619 -539 -734 1092 356 -1723 -1001 241 -381 -1141 1052 1416 202 831
4396 831 2399 760 -473 465 517 -958 -1498 327 -545 -1431 254 1710 36 0 1922 1571 -266
4413 -266 252 979 -937 -1842 -322 -26 -2053 -1441 628 503 -751 546 1622 222 -215 758 40
4430 40 -1707 -808 -49 -1732 -2210 161 401 -613 -372 1800 800 42 1020 1229 -992 -1386 182 -601
4448 -601 -1933 -687 439 -657 -859 1288 1515 -544 436 1947 642 -1144 -161 45 -1527 -749 438
4465 438 -745 -1084 871 1710 338 522 2160 1601 -566 18 858 -601 -1514 -454 206 -1340 -663
4482 -663 1209 817 91 1840 1962 -129 -214 1354 545 -1768 -709 74 -1002 -1148 346 379 -672 815
4500 815 2150 540 -371 713 705 -1232 -1179 122 -892 -2145 -745 779 -525 -894 1003 1162 -376
4517 -376 355 1306 -907 -1790 -130 -91 -1966 -1418 122 -237 -683 878 1378 -353 -190 1516 942 -1161
4535 -1161 -323 261 -1558 -1605 -134 -36 -1303 70 1708 750 153 1371 1425 131 -77 853 -611 -1758
4553 -1758 -430 376 -893 -861 1186 1295 -39 844 1894 761 -364 955 428 -1366 -983 588 -122
4570 -122 -1492 530 1313 -81 241 1644 1717 -118 322 1108 -567 -1483 -93 -426 -1879 -827 704
4587 704 -131 -547 1145 1384 -168 -97 1466 413 -1602 -986 154 -1127 -1440 -22 80 -1056 225
4604 225 1672 484 -218 931 809 -748 -569 102 -777 -2201 -487 322 -902 -706 1200 753 148
4621 148 759 1348 -251 -722 899 260 -1738 -1063 218 -366 -1312 833 1314 -23 636 1910 1045 -263
4639 -263 317 733 -976 -1233 -176 -270 -1189 -341 1566 57 -202 1601 1513 261 109 1003 -69 -1398
4657 -1398 -694 217 -1535 -1325 814 628 -585 432 1503 532 -54 551 609 -1183 -719 185 -805 -1700
4675 -1700 -38 132 -894 -97 1230 856 -375 695 1418 -823 -1088 -18 -296 -1865 -1208 118 -892
4692 -892 -1026 999 1438 40 536 1832 522 -481 -135 265 -1053 -978 193 -205 -1221 283 1515
4709 1515 521 241 1271 1362 -368 222 921 -261 -1433 -462 237 -753 -541 742 741 137 958 1680 -208
4728 -208 -85 1093 780 -1446 -984 33 -573 -1602 245 977 -240 78 1659 865 -252 419 529
4745 529 -617 -1026 -110 -1401 -1811 -93 967 -366 -988 688 1429 132 -121 1092 104 -1197 -133
4762 -133 -16 -1436 -1544 1 -114 -600 387 1071 -321 281 1513 984 -1409 -804 282 -295 -1466 -622
4780 -622 -59 -769 -437 1159 473 -249 1202 1655 211 -323 416 -371 -1475 -459 604 -548 -907 576
4798 576 1544 180 333 1462 1136 31 657 643 -1278 -859 243 -197 -1357 136 775 -139 -100 1206
4816 1206 1222 -263 454 923 75 -1224 -142 93 -957 -1179 8 -169 -386 933 1604 253 -46 817
4834 817 -97 -923 -320 363 -1205 -1918 -168 635 -1044 -455 964 509 -113 732 705 -460 -632 273 -1040
4853 -1040 -2162 -707 726 -773 -782 845 1300 -111 180 1220 717 -316 376 366 -1128 -716 193 -439
4871 -439 -942 439 1112 29 90 1685 1566 -431 -21 740 29 -1268 -268 101 -1145 -73 1142
4888 1142 582 -309 1081 1830 293 122 1102 316 -1249 -480 191 -801 -980 138 443 -410 385 1170
4906 1170 487 42 840 775 -1020 -1310 89 -294 -1402 -469 413 -787 -240 1015 1049 -157 221 1183
4924 1183 -271 -984 -82 70 -1306 -1108 3 -260 -958 215 1401 312 299 1316 429 -867 -74
4941 -74 546 -1088 -1469 179 200 -1011 -162 939 631 32 677 1007 48 24 606 -162 -1017 -448 233 -1022
4961 -1022 -783 1310 972 -253 697 1730 380 -218 736 836 -361 -506 -175 -599 -902 297 580 -347
4979 -347 185 1585 1216 -566 104 1052 85 -972 -95 99 -1004 -778 594 -225 -670 714 668 167
4997 167 -164 1178 -30 -1332 -551 -73 -1103 -1262 -168 212 -295 -146 944 216 80 1043 847 -536
5015 -536 -670 346 -176 -1676 -316 87 -912 -403 1253 863 -115 577 1292 -119 -766 273 358 -1025
5033 -1025 -797 -106 -366 -918 241 855 0 429 1722 507 95 460 1046 -658 -1030 226 382 -1141
5051 -1141 -502 1063 239 37 584 1085 56 94 791 -70 -1082 -68 132 -1141 -940 552 -52 -570
5069 -570 401 1245 387 -536 456 989 -331 -636 69 -961 -852 -321 7 -655 -378 991 911 -160 324
5088 324 933 -39 -972 -137 9 -1440 -1363 -175 -133 -762 347 710 -127 335 1018 320 -762 -25 712
5107 712 -885 -1302 -53 305 -621 -66 344 307 53 1065 1113 -522 393 842 -71 -1049 -267 -60 -905
5126 -905 -806 968 740 -111 721 1502 761 -155 460 157 -603 -474 83 -598 -1288 -191 515 -114 -107 740
5146 740 812 -38 520 568 -674 -795 -9 7 -1391 -879 22 -630 -441 593 774 212 230 898 149 -563
5166 -563 60 -53 -1267 -1018 97 -415 -901 23 1146 172 -256 534 934 -304 -268 435 -691 -1151 -11
5185 -11 -369 -857 -344 638 574 -53 769 954 109 -327 639 201 -1004 -967 -11 -194 -590 316 190 -387 557
5206 557 1714 567 -239 616 585 -482 -1224 -244 -332 -774 93 624 -223 -155 928 974 151 356 549 -191
5226 -191 -974 87 74 -802 -1205 180 197 -707 285 823 495 95 813 447 -817 -379 -98 -696 -1273 -525
5246 -525 144 -612 -73 992 857 -250 818 928 -135 -568 295 -511 -994 -577 -271 -578 -640 635 788
5265 788 54 204 1101 572 -324 163 422 -1118 -758 -192 -327 -1097 -83 1065 373 292 1195 953 39
5284 39 359 638 -206 -978 80 9 -522 -445 440 513 -163 781 1355 32 35 1268 443 -626 -629 122 -530
5305 -530 -1018 441 513 -417 145 846 504 -214 570 768 -367 -572 11 -238 -1351 -198 93 -473 -509
5324 -509 774 897 66 71 306 -217 -623 62 -87 -903 -1076 276 -298 -783 183 734 86 340 835 498
5344 498 -563 -259 243 -490 -1096 -309 69 -938 98 562 309 -52 1123 1016 209 -38 462 230 -643
5363 -643 -351 -27 -594 -666 474 823 70 332 1113 450 229 594 482 -782 -376 -76 -419 -974 -74 472
5383 472 -24 -141 550 797 -239 416 1147 171 -531 -182 -363 -773 -549 -247 -166 -99 281 543 -63 137
5403 137 715 495 -505 -412 101 -435 -717 -304 -95 -844 -267 797 363 -216 583 682 -221 -104 202 -645
5423 -645 -1327 -364 10 -783 -603 303 530 277 271 655 28 -256 442 487 -696 -966 368 -123 -862 -256
5443 -256 400 190 295 1312 705 -264 376 497 -84 -643 194 -235 -435 -214 676 100 -187 656 1626 476
5463 476 -3 472 53 -545 79 104 -1020 -829 269 436 -290 266 802 865 80 486 586 -757 -667 346
5483 346 -513 -1098 -723 -23 -457 -313 802 405 -508 181 774 -188 -611 -136 -174 -789 -896 57 -668 -687
5503 -687 371 730 -28 -363 850 532 66 323 424 -760 -906 -228 -9 -1111 -345 997 212 16
5521 16 383 671 -170 85 629 66 -416 40 192 -483 -298 592 414 -321 843 1004 338 22 789 619
5541 619 -508 -385 69 -325 -737 532 70 -419 -59 996 687 -326 511 828 -279 -548 164 -348
5559 -348 -1313 -756 162 -135 -234 312 689 -192 118 373 36 -517 82 105 -826 -986 72 -406 -1076 -499
5579 -499 519 241 69 550 356 -347 -410 63 -226 -529 -136 -200 -637 -248 765 104 -339 398 971 311
5599 311 -394 310 46 -685 -657 -113 -512 -534 450 479 -313 356 938 100 -139 496 732 -335 -732 132 -166
5620 -166 -927 -591 133 125 103 759 499 80 364 1072 273 -681 -31 223 -811 -436 173 -148 -415 -134 793
5641 793 306 347 388 450 -461 -504 50 -522 -753 -25 59 -525 -245 323 448 -180 350 886 -102 -232 201 -137
5663 -137 -925 -859 148 -394 -751 235 521 -95 374 598 250 -345 -20 241 -511 -498 87 -384 -873 -93
5683 -93 429 443 9 693 804 -38 128 264 -55 -402 116 43 -541 -193 448 82 -330 530 747 134 211
5704 211 424 594 -293 -102 -39 -642 -933 -121 153 -146 372 583 413 -500 343 701 -111 -280 62 -280
5724 -280 -764 -328 70 117 -255 410 234 -340 147 624 75 -205 -172 109 -739 -604 130 -80 -641 -162 580
5745 580 -389 230 795 442 -324 111 14 -774 -1014 -4 -240 -771 -674 323 436 214 381 334 338 5 397
5766 397 72 -682 -514 390 -368 -583 322 324 -70 312 1118 178 -445 533 379 170 -431 338 -28 -804 126
5787 126 576 -156 -169 1106 712 -49 214 423 269 -402 133 -75 -800 -720 155 -182 -514 159 824 -22
5807 -22 134 383 245 -423 -70 -269 -699 -953 -203 -682 -670 -273 542 250 108 876 550 -180 -607 629
5827 629 65 -692 -601 -67 -503 -573 290 261 225 322 589 471 -140 153 353 -513 -384 36 -278 -1179 9
5848 9 788 168 5 359 548 192 325 361 -222 -348 196 180 -1103 -141 498 -74 -99 432 665 -261 219
5869 219 919 -5 -438 -156 212 -607 -621 -170 -80 -446 -79 659 258 -13 800 352 -217 -231 160 -275 -624
5890 -624 -390 214 -446 -584 159 680 221 303 464 75 -252 104 -150 -945 -510 89 -506 -756 234 534
5910 534 -250 -193 692 421 -473 34 417 -167 -572 -274 -209 -576 -97 468 -139 -83 568 598 -71 -217 612
5931 612 170 -313 -2 -146 -663 -563 181 654 28 199 926 -31 187 276 465 -227 -406 245 -292 -629
5951 -629 -278 532 27 -30 719 254 83 208 795 -120 -584 -26 -204 -775 -513 137 -295 -497 516 840
5971 840 63 167 602 167 8 -29 -151 -444 -559 -16 -546 -439 -246 568 281 -110 456 776 -307 -164
5991 -164 108 -70 -539 -179 -31 -420 -575 304 -13 -66 454 750 50 -128 490 260 -512 -507 165 -69 -473
6012 -473 286 346 -360 117 828 318 -65 194 419 -19 -238 359 -4 -638 76 629 -157 -325 610 546 19
6033 19 4 396 96 -268 137 89 -615 -780 -122 178 -430 218 805 -178 -250 415 202 -86 13 114 -161 -884
6055 -884 -226 -11 -430 -164 200 -61 -220 59 528 -66 -204 198 -140 -655 -610 150 -389 -592 179 425
6075 425 -122 -307 503 469 -106 229 217 -495 -155 52 193 -580 -34 179 -144 -225 390 433 331 249 375 81
6097 81 -690 219 335 -517 -546 263 246 -130 133 760 134 256 366 -56 -522 -229 264 -215 -412 -183 248
6118 248 -351 -74 554 790 18 287 741 172 -402 56 -64 -408 -119 115 -461 -417 225 511 -72 6 269
6139 269 166 -432 266 171 -518 -778 187 -232 -701 -108 44 33 120 474 219 -40 -121 687 -242 -739 -262
6160 -262 -15 -380 37 402 -46 -85 327 557 -21 -352 186 -121 -463 -71 151 -39 -447 67 205 -339
6180 -339 -41 477 283 293 149 482 -290 -203 329 -152 -842 -321 161 -227 -168 377 585 116 604 525 24
6201 24 -419 22 13 -446 -501 -129 -124 -117 16 425 -241 -37 392 236 -122 -222 50 -150 -679 -207 -362 -554 26
6224 26 424 364 -310 103 140 -218 -181 413 -9 -453 -73 96 -591 -659 -249 -39 -142 220 430 185 -233 420
6246 420 449 -229 -543 97 -224 -688 -20 78 81 238 516 461 239 302 441 -77 -341 -13 -283 -450 -333 341
6268 341 230 -376 411 336 85 141 361 228 -244 36 212 -101 -417 -14 154 -498 -184 4 164 -86 706
6289 706 139 -187 -234 412 -356 -735 -47 -197 -148 -401 195 -6 -317 101 536 110 -337 103 -310 -251 171
6310 171 -255 -491 -587 -93 199 -64 -195 333 680 -294 -219 -16 -340 -292 27 -272 -584 -351 270 109 -235
6331 -235 591 653 322 124 745 257 -309 -194 111 -51 -181 -15 141 -59 261 682 57 86 445 606 -161
6352 -161 -213 28 -289 -656 -119 129 -38 -143 293 329 -81 7 276 243 -122 96 58 -456 -541 259 -270 -427
6374 -427 252 172 152 194 313 34 -23 -164 122 -520 -508 -223 59 -489 -93 148 175 -185 198 375 -334 -96
6396 -96 205 -28 -727 -148 -161 -273 -27 192 -156 -470 344 808 238 -203 -107 269 -100 -181 297 -372 -623
6417 -623 -11 280 -229 -245 470 304 83 599 499 242 -229 246 156 -296 -130 -68 -191 -131 210 412 -28
6438 -28 17 462 141 -193 -4 -57 -41 -501 70 25 -320 197 604 256 58 82 151 4 -74 216 -174 -293 -539
6461 -539 73 -281 -297 273 72 -263 72 -110 -69 -54 -35 -156 -548 -259 73 16 -364 -16 465 -119 -148 279
6483 279 573 -157 -100 126 -190 -238 80 40 -301 5 126 -385 -51 336 215 11 -17 171 -90 262 38
6504 38 -223 -744 -336 169 179 137 198 555 208 90 274 350 -19 -57 201 -484 -93 -13 225 -174 -60 303
6526 303 143 20 298 326 -52 -485 -48 -76 -393 -3 24 -249 -473 147 95 -63 280 378 128 -538 -215 377
6548 377 -363 -78 -254 -364 -339 -154 77 160 -179 203 154 49 7 171 124 -319 -56 1 -350 -492 -45 34
6570 34 -74 408 152 103 -122 153 -273 -393 -184 42 -368 -35 -31 37 -141 122 643 275 -21 -11 337 81
6592 81 -63 214 -144 -333 -248 -66 -372 -164 116 154 -192 139 269 198 28 388 71 -642 -100 -78 54 -219
6614 -219 28 289 -106 25 172 -113 -193 -59 96 -32 -339 -142 -58 -298 -446 -106 -130 -93 -5 460 -160 127
6636 127 433 -93 64 -321 114 -142 -150 189 32 -130 85 529 -195 98 -48 70 -16 187 -8 79 -460
6657 -460 -157 334 -52 -306 287 218 312 151 343 20 -233 278 -25 -271 -489 -132 30 -127 111 113 -176
6678 -176 37 198 528 -289 -127 -150 -101 -275 -98 210 -102 130 16 178 108 15 163 19 104 -69 -81 -563
6700 -563 -39 -134 -374 -273 150 440 -264 234 126 33 -74 662 55 -219 -484 -338 -370 -421 59 331 -173
6721 -173 -45 481 365 -39 3 112 78 -201 -145 179 -154 -55 -323 -219 -48 190 715 109 -25 309 -141
6742 -141 -143 84 207 32 -265 -92 -17 -117 -272 350 115 183 -52 4 283 -64 79 -156 -676 59 -77 172
6764 172 -240 204 59 63 264 259 -87 -249 134 -203 -151 -187 -78 -446 -124 -76 200 -162 -78 100 -126 -29 -145
6787 -145 355 -281 -389 -190 -66 -328 -325 101 -91 10 -48 58 146 155 -6 -4 -232 -320 -78 -262 -175 264 -356
6810 -356 0 264 52 142 8 357 63 225 -246 332 -177 -396 -13 -22 -109 -208 487 363 45 173 343 337
6832 337 -85 -68 -76 -393 -162 -65 73 -283 12 87 -91 -55 134 241 -65 37 161 -231 -188 -104 15 -211 -294
6855 -294 42 2 -39 -30 57 -243 173 14 -307 -81 -210 110 -5 110 -14 -349 174 334 245 -6 -180 -224
6877 -224 75 -197 -346 -260 -45 -380 93 11 -64 -115 337 61 198 275 213 -151 -185 201 -34 -203 -439 234
6899 234 -59 -17 251 150 127 -18 195 222 116 -101 -171 -99 -104 -218 57 -161 137 235 112 -56 164 148 119
6922 119 171 -44 -109 -230 -145 -181 -325 -27 122 105 -170 85 164 227 -20 176 18 -397 34 153 109 -271 181
6945 181 -230 -167 14 233 -3 -190 22 -122 -208 21 -78 62 -10 -260 240 -31 150 255 80 -112 477
6966 477 352 -51 -227 -128 -45 -189 -34 147 -140 -16 311 336 106 322 -110 416 117 26 -54 -143 -627 -76
6988 -76 10 -248 -70 164 77 92 29 129 197 38 290 -114 -206 -172 343 128 30 -65 165 32 67 56 -224 22
7012 22 297 102 -108 -417 -218 29 115 -3 -130 136 -153 309 21 211 40 126 116 -216 -133 255 75 100
7034 100 100 111 -36 -165 233 17 -145 142 139 -116 -282 223 -148 -79 -477 212 -131 83 325 104 166 -128
7056 -128 414 88 -84 237 116 -70 -239 -223 79 -192 360 61 184 305 482 183 -227 -64 -296 -164
7076 -164 284 -80 435 -536 -162 158 316 253 43 215 281 307 96 -257 -88 56 -2 -413 -113 5 84 -165
7098 -165 44 175 114 -57 -66 147 -93 -151 316 1 -506 -11 265 226 114 129 -39 -9 74 -17 -329 -72 113
7121 113 -106 -140 238 -300 -39 -183 190 69 -248 21 120 39 -322 37 -102 71 -307 48 -210 21 14 154
7143 154 137 188 278 179 158 -57 193 -315 61 18 329 -44 169 658 341 -129 -160 314 210 -225 -4 -4 -119
7166 -119 233 74 81 -214 49 -171 -207 219 266 -139 -326 -69 65 -22 -105 -139 89 -244 -353 311 -104 134
7188 134 257 55 213 225 162 -407 -272 -106 235 -60 -440 59 149 -273 91 -98 23 32 -22 89 -453 -52
7210 -52 -159 -59 -187 36 -127 41 238 158 141 -70 406 -54 30 138 -110 -206 -182 120 -80 -50 -185 20
7232 20 38 69 -31 181 37 -220 277 128 98 -180 111 8 -187 -53 116 431 -271 317 387 38 114 141
7254 141 -241 122 -19 -96 -26 -40 302 32 -3 278 -6 -66 12 13 23 1 100 -24 -119 -101 -18 -6 -92 114 -71
7279 -71 176 58 163 61 -86 -228 -95 -117 -292 35 302 22 79 70 113 28 -47 219 38 -130 -4 174 -141
7302 -141 96 8 -174 -39 125 284 -131 -36 84 213 42 249 -46 58 -5 186 -92 -236 55 118 -194
7323 -194 -80 -138 -52 -96 -48 -54 188 -92 -148 177 -178 68 -102 231 -281 -199 190 194 45 98 213 -159 244 -76
7347 -76 182 -400 -183 -61 -145 -74 27 325 -56 31 152 51 -148 -214 -259 -190 -231 -39 73 58 206 41 45 -214
7371 -214 165 -369 -181 227 131 114 -272 -67 -109 21 -271 193 -33 189 -3 179 434 -90 246 -170 -50
7392 -50 -52 -162 -45 -185 79 17 126 -114 15 75 60 -73 40 -240 47 81 -18 -115 3 63 -21 140 372 165
7416 165 189 266 162 246 134 -41 -162 23 -194 -6 108 183 26 155 65 43 -9 -203 -295 96 -23 -260 -265
7439 -265 95 7 152 39 243 -230 61 195 486 -28 -116 195 23 -84 -294 99 -51 -283 333 118 304
7460 304 32 130 47 291 231 -107 104 -109 -95 135 -13 45 -90 157 88 -4 179 91 84 302 250 -186 -63 -185
7484 -185 -327 -72 214 171 -180 -110 456 -21 -6 62 -37 174 152 -41 -91 -198 227 -304 -179 235 226 291 247 -28
7508 -28 81 334 -181 10 -16 -149 -125 102 317 229 183 -170 -42 -140 396 125 -160 198 -76 -54 -76 -196 -81
7531 -81 -163 -225 -61 -6 372 121 212 -170 173 -173 88 -138 -124 -50 166 -62 254 -121 27 62 154 -86 -31
7554 -31 -209 -11 251 13 86 -148 -311 82 -72 194 -10 90 -123 82 115 334 66 89 111 -220 -72 -315
7576 -315 30 16 103 127 101 126 69 233 -160 30 -42 -116 -357 -467 158 -32 64 -342 485 -87 82 -72 -132
7599 -132 -57 150 -132 -101 -182 117 -31 176 -229 -73 144 -51 66 247 -83 72 233 -176 -66 19 12 -91
7621 -91 -6 275 205 -17 2 -37 148 -86 -82 -53 -376 -146 -248 -83 109 28 99 -119 236 -21 249 -2 58 77
7645 77 -123 -140 90 85 -95 -211 -75 129 93 -62 436 90 28 78 287 -42 -173 -26 -105 -357 -151 154 -108
7668 -108 -144 298 163 -75 509 -87 167 -59 -95 -173 -191 -66 -56 -313 -177 169 -173 140 -72 6 -67 96
7690 96 -203 -153 -18 -90 -42 9 85 14 -17 226 27 201 225 214 -178 235 227 48 292 -94 -139 251 158 5 40
7715 40 29 268 22 250 157 -34 119 169 -133 -134 -44 -221 -46 140 -58 -37 230 29 237 -62 -62 -219 -72
7738 -72 16 -70 -147 350 146 -189 -26 341 95 -65 -46 -183 79 -109 -160 -200 -38 52 86 -212 377 -59 95
7761 95 -145 -203 321 -175 -82 -181 -67 -133 -155 -93 -289 -103 -58 -72 211 -152 -15 227 -273 -160 102 -55 76
7784 76 -148 50 33 -104 183 244 346 178 11 88 247 258 -317 106 -35 -85 -159 123 202 -166 278 -41 -63
7807 -63 -104 245 79 -104 -188 -176 -169 131 -39 159 182 183 -155 -37 245 167 63 250 -197 -133 -144 27 -72 -401
7831 -401 -40 60 -18 208 -94 -50 161 50 66 0 -6 130 -364 -183 -131 -173 53 -31 -166 62 86 -89 168
7854 168 138 105 253 128 -80 -8 68 -22 47 396 220 -197 175 97 -238 132 -97 165 -6 -141 -117 -54 164
7877 164 77 198 -222 -158 66 194 260 196 -189 -119 176 -66 107 237 -204 -49 -15 -204 220 7 325 381
7899 381 -44 7 -288 2 -33 51 -21 131 -87 -393 440 204 -212 -31 260 95 -439 73 -76 -116 -214 141
7921 141 -95 -117 59 175 62 67 -93 140 19 -240 -7 -78 -126 -71 254 -127 -328 -228 -123 18 88 -129
7943 -129 64 141 93 471 -24 -123 -45 -218 -111 134 -88 137 11 -9 357 111 179 274 156 -9 142 79 -13
7966 -13 -103 -259 9 112 -86 114 -15 170 -98 -173 -111 309 -191 -32 43 -75 95 -41 -102 210 -444 -214
7988 -214 -138 -90 216 -330 85 -383 -7 -104 335 205 -162 -39 -230 3 -75 -30 -38 -4 -38 345 36 -234 234
8011 234 -13 163 169 255 -139 -272 185 2 267 -91 210 -75 -76 196 26 -42 -155 114 34 61 -77 177 -49
8034 -49 110 -192 77 -288 0 368 243 -301 -220 -448 -28 13 -178 186 54 261 133 57 -283 147 -94
8055 -94 3 -336 -110 84 -287 154 325 -158 -9 -212 -15 -7 -86 95 -128 -134 -189 21 98 355 162 -21 -36
8078 -36 226 336 165 -107 -20 -20 -47 -163 -216 -148 -71 175 -173 23 184 -84 -174 173 -212 41 15 -53 216 -218
8102 -218 -14 -160 63 115 -300 169 55 -210 170 113 -155 84 -49 -55 -4 -129 -103 -299 -26 4 557 213
8124 213 216 242 -83 -146 -112 340 91 -94 223 170 18 -16 241 352 -71 -272 244 142 -88 -106 66 -7 -159
8147 -159 -23 -492 26 139 -297 -214 -345 231 23 -181 218 -83 -373 -142 79 -48 -31 -90 -156 -41 -328
8168 -328 314 -29 -206 19 128 -312 -195 -253 -253 -187 -125 -57 6 -80 319 290 73 94 -17 -222 59 36 -273
8191b73
##END NTUPLES=NMR FID
##END=
