##TITLE=1H_CA-8570-4-1
 CDCl3, 8 sc, 
 11.3.2019
##JCAMPDX= 6.0         $$ Bruker NMR JCAMP-DX V2.0
##DATA TYPE= NMR FID
##DATA CLASS= NTUPLES
##ORIGIN= UXNMR, Bruker Analytische Messtechnik GmbH
##OWNER= root
$$ XWIN-NMR		Version 3.5
$$ Mon Mar 11 14:29:24 2019 Russian Standard Time (UT+4h)  she@DPX200
##.OBSERVE FREQUENCY= 200.1314
##.OBSERVE NUCLEUS= ^1H
##.DELAY= (6, 6)
##.ACQUISITION MODE= SIMULTANEOUS
##.ACQUISITION SCHEME= undefined
##.AVERAGES= 8
##.DIGITISER RES= 18
##SPECTROMETER/DATA SYSTEM= spect
##.PULSE SEQUENCE= zg30
##.SOLVENT NAME= CDCl3
##.SHIFT REFERENCE= (INTERNAL, CDCl3, 0, 15.7039)
##AUDIT TRAIL= $$ (NUMBER, WHEN, WHO, WHERE, WHAT)
$$ ##TITLE= Audit trail, XWIN-NMR		Version 3.5
$$ ##JCAMPDX= 5.01
$$ ##ORIGIN= Bruker BioSpin GmbH
$$ ##OWNER= she
$$ F:/spectra/data/she/nmr/H-F/1/audita.txt
$$ ##AUDIT TRAIL=  $$ (NUMBER, WHEN, WHO, WHERE, WHAT)
(   1,<2019-03-11 14:28:26.79 +0400>,<she>,<DPX200>,
      <created by zg, POWCHK disabled, PULCHK disabled
       configuration hash MD5:
       00 E9 B6 7A A2 85 ED C7 34 08 36 98 17 FE 4E 26
       data hash MD5: 16K
       56 A1 73 1F 38 A0 A6 AB 8E 92 C2 7C 81 DA 3D 56>)
$$ ##END=
$$ 
$$ hash MD5
$$ C2 C9 E2 F6 4E FF 51 57 69 EA 70 46 C6 06 69 8A
##$RELAX= 
##$RELAX= 
##$RELAX= 
##$RELAX= 
##$RELAX= 
##$RELAX= 
$$ Bruker specific parameters
$$ --------------------------
##$DU= <F:/spectra>
##$EXPNO= 1
##$NAME= <H-F>
##$PROCNO= 1
##$TYPE= <nmr>
##$USER= <she>
##$AMP= (0..31)
100 100 100 100 100 100 100 100 100 100 100 100 100 100 100 100 100 100 
100 100 100 100 100 100 100 100 100 100 100 100 100 100 
##$AQSEQ= 0
##$AQ_mod= 1
##$AUNM= <au_zg>
##$AUTOPOS= <>
##$BF1= 200.13
##$BF2= 200.13
##$BF3= 200.13
##$BF4= 200.13
##$BF5= 200.13
##$BF6= 200.13
##$BF7= 200.13
##$BF8= 200.13
##$BYTORDA= 1
##$CFDGTYP= 0
##$CFRGTYP= 5
##$CHEMSTR= <none>
##$CNST= (0..31)
1 1 145 1 1 1 1 1 1 1 1 1 1 1 1 1 1 1 1 1 1 1 1 1 1 1 1 1 1 1 1 1 
##$CPDPRG= <>
##$CPDPRG1= <>
##$CPDPRG2= <>
##$CPDPRG3= <>
##$CPDPRG4= <mlev>
##$CPDPRG5= <mlev>
##$CPDPRG6= <mlev>
##$CPDPRG7= <mlev>
##$CPDPRG8= <mlev>
##$CPDPRGB= <>
##$CPDPRGT= <>
##$D= (0..31)
0 1.2 0 0 0 0 0 0 0 0 0 0.03 0 0 0 0 0 0 0 0 0 0 0 0 0 0 0 0 0 0 0 0 
##$DATE= 1552300106
##$DBL= (0..7)
120 120 120 120 120 120 120 120 
##$DBP= (0..7)
150 150 150 150 150 150 150 150 
##$DBP07= 0
##$DBPNAM0= <>
##$DBPNAM1= <>
##$DBPNAM2= <>
##$DBPNAM3= <>
##$DBPNAM4= <>
##$DBPNAM5= <>
##$DBPNAM6= <>
##$DBPNAM7= <>
##$DBPOAL= (0..7)
0.5 0.5 0.5 0.5 0.5 0.5 0.5 0.5 
##$DBPOFFS= (0..7)
0 0 0 0 0 0 0 0 
##$DE= 6
##$DECBNUC= <off>
##$DECIM= 24
##$DECNUC= <off>
##$DECSTAT= 4
##$DIGMOD= 1
##$DIGTYP= 9
##$DL= (0..7)
0 120 120 120 120 120 120 120 
##$DP= (0..7)
150 150 150 150 150 150 150 150 
##$DP07= 0
##$DPNAME0= <>
##$DPNAME1= <>
##$DPNAME2= <>
##$DPNAME3= <>
##$DPNAME4= <>
##$DPNAME5= <>
##$DPNAME6= <>
##$DPNAME7= <>
##$DPOAL= (0..7)
0.5 0.5 0.5 0.5 0.5 0.5 0.5 0.5 
##$DPOFFS= (0..7)
0 0 0 0 0 0 0 0 
##$DQDMODE= 0
##$DR= 18
##$DS= 0
##$DSLIST= <SSSSSSSSSSSSSSS>
##$DSPFIRM= 0
$$ [...]
##$SUBNAM2= <"">
##$SUBNAM3= <"">
##$SUBNAM4= <"">
##$SUBNAM5= <"">
##$SUBNAM6= <"">
##$SUBNAM7= <"">
##$SUBNAM8= <"">
##$SUBNAM9= <"">
##$SW= 24.9337183474449
##$SWIBOX= (0..15)
0 0 2 0 0 0 0 0 0 0 0 0 0 0 0 0 
##$SW_h= 4990.01996007984
##$TD= 16384
##$TD0= 1
##$TE= 0
##$TE2= 300
##$TE3= 300
##$TEG= 300
##$TL= (0..7)
0 120 120 120 120 120 120 120 
##$TP= (0..7)
150 150 150 150 150 150 150 150 
##$TP07= 0
##$TPNAME0= <>
##$TPNAME1= <>
##$TPNAME2= <>
##$TPNAME3= <>
##$TPNAME4= <>
##$TPNAME5= <>
##$TPNAME6= <>
##$TPNAME7= <>
##$TPOAL= (0..7)
0.5 0.5 0.5 0.5 0.5 0.5 0.5 0.5 
##$TPOFFS= (0..7)
0 0 0 0 0 0 0 0 
##$TUNHIN= 0
##$TUNHOUT= 0
##$TUNXOUT= 0
##$USERA1= <user>
##$USERA2= <user>
##$USERA3= <user>
##$USERA4= <user>
##$USERA5= <user>
##$V9= 5
##$VALIST= <valist>
##$VCLIST= <CCCCCCCCCCCCCCC>
##$VD= 0
##$VDLIST= <DDDDDDDDDDDDDDD>
##$VPLIST= <PPPPPPPPPPPPPPP>
##$VTLIST= <TTTTTTTTTTTTTTT>
##$WBST= 1024
##$WBSW= 4
##$XGAIN= (0..3)
0 0 0 0 
##$XL= 0
##$YL= 0
##$YMAX_a= 219236
##$YMIN_a= -255878
##$ZGOPTNS= <>
##$ZL1= 120
##$ZL2= 120
##$ZL3= 120
##$ZL4= 120
##$ABSF1= 10
##$ABSF2= 0
##$ABSG= 5
##$ABSL= 3
##$ALPHA= 0
##$AQORDER= 0
##$ASSFAC= 0
##$ASSFACI= 0
##$ASSFACX= 0
##$ASSWID= 0
##$AUNMP= <proc_1d>
##$AZFE= 0.1
##$AZFW= 0.1
##$BCFW= 1
##$BC_mod= 2
##$BYTORDP= 1
##$COROFFS= 0
##$CY= 11.3945322036743
##$DATMOD= 1
##$DC= 2
##$DFILT= <>
##$DTYPP= 0
##$F1P= 18.9103706918063
##$F2P= -1.10871071338519
##$FCOR= 0.5
##$FTSIZE= 0
##$FT_mod= 4
##$GAMMA= 1
##$GB= 0.15
##$INTBC= 1
##$INTSCL= 1
##$ISEN= 128
##$LB= 0.24
##$LEV0= 0
##$LPBIN= 0
##$MAXI= 10000
##$MC2= 0
##$MEAN= 0
##$ME_mod= 0
##$MI= 1.114404
##$NCOEF= 0
##$NC_proc= 0
##$NLEV= 6
##$NOISF1= 3.799351
##$NOISF2= 2.8
##$NSP= 1
##$NTH_PI= 0
##$NZP= 0
##$OFFSET= 15.70392
##$PC= 1
##$PHC0= -8851.361
##$PHC1= 19.40014
##$PH_mod= 1
##$PKNL= yes
##$PPARMOD= 0
##$PSCAL= 0
##$PSIGN= 0
##$REVERSE= no
##$SF= 200.130013532006
##$SI= 16384
##$SIGF1= 3
##$SIGF2= 2
##$SINO= 400
##$SIOLD= 16384
##$SREGLST= <1H.CDCl3>
##$SSB= 0
##$STSI= 0
##$STSR= 0
##$SW_p= 3612.71676300578
##$SYMM= 0
##$S_DEV= 0
##$TDeff= 0
##$TDoff= 0
##$TI= <>
##$TILT= no
##$TM1= 0
##$TM2= 0
##$TOPLEV= 0
##$USERP1= <user>
##$USERP2= <user>
##$USERP3= <user>
##$USERP4= <user>
##$USERP5= <user>
##$WDW= 1
##$XDIM= 8192
##$YMAX_p= 0
##$YMIN_p= 0
$$ End of Bruker specific parameters
$$ ---------------------------------
##NTUPLES= NMR FID
##VAR_NAME=  TIME,          FID/REAL,        FID/IMAG
##SYMBOL=    X,             R,               I
##VAR_TYPE=  INDEPENDENT,   DEPENDENT,       DEPENDENT
##VAR_FORM=  AFFN,          ASDF,            ASDF
##VAR_DIM=   8192,          8192,            8192
##UNITS=     SECONDS,       ARBITRARY UNITS, ARBITRARY UNITS
##FACTOR=    0.0002004,     1,               1
##FIRST=     0,             0,               0
##LAST=      1.6414764,     0,               0
##MIN=       0,             -255878,         0
##MAX=       1.6414764,     219236,          0
$$ Real data points
##PAGE= N=1
##DATA TABLE= (X++(R..R)), XYDATA
0@%%%%JjQj6J6j7K5l3M1n6P2q3R8j19J37j62J94k25K62l04L47l99M57n21N91o68
30c55P55q48R52j069J193j328J479j645J827k026K243k484K750l044L374l742
46a968M154m620N153n771O495p355Q400r700J1370j3609J6784k1681L0306m9989
60c2031J75391L2127k73906P4958J63255P9442j08545r0911j7700Q5368O0437
71A47885k3271j06119n5779J7664O6643N3893J562r7784q9432M7872J29169k754
83H9549j30231o6040Q5142J01343J1758p1250q0841j8642P0359P3576j6295p6126
95b7698m0119K3505N7499M1748l8909j13575m3988J02443J08670m0594j18058
106h9076l5568O4541O5880r56o2981n4415L2951Q9135K3727o3298m9085J5131
$$ y = [0, 0, 0, 0, 0, 1, 0, 8, -8, 8, -9, 16, -17, 24, -32, 40, -43, 55, -64, 73, -89, 105, -120, 142, -162, 185, -214, 243, -278, 313, -355, 400, -448, 504, -565, 628, -700, 779, -866, 961, -1065, 1178, -1306, 1444, -1600, 1774, -1968, 2186, -2434, 2719, -3052, 3443, -3912, 4488, -5212, 6158, -7451, 9333, -12348, 17958, -32031, 143360, 175487, -98419, -23461, 139794, 219236, 110691, 19780, 2080, 87448, 147885, 124614, 18495, -37284, -19620, 47023, 100916, 102478, 4694, -84738, -36866, 92303, 89549, -40682, -106722, -21580, 79763, 91521, 20271, -60570, -79212, -8853, 64723, 48428, -27698, -67817, -44312, 13187, 54935, 16026, -97549, -141537, -39094, 69576, 28982, -89076, -124644, -60103, 5777, 4821, -58160, -112575, -79624, 9511, 33238, -30060, -79145, -64014]
118f4014L4945L1921K0405k8088n7836Q224P9440L4443n2625n6648j174L7151
130a3856N0334K0557m9883o4664J7843P3261K0236m2542l7524o221K3081N3868
142D4490K9513n5205o8366K4428P8570J7865m3537l4025L088L3670M3143q539
154F5095p3761l9316N5140O2036j4405m6464j8760r73J6807L6066L446n4992l5141
167d5222L7791M9858M30l5741l7689j4881L7444N4920j1499o5665j4765N1593
179F574K9160k0571k3202j1656p160K2651L9110r950n2690j8755L4392L1174l085
192A5992k8857l5994L705N8208L5527n1650o2801J6812N5985J4840k0333j8613
204a7179j6869M864L8613K1039l5170l6787J5293L3136J2959n430k1567k7064
$$ y = [-64014, -29069, 2852, 23257, -4831, -62667, -54443, 24997, 59440, 6815, -49833, -51007, -13856, 36478, 57035, 7152, -57512, -39669, 33592, 53828, 11286, -26238, -32459, -9378, 44490, 74003, 18798, -49568, -25140, 53430, 71295, 27758, -6267, -3179, 30491, 73634, 65095, -8666, -47982, 7158, 69194, 54789, 8325, -10435, -11408, 5399, 41465, 44911, -10081, -45222, -7431, 42427, 42857, 7116, -30573, -45454, -8010, 46910, 35411, -30254, -45019, 6574, 35734, 15163, -8039, -19695, -26855, -4204, 34906, 24956, -27734, -46489, -12097, 19077, 15992, -12865, -48859, -45154, 13054, 48581, -3069, -65870, -49058, 6927, 21767, 1434, -17179, -34048, -29184, 9429, 30468, -4702, -41489, -26196, 6940, 19899, 14469, -7098, -34162]
216c4162J4934N0268N472n3771k4505L7088L1547o423j5736j6309j3944K0260
228e281L7882o667m2841j0246K7512J6771L665j160k4697k6103K5372M7109p429
241C3887m4545q538K5011J3985l98q219k4705q704L4636K7805k6639l2974J2860
254f538K2483j096o047n093j7807p89L3140J2565l5197k6640J6030K0048J902
267F961n76p239j8095M868K8449R9k7934m069J8557q65o824J1406K142j9333k158
282a4611K1550J475j7636K70J1624J003K123L690j7986j5124K2486K5389j8444
295E809k7306Q025J7453O28Q51P37j9751j0003K6761K0846j8724j9312R180Q466
309C660j174M218o73j4130K570K2218k222k2867K749K0647p690j6231J1386J0550
$$ y = [-34162, -19228, 31040, 36512, -17259, -41764, -4676, 26871, 20448, 4712, -11597, -25541, -5281, 32601, 25934, -16907, -27153, 359, 17130, 20795, 19635, -5062, -31165, -5793, 41316, 33887, -10658, -19196, 5815, 19800, 19402, 11183, -13522, -22226, 12410, 40215, 13576, -19398, -6538, 15945, 14849, 8802, 3709, -14098, -14887, 18253, 30818, -4379, -31019, -14989, 5059, 6961, 6385, -854, -18949, -14081, 14368, 14467, -13467, -17536, 1021, 156, -6668, 4738, 6880, -12453, -14611, 6939, 8414, -9222, -8952, 2672, 3675, 5798, 9488, -8498, -23622, -1136, 24253, 5809, -21497, -13472, 3981, 4609, 5460, 6197, -13554, -23557, 3204, 24050, 5326, -13986, -4806, 3660, 2486, 6704, 6031, -8099, -5529, 16689, 14467, -8400, -5651, 14996, 7306, -8925, 2461, 13011]
323A3011j4297o542J6665L333j2797l115O72m989J0184J8289j4882k9835P385
336a6918L0657q03k0381j864L313k300J1482J5207j4775k1412J0275J7882q370
349A993j1550P550K164n478O787K862j7150m721K4318Q140k0875p315J5368J030
363C123q290O899L886j6007o016J6726O683o860P51k444j4214N549K8339m6l0230
378a2151o688K4125Q975r855m278m767n447J1938J6572j4047k0630J4131K2022
391A9900q136j7260Q04L455L017J4144L931k5249j4616K3757J7792j4885j2886
404f232O404J195k636J1063M230j6811o658J2801K183p935P857O003j6808p570
418a2914K0588O606k0557q129J4309N109p002N7l622r235Q581J8200j1900k4094
$$ y = [13011, -1286, -7828, 8837, 12170, -627, -3742, -3070, -8059, 2125, 20414, 5532, -24303, -16918, 13739, 12936, -7445, -9309, -5996, -8296, 3186, 18393, 3618, -17794, -7519, 10363, 1993, -9557, -2007, 157, -5321, 1466, 4328, -12822, -17543, 6775, 14915, -5960, -13275, 2093, 3123, -5167, 1732, 5618, -10389, -16405, 321, 7004, 144, 895, -1549, -15763, -10214, 18125, 18079, -12151, -18839, 5286, 14261, 4406, 128, -4639, -10086, 1852, 18424, 4377, -16253, -2122, 19900, 11764, -5496, -4692, -1237, 1780, 15924, 19855, -5394, -20010, 3747, 21539, 6654, -6232, 172, 1367, -1269, 9794, 14024, -2787, -9445, 3356, 5539, -2396, 5461, 11464, -5344, -12914, 7674, 14280, -6277, -14406, -97, 5012, -1990, -1933, -5555, -14790, -6209, 11991, 91, -24003]
432b4003Q609K4133n09j2681j946l056m461J3392J2958j5354j5091J5708J3661
445A1360j1371p779J0360J529n823O223M243j0253j559J3201l486j6419M457J4082
459H765p837r679J2912O732j3996n218J2286K584n206M577p81j1641L582J9206
473A6286l773j9887J486J4244j689m898Q595j051j2938L487J2785p402j2719J0338
487B864R019j1346p268R143l42p049N967M241j1520k625J5725L16j4437K811J2239
502G738p211j0911R376Q235p968k465Q006o080r457J0453Q933j2589q502J1185
516a257L774p460K624M418j0772m389J5909M822j4296j350J3903k680j1400N009
530c145P884o573l09J1498m096j3572P084J5008m371r893L624M69n178Q394R191
$$ y = [-24003, -15394, 8739, 8230, -4451, -6397, -9453, -13914, -522, 12436, -2918, -18009, -2301, 11360, -11, -7790, 2570, 4099, -1724, 4499, 8742, -1511, -3070, 10131, 6645, -9774, -5317, 8765, 928, -8751, 4161, 10893, -3103, -8321, 3965, 6549, 1343, 5920, 5139, -6502, -2920, 16286, 12513, -7374, -5888, 8356, 6667, 1769, 10364, 9313, -3625, -138, 12647, 5245, -7474, 2864, 11883, 537, -6731, 2412, 2070, -4979, 988, 5229, -6291, -8916, 6809, 7125, -7312, -4501, 7738, 527, -10384, -1008, 7227, -741, -3206, 4800, -1280, -10737, -284, 8649, -3940, -12442, -1257, 2517, -4943, -2319, 2099, -8673, -13062, 2847, 7669, -6627, -7977, 5926, 3246, -8154, -3145, 4739, -1834, -2143, 9355, 5259, -8313, -1229, 13779, 9408, -485, 3139, 3608, -1570, 6824, 16015]
545A6015j4530j4256J1841J1552j0812n666J0605L06j0101N389Q214p903o169
558e515R704K964q849J587L852q944k697J6502K195k1260o123J9809Q025j0296
572I54o422l690l747J0059J5904j1697k5464M619K4064J374j3887j869K162k230
586i870P061P799r211p472J3216P572j3803o295J1085K926p101P149P127j2178
600a995q858J2697P815q891k569N442n033l346J3536M687j6536r308J2182Q774
614H597j274J381n295j3317N473K1578l160k3534J123K1898K456j4594l533L840
628A639J556P184M672j3719j1823J3591J2848j0348j0550L712J89n502R899R733
642A3081j3062j3037Q371P453m924K099N653j1019j1562J2256J2057j0176j1306
$$ y = [16015, 1485, -12771, -930, 10622, -190, -5856, 4749, 5055, -5046, 343, 8557, 654, -5515, 4189, 7153, -1696, -109, 3743, -5201, -7898, 8604, 10799, -10461, -16584, 3225, 11250, 954, -5468, -9158, -12905, -2846, 13058, 1361, -24103, -19484, 4580, 5954, -7933, -9802, -7640, -9870, -2809, 4990, -4221, -11693, 1523, 9095, -4708, -11003, 82, 3008, -4093, 3056, 10183, -1995, -10853, 1844, 9659, 768, -1801, 3641, -1392, -4738, 8798, 13485, -3051, -12359, -177, 8597, 7323, 8704, 3409, -9908, -4435, 17143, 13983, -9551, -8428, 13470, 15926, 1332, -2201, 1639, 3195, 10379, 15051, 1332, -10491, 3100, 15948, 5600, -4950, -1238, -1049, -6551, 3348, 13081, 19, -13018, -4647, 2806, -2118, -19, 5634, -5385, -16947, -4691, 7366, -2810, -14116]
655a4116M834N901K530O391k915j6347n8K1998N133j8911l740J3416L048o752
669D12J148k508r217O710J8987o17j8429m583M892P06N079Q714q812j8186O872
684h832J8112k502j4363j691K849M95J0801R096j2213j6604J0992J5774n273q759
698b118L822K071j548J0174L941j9291j2744J7092J7854p194j4340n570R12J0066
712C127J2311j1845k6598K431K8959P202j9825p892M916j338J966J3167K20j7769
726a0968l297J6388R064o147q064o761M109K0250R625k2831k0236J8639K2329
739B2100j0992j7953L389N343m810N362J0480r623j8795L097J6793Q380m121j5263
753f613j3640J0608K8526l47l2327j0929K4942J3538j4017p240N936o01j444R913
$$ y = [-14116, -9282, -3381, -851, 5540, 2625, -13722, -13780, 8218, 13351, -5560, -9300, 4116, 7164, 412, 1560, -948, -10165, -3455, 15532, 14915, -3514, -8097, -3205, -2499, 2580, 11294, 2482, -15704, -8832, 9280, 6778, -7585, -9276, -6427, -5932, 4869, 13965, 1752, -14852, -3860, 11914, 6641, -2118, 1704, 3775, 2227, 12401, 16342, -2949, -15693, 1399, 19253, 12059, -2281, -7851, -6939, 3127, 15438, 3593, -23005, -20574, 8385, 15587, -4238, -12130, -7214, -8552, -6586, 6581, 6801, -10968, -14265, 2123, 11187, 5040, -3024, -9785, -5676, 14574, 24199, 1368, -18868, -229, 22100, 11108, -6845, -3456, 1887, -2923, 2439, 12919, 3296, -15499, -12402, 4391, 12771, 8650, -6613, -20253, -9645, 18881, 18534, -13793, -24722, 220, 13758, -259, -7499, -1563, -2164, -3608, 6305]
767F305J866j5902o552J1655R207l78n194j1406o705J5129J6587j3415k0497R803
781i497K1038k822j0123K079j444r602P318J7285j526j5097l246P100L500K413
795G376k929j1952j147J9020P745j9247j1976J1076P189p101J409M946q569m962
809i122J5016P910j6643j2288P807J1948N246J191j1751j2967Q427J9509k973
822A1310j8151J510J2520j995n064O659j793j4443J11J4539K554r335l090l86
836e054j876P696P397j2120j3650J4012J9142p817j7720j756O291N319Q115o28
850G351j5695p149J7375J1359j1031p623M255M11o32R525J985j6637p576J4938
864H56R185q529n827K465m75J894O170k997r730O522J2007n897j1034M964N576
$$ y = [6305, 8171, -7731, -14283, -2628, 6579, 6201, 1007, -10399, -17104, -1975, 14612, 1197, -19300, -9497, 11541, 8719, -1404, 675, -769, -10371, -3053, 14232, 12706, -2391, -5637, 1463, 4963, 7376, 4447, -7505, -8652, 10368, 18113, -1134, -13110, -2034, 5155, -1946, -537, 4409, -4160, -9122, 5894, 13804, -2839, -15127, -7320, 4628, 9874, 11065, -686, -13653, -5226, 14283, 11310, -6841, -5331, 7189, 5194, 130, 6789, 4996, -9447, -9336, 5203, 7757, -1578, -4668, -5054, -6930, 766, 8163, -3957, -17607, -3595, 15547, 7730, -9990, -11746, -5455, -136, 7979, 7351, -8344, -15493, 1882, 13241, 2210, -5413, -1158, -747, -1379, 8146, 10131, -6506, -14082, 856, 10041, 1512, -4315, -1850, -2325, -431, 5739, 2742, -6988, -466, 11541, 5644, -5390, -426, 5150]
879E150q151J089J3665j858j7417j251J4752M600o562m854m299M47J3471O641
893A5423j6742j3557J1988J2241p993n433O076l01o464N042M650r503n239J1213
907A401M521q677k345M989l092j237Q293o38j2689J919J2460j04q776J185J637
922a153q621K045J4469J587j4551l420Q936K597q31K683n097q455Q314J2740q041
937C202j4397M703J1870k114m429J675k954j844J0714M956j3917p940J2943R250
951A1718q585n200J736j970Q27J0273R88j2970k856J0662J425n911L800M585q802
966b80m240R799J559r144J99O208k643l111N229j383j0053N430J3909o152j5921
981a0594K293J3562J28n337k925m139q74J1397N416j3946q575J2022P250q007
$$ y = [5150, -3001, -1912, 11753, 9895, -7522, -8773, 5979, 10579, 4017, -837, -5136, -4689, 8782, 15423, -1319, -14876, -2888, 9353, 1360, -4073, 2003, 1702, -4762, 280, 4930, -4573, -9812, 1401, 5922, -2755, -5100, -111, -3203, -4440, 3853, 3215, -9474, -7555, 4905, 4801, -3975, -2790, -1153, -9774, -7729, 6740, 8327, -6224, -9644, -708, 1889, 1058, 3741, -1356, -9811, -1497, 11243, 3202, -11195, -6492, 5378, 3264, -1165, 510, -2444, -4288, 6426, 11382, -2535, -10475, 2468, 11718, 3133, -2067, -331, -2301, -1474, 8799, 9787, -3183, -6039, 4623, 6048, 137, 3937, 8522, -280, -4520, 5279, 6838, -2306, -2107, 4101, 1458, -1653, 3576, 2193, -7860, -2430, 11479, 5327, -10594, -8301, 5261, 5389, 52, -2873, -7012, -7886, 3511, 8927, -5019, -13594, -1572, 5678, -2329]
995b329k293N536m498n374P873O355q225l703P614Q7p359L586O346n490l502O629
1011A253J231p607J399O723n074k907R737J487j2725j102J4237K511j1166k946
1025d949N114j046J582N447m395r058O110R603o334o117O910L754q735M29R356
1040G671k156r531K083N940l474r83M888l011o174P202P835j0310q166R182P364
1055H360n575l172K214n812k018J1308M119j3683n969J0277N292m568k37P3p558
1070f949J015J1847J21j3134j024R834k65m697L052q72p810M532J2993l076j3604
1085h037J070R751O86k542K71o162l743J1790J0405j2647j3326P111J0643k839
1099B431k203J282n574l574Q920O260r548n501O616J641l637M633L346q690l433
$$ y = [-2329, -4622, 914, -3584, -8958, -1085, 5270, -2955, -6658, 956, 1043, -6316, -2730, 3616, -1874, -5376, 1253, 2484, -5123, -3724, 2999, -2075, -4982, 4755, 6242, -6483, -7585, 6652, 9163, -2003, -4949, 165, -881, 701, 6148, 1753, -7305, -1195, 8408, 2074, -4043, 2867, 6621, -2114, -1685, 7671, 5515, -4016, -1933, 4007, 533, -450, 4438, 1427, -4747, 2455, 10290, -20, -8186, 996, 8360, 2785, -387, 1827, -3985, -6003, 5305, 9424, -4259, -10228, 49, 5341, 773, 536, 609, -6949, -5934, 5913, 6034, -7100, -8124, 1710, 1445, -3252, -200, -1072, -8882, -4350, 8643, 5567, -8037, -6967, 2784, 3470, 928, 1199, -4963, -8706, 3084, 13489, 842, -12484, -5373, 5270, 2431, 228, 1510, -4064, -7638, 1282, 7542, -2006, -7507, -891, 750, -2887, 1746, 5092, -3598, -7031]
1114g031J0778M074j0974l384Q273J436k445L284j261r169K290J3108p36j1743
1128c500n61P023q80k64L538n132r409O674J2095n251r042M999N238o242j103
1143a817O872j487n843K982L698o117J8O674k783r105N508R259o843p709O746
1158E3O618o232l428K319l123l14R573K562j3596n095J1393N415n633j279J504
1173G37m692J690J0709m03j3161j101J0048p80n712M030K084p387l74Q802j947
1188B543q492J673O148l276q83M956m244q513O868J2075o035j2108K391R032J564
1203C699J244m85j0643m938J3897J1306j1266j1154N317P013o62M31o73q355p91
1218f060J1321K781j1180k399P632r62m630L933K663p561J249J1663j299j1380
$$ y = [-7031, 3747, 7821, -3153, -6537, 1736, 3172, 727, 4011, 2750, -6419, -4129, 8979, 8243, -3500, -4061, 2962, 2082, 1818, 5356, 224, -9185, -2511, 9584, 4333, -4709, 290, 5528, -714, -1817, 5055, 3568, -2275, 707, 4405, -1712, -1694, 4980, 2197, -6908, -1400, 7859, 1016, -6693, 53, 6671, 439, -2989, -670, -3793, -4107, 5466, 8028, -5568, -10663, 730, 6145, 512, -767, 737, -3955, -2265, 8444, 8041, -5120, -6221, 3827, 3047, -2665, 1365, 3449, -3938, -4312, 4490, 2543, -5949, -4276, 1872, -1404, -2287, 2669, -1575, -10088, -3220, 8855, 2820, -9288, -6897, 2135, 3699, 4943, 4458, -6185, -11123, 2774, 14080, 2814, -8340, -3023, 3990, 3328, 3759, 3086, -5269, -6060, 5261, 8042, -3138, -5537, 2095, 1133, -3497, 436, 3099, -4462, -3213, 8450, 7151, -4229]
1232d229l69Q336o06j223L627l658q569M350J0697l334r437J246L476k535M274
1247B046O208q760j0037O985J0618p506q839N363N509l221m16K127n610j007J0151
1262C611K131r686j012Q979K82o110K944K039o567J24R689o47r545J916P350m901
1278E97m966P533M236p939l474M869J55j601M855p24q947J465J0892k168r571
1293d788L288Q230m684n659O278K492o465j11O293k798m035N453K352p513O48
1308a019P368m358q106M764P927n408m981M326q05m997M889O319p300o886P470
1323g97N516o860k476M524l393m765O979N174p881l290P817Q32p101J749O190
1338B218k612k329N216j055p695L983Q021n882p610P861P010p498m395P371J981
$$ y = [-4229, -4598, 3738, 3132, 1909, 5536, 1878, -6691, -2341, 8356, 5022, -4415, -3169, 307, -2228, 2046, 8254, -506, -10543, -3558, 7060, -446, -9285, -3922, 1587, -1634, -2050, 77, -5533, -6540, 3611, 5742, -3944, -4956, 4023, 4305, -1805, 1139, 3178, -3389, -3265, 6424, 5777, -3768, -1852, 5498, 597, -4369, 3164, 7400, -539, -4013, 856, 1011, -590, 4265, 3541, -5406, -3941, 6951, 4783, -4788, -1500, 6730, 2046, -3613, 2665, 5157, -1308, -1419, 4874, 2076, -1959, 3494, 5846, -1667, -1019, 6349, 1991, -6115, -1351, 6576, 1168, -3813, 513, -292, -5289, -400, 5919, -1381, -8267, -797, 4719, -2141, -4617, -93, -3486, -8251, -1272, 3902, -3979, -7269, 548, 1380, -5721, -3972, 2218, -394, -2723, 2493, 1438, -6257, -2274, 5747, -135, -7745, 116, 7126, -372, -4767, 2604, 4585]
1353D585n569J20L516k889K64N003k900p806M764Q430o588p007P919M820q099
1368a437k213Q909J050o712N19L241m879n76P359m6p758J954N094m186l857N828
1384B290J563p196J651Q018m032q213M709M586o659k950P903J717n361J313L531
1399B870p393l856Q356M132o471m77M798l361m076N216J712o799J433Q729j440
1414C373p734L300M281p153l789J0208L105q274m96P810j519o261J425K760p00
1429C36M050M123q546p210P639P152o838n262O823J033n104M390N989q100q897
1444h422P637P684l800l614K316k411k383M649P84o814P59R654j178p999K277
1459h61L947n388j328J0364l48j2930m38J2346J198j0005k345M075R20K069K558
$$ y = [4585, -984, -864, 2652, -237, 27, 5030, 2130, -5676, -912, 7518, 930, -6077, 1842, 6662, -1437, -3650, 5259, 6309, -403, 116, 3357, -1522, -2098, 5261, 5215, -2543, -589, 4505, 319, -3538, 2290, 3853, -3343, -1692, 6326, 2294, -5919, -1210, 3376, -3283, -6233, 1670, 3387, -1974, -661, 2870, -4523, -8379, -23, 4109, -2362, -2839, 1959, -1402, -5478, -262, 1450, -5349, -3916, 4813, 3373, -4361, -1061, 3220, -3933, -7722, 2486, 5591, -2683, -3179, 4631, 3112, -3149, -1724, 1036, 336, 4386, 8509, -37, -7247, 392, 7544, 706, -4556, 2267, 3300, -1804, 2586, 8575, 475, -8422, -785, 6899, 3099, -515, 1801, -610, -2993, 1656, 2440, -4374, -3615, 6039, 4861, -3138, -861, 3086, -2302, -3630, 6734, 6386, -6544, -6982, 5364, 6562, -3443, -5788, -1713, -793, 1276, 3834]
1474C834o566m333O315L927o602j315Q567k897j0120L830J1556m774j0075N624
1488c029Q341m597n694K493J305K04L334p33o976J301Q963k097p554L126O119
1503D506o237k835J0533K058j2349m009J0189L169o177P12L398j916n04K890m070
1518f42l378O885M233q769k847J0317J737j1005j996Q084L85m589L293L481m225
1533I64q31M179m403o513O635P673n139o060M018P89l803K044M112n293l065Q045
1549C352K793q226r47O361l297o312M966O837n538m456M344J200m114K083L642
1564B688n101k065P736R72q829k21Q002j137o319K101J777l615L063P726m881
1579A897j0896M458R582k269o583K838J555k882L004M070o536m902P364M718o215
$$ y = [3834, -2732, -7065, -750, 3177, -3425, -4740, 3827, 930, -9190, -5360, 6196, 1422, -8653, -3029, 5312, 715, -4979, -2486, -1181, -977, 2357, 1624, -5352, -4051, 4912, 2815, -4739, -1613, 4506, -1731, -4566, 5967, 8025, -4324, -8333, 1856, 5025, -1152, -440, 2958, 1042, 538, 3428, -642, -4020, 2865, 7098, -1671, -4518, 5799, 7536, -3469, -5465, 2619, 3004, -1585, 1708, 5189, 964, 133, 4312, -91, -6604, 31, 7704, 2565, -3495, 523, 1312, -2491, -447, 3665, -1628, -4693, 3352, 6145, -2081, -3028, 3333, 36, -6276, -1310, 5527, -11, -4467, -123, 1077, -3037, -954, 2688, -2413, -4478, 3258, 4230, -4599, -4820, 3182, 2045, -4274, -2173, -396, -4011, -948, 6778, 1897, -8999, -4541, 5041, 2772, -3811, -973, 582, -2300, 704, 4774, -1762, -6664, 700, 5418, -797]
1594g97k100O019j426m254M036K563p987j802R841K655p744j199M950k686k478
1609b409O130R65p179l88P510J54n182R78M05m792L399R539l252j0386L204Q305
1625G001l608p440K972L471k425J215L238n230n454N898M493n318k415N858m26
1640A830m137M281J787q094l698R341M261o680j459M598k113l042M900J195o318
1655c348O75P434k689o913K510N536m224l273N111R7n413K634N551m286m036N081
1671D47R41n874K317P053l757p106N023N392n322l379N504P69m683K562M062l796
1687A53k710N867o73o547K124P669l083o628M511L400m823o07O115j916o419L917
1703C50N631m573m444M394J999m358N36L246l689j218P925L56j0519k387R287
$$ y = [-797, -2897, 3122, 1696, -2558, 1478, 4041, -3946, -5748, 4093, 6748, -996, -2195, 2755, 69, -2409, 3721, 4686, -2493, -2881, 4629, 4783, -399, 579, 984, -3808, -409, 9130, 5878, -4508, -1304, 7001, 3393, -4047, -1075, 2396, -29, 1186, 4424, -806, -6260, -362, 4131, -1187, -3602, 2256, 1830, -2307, 1974, 3761, -4333, -8031, 1310, 5571, -1109, -2568, 2030, -83, -3125, 1775, 2970, -3348, -2673, 4761, 2072, -4841, -2331, 3205, -1019, -4292, 819, 916, -4497, -1863, 3688, -598, -4634, 447, 1388, -4486, -2169, 4884, 1127, -5979, -956, 4436, -886, -4265, 1239, 2008, -2675, -113, 3949, 153, -2557, 3310, 2637, -3910, -1786, 5883, 2800, -3828, 683, 4083, -740, -1347, 4768, 2852, -3567, 350, 5981, 1408, -3036, 1358, 3357, -1001, -465, 2781, -908, -2126, 5799, 6155, -4364, -6751, 2536]
1718B536J784o490M3K114l152J105N912j957p815K306P677k188m916L382R65n045
1734c739J830N438m792n747O568O013n438m107L808O06k986M124K870p307m838
1749g697Q228N440o305k682J426j280R5P595K45r440q86R656J976p879n69L738
1765A661j263L03M826k700p802L488Q607k793p268K070L840k023K006K923o078
1780b03o459O827P372n530n450L203J561k848K683K708n908l580O486K413o201
1795b926m61N283k025n315L615L624n654o77O531P4o430P78L867k645j081N338
1811A896q30o675L120P176k400o673L416L754m195j89N205k346n553L461L787
1826B954n435k591O321J552n936Q06M600k839k230N200M13o574Q51P361p97o211
$$ y = [2536, 4320, -2170, -2127, -13, -3165, -2060, 3852, 1895, -5920, -3614, 4063, 1875, -3041, 341, 1306, -3739, -1909, 3529, -1263, -7010, -442, 5571, 133, -3974, -166, 440, -2546, 1578, 4448, -2859, -7697, 531, 5971, -334, -3016, -1590, -2870, -2775, 4820, 5065, -4375, -5261, 4395, 6371, -1508, -2077, 1661, 398, 701, 5527, 2827, -4975, -1487, 7120, 4327, -2941, -871, 2969, 946, 2952, 5875, -203, -6662, 165, 7537, 2007, -3443, -240, 1321, -1527, 1156, 3864, -2044, -5624, 862, 3275, -2926, -3387, 1896, -129, -5444, -1829, 1795, -3859, -4536, 1995, 2069, -4361, -3583, 284, -2361, -3442, 1896, 1066, -5609, -2489, 4687, 2287, -4386, -970, 2784, -1411, -1600, 3605, 1259, -4294, -833, 2954, -2481, -5072, 1249, 2801, -3135, -2329, 2271, -568, -2798, 2402, 2815, -3759, -2908, 4453, 3656, -2555]
1842b555K679M195l380j895N337k59m641L545M082n529l861O079K583o737r11
1857a268M338j933l496M213K621o965k312O508O32n136J854L693m373k843N638
1872A171J416n649N78M935j896l518M543J519o578m20P513j612p100J751N322
1887A975k451l253K568r98m327M420N111m877m891N270L720n441q75M422j165
1902g92l252M582L678n738j141O490p8o150J993N787k265l855K282O49m190K386
1918C86M770l755n046N025L547n367j326M963j142n350L048M158m496l137N725
1933B003J784n178J68M129k138k899N221J624n720p31M544q18m212L269J694o259
1949c519p67Q269P50r068l72O292j23l472J754L61l176J422M152l374m973M888
$$ y = [-2555, 124, 4319, 939, -956, 4381, 4122, -519, 3026, 7108, 1579, -2282, 3797, 6380, -357, -1268, 3070, 1137, -2359, 1854, 4475, -2490, -4802, 1706, 2338, -2798, -944, 2749, -1624, -4467, 1171, 2587, -3062, -2484, 2451, 555, -2963, 1580, 3099, -3479, -3899, 3614, 2002, -5098, -3347, 1975, -476, -3729, -1161, -2159, -6486, -2066, 3045, -1832, -6723, -1453, 2267, -3174, -4049, 373, -792, -4044, 538, 4216, -1522, -2663, 3827, 3749, -2401, -408, 5379, 3114, -741, 1541, 2190, -2000, 386, 5156, 1401, -3645, 1380, 4927, -440, -1766, 3197, 2055, -3295, -247, 3911, -585, -3722, 2003, 3787, -1391, -1223, 2906, 768, -2131, 3090, 4714, -1006, -1737, 2807, 1989, -2223, 1046, 2740, -3519, -4286, 3983, 4733, -4335, -4707, 1585, 1462, -2010, -256, 105, -3071, -1649, 2503, -871, -5844, -956]
1965i56L722n076j501N341o19n236L211M790m655n445N374M713l968j842K158
1980A1j606j662N298J478n897m81N946j243m568K985L618n072k255O683J717o518
1996a566q70N558n30l065K216L91l765J827M848l877o320M174O194l896l146L411
2012A584l35m556K813N149l464m427L930J805m392M40M181l020m068N706M514
2027E860o207l239N967J167n315k20L542j314r70L474j808n599K683N394l561
2042a46m644N446M252o392k514N310P19n303O13L478j797p41M014j306o035J548
2058c498N176j309k184L694P32n691L52M957j990n013M724M986m833m113M998
2073I88J808m368m44L568q15j846L554J89m555J222L498m037k869O704M086o971
$$ y = [-956, 2766, -2310, -3811, 1530, 911, -4325, -1114, 3676, -979, -6424, -1050, 3663, -305, -2147, 11, -1595, -3257, 2041, 3519, -2378, -2859, 3087, 1844, -2724, 261, 3879, -1193, -3448, 3235, 4952, -1566, -2436, 3122, 2592, -473, 1743, 2134, -1631, 196, 5044, 1167, -5153, -979, 5215, 1319, -1827, 1584, 1249, -3307, -494, 4655, 1191, -3236, 694, 2499, -1893, -1453, 2728, -292, -4360, 1346, 5860, -347, -3586, 2381, 3548, -1767, -1987, 1555, 241, -729, 2745, 937, -4662, -1979, 3415, -146, -4790, 656, 4908, -1484, -3998, 1312, 2031, -3272, -2659, 819, -978, -1719, 2295, 989, -5046, -3498, 1678, 369, -1815, 1879, 2611, -3080, -2728, 2229, 239, -4774, -50, 4936, 103, -4010, 988, 2796, -1572, -2016, 1552, 737, -1109, 2445, 2634, -1921, -699, 2799, -1238, -4107, 2597, 6683, -288]
2089b88l823N385J553l681J287K332m410j630O573K025o755j968M162J186j802
2104A46J533o11l929L037N368m490p217M396O721m325m124L919J982l564M67M067
2120C376k754l857J736K630k463J567L173m231n427M706M898m226l294M007J672
2135A513k499J849J486o403j850P244K622p027j684O966J182m885r59J377j020
2150b088J729M919k627n429K730L123l976j851M935m14m672L546O435n038p948
2165f626L946O602k872l112K672J719j921O54l36l619J263N456q89m272L196L529
2181E390o358l386P156L496q091l305P370K875m825k720J688m11J653K814l094
2196B52l482L667L797m987l085N019O25n026K300N528l722o141M708N834m382
$$ y = [-288, -4111, 1274, 2827, -854, 433, 2765, -1645, -3275, 3298, 5323, -1432, -3400, 762, 1948, 146, 1679, 1068, -2861, 176, 5544, 1054, -6163, -1767, 4954, 629, -3495, 424, 2406, -1158, -691, 3376, 622, -3235, -1499, 1131, -1332, 235, 3408, -823, -6250, -1544, 3354, -872, -4166, -159, 1513, -986, 863, 2349, -4054, -5904, 1340, 3962, -3065, -4749, 2217, 3399, -1486, -2445, -1068, -2088, -359, 4560, 1933, -3496, -766, 2357, -1619, -3470, 1465, 1051, -3621, -75, 6360, 1322, -6626, -2680, 3922, 1050, -2062, 610, 2329, 408, 1062, 726, -2893, -1630, 3826, 2937, -1335, 1861, 5390, -968, -4354, 2802, 6298, -1793, -5098, 2272, 5147, 322, -2398, -710, -1121, 532, 3346, 252, -3230, 437, 4234, -753, -3838, 1181, 1806, -3220, -920, 4608, 886, -5255, -547, 5287, 905]
2211I05m808K312J782j222P10L98l469n00M592n83n200K353M558l446l266N807
2227I23K143o395j576N569L38m632J799M504k116j983K295kl443J744L603k617
2243A54j225M203o51o890J538O637k186n487K822N551k539k875K598l28l134K263
2259D51L925j988j546L204j038n435K489N468k651n174L506M497l953l446K192
2274E01j022j755L060K404n734j452N811R55o339q95M674q29j441M105O11n400
2290b746j834N432J166k979M52J178k481J568N091l202p346K780P352k295n849
2305c713J624K469k283Q6K198k454k746L977L784l372k342K588p87j431M484K505
2321D587p312l367P531M304m834k653K764m76o00M097L43n720j025N765R0m313
$$ y = [905, -3903, -1591, 191, -1031, -321, 77, -3392, -3892, 700, 117, -5083, -2730, 1828, -1618, -4884, 923, 3066, -3329, -4905, 664, 1002, -3630, -1831, 2673, 557, -1426, 869, 867, -2576, -832, 2771, 154, -1071, 3132, 2481, -4409, -2871, 3766, 1580, -3907, -1085, 4466, 1927, -948, 1650, 1322, -1812, 451, 4376, 2388, 842, 4046, 3008, -2427, 62, 5530, 2879, -2295, 1211, 5708, 1755, -1691, 501, -521, -2276, 784, 3188, -2546, -3998, 1813, 2768, -3571, -4466, 208, -621, -2062, 2043, 2654, -2746, -4580, 852, 2018, -961, -509, 669, -1812, -244, 4847, 1645, -5701, -2921, 4431, 2136, -3713, -2089, 380, -1903, -1817, 381, -2073, -4819, -842, 2942, -430, -2772, -184, -971, -2402, 2082, 4587, -2725, -6092, 1439, 5743, 909, -1744, 1020, 544, -56, 4041, 4384, -1336, -2361, 3404, 3494, -819]
2337h19M34J773k603L18M937j841o029J975O888j787n070J217K006k236J637L443
2353D243l549n025L309N030l258l035K772J03k679J971K767m338l044M592J438
2368A297m378J02M734j722l728K984L004l898j470M625K12l378J299K214k855
2383i58p91M445m5n389P48N576j684l571K115J556l994o4M763j406m796K173L144
2400A822k893j702M119M75m235J098L879j806k679L179J568m341K38M556j644
2415A634m290L434L652l583k331L682Jk997J934K865n017l184N052L496n258k356
2431c266L026n0p95L185K00n455K9N845n27n390J619L485k214k134L852P65m705
2448b530P61M701j779l146K598J728l738L24L712j665m580K777L987k754k819
$$ y = [-819, -385, 1388, -1215, -897, 4040, 2199, -3830, -1855, 5033, 3246, -1824, -607, 1399, -837, 800, 4243, 694, -4331, -1022, 4008, 750, -2285, 487, 590, -2089, -118, 2649, -1689, -4733, -141, 1297, -3081, -2979, 1755, 33, -3695, -711, 2293, -1605, -3075, 1550, 1762, -1616, -317, 1897, -958, -1749, 2696, 2651, -2738, -1990, 3586, 1902, -1669, 446, 2002, -1992, -2056, 2707, 1301, -3495, -1322, 1822, -1071, -2773, 1346, 1821, -2414, -1316, 2563, 757, -1922, 1257, 2825, -1516, -1278, 3278, 1634, -2656, 778, 4430, 847, -1484, 2198, 2199, -798, 1136, 4001, -1016, -4200, 852, 4348, -910, -3266, -240, -290, -1085, 2100, 2300, -3155, -3126, 2719, 2192, -3198, -1579, 1906, -308, -2442, 1410, 2175, -2530, -1769, 2932, 1153, -1993, 605, 2333, -1405, -1081, 2631, 966, -3614, -837, 3150, 396, -2423]
2463b423K964m50l036K407L849m621m332N005L573l629j978K185k25j610L276
2478I55J378m886j37O307qo213N35M565q40k275K157Q3l750J925M433k155m713
2495b639K742K697l320p69L637j066m390J777L793l156k061L360Q46l774J780
2510e43M082k784l851L902K900l732j435L352m03k571K788J550m731p80N960M91
2526D195n361k85L914j832k786K531O41l890O55M403j924l786K938K911l506k333
2542c515M772J56l526Q00K935k660k609M333Q08m100Q47L995k066l040K742K155
2558B027l919q66L454r81l422K760L433m236k742M131J638l057K75L424k371j951
2574b403L905J059m444m79N599j191l913K312K964k826k178M654j26m497P51M473
$$ y = [-2423, 541, 91, -2945, -538, 3311, -1310, -5642, -637, 2936, -693, -2671, -486, -711, -2321, 955, 2333, -2553, -2690, 3617, 3609, -2604, -2069, 2496, 1656, -619, 1538, 1621, -2129, -204, 4229, 2074, -2639, 103, 2800, -520, -1289, 2348, 1282, -3108, -1331, 2462, -694, -2755, 605, 1451, -2323, -543, 3539, 755, -3096, 806, 3706, -26, -1461, 1891, 1488, -1083, 1705, 3255, -1476, -2256, 3704, 4195, -1166, -1451, 2463, 631, -2155, 376, 1017, -2873, -2218, 2185, 261, -3525, -587, 2324, -1182, -3515, 1257, 1413, -2113, -1313, 1622, -1038, -3647, 686, 1494, -2606, -1759, 2236, 170, -2870, -128, 2027, -1892, -2758, 696, -285, -3707, -947, 2486, -1750, -4492, -361, 1277, -1780, -1505, 1919, -452, -2403, 1502, 2561, -1883, -2362, 3237, 2046, -1867, 445, 3409, 583, -1595, 3059, 2933, -1564, -813, 3660]
2590C660j715l439K617O57l498Q95M240k591l055K903L001l934j275M186q76m421
2606b645J355M649j992l225K335J114l492P10L101j782k469L578J191m716j188
2621c476M255n96l306J961K670l567j588M497N25m616N99M490j459l143K525J546
2637A317l020o58K894n27k683L451J632m834p76N954j86n758N68N081j525l644
2653b714K760J900k894j33L105j775k719L628K420l679j395L547o52l027L215
2668A587K942n318k359N358K252m192j001L545j048k325K015J256l925O8M183
2683C038j013m371K029K515l096j330M492J47n147J024M944k115m537K088J542
2698B10j956J030L323k938m486L289M282l320k288L225O01l066J305K631l872
$$ y = [3660, 1945, -1494, 1123, 1780, -1718, -823, 3417, 826, -2229, 674, 3675, -259, -1534, 2652, 1776, -2645, -1290, 3359, 1367, -1858, 477, 1591, -1901, -1191, 1910, 128, -2341, 1237, 2428, -2288, -3476, 779, 183, -3123, -1162, 1508, -2059, -3647, 850, 1375, -3241, -2642, 1848, 389, -2754, -229, 1317, -1703, -2361, 533, 6, -2677, 774, 2406, -2428, -3204, 2750, 2564, -3194, -2626, 2455, 930, -2714, 46, 1946, -948, -1081, 2024, 249, -2470, 1158, 3578, -101, -1496, 2051, 1399, -1628, 1587, 4529, -789, -3148, 2210, 4462, 270, -731, 2814, 1766, -559, 1456, 2712, -1213, -1145, 3038, 2025, -2346, -317, 2198, -898, -2228, 2264, 2411, -2736, -1712, 3232, 1117, -3420, -1332, 210, -1746, -716, 2607, -331, -4817, -1528, 2754, -566, -2854, 371, 972, -2094, -789, 1842, -2030]
2713b030k216M630J894m210l20L982j218l166L149J397m097n97N624j26n190R8
2729b396L885j251j451K788k23l598K378M039k892l892L356K368l486q05L771
2744B591q06l917K907K469l422k359M676J795m428k63L031j379k264L403P05m389
2760a650K10L596r81l203K953K405m732j235N441k19n981P53N202j120l682J724
2776e19R76j996N22K155k673j692M267J623m902j357M419j088l580K732M013l941
2792a041l045M036K089m192n94L674k96k116J945N91l139J50L506j758l328M003
2808D85L712m591k823M507J309m105P10L620j657k523K972J019m165J77M029m31
2824B245l490K276K522k906j776L773n35m051J801L150k393k021L942n50n154
$$ y = [-2030, -4246, 384, 2278, -1932, -2252, 1730, 512, -2654, 495, 1892, -2205, -2802, 2822, 2696, -2494, -2396, 1489, 238, -1213, 1575, 1352, -2246, 132, 4171, 1279, -2613, 743, 3111, -375, -1180, 2591, 1785, -2132, 775, 3244, -178, -2537, 2139, 3934, -494, -757, 2274, 895, -1369, 2034, 2739, -1650, -1440, 2156, 1175, -2028, 925, 3330, -1402, -2637, 2804, 2585, -3396, -2643, 2559, 1439, -2243, -519, 457, -1539, -1017, 1138, -1535, -3227, 1040, 2663, -2239, -3596, 823, -265, -3845, -1113, 2900, -1041, -4086, -50, 2039, -2153, -2747, 927, 631, -1485, 460, 1051, -2088, -1938, 1568, -190, -3518, 485, 4197, -394, -3217, 1290, 2599, -1506, -796, 2824, 1167, -1356, 1616, 2635, -1530, -1353, 2676, 2245, -1245, 1031, 3553, 647, -1129, 2644, 2109, -1942, -141, 3009, 616, -1405, 2537, 1987, -3167]
2839c167J351O164j589n272J721L442k014j976K170j004k016K708K311l876j677
2854b724L069L23l273K275L184m293l326N030L113n929k853M951K636l444j5R19
2870c57j639j63L375j99l452J808K523l520j644M953M7n408J067O405j141n850
2886c195R65M023j811j561K997m02l177J937K716k814k433K730J297j332K058
2901A998K384m920l261N449L796n976k603N322K032m135m45K050j798j163L128
2916A858Q28l076Q19J961k880j814L449M93n068J453O207j254o001P22M616j801
2932E12j938K716O88l248N46K942k247k101K419J79l225K199M012l390n030M027
2948i39L984m130k823L665J146l500O27K605j917j109K549N55l886J566L593k051
$$ y = [-3167, -1816, 4348, 2759, -2513, -792, 2650, 636, -1340, 830, -174, -2190, 518, 2829, -1047, -2724, 345, 668, -2605, -330, 2854, -1439, -4765, 265, 3378, -2551, -5404, -453, 2183, -1261, -1276, -357, -1996, -2159, 1216, 1017, -2435, -627, 1896, -1624, -3268, 1685, 1732, -3676, -2609, 3796, 2655, -3195, -2230, 1793, -18, -1579, 1418, 1016, -2161, -224, 2492, -322, -2755, -25, 1272, -60, 1998, 4382, -538, -3799, 1650, 5446, -530, -3133, 2189, 4221, 86, -359, 1691, -107, -1270, 1858, 2686, -390, 429, 2390, -490, -2304, 1145, 1638, -3430, -1977, 4230, 2976, -3025, -2303, 2313, 512, -1426, 1290, 1978, -1270, -724, 2218, -29, -2130, 289, 468, -2757, -558, 3454, 64, -4966, -939, 3045, -1085, -3908, -243, 903, -2597, -1970, 635, -1282, -2391, 158, 713, -3173, -1607, 1986, -65]
2964f5k950L781J896m143j811L812O95k659J689J554l284o71M793K29n140m6M335
2981B015m32k614K412O68m250M90M868p08m485J792L404k015p06J994j390l940
2997b897L623M056l770m008L857K236l179r69K219j301j985L734K237m484k428
3012c059K952Q12k376K168K048m048j239M463J500m900j90K966n30k029K910M46
3028A894n283k13N896j78n640K19L390m96q44J801j485l873K811M097k930l593
3044d427L162K180l411O23M027j859l966K670M525k736k395K372N05k045J726
3059I51J767l504j456M349J370m311k14L773j340k960K951J888m283j703N012
3074B290J023m085RK305j307l01K961p99m530K113M491k330m008K307K258k793
$$ y = [-65, -3015, 766, 2662, -1481, -3292, 520, 1215, -1444, 245, 1799, -1485, -2156, 2637, 2866, -2274, -2320, 2015, 1583, -1031, 1381, 2049, -2201, -1711, 3157, 2449, -2036, -244, 3160, 1145, 439, 2433, 1043, -2897, 726, 4782, 1012, -2996, 861, 3097, -82, -1051, 1168, -133, -2118, 1616, 3853, -631, -3059, -107, 705, -1671, 497, 2545, -1503, -2742, 1721, 3221, -1679, -1869, 1097, 567, -1462, 1448, 1894, -3389, -3602, 2294, 2116, -3524, -3305, 85, -411, -1255, 546, -939, -4812, -2001, 2096, -834, -4427, -1265, 915, -2496, -1873, 2154, 295, -3671, -1001, 3524, 788, -1607, 765, 1270, -775, 951, 2718, -786, -2242, 2107, 3477, -834, -1048, 2725, 1385, -1575, 1376, 3264, -1019, -2722, 2290, 3313, -772, -763, 1542, 235, -66, 2895, 2096, -2434, -321, 4170, 1840, -2168, 139, 2397, -396]
3090c96m82L415p98m134K233L229l360k019K969K81k869J705K381l422l083M092
3106b58K414m041p31L456o03k922K314K224l806j062L766K78l699J193K986k802
3122a293k241L877Q17l537M45L400q18k864K035J786l253j29L536j001l573K560
3138b53L056k737j604K908N98l612J452L634k439l198K989J879l465o93L771l64
3154A922l414J964K586k634j357K735k28l341J995L432l537k179L184K172l985
3169f85j008L578k13k471J500J338l417j77L782j170m394J387L952k398j281K766
3185A089m46l573J130M415k048l634K049K370k569q39K891j389l178K983L031
3200B282k809k331L541M61l045J599K309l298k597M693K431m097k033K961M36
$$ y = [-396, -878, 2537, 1739, -2395, -162, 3067, -293, -2312, 657, 938, -1931, -226, 2155, -1267, -4350, -258, 2156, -1885, -2616, 840, 237, -2685, -371, 1853, -1953, -3015, 751, 1029, -2670, -1477, 1509, -1293, -3534, 343, 1160, -2377, -1932, 1468, 650, -2214, -179, 1607, -1646, -1775, 1761, 760, -2813, -253, 2803, 66, -1538, 1370, 1968, -1644, -192, 3442, 1003, -2195, 794, 2673, -792, -1485, 2286, 1922, -1492, 472, 3058, 424, -933, 1802, 1574, -1767, 228, 3660, 123, -2056, 1128, 3300, -685, -1693, 1885, 1672, -799, 701, 2039, -1378, -1555, 2227, 1057, -3337, -1950, 2002, -396, -1677, 1089, 643, -2930, -1800, 2615, 567, -3067, -1018, 1352, -1217, -2056, 835, -554, -3732, -749, 2282, -527, -2858, 683, 1144, -1901, -302, 2007, -1291, -3888, 805, 3236, -861, -2894, 67, 503]
3215E03j049J660P65m155K07N476K43n795k12L994j066j751K470N88l496Q64M148
3232C394j524m061J974K658j799j122K475j294l274L092L429l685l092L352K319
3247B842k671n79K264j858k181L287K171m246j162L714m33l050J918J901l516
3262a599l53M153K90m660RM022j400k928J814J275k871R64L332j915l427K349
3278i45K815k731j140L045l24l637J845L375k945k658K933J733k930k06L243q13
3294F60k751K161J088l055K27L735r39l863K298L655k575k581L689M45l286L94
3310f98L313j414k386J929J575l039k10K956q48k117K104J802l579j563M349M81
3326B655m205O6L766j124k921K737P80l630J94L619m22l039J151J397k399K73
$$ y = [503, -546, 1114, 1879, -2276, -2069, 3407, 3650, -2145, -2357, 1637, 571, -1180, 1290, 1878, -1618, -754, 3394, 1870, -2191, -217, 2441, 642, -480, 1995, 701, -2573, 519, 3948, 263, -2829, 523, 2842, 171, -408, 1856, -2, -2183, 1104, 3275, -971, -2133, 1581, 1148, -1902, 16, 1917, -1599, -1952, 2201, 2491, -2169, -2160, 1862, 462, -2466, -652, 623, -2248, -1284, 2048, 133, -3294, -945, 1870, -861, -2001, 1044, 720, -2917, -1072, 2303, -642, -3300, -367, 1366, -1564, -1770, 1473, 660, -2091, 70, 1158, -1897, -1670, 2065, 1126, -2737, -439, 3216, 641, -1940, 1749, 2194, -1092, -698, 2615, 1201, -1185, 744, 2319, -720, -930, 2026, 1178, -939, 1165, 2967, -612, -2175, 2174, 2655, -1550, -1484, 2282, 1158, -1763, 974, 1754, -1876, -1682, 1937, 1515, -1524, -373, 1024, -1375, -1102]
3342a102L089k021l579K534L844k687l253K314K098k210k73K417j896k017K810
3357F8K367l718j898K689N94j614K013J169l855o84M488J208n283n29M097K56
3373A368k696J503J150l375P0M023n34l213J192K507j132j193J947j038k834K318
3389F3L571k973l240K858J917k716n77L225j265k387K682K047l503k022L174J047
3405A901k616Q84J325k466m62L971l17m693P52M590j013l850J204K043k444M5
3421a146K709j120l345J897L181k110k297K679N68k279Q28J844k224k411L309
3436H3J869l427r13L076j55k262K058J304l381p32L865L85l687L61K470j368j882
3453b336K346J543l026Q7L246j294k622J429K149k509J79L276j667l285K076L641
$$ y = [-1102, 1987, -34, -3613, -1079, 2765, 78, -3175, -861, 1237, -973, -1246, 1171, -725, -2742, 68, 2435, -1283, -3181, -492, 102, -1512, 501, 1670, -2185, -2869, 1619, 2827, -2456, -2985, 1112, 1368, -1328, 175, 1325, -2050, -1980, 2043, 1509, -1704, -512, 1995, 863, -330, 1617, 579, -2255, 63, 3634, 661, -2579, 279, 2196, -520, -1097, 2128, 863, -1524, 1158, 3205, -298, -2320, 854, 1901, -715, 169, 1494, -972, -1434, 2537, 2220, -2473, -1721, 2869, 1856, -1994, -790, 1253, -1191, -1146, 1563, 443, -2902, -1005, 2176, 66, -2231, 448, 1016, -1263, -435, 1409, -815, -3226, 83, 1952, -1475, -2388, 688, 533, -1729, 329, 1633, -1748, -2480, 1385, 1770, -1917, -1556, 914, -454, -2336, 10, 1553, -1473, -1386, 1860, 566, -2056, -627, 1522, -987, -808, 2468, 801, -2484, -408, 3233]
3469C233k996k509L036J923k338q21K144j400j560K196J391l098O2L266j165l418
3485b054J566K908k065j155K719R3l665J039L012k002k741K268K813k827q73K241
3501A277q55j920J371J967k536q94L041q24l213J242K574k819j082M051R18m931
3517b633o81M459K83l307N95J863j483k72K004j036k804J947K305j872q57K923
3533A434m63l766J663M094k515m058K435L933k061k460J222Q82q47J813O57l192
3549a229m68L710N11l296j32K402j504j198L738K34m991LN004L92l569K65J775
3566A647j407p83K474j176k716J762K744j727k104J854m1k067K050K606l079l116
3582c079L137L136l866j853K486Q83k254J122K638l047k326K350J806j312k77
$$ y = [3233, 237, -2272, 764, 2687, 349, -472, 1672, 272, -1288, 908, 2299, -799, -737, 2529, 1364, -2054, -488, 2420, 355, -800, 1919, 2012, -1653, -614, 2398, 396, -2345, -77, 2736, -91, -964, 1277, 422, -1498, -127, 1840, -696, -1590, 1451, 627, -2586, -1344, 1230, -1589, -2671, 1380, 2298, -2633, -3314, 1145, 1428, -1879, -1284, 579, -904, -1176, 828, -208, -3012, -1065, 1240, -632, -1489, 1434, 971, -2795, -1132, 2962, 447, -3611, -1176, 2757, 696, -1764, -542, 340, -507, 1306, 1963, -1229, -1697, 2013, 2524, -772, -904, 1498, -6, -1204, 2534, 2768, -2223, -2220, 2784, 3176, -393, -128, 1647, 240, -543, 1931, 755, -1961, -199, 2545, 818, -1286, 568, 527, -1540, 510, 3116, 37, -3079, 58, 3194, -672, -2525, -39, 844, -1410, -288, 2350, -697, -3023, -673, 1133, -179, -456]
3597d56N70k022p0L299j29m869J4N931k86m439M24L300r97k618K203J139k239
3614a245J99K082j162j180J749o16k276J955L828k148l963K693L440l321k022
3629a987L062Q95k791L94K709j738j707J815N31j414Q26K278k096k454K774J629
3645B726l796o22L630M71l531R48K304j833j959K842O67l030M19K220j185j900
3661a629K197Q79k968K37K939q90k840J975J802k654j119K778M20l687O45K917
3677A002j025k247K055M28k210L73L403j710l175J886K665j854j500K057j43k350
3693b345K276K167k653k180L131J825k683n56K092j353j210K713P66l377q41L422
3709A194N68l387Q42K182j343m42K440L3l989Q57K633n53j755J589N21l000J208
$$ y = [-456, 114, -1908, -1978, 1321, 1192, -3677, -3663, 2268, 1982, -2457, -2033, 1267, 270, -2348, -145, 994, -1245, -1046, 1036, -126, -1306, 443, -173, -2449, -494, 3334, 1186, -2777, -84, 3356, 35, -1987, 1075, 1970, -821, -427, 2282, 544, -1163, 652, 1183, -231, 595, 2873, 777, -1677, 1097, 2726, -1070, -1692, 1938, 2409, -1122, -174, 2130, 297, -1662, 1180, 1847, -1183, -764, 1456, 271, -1629, 568, 1447, -1521, -1284, 1655, 765, -2075, -100, 1702, -952, -2071, 707, 1127, -2560, -1915, 1002, -23, -2270, -215, 213, -1997, -1624, 1779, 69, -3106, -1220, 1445, -409, -1909, 148, 5, -2345, -69, 2098, -555, -2735, 396, 2221, -462, -1018, 1074, -279, -1489, 1224, 1990, -1387, -2228, 1194, 1762, -1625, -783, 1399, 56, -386, 2054, 2087, -1902, -1045, 1588, 1035, -720, 869, 1390, -1610, -402]
3726d02L487j697l899J619L973r58k923Q84L40j486J474J354k686j658M005J264
3742B691l305j001K444m56j860K169J358l142j526L268J296l287k51J760m73o92
3758a007K329m22l372P67L368j318k486K055R48k612m2L140o23l887J646L400
3774A884j403k132J279K82j290J545J672k752k125L354J787k634j186K835p30
3789C86j777K489Q94k931j158L050J140k964O2K064r91j183K218O24l138O82K822
3806B289j179k482J676J474k392o80K941m55k850J174K420j240j952J997O83k342
3822i18O01K583j924k709K118J972k742k52K681n41l002J600K316j967j842K254
3838B28N53k731J179K053j644k276K694J333k582n09K441o14k154K058J605k517
$$ y = [-402, 3085, 1388, -2511, -892, 3081, 2123, -800, 84, 424, -1062, 412, 1766, -920, -2578, 1427, 2691, -614, -1615, 829, 373, -1487, 682, 2040, -1102, -2628, 640, 1936, -1351, -1602, 158, -315, -1007, 1322, 900, -2472, -1705, 1663, 345, -2141, -86, 862, -1750, -1792, 1348, 725, -3162, -1516, 1884, 481, -1651, -372, -90, -1380, 165, 1837, -915, -3040, 314, 2101, -533, -1719, 1116, 386, -1391, 1098, 1992, -939, -2097, 953, 2093, -871, -809, 1255, 264, -919, 1299, 1923, -1215, -533, 2289, 1110, -1372, 304, 1778, -614, -1294, 1647, 1192, -1658, -484, 1936, 696, -1256, 741, 1424, -918, -317, 2266, 342, -2367, -249, 1723, -1019, -1271, 1410, 869, -2133, -533, 1783, -184, -2026, 228, 781, -1950, -771, 1282, -362, -2638, 56, 1389, -1193, -1702, 739, 125, -2029, 29, 1634, -883]
3854h83j843L039R81k730O2J958j640l43K834p8l902M50M261l81l262N29J483
3871E35j087q7K368j006l046J710L026j628k032K179M23k424J210K528k513k700
3887b544L056K448k295j570J429O5q73J457J349l426j072L361J381l380n80J807
3903F13q42m25K351K9l917J9M144K80l315j1J538p77k01J954j085l597J977L529
3921B264j643k844J485J251j523N66K143j892k895K419K957k673j299J445L36
3936I7j779K330R47l174r53L245J258l450M7K139p82j835K352J137k772n10L117
3953A414K98k814P61J744j936n25K686J8l618J061L204j514k119J518J426k138
3969e34L95K578j013k915J646J717j711p54J764k53k255J379K769k654j790K433
$$ y = [-883, -2726, 313, 1294, -1436, -1374, 584, -1056, -1399, 1435, 1357, -2545, -2095, 2166, 1785, -1477, -948, 535, -552, -639, 1729, 723, -2323, -613, 2413, 785, -1247, 932, 1355, -1069, 141, 2669, 156, -2544, 512, 2960, 665, -905, 524, 589, -284, 1173, 2522, -904, -1976, 1385, 2766, -614, -1194, 613, -229, -654, 1697, 1726, -2191, -2172, 1972, 2252, -1063, -1074, 464, -313, -514, 1440, 355, -3242, -1265, 2264, 621, -2223, -738, 513, -1010, -444, 1699, -193, -3088, -669, 2288, -385, -1684, -239, 97, -1682, 648, 1595, -1579, -2532, 713, 1971, -1479, -1432, 707, -75, -1910, 442, 1579, -1193, -1703, 1414, 1712, -1102, -341, 1403, -533, -1058, 1628, 1646, -1972, -911, 2293, 779, -1340, 178, 1604, -534, -139, 2439, 1426, -1489, 157, 1874, 163, -591, 1173, 920, -1335, 44, 2813, 159, -1631, 802]
3985H02R28k306o13K840j255k266J368J983j711p63J577o77j388K118J512l372
4001a223j548L913Q95l361m87K355j035j106J931O62k948%K844K17k547N69Q30
4018c9j210N43K446j287l202J490L575j534k606J484J909k272J73K239j428k183
4034a902J832J706j703j017J686m18j787K583J602k969j564L500J300l163o14
4049i28K004l91j285J814P85k859o37L113L52k634J2J796j072m44K288j389l242
4066b717J786L760j969l256J876J786j946N7K178j439k443K010K371k377j619
4081a942K041M13j932P97K104k198j496K832Q36l077n2K465p80j817J885J327
4097A406k963q85K664J373k604l6J694j118j62K175p24l069J091L278j146k560
$$ y = [802, 1730, -576, -1189, 1651, 396, -1870, -502, 1481, -230, -993, 584, -93, -1481, 637, 2149, -1223, -2771, 1142, 2037, -1324, -1811, 544, -491, -1597, 334, 996, -1952, -1952, 892, 1109, -1438, -869, -39, -1249, -706, 1740, 453, -2749, -1259, 2316, 782, -1824, -340, 1569, -703, -530, 1709, 281, -1902, -70, 1636, -67, -1084, 602, 184, -1603, 980, 2582, -387, -1951, 1549, 2849, -314, -928, 1076, 685, -600, 1214, 1999, -860, -1497, 1616, 1968, -666, -654, 1142, 70, -374, 1914, 525, -2717, -931, 2829, 860, -2396, -520, 1266, -680, -623, 1555, 116, -2327, -317, 2054, -323, -1942, 99, 512, -1420, -623, 1481, -717, -2213, 619, 1455, -1622, -1674, 791, 11, -1806, 79, 1406, -1557, -2442, 222, 1595, -1009, -1045, 649, -469, -631, 1544, 820, -2249, -1158, 2120, 974, -1586]
4113a586J648J504j962o18K423k76k495J448J942j979j794K885K51k275R93J821
4129A930j500j676J910J128k370m7K599j262j931K188J479l097j624L518N67k486
4145f74O84J304j417j291J985P20k652J28K939q41k958J456J694k491m38K875
4161A023o36j936R38K285k508j177K589P4k475O16K695j162k842J717J835j826
4177g90k63K270j103k079K040J514j917j705K279J94j948J367J881k194j897L262
4193I11J683l150j073K619L41j732Q5J795k010o25K168J76k345J090J472j433
4209b8o97K521N1l592P26L672j171l022O07K736j169j032J227m60j476J400J658
4226A951j866j066K292j86k769J005K070j717k259K780K318l070j494K016P18
$$ y = [-1586, 62, 1566, -396, -1014, 1409, 1133, -1362, 86, 2028, 49, -1745, 1140, 1391, -884, 109, 1930, 430, -1246, 664, 1792, -578, -625, 1974, 712, -1219, 969, 2448, -649, -2273, 1245, 1812, -674, 10, 1314, -103, -1394, 591, 1311, -1341, -1213, 1726, 885, -2073, -617, 1077, -1414, -1852, 1023, 387, -1549, -611, 1674, -834, -2011, 578, 652, -1823, -1207, 1488, 326, -2516, -799, 1036, -790, -1053, 1217, 114, -1965, 75, 1589, -328, -2033, 246, 440, -1508, -141, 1740, -454, -2351, 911, 2594, -556, -1629, 990, 1331, -401, -316, 1479, -531, -1156, 1012, 1188, -1157, -67, 1405, -28, -725, 1796, 1847, -1745, -1019, 2653, 1482, -1540, -933, 1803, 634, -398, 829, 369, -1107, 293, 1951, 85, -981, 1311, 1125, -1644, -639, 1431, -286, -2545, 235, 2553, -517, -2011, 5, 723]
4241G23j912J161R43j599j136K498J72k610K52J487p54n11K365K36l477L66L702
4258A906j366k761J238K405j716r50K116k19k820Q02K724m89j852J075M07j398
4274h98R01J596k403j445L132J554k815j350L320k58l064J301L201j994k257J719
4290B40J695j680m44P24p56m2K169k11l495N64L987r75l294J161K457j866j728
4307a494K639M20l101P53K426p82j524J228J5j450O64K100j819k407K207J755
4323A630k755r16K622J77k549R77K545j968k239K129J346k002n4J546j002j328
4339a841K263N24k726k1K979j95j859N22J327k063q12K949J97l216R33K721r32
4356G50k465J744R42j664L39K003o16k072J212J602k353p85K844j2k601P70K823
$$ y = [723, -1189, -28, 915, -684, -1820, 678, 850, -1760, -1508, -21, -775, -1286, 1079, 1315, -2162, -1796, 1906, 540, -2221, -983, 1422, -294, -1244, 872, 653, -2167, -1365, 1359, 870, -982, 93, 500, -898, 3, 1599, -804, -2249, 883, 2437, -378, -1728, 1592, 1334, -1730, -429, 2772, 778, -1479, 240, 1935, 255, -189, 535, -221, -263, 1906, 1695, -1800, -1236, 2751, 1776, -1518, -357, 2100, 234, -1494, 1145, 1565, -1536, -783, 1643, 861, -663, 565, 580, -870, -206, 1894, 75, -2332, -125, 1630, -1125, -2041, 581, 758, -1791, -814, 1731, -237, -2476, -347, 999, -1003, -1057, 489, -513, -1841, 422, 946, -1780, -1801, 1178, 983, -876, -354, 973, -1090, -1902, 1047, 1244, -1972, -1039, 1682, 750, -1715, 29, 971, -693, -354, 1649, 1033, -1039, 173, 1775, -578, -1363, 1481, 1469, -1132, -362, 2461]
4373B461j740j859J153J354j373M16J727j638k105K583J590l244r13K754K19j806
4389d21P68J357j813j324K447M26k335J15K450j459j853K013P50k750k42L589
4405A718k60l321P62K568j822q38J702l64k171P99K641j384k103J605R28j735
4421a275N27K187j707k413K356L094l078k630K382J095j203O23P64j710n02K736
4437A246O68l288l8K816m78j913J656J066k749n83L686k23k923P5K365q18p79
4454b14J635k87k566O50K452r85j792J283J249j659m2K021j485k137K050K651
4470B824k495k020K085R56j974K55J409j338j216K269J029k634l17J728n87j416
4486a442J472J074k567j069L497m3k846R37J949j024j536K026K02k280J12K610
$$ y = [2461, 721, -1138, 15, 1369, -4, 412, 2139, 501, -1604, 979, 2569, -675, -1588, 1166, 1385, -421, 347, 1704, -109, -1433, 1014, 1440, -895, -780, 1670, 211, -1642, 371, 1121, -1629, -1871, 1718, 1458, -1863, -1101, 1467, -355, -1193, 509, 145, -2026, -1227, 1414, 30, -2073, -468, 460, -1275, -748, 1439, -268, -2681, -325, 2769, -309, -2939, -557, 538, -665, -42, 722, -988, -1490, 1246, 1914, -1374, -1412, 1404, 926, -987, 669, 1735, -1014, -1597, 2089, 1866, -1057, -982, 1383, 565, -214, 1421, 1134, -1432, -782, 1670, 685, -1107, 176, 1425, -234, -276, 1745, 260, -1877, 173, 2824, 329, -1691, 394, 1350, -624, -369, 1040, -298, -1514, 755, 1784, -850, -1167, 561, -26, -1442, 30, 1104, -1463, -2532, 965, 922, -1924, -987, 962, -62, -1598, 428, 630, -1650, -1538, 1072]
4502A072j244j710J278J283j789k73K779p09k897J471K286j641j683J997L46k130
4518a564R94K359j769j819J919J666j843m64J862p55j888J767K228l028j495L088
4534A258N51k140O3K254k009j315K589R75k810l51K493l93k155J128J149j828
4550e41p27K809Q5l009P73K159r26j671J882j05k241O17L147j420l064J209K016
4567I93j536m99K000j001k031J752K407k408k181K137R11j437M83Q86j681q38
4583b043K366J244k788r36K600N89j962O06R18k167l02L058J33k768K03K359n31
4600E79j436J654P34k848K33K959n54k845J026J944j600k0J896n49k857J641K721
4617B678j629k459J811O41j440O41J591j814j749K456K028k977j237K310M03j913
$$ y = [1072, -172, -1882, -604, 679, -1110, -1383, 1396, 687, -2210, -739, 1547, -94, -1777, 220, 566, -1564, -570, 1789, 20, -1799, 120, 1786, -57, -521, 1341, 586, -1302, 465, 2693, -335, -1830, 1258, 1809, -331, -268, 1986, -23, -1338, 1251, 2226, -584, -935, 1558, 1165, -990, 138, 1287, -541, -1268, 1541, 1626, -1383, -610, 1549, 623, -1048, 834, 729, -1512, -895, 2252, 832, -2232, -1023, 993, -543, -1042, 958, -43, -2074, -322, 2085, -323, -2504, -367, 544, -893, -410, 476, -1205, -2043, 323, 1567, -1221, -2157, 443, 1032, -930, -324, 594, -1573, -1875, 1183, 1316, -1452, -1249, 1110, 579, -857, 797, 1531, -1317, -1084, 1875, 1321, -1524, -498, 1446, -154, -174, 1722, 1173, -1684, -43, 2678, 1049, -1410, 401, 1042, -398, 243, 1834, 20, -1729, 727, 2755, -222, -1459, 851, 1254, -659]
4633f59J030J284k175q92K936m24k230J67K007p28j419J970O20k456l99K684n42
4650G74k185Q04J401j599o60K498l91k878J183K474j213j777J526O55j594N39
4666d43J602j441k093K303J837k204j055J867J21j267O09J459j719j152K446O92
4682A562k713J22K373j038k209K303J029j824n00J963J71j999J089J123k041j87
4698g76K713n47k386J43K872j216j999J917N76j858J53J926o80k536J503J524
4714A329j686m86K016n01j639J022J702j888j646K334J182k599M33J687j101k278
4730b119J766J755j731j110J633L79j429P00J064j755j126K449L73k431N11J988
4746I17p91j568J616J004k692j97L132j97k745M84J700p80q06J602m00j705R32
$$ y = [-659, 371, 1655, -520, -1412, 1524, 1100, -1130, -963, 1044, 316, -1103, 867, 1487, -969, -1368, 1316, 774, -1411, -607, 794, -805, -1465, 1033, 642, -2236, -1053, 1421, 208, -1569, -43, 612, -982, -443, 1159, -282, -2375, -72, 1765, -439, -1494, 373, 494, -773, -164, 1295, -424, -1576, 870, 1562, -1151, -1029, 1344, 306, -1903, 400, 1429, -395, -895, 1068, 1239, -760, 329, 1452, -589, -776, 1937, 1390, -996, -853, 2019, 803, -1196, 721, 1297, -561, -408, 1518, 838, -1698, -195, 1329, -357, -843, 1173, 672, -967, 55, 1757, -131, -1777, 557, 1739, -860, -427, 1260, 159, -2119, -353, 1402, -329, -1439, 194, 573, -856, -156, 908, -847, -1973, 476, 849, -1582, -1071, 917, 126, -1442, 174, 1178, -1514, -1711, 1421, 1224, -1521, -1037, 663, -117, -923, 679, 279, -1426, -494]
4763d94K227j701j372J712Q65j895J08K407j416k162J560K278j938j332J760N85
4779A192j415O46J049k030m41K363J98k663J45K182q45j596J864J036k484o21
4795a420K739K02k367L81J572q68j197J742l93j954N15K141p32j560J508M94j749
4812i46M03K013j257k363J901K104k064k164K168Q92j522K0J455j115j247K631
4828I09M20k739k57K257j65j774J402P02k058j94K797l80k751J041K370j227j184
4845h31J425L44j957K44K021n48k461J760J053j247j48J715l64k431J655J581
4861A811j622j543J960P07j738N08J554j368j618K250J145k639n31K359j66k290
4877a221J092J158j693j99J784m6k040J094J550k344r18K240J118k677m56K533
$$ y = [-494, 1733, 32, -1340, 372, 1237, -658, -550, 1857, 441, -1721, -161, 2117, 179, -1153, 607, 1192, -223, 423, 1472, -558, -999, 1364, 1562, -1101, -956, 1226, 381, -1215, 649, 1685, -799, -1420, 1319, 1521, -846, -465, 1107, 239, -958, 784, 391, -1563, -1048, 1093, 361, -1199, 309, 803, -946, -543, 1470, 213, -2150, -249, 1855, -209, -2373, -205, 687, -835, -815, 640, -475, -1722, 909, 1329, -1410, -1667, 590, 425, -1349, 53, 755, -1303, -1497, 1300, 920, -1831, -790, 1580, 353, -831, 594, 938, -1019, -775, 1246, 698, -1763, -3, 1050, -197, -345, 1370, 1006, -1425, 230, 1811, 189, -1354, 606, 1313, -425, 83, 1637, 269, -1349, 901, 2046, -593, -1124, 1235, 1069, -1221, -129, 1029, -664, -863, 921, 875, -1165, -71, 1479, -865, -1783, 457, 1575, -1102, -1558, 975]
4893I75l19k000Q23J172j922l83K195M11j809K65R63j095j19J486l4k390Q71K357
4911A447j034k762J998J467j594n09J584L23k083J121J105j353j063J496L63j023
4927e17Q37J108j924j422K820J143k262q97J964J07j451N31R64k119Q2K606J48
4944A718k710k13K270J20j314N47J26j376J042J778j757k048J429K079k039m61
4960h09J791J19k178L93K323p46k222J003Q89q70M74M30j433p63K048J076k483
4977i58n53K411j92k255P56J752j883q01K329O32k518l10K084l25r36J062r2j551
4995a348O13K046j120k331J861J711j322j702K254j81k110J075J843r60j474J651
5011E06P65j649m40J579r14m93J361O93j800l19J968l53j591P32J705j760r16
$$ y = [975, 656, -1344, -521, 651, -1271, -1654, 541, 952, -857, -592, 371, -724, -843, 643, 609, -1781, -910, 1447, 413, -2349, -351, 1116, -478, -987, 597, 920, -1163, -42, 1063, -290, -1353, 143, 506, -517, 320, 1428, -496, -1918, 902, 2045, -217, -1114, 850, 957, -494, 37, 1001, -1118, -1036, 1570, 1718, -992, -1205, 1065, 1185, -129, 418, 544, -832, 210, 1988, 231, -1817, -388, 1691, -348, -809, 982, 1101, -1077, -684, 1639, 893, -1329, -326, 563, -307, 167, 597, -836, -1599, 449, 1525, -958, -1511, 900, 708, -1547, -791, 961, -922, -1723, 606, 1238, -1280, -1590, 494, 169, -767, 295, 203, -1348, -735, 1311, 191, -2140, -279, 1432, 110, -1592, 662, 481, -1629, -554, 1289, 329, -1145, 506, 1271, -378, -818, 761, -153, -646, 715, 1408, -392, -711, 1257, 904, -687, 45, 1750, -10, -926]
5028i26K066N61k403n31K360n8j896J015R91j432R5J568j096j687J760J119j848
5045c42j278K390M13k438K43K102q31j324J059Q69j618r7J672m65j463M51J320
5062F63j561k39J770l32j901J175J860j461j984J406J215j451J39J278n62j556
5078a541J645J270k098o00K024J56j442M83R14j357p04J823N25j817r2J538j69
5095E58j114J233K20j751L50K392o38k830J013K246j187j021R69L38j421J019
5111C76J363j658j559J797J069j748K39J230j048j275J658J475k416j089K284
5126F98K30j148p4Q52j236m79K181J12k596j11K377j48j472Q75j18r85M08K028
5144A394p06k861J074K080j001j396J141N97j572Q76J474j485j301J384J479j728
$$ y = [-926, 1140, 1701, -702, -1233, 1127, 1069, -827, 188, 1179, -253, -158, 1410, 314, -1373, 387, 1506, -342, -1620, 770, 1183, -1255, -1012, 1090, 259, -1065, -6, 863, -755, -852, 820, 355, -1108, -657, 663, -898, -1137, 633, 301, -1600, -425, 1435, -26, -2010, -604, 611, -840, -701, 577, 15, -1541, 104, 1374, -724, -1324, 700, 856, -586, -103, 811, -546, -1250, 573, 1098, -719, -811, 727, 558, -556, 677, 897, -854, -504, 1888, 1250, -1580, -567, 1679, 492, -529, 440, 778, -643, 376, 1739, 81, -1478, 319, 1388, -360, -121, 1109, 61, -1214, 444, 1919, -497, -1586, 698, 928, -220, -294, 558, -678, -1157, 1024, 1136, -1460, -1571, 806, 658, -814, 61, -57, -1042, -634, 1394, 688, -2173, -1099, 981, -20, -1416, -275, 322, -1250, -374, 1100, -385, -1686, -302, 1177, -551]
5160e51m27J571n01j507J808J022k263p81K520J08j699K15J750r38j049J425P57
5177A460k037m55K041l04j307R34O02j662J73K152k61k466P69J914o98j451R93
5194C97N47j218J75J612j006j486J247J032j428n14J526j77j587R78J232j250
5210H0r69J461l4j689R66J627j406j777J679J550j645j031J404j20j029Q76M98
5227D41j133j002K069N3j428N9J715j262n40J471M15k161l08K017r2j133M00P49
5245C30j180J73J798l27j955M84J696j001q34J095N59k049R92J836j310j844J546
5262IJ614j433n47J275o13j106J248J325k110j123K191P39j850L21J137r49j206
5279a078J849Q66k359k14J749J52j926R60J260j973K37J467J7k014J38J967o47
$$ y = [-551, -978, 593, 92, -1415, 393, 1415, -848, -1629, 891, 999, -700, -485, 1265, 327, -722, 703, 1460, -577, -1032, 1009, 705, -602, 332, 934, -728, -555, 1597, 1336, -1130, -361, 1553, 855, -596, 397, 944, -274, -99, 1513, 507, -979, 268, 1300, -128, -642, 884, 707, -880, 98, 1330, 80, -889, 572, 538, -1151, -185, 1442, 36, -1741, -62, 1488, -157, -1188, 216, 96, -933, -57, 441, -692, -1694, 375, 428, -1000, -941, 774, -488, -1028, 443, 858, -1303, -1611, 406, 314, -819, -419, 330, -850, -677, 1121, 794, -1161, -677, 1019, 18, -816, 279, 838, -1211, -219, 1617, 307, -1537, 9, 1623, 190, -357, 918, 305, -801, 447, 1772, -338, -1461, 730, 1469, -381, -60, 1077, 128, -1078, 771, 1637, -722, -936, 813, 965, -961, -1, 1259, -714, -477, 990, 1007, -1007, -869, 1098, 451]
5296D51r44N99J60j427O32J925j311k202J621J354r04q47J162m73j146J403J049
5313A102j573j373J736J309j644l00P46k66q27J366R64k428o9J896P6j666P41
5330b10M57q01l77J868k06j890N46K169j079r55N89L66j016O0K104j212j524J316
5348B05J109j141n17J124lj226O11J245j535j178K007M50j404l46J413m75j122
5365g83J021O99j303l44J966n23j724R31J165j631k85J484K53k059L74J462q19
5382a16o74Q95N88j758r0J798p43j209R14J283j592n72J779j48j344K94J517r80
5400a58j033J884N4j873R8J762k57j967P09J484r16k86J247o60j130J267J177
5417A402j537j009J243J091j435O5R58o69n79J305M36j705m71J825L15j772N61
$$ y = [451, -493, 106, 266, -1161, -529, 1396, 85, -2117, -496, 858, -46, -893, 269, -204, -1350, 53, 1102, -471, -1844, -108, 1201, -443, -743, 3, -263, -1090, 276, 1240, -1188, -1257, 639, 715, -951, -210, 247, -554, -931, 937, 731, -1159, -613, 1556, 477, -478, 111, 477, -539, -479, 1625, 413, -1111, 205, 1314, 173, -344, 780, 777, -449, 162, 1407, -128, -1306, 701, 1151, -253, -599, 814, 339, -783, 238, 937, -366, -710, 1256, 733, -991, -60, 1105, -526, -811, 673, 926, -1133, -759, 703, -116, -790, 105, 693, -1065, -1155, 643, -100, -1309, -395, 888, -704, -1276, 503, 355, -989, -695, 822, -158, -1191, 693, 747, -1126, -1028, 734, 477, -1490, -781, 703, -213, -499, 748, 88, -1042, 225, 1402, -135, -1144, 99, 1190, -245, -180, 778, 109, -470, 835, 1271, -434, -905, 920, 1235, -537, 24]
5434B4R40p94o86J661K6k011O83J550n35j386J472j70j335O0K046m95k370R50
5452c70J713j006j135Q05J84p49O71J162j575j351J630J040j440n45J162m81r49
5469a234J505R03k056o19J734Q08j756l21J138m74p08J226L29j559J13J667p11
5486a5j181J284N11j398K20J809o19k241O61K194j248p59R74L84j063L99J294
5503A206j262r68J550J019j602l89J224n31j154J199P63j340o95K191L00j666
5519a55m67J791m66j089R62K74j491L95J527j023j209R28J046j218k54J753m63
5536H41j922P65J552j314j100J268M51j675L89J518n58j329J243P39j650j08J637
5553G47p98r39L03J450j501l90J119P4j367R36J527r51j416J362N26j471j46J290
$$ y = [24, 964, 170, -516, 1145, 1171, -840, -157, 1393, 858, -528, 944, 774, -561, -501, 1545, 1050, -1320, -370, 1343, 337, -798, 7, 191, -558, 113, 1275, -300, -1651, -21, 1019, -421, -966, 196, -285, -1234, 271, 1174, -882, -1501, 233, 1041, -715, -1036, 102, -372, -1080, 146, 475, -1084, -971, 696, -15, -1196, 88, 599, -799, -579, 1230, 611, -1630, -969, 1225, -23, -782, 192, 576, -487, -88, 1206, -56, -1024, 526, 1545, -57, -446, 778, 247, -907, 292, 1055, -285, -980, 1211, 1511, -155, -622, 1169, 703, -386, 576, 850, -641, -246, 1281, 258, -951, -23, 1023, -195, -449, 1304, 841, -1081, -316, 1236, -78, -1178, 90, 541, -1134, -745, 773, 215, -1114, 129, 868, -782, -890, 747, -51, -990, -687, 763, -738, -1128, -9, 65, -1302, -366, 1161, 210, -1206, 156, 682, -789, -935, 355]
5571C55J7j344J052J129j280r36J446j9l67k02J195j028p27J329L56j880J77J961
5589A234m10j580P77J244j469m04J421M82k034M23J574n43j264J004k18q40R17
5606C14Q22r87j353J514J461j767p63J157k3j255P92J108j235j269J677M58j243
5623e92k3O97l91j54J092k67k017P80J753o91j488O25J309j249j34J314n5j616
5641a107L71J513l85j470N87P05r27L92J250j480p36J781Q13j873n21J951j51
5658G13j524N83J289j123r44J517O27j608p8J083m72k99R53L06j797O22J536p57
5676F27j630N64J799j169p44J299M56j967P71J076q35j623J657Q34j121m65J025
5693E54k67j487J258O89q50n00J245k19j558R97J081j192j361K063Q37k124l86
$$ y = [355, 372, -972, 80, 1209, -71, -1007, 439, 420, 53, -149, 1046, 18, -709, 620, 976, -904, -727, 1234, 824, -756, 21, 1265, -204, -608, 813, 1295, -739, -316, 1258, 715, -549, 455, 237, -603, 314, 1136, 149, -1204, 310, 1771, 4, -759, 398, 375, -880, -88, 1020, -215, -1484, 193, 651, -592, -615, 82, -309, -463, 629, 362, -1655, -875, 878, 187, -1301, -676, 633, -616, -750, 564, 509, -1107, -736, 777, 392, -1078, -491, 214, -713, -321, 929, -551, -1287, 494, 1307, -566, -1087, 864, 713, -811, -228, 1061, -62, -1006, 511, 1138, -470, -548, 535, 63, -236, 717, 1023, -774, -152, 1384, 627, -1003, -439, 1360, 191, -553, 746, 1202, -765, 6, 1082, 247, -1376, 281, 1115, -6, -471, 554, 287, -1200, 58, 747, -103, -603, 642, 423, -1135, -138, 943, -249, -1610, 453, 1290, -834, -1220]
5710a220J594l20q95Q10L69r35O8J007n24j342N82J332q68j130J866O84j963J01
5728g84J609j172r04J193J013j168m22J188k80j148Q26M93j081J31J711m55j852
5745a102O49J668j008j191J170J044j439j10J164q29o71R59J041j280m17J288
5761I36q2j122L86J134j465j074J972N02j649R8J359n02j427J026P55j323n46
5778a022J919P6k029N14R50n89o05J369j94j431N89J393o13j759J412N03j303
5795h20k6J199n38j293J396J356j855r17J561O45j255M89J052j739p41J673N98
5812G85j606k40J487J03j453J364M30j836J14J807J1j940M75J404q76q74J496
5829F51K28j570M63J510n26j586J029P67j193L25R04n61j571J289J336j408r76
$$ y = [-1220, 374, 54, -841, -31, 338, -597, -529, 478, -46, -1388, -806, 526, -342, -1472, 394, 1078, -885, -784, 825, -347, -1251, -58, 955, -213, -635, 553, 273, -875, -49, 444, -637, -506, 1205, 750, -1102, -453, 1215, 207, -984, 186, 1230, -209, -319, 845, 16, -655, 304, 1345, 65, -352, 936, 854, -268, 118, 1252, -213, -1287, 685, 1187, -462, -364, 995, 493, -934, 92, 847, -476, -1022, 897, 973, -1056, -542, 408, -181, -786, 583, 389, -1042, -453, 940, 327, -1432, -20, 483, -820, -846, 353, -185, -1478, -82, 1274, -581, -1498, 63, 708, -547, -58, 994, -745, -1486, 187, 785, -821, -1061, 426, 529, -924, 440, 870, -966, -852, 955, 966, -974, -499, 905, 29, -845, 651, 879, -691, -228, 1282, 756, -830, 199, 966, -227, 98, 1002, 441, -1130, 159, 1495, 87, -889]
5846h89J157P23j280M3J220m65j237Q44Q54j579K4J014m51p41J106L41j220o56
5864a192K084k50j550n4J836j070p49Q89O44j510Q8J559m75j273N61R62j082l84
5882i66J507l57j579Q99J073r11r42J582L19j641N1J658m09j105P57J188j506
5899c82k54J178l82j143P69J110j146q16J610M65j639K91J352q39r85J377O96
5916A262j571o19J934k66j306O26J021r82l63J119p8j367L85J157j161m86J439
5933G44P5j686N4J839n54j552J165P86q20o29Q77%j348Q04J155j350p88J259O31
5952F62j127k86J229q50o71J225Q63j672l33J373j07j200N76Q60o22j155J883
5969F48l91j131J48J430p73p37J044M21j508j82J726l89j445O52R03p65k94J394
$$ y = [-889, 268, 991, -289, -246, 974, 509, -728, 116, 970, -609, -585, 429, -22, -763, 343, 684, -536, -1192, 892, 642, -908, -962, 874, -196, -945, -56, 588, -922, -834, 725, 250, -1023, -462, 500, -582, -966, 541, 184, -1395, -496, 577, -334, -1276, 306, 625, -1016, -965, 693, 284, -821, -64, 1124, -382, -636, 542, 160, -983, -214, 896, -250, -1066, 544, 1009, -630, -339, 1013, 174, -811, 566, 1262, -309, -928, 1006, 740, -566, 60, 1081, 99, -264, 855, 777, -590, -205, 952, -209, -695, 744, 819, -867, -813, 1026, 472, -1080, 85, 871, 51, -578, 299, 299, -1049, -245, 910, -440, -1228, 31, 662, -465, -751, 478, -372, -1043, 182, 1045, -627, -960, 413, 306, -894, -318, 542, -80, -1235, 648, 257, -874, -726, 704, -69, -806, 238, 659, -849, -1031, 695, 306, -1139, -487, 416, -349, -643, 751]
5987G51p1j752R11J366r48j572J635M52j093L08J153r09j371J395J284j895k82
6004f38J407k19j078O59Q17j113o12J663L91j466j90J507o92r86J141J91j358
6021e76l27J875m22j407N95R43j058j69J364m97j330O07J499p13j651Q60J173
6038G66j556J59R33k27r87P53R60j130o75J028J7j120O37J361j412j021J684M54
6056F24j376k00J503l62r81J031P21j593j29J451J88j543N59Q70r04o05J330M69
6074A053j295q4J323n78j265R71P69j390L5J158k97j254R61J181j160o46J145
6091F27R0j316K11J764j112j115R69Q65j594J22J237o14j113J133J094j465q42
6108a059J504j8q62m91J613j223o34J864L9j624j77J846o89p90N59Q15j418m20
$$ y = [751, 680, -1072, -161, 1205, 257, -1315, 320, 772, -321, -13, 1140, 231, -1140, 255, 1539, -356, -638, 769, 550, -528, 131, 948, -165, -777, 886, 1277, -189, -379, 1128, 436, -550, 591, 782, -576, -903, 972, 550, -857, -262, 681, -377, -546, 818, 321, -1009, -402, 1097, 384, -1267, -407, 766, -790, -631, 302, 75, -912, -159, 801, -329, -1004, 24, 41, -1079, -442, 919, -493, -1514, 170, 624, -752, -952, 551, 189, -792, 239, 960, -633, -762, 689, 877, -666, -107, 763, -141, -746, 584, 1053, -242, -326, 997, 419, -846, 125, 894, -496, -461, 697, 400, -854, 107, 1288, 128, -518, 627, 717, -599, -388, 1376, 264, -851, 118, 983, -611, -489, 748, 134, -979, 154, 1248, -217, -1059, 445, 427, -435, -926, 687, -536, -1170, 694, 733, -891, -1068, 778, 89, -701, -142, 673, -745, -1165]
6126a165J643K57j700L32J132p36n47Q91M33j699N09J434m46j272J067L76r34
6143d25p3J006n15j190R30J560j547n17J140N59j305L08P78j286j71J251O95j392
6161a94l16J316k51j144J188J82j150J17J552k99j684K9J735j240o45J168L36
6178G00j315K4J383k56j295P89M50q65K36P12q29r23J124J238j391j100J269R78
6196I29j181k11Q92p61n21Q63N61j452N27J048m94j008Q51N69j176k13J312Oj546
6215a005J38J328k98j273J351K57r17l04J618l57j600Q02R03j211L16J068m84
6232C32j403Q51J302q10j240J330M52j296L83J280q58j341J132R04j123m70J290
6249G15m73j123J372P10q63j176J466J76j476K67J368r41o44J168J54j333J56
$$ y = [-1165, 478, 735, -965, -633, 499, -237, -784, 107, 540, -1159, -650, 784, 338, -934, 133, 509, -425, -498, 508, -7, -1197, -267, 1293, -254, -771, 369, 928, -377, -69, 709, -577, -748, 503, 1198, -194, -510, 806, 555, -589, 599, 781, -369, -252, 1300, 1001, -683, -654, 1081, -159, -804, 364, 700, -615, -591, 792, 536, -759, 30, 480, -385, -149, 563, -266, -1189, -65, 1173, -218, -1318, -49, 929, -252, -463, 429, -332, -853, 10, 571, -881, -354, 694, 200, -808, 43, 612, -564, -777, 535, 541, -1005, -867, 461, 163, -1110, 241, 498, -419, -723, 895, 538, -1062, -260, 643, -568, -252, 816, 332, -1071, -220, 1082, 272, -968, 362, 814, -482, -99, 1181, 323, -1018, 114, 1018, -105, -575, 715, 242, -881, 491, 1201, 338, -838, 628, 804, -672, -405, 963, 22, -622, 546, 700, -633, -477]
6266d77J369m74j336J008O32j029m45J280l31j189N71N96k32q59J043J05j269
6283a037M48J182n55q95P57R26j284n15J609l62j535J019J178q41r89J156J95
6300D57q50k6Q37m23q22J159L93j267j86J473m20j051J095P31r66j062J659J94
6318I25j577L23R57K2q17M88l06o51O34J082r28q12J039Q46j267j31J141j99j435
6337f66O4J785r53j082Q41M30o48KP31p38p47J340R5j301k05J027M34j652R64
6356b79R42j478k67J246N20j578o5J164k6j087M49M83q78L51J146l73j308P99
6374b39J077j197q13J534j64j233O38J768j263j150R91O32r82k21J167l25j325
6391a105J415P80j379l48J115k35o14P59L48j048m20J613L94j596Q4J387m04j003
$$ y = [-477, 892, 418, -918, 90, 722, -307, -752, 528, 197, -992, -421, 175, -57, -916, 127, 232, -1037, -589, 593, 38, -857, -100, 826, -458, -973, 636, 274, -1261, -242, 936, 95, -894, 262, 457, -393, -419, 418, -5, -827, 332, 725, -542, -728, 745, 325, -726, 369, 1100, 134, -928, 731, 925, -652, -329, 628, 650, -167, 321, 15, -636, -2, 1080, 152, -660, 379, 1225, -42, -173, 968, 769, -666, -602, 1183, 230, -852, -11, 419, -229, -227, 504, -234, -981, 359, 454, -847, -1052, -25, 409, -1243, -279, 663, -815, -1082, 164, 684, -894, -959, 205, 179, -908, -459, 24, -854, -503, 643, 270, -1038, -239, 838, -359, -1172, 362, 198, -1035, -397, 1371, 108, -1042, -51, 581, -401, -622, 545, 220, -1105, 310, 1090, -289, -637, 478, 243, -371, 388, 736, -312, -732, 881, 1275, -321, -237, 1150, 746, -257]
6409b57N86P35j014m60J597m90j085N70O73o53p77J153j7j603O81J562o82j412
6427h93Q19Q61p89k79Q86o88r29Q16R52p85n30P38l9r47L32O53q52k57J296K9
6447C94j241l7J424m06r47K57J434j087p77J042O6j064M49P52o77o04J736j95
6465E19j382O17J174p18j110J059O00q55m94J247k23j108M73R88q63l15J062j5
6483F56j123M42Q58n79j053J135M71r32l90J303m54j230J122Q30r78m24R18j09
6501D63q79L17J333j379q20J402N13j469k54J238j67p38M12M03q26k58J254j70
6519C75j354M97J018q36l13J110k85j254M08J006n7j350K51J181q31j34J089o30
6537a09o90P66Q26j318m42J269J27r92J65J155r01m98N19O56q05o27J233N4l84
$$ y = [-257, 329, 1064, 50, -410, 1187, 697, -388, 182, 855, 202, -575, 578, 561, -1042, -361, 1201, 519, -893, -74, 787, -2, -281, 605, -83, -1012, -196, 756, -29, -559, 179, 140, -807, -475, 178, -674, -931, 365, 394, -847, -884, 540, 134, -813, -556, 878, -209, -986, 56, 122, -942, -493, 259, -418, -1022, 714, 519, -863, -246, 928, 210, -900, 159, 759, -96, -590, 657, 434, -674, -201, 787, -76, -391, 671, 656, -467, -25, 833, 254, -799, 336, 807, -125, -515, 788, 334, -896, 226, 1056, 78, -346, 572, 463, -416, -99, 1234, -145, -965, 437, 950, -519, -773, 465, 298, -440, -28, 375, -451, -709, 545, 375, -979, -482, 536, -300, -613, 497, 212, -1042, -634, 372, 315, -1035, -784, 397, -434, -568, 521, -109, -799, -33, 793, -525, -967, 302, 429, -563, -398, 757, -144, -642, -123, 533, -272, -899, 334, 388, 4]
6556DK22K77q19J72J009j14j376L10J337p46p10P83J93j374Q85J080o32j139P49
6575A11Q29q29m20J000j26j178R20L26n05r48J178N40j222K51P90j032m23J114
6593C76L25j172m08J371k08j281N30P86m95n99J351j34j511O26Q90n60p76J020
6611A31J10j131L39R81k44j296Q02O40q92l63Q76N38j149J59J052r19n23R76K50
6630C37o13m3J394j070o60L77R69r22n76J646o82q51N37J264q68l72O64k4q30
6649c23K23Q78m39q09R97M62j115l68J217j99p31N82O23j220k61J304k02j068
6667d49o1J368o16q09N95J97o12j77J397q65p33N69Q03r66m49J083K2j302P53
6686b52M47o45l54J029K87p40k88R48m38r23J285M81j576j96J213Qj057N16M89
$$ y = [4, 226, 503, -316, -144, 865, 751, -625, -315, 1022, 276, -434, 349, 542, -832, 53, 1133, 501, -638, 111, 940, 111, -309, 691, 565, -613, 307, 633, 128, -820, 358, 898, -324, -73, 717, -315, -738, 376, 701, -471, -879, 492, 284, -997, -467, 319, -176, -775, 576, 442, -1069, -443, 447, -113, -889, 131, 241, -890, -551, 430, 186, -1110, -308, 332, -560, -923, -47, 491, -658, -499, 553, -366, -889, 87, 337, -276, -319, 1075, 5, -655, -278, 691, -231, -807, 839, 157, -694, -157, 1107, 239, -133, 531, 507, -323, -100, 778, 339, -470, 527, 989, -126, -494, 723, 524, -207, 375, 998, -222, -483, 821, 619, -449, -510, 858, 242, -567, 28, 225, -387, -564, 833, -32, -765, -196, 607, -359, -808, 275, 297, -1005, -252, 195, -450, -804, 225, 512, -228, -516, 432, -6, -929, 356, 837, -739, -935, 278, 286, -771, -255, 234]
6705B34n43J27R72m13j159L73J147l53j219Q58K42q98M35J230n48j001M16J010
6723I10m84n59M43K04q28J61J483j278r03J260N99q52m94P37q9n48O61Q18j885
6742f44N4J131J60j054l0Q72n94k91J016R1j414M11J033k66j059M08M10o97j36
6761e99J009k64j070N93R19l96j030O71M75q37K61P71p65j169J226M67j127L42
6779e23Q83n02o29O47N10k50j033J031J02q68L17M87n34n16J075K22o02k10R98
6798F05k66r78R08L69j076j99J310mj343O01R11q95j21Q81M5r71K40R85n97r77
6818e72P86M42j001l73J604k38j517Q95O59k31q29P36k05q51Q62P03q84r40J096
6837A42L63p22m18J023j21r49R81O68j441p45J129N05r18k7P65k18m38O62K8q10
$$ y = [234, -309, -182, 790, 377, -782, -409, 738, 385, -834, 24, 266, -632, -197, 1033, 485, -516, -100, 910, 426, -133, 310, 514, -314, -153, 1330, 52, -851, 409, 1008, 156, -338, 399, 310, -238, 423, 1241, -644, -590, 541, 701, -353, -383, 489, -105, -396, 620, 711, -703, -292, 741, 475, -584, -176, 234, -463, -599, 410, 146, -924, -331, 588, 192, -838, -167, 308, -529, -268, 503, -262, -1431, -205, 262, -865, -523, 360, -142, -771, -124, 386, 136, -897, 134, 236, -632, -315, 172, -362, -878, 197, 419, -183, -393, 605, 339, -639, 269, 638, -438, -637, 673, 669, -674, -73, 838, -57, -178, 703, 748, -223, 17, 1002, 405, -572, 214, 656, -345, -718, 886, 648, -869, 26, 685, 454, -375, 361, 156, -695, 167, 870, -14, -954, 142, 505, -217, -635, 388, 267, -682, 299, 967, -474, -1219, -90, 415, -503, -530, 235, 17, -421, 241, 269, -541]
6857e41j17R82K27j264M45O77q76j31Q57J99j348L37J285o48q75N65J55p46N50
6876b67J037p61j064Q11Q60r38J81N01k67n90Q68N30j267k97J308L13j365M05
6894bP59p41p04R08P16j211j35R52j15o80K96M38r28o6J186j73j128M70J129q01
6914A70q69R82L56q32j15R16l19j079O70N66m59p29R42j78q34J078N28j327k38
6933g71J366j25r70J93O14n99l79O56O53j288J86P64j26p28L25O24o76n20J209
6952D08K7j155K67J317p21q61P96M64p02k77J187m87q98P43N97j060K65P58l45
6971C23q66O47Q16o47q12R81J24l49k88O38n34o91R25P84j330q5P29k61o16M77
6991c5Q79j157l36J054J62r07j79P90j80m62K67M62q45Q3J215p77q52R19L57q49
$$ y = [-541, -658, 324, 551, -713, -268, 409, -467, -598, 259, 458, -890, -553, 732, 84, -791, -226, -71, -817, -267, 770, 9, -1055, -244, 616, -322, -141, 360, 93, -497, 371, 901, -366, -663, 645, 958, -407, -2, 757, 16, -688, 220, 936, -275, -410, 542, 427, -253, 43, 481, -447, -513, 673, 500, -628, -158, 971, 170, -699, 283, 639, -193, -308, 608, 289, -790, -120, 446, -13, -742, 200, 22, -812, 266, 794, -533, -771, 595, 470, -500, -307, 307, -292, -671, -15, 638, -650, -464, 300, 174, -554, -229, 395, -281, -801, 408, 435, -720, -453, 864, 143, -718, 78, 542, -160, -437, 750, 263, -635, 108, 705, -355, -90, 668, 323, -543, 104, 920, 273, -539, 442, 566, 217, -71, 567, 33, -658, 267, 1051, -279, -364, 365, 104, -512, -35, 844, -313, -649, 405, 567, -340, -519, 271, 91, -371, -104, 358, -487, -404, 811, 34, -818, 101, 458, -391]
7011c91o21J621j38j261J77O31L09q70N68J21o31P1J018n79r39R13P98j265l12
7030g80J195l41r34M79J182j153m34Q39O49p35n39P20J01n08P72m05n39j21J199
7049F47q1j028N67M47l86n95Q32J31j267M60J294n57j244O38M48p32L99J131n83
7068E21j195P84P67o81q70R84j30m44N68M31q08q40J114M07r90j86Q81o3n17N00
7088B33K00q76l75Q51K84j005N45L50l19k36O51j08m97j82J257p35j204P33R10
7107D77q47k51R65J1j272R03N44m84n20P55l9j114J073M37r87m62R64N61q88l17
7127d91J211k87r75N52N76o36l28J076j84r21K78Q60o80k81O71M6j063N28P73
7146G25j63j491J031R84j391l48R72M44j175L71L08j99n25Q95k2q03q6J030p05
$$ y = [-391, -1012, 609, 471, -790, -613, 18, 327, -543, 25, 146, -485, -414, 604, 25, -914, -1, 797, -468, -780, 415, 74, -860, -381, 801, -352, -786, 53, 702, -33, -572, 148, 249, -259, 513, 108, -431, -552, 647, 566, -462, 105, 552, 166, -429, 403, 534, -733, -273, 1021, 464, -780, -142, 306, -426, -27, 1104, 521, -674, 110, 877, 196, -674, 310, 180, -264, 304, 735, -73, -913, 201, 608, -382, -568, 313, 250, -267, 233, 433, -443, -818, 33, 317, -688, -143, 207, -112, -348, 303, 195, -302, -484, 773, 38, -1166, -433, 477, -370, -621, 344, 355, -917, -14, 530, 46, -474, 281, 242, -872, 201, 638, -349, -811, 153, 714, -174, -491, 720, 433, -542, 10, 586, -50, -378, 698, 514, -407, -129, 731, 51, -230, 441, 487, -576, -48, 725, 562, -929, 102, 1086, -305, -653, 319, 763, -412, -41, 267, 68, -457, 438, 416, -387, -473, 557, -148]
7165a48n89R00M23p28n53J271l11j149N35N41k83k52o0P76j234M20P64o03n94
7184h74J113M99j599K60J096m26p14P32J43n95n43J184M18j074m4R56o85k64P64
7203C47N9q26l10J635l01r19R3Q19n30j49Q06n35m96L04J043q54r10J206K18q59
7223a59J59O98q43m62O67N65n11p08Q03Q4n15L90M95j114j5J131j54r83R6Q02
7243D26k95o57Q25K57q82j60J159j32j133K48M52l58k72Q18o34m96M85O18n14
7262b45l38N83K74q91L34R45n17j135P57O47o30k37M90K87p48J90N85n64n24R51
7282B14N6p44M6J011o18q31J184N06j169k63J427K3j104K39O83m41o54P32l3m16
7302a52M24M87n89o70J078K48j148Q7N35J93j080N49N70m91n64Q06k01q38N38
$$ y = [-148, -737, 163, 586, -142, -695, 576, 265, -884, -349, 192, -91, -343, -403, 373, -861, -441, 323, -280, -874, 239, 738, -861, -601, 495, 69, -645, 87, 230, -365, -908, 276, 694, -380, -424, 532, -153, -417, 347, 406, -420, -730, 905, 604, -315, -222, 597, 67, -82, 724, 189, -307, -3, 1040, 186, -724, 482, 700, -159, 0, 698, -145, -607, 60, 625, 114, -594, 209, 293, -222, 168, 663, -451, -466, 665, 511, -472, -376, 426, 131, -526, 299, 556, -326, -486, 673, 541, -592, -344, 108, -250, -522, 296, -338, -834, -349, 269, -245, -583, 0, 274, -617, -283, 662, 145, -990, -233, 414, -216, -453, 37, 324, -424, -234, 351, -213, -737, 214, 270, -474, -428, 583, -35, -866, 318, 824, -345, -608, 819, 842, -262, -23, 660, 219, -435, 297, 264, -152, 272, 759, 170, -500, 578, 826, -322, -235, 300, 493, -587, -38, 532, 41, -523, 283, 82, -756, -218]
7321b18Q79o59n74Q82j97n51l8J118n06j011J090K02o53n8N03j81p76O35O50r07
7341c70p44J463J73j434L93P74j31p97P06J72o36k15J429n72r88L57R04o31l42
7360d89N95k22q69P81J039q73k86K65O53p97q6P94l27j157J153N64p95p79J100
7379B64K79r57P21L81o85n79J089L75r54j13P12r9m78M55m6p71K36J008j9r94
7399a75J94P77o16l73P22m48n01K83O41m37m28K30P47n14m17R35m65j079J034
7418A10O21j133m96Q96L49q83L07R66j024o62J278L03j684K07R08Mj006P42O75
7437D78r73L37O50l18o36l0Q22o6p39Q20p8q63J33R01l77q26P15R86j378K21P67
7458E46J06r65%J124p02n80J083K05j159J87P34l67r00R16L02p43R6O85N6q65
$$ y = [-218, 661, 2, -572, 310, 113, -438, -476, 642, 136, -875, 215, 417, -236, -294, 209, 28, -748, -113, 537, -370, -1114, 349, 522, -912, -519, 255, 124, -673, 33, 205, -431, -646, 783, 211, -777, -420, 484, -147, -489, 106, -116, -985, -204, 835, -38, -324, -59, 594, -203, -289, 505, 178, -979, 174, 738, -57, -836, 264, 543, -414, 307, 688, 3, -576, 513, 888, -66, -179, 533, 434, -44, 411, 365, -406, -170, 838, 819, -175, 19, 796, 180, -193, 529, 81, -420, -137, 504, 67, -361, -131, 616, 102, -315, 620, 155, -924, 110, 731, -402, -898, -2, 347, -536, -229, 737, -287, -949, 329, 632, -1052, -845, 63, 67, -939, -197, 478, -495, -158, 492, 174, -462, -492, 330, 264, -475, 345, 267, -596, -463, 438, 61, -765, -50, 936, -442, -221, 546, 652, -313, -313, 811, 109, -471, 612, 817, -342, -155, 579, 212, -688, 228, 530, -213, -117, 568, 624, -241]
7478b41K88Q10r60m72Q83M87j088r8Q07j49q35P88K09p06j37R25m46p08R48k3
7498B82o98k86J349k73j200K04R02m81kM69l2o49m6P09l68o71P49M16q43J22O10
7519B63m30o34P48R77j122p68J156K00p88L26O84n99n08P02L78o41m51Q36j37
7538A92m66M70K64p37l40J298j05q87l1Q63m17l10L29K20q02J64J032m98p47L97
7558a11O16n62j04P45l45o61Q01Q23j378n02Q43n5o75Q4J073m49p69P14P36j351
7578e27N9N06M16q04N18N17r16o38J130J62q46l7R66o57n55Q51N7q26J71J033
7598E80n90p92M34O80m00n79R87K58j440O77R11r51j36N33K90r95K07R21p08n50
7618f63P51Q96j036l69L59M87m51K02L44n53k77O71J84j189P13P30o24p67J148
$$ y = [-241, 47, 857, -103, -575, 308, 795, -293, -391, 416, 267, -568, 220, 429, -277, -414, 511, 65, -643, 305, 282, -416, -702, 647, 374, -826, -622, 280, -201, -203, 266, 234, -415, -461, 248, -120, -791, -42, 374, -469, -347, 263, -167, -801, -53, 924, -198, -966, 190, 390, -398, -72, 612, 13, -495, 207, 585, -56, -507, 329, 192, -274, 196, 460, -277, -617, 681, 576, -311, -342, 521, 104, -206, 123, 343, -459, -295, 737, 239, -508, -111, 505, -57, -161, 584, 239, -422, 379, 1202, -176, -678, 165, 110, -565, -481, 592, 143, -626, 88, 824, -527, -468, 38, 454, -350, 168, 685, -231, -869, 261, 423, -423, -460, 506, -151, -706, 145, 202, -624, -453, 580, -10, -802, -368, 312, -88, -667, 320, 578, -862, -185, 726, -225, -361, 172, 462, -533, -326, 595, -113, -663, 88, 984, -52, -421, -62, 425, -26, 176, 520, -33, -310, 361, 545, -644, 69, 799, 175, -592, 556]
7637E56j44o31K36Q97n22o84K54M08j87n49N19M56j127K98P68m48n87N44K90q00
7657d53M93L14l72r30Q55O08j051l15J132nq99L98P13q03l65P80L13n77l09O78
7677B05n15m16P81N7j82m78J202p64p00P00O32q64m86J276o7r18K12R46l55p94
7697e28Q46K87q32J61N02k88p22M26O29m31k08O45j61r26L64J073n84p24M73R27
7717I29q44k22M98k80k13L17M96r29l54J121j11p33M05L83m83l34P22K09r10j44
7737d77J219n15n00J07O70q72J67O11j59r30N06L52m53J60R4j9j015Q69P22m95
7757D2j001Q31Q81j105l5P35l48p96R29K10m61k55L98J2n33N11L25n82m45J069
7777C82M44j097o16J502J45j209M53P56r47k76R77k15n47L13O93n26l06K96J06
$$ y = [556, 412, -219, 17, 914, 392, -292, -38, 370, 183, -366, 153, 609, -518, -220, 548, 100, -487, 57, 347, -453, 40, 354, -18, -948, -93, 515, -536, -851, 281, 276, -623, -225, 488, -315, -680, 100, 413, -164, -473, 205, -310, -726, 55, 112, -70, -548, 654, -110, -810, -110, 522, -342, -828, 448, 381, -537, -325, 621, 266, -528, 318, 605, -227, -66, 436, 148, -574, -148, 481, 50, -158, 487, 326, -600, -236, 837, 253, -471, 2, 929, 85, -137, 361, 81, -132, 185, 681, -248, -602, 519, 408, -325, 80, 463, -20, -354, 368, 577, -333, -477, 742, 227, -273, -166, 504, -368, -201, 410, 251, -679, -173, 179, -274, -114, -20, -39, -1054, -185, 537, 42, -959, -128, 753, -352, -387, 348, 0, -796, 133, 343, -118, -373, 25, 37, -496, 15, 340, -242, -687, 382, 826, -271, -887, 615, 760, -449, 4, 760, -187, -463, 514, 299, -248, 65, 758, 232, -74, 222, 328]
7796C28o95J48P59j77r73P69K31o13j01Q16l31p62M59P02p77k33M66O56j273L69
7816b32P11o79l03M36P57j217j15Q66j53p19M41P05j013j44P97K75p04J29J12
7835e0k76R3L87K77r34R5N48j02r79O37N81l06m21Q81j47o68R1O39k63p64P93
7856A12K13o39K09Q06p90l83L37O56o11k4L90m16m14P72M71q77k12Q25K87o36
7876G6j75P26n69o05J084J39j045l94J374n62o39N91M26p84N4O23O4q39l6J192
7896G01p15j45K89k28l49K11J150p71o57P3O75j23p45M39K97n78K93P44j006r9
7916e44M58O06q33J38K72k97n00P38P52j214L7P07q9o60J55Q41p87k12Q13J05
7936D86q62J12O04l33j72K32M77j106K56J041l16r76M25R43p66k99P31K0o87K30
$$ y = [328, -367, -219, 540, 363, -610, 159, 390, -223, -324, 492, 161, -601, -142, 560, -217, -450, 16, 672, -601, -232, 479, -200, -503, -67, 690, -527, -642, 224, 71, -648, -207, 498, -515, -659, 138, 413, -291, -162, -50, -326, -233, 154, 431, -503, -408, 140, 38, -941, -304, 277, -29, -450, 431, 284, -384, -293, 346, 83, -681, 112, 325, -314, -105, 701, -89, -472, -135, 521, -90, -114, 276, -140, -554, 218, 689, -188, -400, 425, 712, 76, -99, 627, 58, -547, 537, 676, -369, -763, 611, 49, -590, 1, 427, -357, -303, 320, 384, -455, -491, 701, -14, -159, 130, -98, -447, -236, 914, 143, -514, -441, 234, 111, -634, -195, 102, -476, -183, 561, -445, -544, -86, 520, -313, -175, 97, -200, -700, 38, 790, -424, -387, 320, 231, -429, -274, 567, -220, -432, 381, 486, -376, -264, 340, 7, -165, 67, 544, -562, -306, 735, 419, -557, -132, 811, 45, -254, 477, 497, -190, 40]
7956D0L90o10k00M24J66l24J72J99Q9r44Q56N18j015K1O83Nq50J82M35k86l76
7977d25P08j39o47J87O62l35n79N87L91p30j12O11P4q86N16O41r24k39N61j7m96
7998e91N22K78l80k25N07j42o04M55P53j042j5N84L80o65m77J134J36n35K35L75
8018F83j142P2Q32q6r20O43M43k59n91N53K90o08k72O40J20m57O1L37m67r3O89
8039D68r4p19K65Q13o68l46P02K21q04nO51M1j213O80K80k39m77N78L6o70O93
8060A93ok07p12R75Q9m44l56R96o81m00N50N15n29n51P27j89k55K1M98m40n51
8081g57J053Lr20K12O66m18m92M92L61m89j43J040m68o91L10P22n58j89Q24k02
8101C56o96L83L71k54k40M3L21m23m24R19l29m18M30O70o42k23O50J51p23J72
$$ y = [40, 430, -180, -380, 44, 210, -114, 58, 257, 346, -598, 258, 776, -239, -218, 465, 470, -380, -198, 237, -49, -425, 283, 144, -503, -316, 346, 11, -568, 19, 410, -320, -432, 179, 253, -633, -117, 524, -400, -639, -78, -95, -591, -69, 209, -171, -396, 111, -31, -635, -180, 573, -469, -484, 100, 480, -185, -662, 472, 608, 73, 308, 683, -459, -387, 445, 359, -561, 82, 525, 266, -325, 228, 518, -90, -362, 278, 398, -59, 2, 339, -128, -221, 468, 374, -345, -80, 733, 65, -281, 421, 642, -162, -167, 484, 525, -688, -8, 272, 33, -444, 134, 170, -500, 193, 187, -20, -732, 243, 332, -112, -468, 528, -153, -553, -3, 512, -17, -568, 159, -30, -285, -264, 234, -206, -757, 296, 299, -621, -409, 257, -161, -653, -161, 200, -289, -432, 608, 140, -551, -241, 481, -77, -266, 558, 356, -340, 43, 414, 160, -80, -37, 284, -139, -563, 356, 27, -391, 39, 709, 67, -156, 494, 645, -78, 94]
8121I4J90k47n50O75N40j226k54J189l32l79K91L08n04j72R96j18j146O53M06
8140D14m46l34M53J24p43M71L16j54o48L62M16l83l95P36n94j34P41K75o60n00
8160f83Q76j88l96J88N79m47o25R49L61q73k24P72m04o01O07L33n07q7J002l39
8180B93l30k78P65k73k61L47j18m83K56O17j82
$$ y = [94, 284, 37, -513, 162, 702, -524, -778, 411, 79, -300, -9, 299, -205, -377, 619, 501, -645, 8, 414, -32, -366, 87, 211, -532, -61, 255, 101, -547, -185, 231, -152, -547, 189, -405, -539, 202, 477, -183, -683, 193, 5, -391, -203, 376, -71, -696, 253, 614, -259, -483, 289, -115, -716, -109, 224, -283, -370, 632, 293, -37, -315, 450, 177, -84, 263, 145, -338, -82, 535, 353]
8191C53
$$ Imaginary data points
##PAGE= N=2
##DATA TABLE= (X++(I..I)), XYDATA
0@%%%%%%%%%Nj3J6j6J6j6K4l2L4m2N2n9O8p9R0j02J16j33J51j73J97k19K46k78
33a47L11l45L84m28M75n27N82o45P14p89Q75r72J081j199J335j494J677j895K157
52A150k479K886l423M164n252P020j0366J8872p7988j90462J42078K19021L9369
65A44590j31442q1679M5302J09050M6182n6797r3139r571O7834P0800K0956l7064
77I5022r3300n5082P8743J15129l3320j38237k8768J14756Q4188l8402r3091n5419
89d7781K3706Q9796N7113m6970q2979r201N5917M8838P026n2500q3814m768J16939
102G1322Q2871q2346j30009l305R3543M6309l9388p0143l2840M2814P2178n573
114D5433q7696m8634L9380M9404R435j1455l2114l9197J8918P2258J7344o9339
$$ y = [0, 0, 0, 0, 0, 0, 0, 0, 0, 0, 5, -8, 8, -8, 8, -8, 16, -16, 18, -24, 28, -31, 37, -42, 48, -54, 62, -71, 80, -93, 104, -115, 131, -147, 164, -181, 203, -225, 250, -277, 305, -340, 374, -415, 460, -512, 569, -630, 705, -789, 888, -1007, 1150, -1329, 1557, -1866, 2298, -2954, 4066, -6300, 12572, -65416, -255878, -113800, 105221, 144590, 13148, -68531, -23229, 85821, 132003, 75206, -17933, -27504, 40330, 111130, 132086, 95022, 1722, -53360, 25383, 140512, 107192, -31045, -59813, 54943, 139131, 100729, 7638, -47781, -24075, 65721, 122834, 75864, -7115, -16316, 39601, 88439, 95465, 42965, -40849, -45617, 71322, 154193, 71847, -58162, -61467, 32076, 78385, 38997, -31146, -63986, -21172, 51006, 45433, -42263, -90897, -51517, -2113, 7322, -4133, -36247, -75444, -56526, 15732, 33076, -36263]
126c6263n1363K8864N7648L0088j2138n3854m4716L3312P1951M514o1457l5250
138f8664J8579L7961L3547j896n8623m8666M3248P8394J607n9568k8868K5991
150b6958M1113K3503k5523n9433q897P1778N6120l2921n4652o422K3234K4625
162B5567K2294j0764n0623j7824M9236M3296k1857m6809k3818R428M4061L9448
174F1635k7815o5642k51O1636K2103l7620k6709L491P688K2062K6174j9848n1332
187b4428l186M7466K5081k0801l1615j6772J5735M9261J6146o1154n6223L5485
199b5005O4729j980m2626k0693J219J1326K8597R249m0450l2069K6230M0371l31
212A8567k2734j8623r815J8956L9686l304n4066j6898M7207L2394k1952k8122
$$ y = [-36263, -87626, -58762, -1114, 28974, 16836, -37018, -81734, -48422, 23529, 28043, -33414, -68664, -50085, -12124, 21423, 19527, -39096, -87762, -44514, 33880, 35487, -24081, -52949, -26958, 14155, 37658, 12135, -47298, -56195, 15583, 71703, 38782, -15870, -22292, 942, 25567, 47861, 37097, -13526, -31350, 17886, 61182, 39325, -7484, -31302, -21874, 22187, 61635, 33820, -31822, -32073, 29563, 51666, 14046, -12663, -9172, -1484, 20578, 46752, 26904, -24428, -27614, 19852, 44933, 24132, -7483, -24255, -8520, 40741, 56887, -4267, -60490, -25005, 39724, 37744, -4882, -25575, -24356, -13030, 15567, 24816, -15634, -47703, -21473, 18898, 18567, -4167, -22790, -32605, -13649, 26037, 22733, -31333, -48231, -1024, 31370, 9418, -18704]
224a8704o791L018K0497K5332j3245m1594k598L6968J7369j1202j3253j6048j1008
237c1259K8485L7260j6071m6887k665L5928J3853j1354j3147j2599K901L3485
249A7930J8993l1631l0541J9220K8625n658j3756l797o297M545K6805N225l7663
262h000j9250K7257K4511o232j0248o817j1693P537K3511m036l1147k301K3996
275G088J115j2422O403M002j8299j110K2729J649k0640L73J6211m00n546J022
289B175j0627r872K1485K2612k2011k8695J3213K5441m478r856j295j0519m939
302a7366K3499J7182k4380k2710J3494J5797m975l103J478r430J698J8775p69
315I190k3488K081K2685l318j7235Q537J4611j1882q084J5176M732j4668m498
$$ y = [-18704, -25495, -22477, -1980, 23352, 10107, -31487, -34085, 2883, 20252, 9050, -4203, -20251, -31259, -2774, 34486, 18415, -28472, -31137, 4791, 18644, 7290, -5857, -18456, -15555, 17930, 36923, 5292, -25249, -6029, 22596, 16938, 3182, -615, -6912, -2367, 24438, 29663, -8000, -27250, 7, 24518, 18286, 8038, 1221, -10472, -2935, 20576, 16540, -14607, -16908, 7088, 8203, -4219, 2184, 6186, -12113, -13223, 9506, 11155, -9485, -9112, 7099, 6699, 1153, 2175, -8452, -18324, 3161, 25773, 3762, -24933, -11720, 13721, 9243, -613, -1908, -12427, -17366, 6133, 23315, -1065, -23775, -10281, 5516, 541, -2562, -1084, -10514, -8816, 9959, 9190, -14298, -12217, 10468, 7150, -10085, -1548, 13063, 1181, -6903, 8273, 13005, -1663, -6161]
328f161P443j86N995J0251j3683k4880J1250L1110l562k5572k084J1981J038N255
342H195P963j4706j9348J1899K0552r485j4508Q009O408n873K133L777j2822j914
356i720K1801N870k4072p977J8067K792j1366K874N125j3133l963J8195O076j2158
370a589m415J891p230N183K1819l329l1294l548K8002P944j7669p491L236p96
384i286R115J2254j2646j9009J3967K2726j1690k0845M922J2232K114N018L52
397I224k1006r402K5801J7682j9036j6713J1041P324l024N149L279j4520n977
410a0178J5547O064r558K322O664j2613o128J8386P735k0348p858J7639P192j0704
424D162l365J219m805O464J3078j1098k1704R552K4827n759j9983l114L645q83
$$ y = [-6161, 1282, 1096, 7091, 17342, 3659, -21221, -9971, 21139, 17577, -7995, -10079, 1902, 2940, 8195, 16158, 1452, -17896, -5997, 14555, 5070, -9438, -1429, 4979, -894, 1239, 5016, -7806, -9720, 12081, 17951, -6121, -14098, 3969, 6761, -4605, -1731, 3394, -9739, -13702, 4493, 10569, -1589, -6004, -4113, -11343, -6160, 15659, 12330, -18964, -22512, 5490, 13434, -4235, -11726, -8490, -9286, -171, 12083, -563, -19572, -5605, 17121, 5431, -15414, -10492, 1740, 3854, 8872, 9224, -11782, -21184, 4617, 22299, 3263, -13450, -2409, 4915, 1891, 7040, 10319, -4201, -10178, 5369, 11433, 1875, 4197, 10861, -1752, -7880, 10506, 18241, -2107, -9965, 7674, 14866, 4162, 797, 2016, -2789, 3675, 16753, 5655, -16049, -6497, 18330, 12571, -7412, -10526, -6881, -7764]
438g764R204Q079j5716j4047J5843J4910j3268j0637J0977M824p521K711N411
451C006q874k600J2168j357j4846M810J6390o446j1473J0267P874j4016o226J3851
465B528L354r114k49K844q887K636J6214l715k0021K932J9135p94q809O399J795
480F248j1280K359J4677n534j2453R141J0985j0914q874J0397L460p937K175O242
494H692r422l849J3640J346j5510L3J3932n389j1959Q755J0719q915n800Q063
508D336k072q115P885R925j1385q941J1953O224r685j680N650p620m225J2794
522E044M603j6200m424J3642j991j2451L441J0282n391l220Q846k679j1353O740
536e111J4888n614j1944L997N767l429M243P098j2104j1841J3947J3988j1243
$$ y = [-7764, 1440, 9519, -6197, -20244, -4401, 10509, -2759, -13396, -2419, 2405, -5116, -2405, 3006, -5868, -8468, 3700, 2343, -12503, -7693, 8697, 2251, -9222, 1045, 8919, -5097, -11323, 2528, 5882, -3232, -3481, -637, -9524, -6888, 9326, 5611, -14410, -11478, 7657, 6863, -1946, 4453, 6248, -5032, -2673, 12004, 6470, -5983, 3158, 14143, 3229, -5645, 4752, 8212, 275, 2450, 8692, -730, -4579, 9061, 10407, -5103, -5070, 8862, 3473, -8486, 269, 10988, 2073, -3727, 4336, 2264, -5851, 2034, 11959, 574, -8367, 3586, 9810, 125, -1555, 4095, -3525, -7750, 5044, 9647, -6553, -10977, 2665, 674, -11777, -8336, 1946, -3445, -6665, 2181, -498, -11851, -5111, 9777, 4163, -7781, -3784, 1983, -1446, 2797, 9895, -2209, -14050, -103, 13885, 2642]
549B642q202J1104J986r985K400Q950p560p332R587M458r648r04P161m691k845
564b879J3698K600j9324l247K1717P699j6175q521L045J620O911R832j2848k2036
578a7908P910K5586j758k0142l135P055j72K213M981q479q970J0684P752j4275
592h658p800J3713M793q105K277O911r943q331J3413Q980j0205n569P036j160
606b648l691R654L339j6274o797J5184R765o346m581l144p444N985J8586m271
620G317k2138K117K3673J542j8179l181R867L790J891K145j1095p464J4275J3307
634A7867j2316j2294P516N747l015N781P359j2970j2122J0937J1649o700l926
647C513M495q195r558J2019J1972j1928j3299P558Q742j416n55l624j2618J118
$$ y = [2642, -5560, 5544, 7530, -2455, -55, 8895, 1335, -5997, 3590, 8048, -1600, -2504, 4657, -34, -2879, 10819, 13419, -5905, -9152, 12565, 20264, 4089, -4432, -1387, 233, 7144, 16976, 4128, -17908, -9998, 15588, 13830, -6312, -9447, -2392, -2564, -351, 4630, -3849, -12819, -2135, 5617, -8658, -16458, -2745, 2048, -6057, -3780, 3131, -6812, -15143, -1730, 7250, -2955, -8524, -1488, -2648, -6339, 3315, 6654, -9620, -16417, -1233, 8532, 2186, -2395, -5539, -12983, -6998, 11588, 7317, -14821, -12704, 10969, 12511, -5668, -8849, 1018, 4808, 6699, 8844, -2251, -9715, 4560, 17867, 5551, -6743, 773, 6520, 3505, 9286, 16645, 3675, -8447, 2490, 14139, 7439, 3513, 8008, -187, -9745, 2274, 14246, 2318, -10981, -3423, 5319, 3903, 3348, -276, -12894, -11776]
661a1776J9909K203k0051n859J6526L774j0359k04K590l861O366J5871l931k0302
675i104k527J2874M098M19M144q533j3878P794J8316n457j7886n75Q712K580L455
690D432M039j4339j3676J2410J6609p602j2618N515N863j763M640K126j4203p183
704a5750K0574J6830j1814j6755N99Q591Q785N859j2108j9933P152K8806J386
717B2222k5952j0541J1346L156j815P234k637j6579k208J7934O600j2188r046
730a2474K36P911J4676L592k2656j5108K2104K2840j4095k0938Q014J2017k349
743C770P95O986q993j4642P535J8052K939j2063j3625n333J3862K1977o703l2271
757a7714o156K9980J3032j9097j0863J0040L499l188O081k33j3014l981J4819
$$ y = [-11776, 8133, 10336, -9715, -15574, 952, 4726, -5633, -5837, -3247, -7108, -742, 15129, 11198, -9104, -11631, 1243, 5341, 5760, 9904, 1371, -12507, -4713, 13603, 8146, -9740, -10315, -1603, 977, 4432, 8471, -5868, -19544, -7134, 9475, 1873, -10745, -5230, 633, -1130, 3510, 5636, -8567, -15750, 4824, 21654, 9840, -6915, -6316, 2275, 11060, 16919, 4811, -15122, -7970, 20836, 22222, -3730, -14271, -2925, 231, -1584, 5650, 3013, -13566, -15774, 2160, 8760, -3428, -12474, -12238, -4327, 10349, 13941, -8715, -23823, -1719, 21121, 7026, -13912, -5898, 6119, 3770, 4565, 11551, 2558, -12084, -4549, 13503, 16442, 4379, -9246, -14579, -717, 21260, 14557, -17714, -23870, 6110, 19142, 45, -10818, -778, 2721, -467, 5614, 5381, -7633, -11614, 3205]
770C205Q383o986q732o154j077J3922J2349j5382j9096J1679K1029n948j6830
783i638J334L586m894N702J4827m558j7550n37J1990M438k109l020o170J650J6627
798A1678M051k0437j0494J5909R966q705k998M926n193n277J1975M965j7264j0468
812a7366J2790J3751j005o416r613p165J0767J8088n126j8504K178J5922j186
825G115q326L932O12r824J649J5464J812j2917l399L740J259L883M865j1178j0753
840a2066J3488J5648j1556k0530K518J2513M797J022l406j3146l516J8407R937
853A4110j3928j0899P353N247k051M356K61j3688m741J6615R075j1814p996N355
867b745K452n28L941k657p653M288J0877o162j2313N495Q551n647j517J1128j935
$$ y = [3205, 11588, 4602, -4130, -10284, -11361, 2561, 14910, -472, -19568, -7889, 13140, 7192, -9638, -8304, -4718, -9612, -3910, 10917, 6359, -11191, -11728, 262, 4700, 2591, -429, -6599, -4949, 11678, 15729, -4708, -15202, 707, 10673, 1968, -1030, 3896, -1297, -6574, 5401, 10366, -6898, -17366, -4576, 9175, 8170, 1754, -7859, -15024, -4257, 13831, 8705, -9799, -7621, 8301, 7115, -1211, 2721, 3333, -6491, -4842, 10622, 12434, -483, -3882, -142, 1117, 5000, 9865, -1313, -12066, 1422, 17070, 5514, -15016, -12498, 15, 4812, 5834, 2428, -10718, -14234, 4173, 14110, 182, -10717, -3364, 1883, -168, 4188, 4449, -9239, -13980, 2635, 11710, -104, -8100, -2745, -293, -821, 3120, 463, -7190, -2902, 7975, 1813, -10500, -5005, 3546, -2101, -3618, 7510, 5575]
882E575j5941R65J6981L806j0915m907J186L649R837K337j5870j0801J4804J3842
896A4548r032r516O421K423o496L160M995p833m543J0876N029j0393l920O458
910B177K1l113N437l70j0261R32J3355r14j2619L57M561m023N69J2486k96j5925
926g626l121J2485L713n364m78l132m986O643J0935q494j4871P351J3644l070
940C629q631J840P36j190P002L049j2864o827J4226Q545j0530q685N734K346L1
955a589P041L9j2123k188J2545L461q365J221M471o483l684R604L184r491m78
970b835Q054j189m454L708J174p653L441J1953n489j5928M298J5442p84j0100
984c62k734O74J245Q755L138j3609p140J3121Q144j0908m939O071q81n594O472
$$ y = [5575, -10366, -9401, 7580, 11386, 471, -4436, -3250, 399, 10236, 12573, -3297, -14098, 706, 14548, 5516, -4000, 2421, 4844, -1652, 1508, 6503, -1330, -5873, 5003, 10032, -361, -4281, 2177, 2198, -915, 4522, 4152, -6109, -5177, 8178, 7264, -5355, -4998, -437, -4460, -3891, 8595, 8299, -7626, -10747, 1738, 5451, 87, -391, -3523, -8509, -1866, 9069, 575, -14296, -6945, 6699, 3629, -5002, -3162, -2426, -3616, 3386, 6435, -6429, -13256, 970, 9515, -1015, -9700, -3966, -1620, -1589, 5452, 5491, -6632, -8820, 3725, 7186, -1179, 42, 4513, -1970, -5654, 3950, 7134, -2357, -2835, 5219, 4030, -424, 3284, 4458, -3195, 246, 12199, 6710, -9218, -4920, 10522, 9738, -362, -3096, -2422, -1177, 7578, 10716, -2893, -10033, 3088, 11232, 324, -4615, 1456, 575, -5019, 1453]
999A453N851q441n724Q181J500p818K034O879m431n576N981K337p526N65P154
1014B419l298m465P541J840j1366r69J3637J687j3728k689P901J606j032K926
1028B010l254p315N747R444n256q650P051N089p862j791R269j459r994K718Q217
1043C964k453l163M241r30n971N811O775q183q159J0043P859p715n799L560o82
1058h02j634Q901K855j2769m940J2910O290q138k705J740m132M28J0252r00j2992
1073e636j142J1167Q18p521J711J431n473K925J0869m325j4119K045J2077k28
1087D599o553m73j518j671R946O862j2754j2866J0335J3284m621o717J282j558
1101b423k673P803M649r572o123P880M129n481J217L054o819l823J0077L521j1236
$$ y = [1453, 7304, -1137, -6861, 1320, 2820, -4998, -2964, 3915, -516, -6092, -111, 2226, -5300, -4735, 2419, -879, -5344, 2197, 4037, -7329, -8298, 5339, 7026, -6702, -9391, -1490, 116, -916, 2010, -1244, -8559, -2812, 6632, 1376, -7274, -223, 4866, -2996, -4787, 4482, 3023, -6971, -4253, 3964, 1511, -1652, 2589, 1659, -4312, 1499, 8274, 91, -8068, 1975, 9834, 2119, -3680, -120, -802, -2436, 6465, 9320, -3449, -8389, 4521, 10811, 2673, -32, 1708, -2424, -1996, 8256, 7356, -5636, -6778, 4389, 5207, -2314, -603, 828, -4645, -1720, 9149, 4824, -9295, -7250, 4827, 4599, -1954, -2427, -3945, -5616, 4330, 11192, -1562, -14428, -4093, 9191, 4570, -2147, -865, -2423, -5096, 2707, 7356, -2216, -8339, -459, 3670, -1811, -594, 2460, -4359, -8182, 1895, 5416, -5820]
1116e820l327J0267K560m875N31N81o518K838J1315j064j3270J81R055J30l770
1131a186K208k894o365O825J1026n453j1313M633P665n585l304O528J09o821K428
1146a499N253m421k274O684n01q010M814R186n980q665O581P077p051n488L783
1161e11N99j363O619R92j2748l637J2922N690q515l818L262j530O35Q138j469
1176E266j2249J36J1649N11p566K783L803n990r69Q163l80r482J889P372k643
1191B293l902L580j942p116N455J0274p055j3152N049J0805l20m222j699o477
1205h429j792J3806Q515j2863j1673Q898J0104l170l018m00m383J96J0078J814
1219G683j2172k967R575N80o197K718L540o101J08R146j567j1989K83J0612M42
$$ y = [-5820, -9147, 1120, 3680, -1195, -664, -83, -6601, -3763, 7552, 6488, -6782, -6601, 2454, 2584, -1186, 1022, -1872, -8237, -1412, 9614, 4161, -7152, -2519, 5146, -439, -3743, 2785, 2894, -3927, -1499, 3754, -667, -2941, 3743, 3242, -4768, 46, 9232, 3252, -5413, 1168, 8245, 1194, -4294, -511, 88, -1275, 5344, 6336, -6412, -10049, 2873, 8563, 48, -3770, -508, -2038, -1403, 6735, 5266, -6983, -6847, 4802, 5313, -2253, 530, 4333, -1657, -2626, 5537, 5157, -4325, -2436, 4936, 2293, -1609, 1971, 29, -7087, -1632, 8642, 1587, -11565, -6516, 4289, 3969, -253, -1952, -8429, -10221, 3585, 12100, -763, -12436, -3538, 6566, 3396, 378, -22, -4405, -4209, 5869, 7683, -4489, -7456, 2119, 2699, -3498, -780, 2760, -3341, -3233, 5913, 4346, -7643, -7360, 3252, 3694]
1234C694m727J767j025o104M763J1001m031j0643K687O988j216P72L434o889r252
1249h781Q267J0535p853r769N842P101n170k776K174k866j680Q302J009j0138
$$ y = [3694, -1033, 734, -291, -6395, -1632, 9369, 5338, -5305, -2618, 4370, 3154, 3926, 7360, 471, -8781, -514, 10021, 2168, -7601, -1759, 5342, 172, -2604, -430, -3296, -4976, 3326, 4335, -5803]
$$ [...]
8191e68
##END NTUPLES=NMR FID
##END=
