##TITLE=1H_CA-8570-3
 DMSO, 8 sc, 
 7.3.2019
##JCAMPDX= 6.0         $$ Bruker NMR JCAMP-DX V2.0
##DATA TYPE= NMR FID
##DATA CLASS= NTUPLES
##ORIGIN= UXNMR, Bruker Analytische Messtechnik GmbH
##OWNER= root
$$ XWIN-NMR		Version 3.5
$$ Thu Mar  7 16:44:10 2019 Russian Standard Time (UT+4h)  she@DPX200
##.OBSERVE FREQUENCY= 200.1316
##.OBSERVE NUCLEUS= ^1H
##.DELAY= (6, 6)
##.ACQUISITION MODE= SIMULTANEOUS
##.ACQUISITION SCHEME= undefined
##.AVERAGES= 8
##.DIGITISER RES= 18
##SPECTROMETER/DATA SYSTEM= spect
##.PULSE SEQUENCE= zg30
##.SOLVENT NAME= CDCl3
##.SHIFT REFERENCE= (INTERNAL, CDCl3, 0, 15.7039)
##AUDIT TRAIL= $$ (NUMBER, WHEN, WHO, WHERE, WHAT)
$$ ##TITLE= Audit trail, XWIN-NMR		Version 3.5
$$ ##JCAMPDX= 5.01
$$ ##ORIGIN= Bruker BioSpin GmbH
$$ ##OWNER= she
$$ F:/spectra/data/she/nmr/H-F/1/audita.txt
$$ ##AUDIT TRAIL=  $$ (NUMBER, WHEN, WHO, WHERE, WHAT)
(   1,<2019-03-07 16:43:05.03 +0400>,<she>,<DPX200>,
      <created by zg, POWCHK disabled, PULCHK disabled
       configuration hash MD5:
       00 E9 B6 7A A2 85 ED C7 34 08 36 98 17 FE 4E 26
       data hash MD5: 16K
       EE E8 24 DF 71 D0 2B 8F 2E 39 53 94 CB 35 56 A6>)
$$ ##END=
$$ 
$$ hash MD5
$$ 8D 83 13 08 53 34 97 1A AF 0E 17 BC 6B AC 33 AB
##$RELAX= 
##$RELAX= 
##$RELAX= 
##$RELAX= 
##$RELAX= 
##$RELAX= 
$$ Bruker specific parameters
$$ --------------------------
##$DU= <F:/spectra>
##$EXPNO= 1
##$NAME= <H-F>
##$PROCNO= 1
##$TYPE= <nmr>
##$USER= <she>
##$AMP= (0..31)
100 100 100 100 100 100 100 100 100 100 100 100 100 100 100 100 100 100 
100 100 100 100 100 100 100 100 100 100 100 100 100 100 
##$AQSEQ= 0
##$AQ_mod= 1
##$AUNM= <au_zg>
##$AUTOPOS= <>
##$BF1= 200.13
##$BF2= 200.13
##$BF3= 200.13
##$BF4= 200.13
##$BF5= 200.13
##$BF6= 200.13
##$BF7= 200.13
##$BF8= 200.13
##$BYTORDA= 1
##$CFDGTYP= 0
##$CFRGTYP= 5
##$CHEMSTR= <none>
##$CNST= (0..31)
1 1 145 1 1 1 1 1 1 1 1 1 1 1 1 1 1 1 1 1 1 1 1 1 1 1 1 1 1 1 1 1 
##$CPDPRG= <>
##$CPDPRG1= <>
##$CPDPRG2= <>
##$CPDPRG3= <>
##$CPDPRG4= <mlev>
##$CPDPRG5= <mlev>
##$CPDPRG6= <mlev>
##$CPDPRG7= <mlev>
##$CPDPRG8= <mlev>
##$CPDPRGB= <>
##$CPDPRGT= <>
##$D= (0..31)
0 1.2 0 0 0 0 0 0 0 0 0 0.03 0 0 0 0 0 0 0 0 0 0 0 0 0 0 0 0 0 0 0 0 
##$DATE= 1551962584
##$DBL= (0..7)
120 120 120 120 120 120 120 120 
##$DBP= (0..7)
150 150 150 150 150 150 150 150 
##$DBP07= 0
##$DBPNAM0= <>
##$DBPNAM1= <>
##$DBPNAM2= <>
##$DBPNAM3= <>
##$DBPNAM4= <>
##$DBPNAM5= <>
##$DBPNAM6= <>
##$DBPNAM7= <>
##$DBPOAL= (0..7)
0.5 0.5 0.5 0.5 0.5 0.5 0.5 0.5 
##$DBPOFFS= (0..7)
0 0 0 0 0 0 0 0 
##$DE= 6
##$DECBNUC= <off>
##$DECIM= 24
##$DECNUC= <off>
##$DECSTAT= 4
##$DIGMOD= 1
##$DIGTYP= 9
##$DL= (0..7)
0 120 120 120 120 120 120 120 
##$DP= (0..7)
150 150 150 150 150 150 150 150 
##$DP07= 0
##$DPNAME0= <>
##$DPNAME1= <>
##$DPNAME2= <>
##$DPNAME3= <>
##$DPNAME4= <>
##$DPNAME5= <>
##$DPNAME6= <>
##$DPNAME7= <>
##$DPOAL= (0..7)
0.5 0.5 0.5 0.5 0.5 0.5 0.5 0.5 
##$DPOFFS= (0..7)
0 0 0 0 0 0 0 0 
##$DQDMODE= 0
##$DR= 18
##$DS= 0
##$DSLIST= <SSSSSSSSSSSSSSS>
##$DSPFIRM= 0
$$ [...]
##$SUBNAM2= <"">
##$SUBNAM3= <"">
##$SUBNAM4= <"">
##$SUBNAM5= <"">
##$SUBNAM6= <"">
##$SUBNAM7= <"">
##$SUBNAM8= <"">
##$SUBNAM9= <"">
##$SW= 24.9336934301222
##$SWIBOX= (0..15)
0 0 2 0 0 0 0 0 0 0 0 0 0 0 0 0 
##$SW_h= 4990.01996007984
##$TD= 16384
##$TD0= 1
##$TE= 0
##$TE2= 300
##$TE3= 300
##$TEG= 300
##$TL= (0..7)
0 120 120 120 120 120 120 120 
##$TP= (0..7)
150 150 150 150 150 150 150 150 
##$TP07= 0
##$TPNAME0= <>
##$TPNAME1= <>
##$TPNAME2= <>
##$TPNAME3= <>
##$TPNAME4= <>
##$TPNAME5= <>
##$TPNAME6= <>
##$TPNAME7= <>
##$TPOAL= (0..7)
0.5 0.5 0.5 0.5 0.5 0.5 0.5 0.5 
##$TPOFFS= (0..7)
0 0 0 0 0 0 0 0 
##$TUNHIN= 0
##$TUNHOUT= 0
##$TUNXOUT= 0
##$USERA1= <user>
##$USERA2= <user>
##$USERA3= <user>
##$USERA4= <user>
##$USERA5= <user>
##$V9= 5
##$VALIST= <valist>
##$VCLIST= <CCCCCCCCCCCCCCC>
##$VD= 0
##$VDLIST= <DDDDDDDDDDDDDDD>
##$VPLIST= <PPPPPPPPPPPPPPP>
##$VTLIST= <TTTTTTTTTTTTTTT>
##$WBST= 1024
##$WBSW= 4
##$XGAIN= (0..3)
0 0 0 0 
##$XL= 0
##$YL= 0
##$YMAX_a= 108652
##$YMIN_a= -151737
##$ZGOPTNS= <>
##$ZL1= 120
##$ZL2= 120
##$ZL3= 120
##$ZL4= 120
##$ABSF1= 10
##$ABSF2= 0
##$ABSG= 5
##$ABSL= 3
##$ALPHA= 0
##$AQORDER= 0
##$ASSFAC= 0
##$ASSFACI= 0
##$ASSFACX= 0
##$ASSWID= 0
##$AUNMP= <proc_1d>
##$AZFE= 0.1
##$AZFW= 0.1
##$BCFW= 1
##$BC_mod= 2
##$BYTORDP= 1
##$COROFFS= 0
##$CY= 11.3945322036743
##$DATMOD= 1
##$DC= 2
##$DFILT= <>
##$DTYPP= 0
##$F1P= 18.9103706918063
##$F2P= -1.10871071338519
##$FCOR= 0.5
##$FTSIZE= 0
##$FT_mod= 4
##$GAMMA= 1
##$GB= 0.15
##$INTBC= 1
##$INTSCL= 1
##$ISEN= 128
##$LB= 0.24
##$LEV0= 0
##$LPBIN= 0
##$MAXI= 10000
##$MC2= 0
##$MEAN= 0
##$ME_mod= 0
##$MI= 1.114404
##$NCOEF= 0
##$NC_proc= 0
##$NLEV= 6
##$NOISF1= 3.799351
##$NOISF2= 2.8
##$NSP= 1
##$NTH_PI= 0
##$NZP= 0
##$OFFSET= 15.70392
##$PC= 1
##$PHC0= -8861.681
##$PHC1= 10.20014
##$PH_mod= 1
##$PKNL= yes
##$PPARMOD= 0
##$PSCAL= 0
##$PSIGN= 0
##$REVERSE= no
##$SF= 200.130013532006
##$SI= 16384
##$SIGF1= 3
##$SIGF2= 2
##$SINO= 400
##$SIOLD= 16384
##$SREGLST= <1H.CDCl3>
##$SSB= 0
##$STSI= 0
##$STSR= 0
##$SW_p= 3612.71676300578
##$SYMM= 0
##$S_DEV= 0
##$TDeff= 0
##$TDoff= 0
##$TI= <>
##$TILT= no
##$TM1= 0
##$TM2= 0
##$TOPLEV= 0
##$USERP1= <user>
##$USERP2= <user>
##$USERP3= <user>
##$USERP4= <user>
##$USERP5= <user>
##$WDW= 1
##$XDIM= 8192
##$YMAX_p= 0
##$YMIN_p= 0
$$ End of Bruker specific parameters
$$ ---------------------------------
##NTUPLES= NMR FID
##VAR_NAME=  TIME,          FID/REAL,        FID/IMAG
##SYMBOL=    X,             R,               I
##VAR_TYPE=  INDEPENDENT,   DEPENDENT,       DEPENDENT
##VAR_FORM=  AFFN,          ASDF,            ASDF
##VAR_DIM=   8192,          8192,            8192
##UNITS=     SECONDS,       ARBITRARY UNITS, ARBITRARY UNITS
##FACTOR=    0.0002004,     1,               1
##FIRST=     0,             0,               0
##LAST=      1.6414764,     0,               0
##MIN=       0,             -151737,         0
##MAX=       1.6414764,     108652,          0
$$ Real data points
##PAGE= N=1
##DATA TABLE= (X++(R..R)), XYDATA
0@%%%%%%%%Qj6J6j6J6k3L1l2M0m9N7p1Q1r2J08j27J47j68J93k18K45k81L19l56
32a88M00m50N02n60O24o92P68q52R44j046J159j283J420j575J750j945K168k426
50a282K727l086L521m059M746n660O946q905J2280j9698O6895o2665j32600R3941
64d6899J27978J5809j14266o6105L1284P6911K5192k4729m8199k1335J7756M9209
76B2606K8793j8703n5264l1114L0086P1770K5496o4586q9985N806J06102P0332
88A01339p0176j20759o817J18067Q1231n7918j08018j4637Q3150O7061k2987o7037
100a7501l2262K5418M4391K0592j8156m0885k9811J4708N4383L7579l4928p8118
112e4590j9064P9964Q1155l0407j06506l7392Q2363Q7967k1956r3260m2280M8740
$$ y = [0, 0, 0, 0, 0, 0, 0, 0, 0, 8, -8, 8, -8, 8, -15, 16, -16, 24, -25, 32, -39, 42, -50, 58, -69, 78, -90, 103, -115, 130, -151, 168, -188, 212, -238, 264, -296, 328, -364, 404, -448, 496, -550, 609, -674, 746, -829, 921, -1024, 1144, -1282, 1445, -1641, 1880, -2179, 2567, -3093, 3853, -5052, 7228, -12470, 54425, -8240, -140840, -46899, 81079, 96888, -17378, -83483, -52199, 24712, 49904, 25175, -23024, -44359, -26603, 22606, 51399, 32696, -22568, -53682, -23596, 48174, 73670, 9084, -80901, -75095, 31007, 101339, 31163, -89596, -96413, 21654, 102885, 44967, -63051, -77688, 5462, 72523, 49536, -17501, -49763, -24345, 20046, 40638, 22482, -18403, -48214, -33506, 20877, 58456, 23528, -54590, -73654, 6310, 87465, 57058, -49448, -86840, -4477, 83490, 61534, -31726, -74006, -25266]
124b5266O8634R418n0305n1280J582M8873M2867r380m8799l2986J8778N1170L0178
137E3484k4529n9225k8121M4990P2667L245q2191o3932M4337R5033J5668q1794
149a0368o4697L4244P6688K1297m4731m5994k145L3472L5095O317l1729m2194
161c4745n604M4007M4259j2266o0596l6845L5014O9355J7308o1234o4170J8238
173d7279Q1363L9120n3381p4300K035O9148M3025l1410n7675j5999L3042L8447
185B6136O026k7289l3767p734K9563M0417N505m2216m3057J1958O0240L5688l9136
198B2334o9930r919O7634N5759l0877p6455k1657N7022N6194j3200n5621k6479
210d5195K5404M0674J5189k0622l4123j4131K2671L8924J0423l4804m3136J232
$$ y = [-25266, 43368, 52786, 2481, -48799, -47217, 1656, 44523, 35143, -13656, -46642, -27864, 23306, 53484, 28955, -30270, -58391, -13401, 59266, 62511, -19680, -83612, -39275, 55758, 71426, -10368, -75065, -40821, 35867, 57164, 12433, -33561, -35706, -2234, 32861, 39178, 7449, -34745, -40349, 3658, 47917, 35651, -24945, -61790, -26776, 42579, 59887, -1347, -65517, -47279, 34084, 73204, 19823, -54477, -52442, 16706, 59731, 28321, -29354, -45353, -12311, 26136, 32162, 4873, -28894, -36628, -7065, 33352, 38857, -3359, -46416, -34458, 25782, 61470, 22334, -47596, -57515, 10119, 65878, 35001, -41454, -63111, -6089, 50105, 36905, -18716, -45195, -19791, 20883, 36072, 15450, -18673, -32804, -10133, 28791, 39214, 4410, -38726, -37494]
222c7494M7292L7795k1196n8575k3038M4548N8566k564o2210l9772L4344O1391
234C9087J0320m8736m1224J2374M2300K1113j6927l2646j8167J3541L4640J9238
246C4913k2527m2903j0753M0281M4470q135n2752l1559L1395N6157R886m9920
258a447m6386J5895N5069K2441l5525m4701o31L7033K8134p815k9502k0542P487
271b0490L0082K3555j1431l8792k0482K6406M5086O003m4523m1253J5636N3821
283B3618K2802l7345n0180J006N0135L4121k2456m6683j0941L2400L2650k648
295B6479k7948k1620L033K3052K1686k711k9989k6686J2731M1890J8879l1072
307G724m4567Q68M6892L4210k2270n0111j4213L9788M1446q800m4983k3970K3504
$$ y = [-37494, 9798, 47593, 26397, -32178, -55216, -10668, 47898, 45334, -16876, -56648, -22304, 39087, 49407, 671, -40553, -28179, 14121, 35234, 18307, -14339, -32506, -18965, 15675, 34913, 12386, -30517, -41270, -989, 43481, 35346, -17406, -48965, -17570, 38587, 48473, -1447, -47833, -31938, 23131, 45572, 10047, -34654, -35285, 1748, 29882, 22067, -7435, -27977, -20490, 9592, 33147, 21716, -17076, -37558, -11152, 33934, 39937, -4586, -45839, -30203, 23618, 46420, 9075, -41105, -40099, 10036, 44157, 21701, -24982, -35923, -3523, 29127, 26479, -1469, -23089, -20056, 2996, 24682, 21971, -8018, -34704, -21973, 19917, 38796, 7724, -36843, -35975, 10917, 45127, 22857, -27254, -41467, -1679, 39767, 30967, -14016, -37986, -14482]
320a4482L6733N961k5621k5464m5K1591K1571J221k2148k5201K841L3637K5716
333C6310j7456m2692j3781L5779M0429q080m7139k5880K7838M3752N340l8158
345c738l1377J2174L7909J5733k0031k8544n226J9623K1774L758j8052k4167l567
358b3731K5003K7278o293l6723k2635K3474M1319O113l7943l3445J4576M3367
370B0360J7105k9460l6159J065L3782K2906j3150k9695j1843J5504K3286P204
382B0905j5193k2225o798J8844K6520K275k8019k6921J1144L8518J6371k7698
394G723l8016J366L8086K5656j8960l7805r308K8162K8288m086k8213j7356J1155
407a3308K3663J0932j1115k1012r932J3110K4255Q086k1511k7863O08L2258K3444
$$ y = [-14482, 22251, 28212, 2591, -22873, -22918, -1327, 20244, 21465, -683, -25884, -23043, 10594, 36310, 18854, -23838, -37619, -1840, 38589, 30509, -16630, -42510, -14672, 29080, 34420, -3738, -35115, -22941, 14968, 30701, 10670, -17874, -23100, -3477, 18297, 22055, 4003, -20164, -23731, 1272, 28550, 22257, -14466, -37101, -13627, 27692, 33805, -4138, -37583, -23007, 20360, 37465, 8005, -28154, -27089, 6693, 29599, 16449, -13246, -25089, -9585, 13701, 20905, 5712, -16513, -23311, -4467, 22053, 24328, -3691, -30612, -19468, 19050, 35421, 7723, -30293, -28927, 9159, 34815, 15855, -21950, -31258, -3096, 25192, 21106, -7107, -24463, -13308, 10355, 21287, 10172, -10840, -20772, -7662, 16593, 24679, 3168, -24695, -24087, 8171, 31615]
420C1615j6733l7354j0012L0460L2206o859l6338j7981K0560L2096L578k5107
432A31k1660M756K2650J4520q101k0385j2104Q603K1907J1655j4508k5952o353
445b4841K4614K6866n523l2870j8816K0979L3752L505l0788k5133J0547L1481
457A3773J2484j9941k5441j708K1005J8364l343j9723j3812N390J9496J4111q296
470A2359k3693j2037J7554K6426K631k6625k4139J0269L2083J3370k3312k9162
482b4276J252K8840J9575j2116k6632q538J7032K1490J736j7789j6961J603J7610
495B826J5259m796k0647j3974J0056K5149R090j9634k5415J543K7718J9572j3888
508A2859k9527p140K2436K3541l948k5056j5048J1320K1797P458j4079j8349l619
$$ y = [31615, 14882, -22472, -32484, -2024, 30182, 23323, -13015, -30996, -10436, 21660, 25238, 131, -21529, -16773, 5877, 20397, 12296, -8089, -20193, -11590, 10317, 21972, 7464, -18488, -24841, -227, 26639, 21116, -11754, -30570, -9591, 24161, 27666, -3122, -28255, -17708, 13773, 26257, 6316, -19125, -20833, 172, 18536, 15193, -4530, -18342, -12952, 6544, 20655, 12359, -11334, -23371, -5817, 20609, 23240, -3385, -27524, -17255, 14828, 28198, 4886, -24276, -23024, 5816, 25391, 13275, -13357, -21895, -4863, 16627, 18363, 574, -16387, -14784, 2826, 18085, 13289, -7358, -21332, -11276, 13873, 22963, 3329, -22086, -20543, 7175, 26747, 12859, -16668, -23808, -1372, 22169, 18221, -6835, -21883, -10563, 11234, 18692, 4613, -13736, -17355]
521a7355J5424J7625j04j8059j6729N531K2820J3765j4095k5580n475K2939K2239
534B2946o289k7181j3915J6539K4630K828k0863j8183N263K1049J1607r451j8479
547i499p047J1599J7232M137j4266j7311o37J8185J7369o296k4200j2377J6238
560f873K5577J613k4177j9404J0216K5974Q865j7658k0909Q01J9280J3769n919
573A1155j7395r208P689J5662P499r912j6973m634J4094J8045o49j9522j5284
586a9433P835K3617R791j7396k2994O93K3424J6263j1304k3814o560J7316J8534
599A5972k102j7354j2238O356J5471Q775p642j4874o639R339J5993M661j4465
612A253j7291J548K0016J3744j0369k2292o168J8178J9476l572k1035j2209J0656
$$ y = [-17355, -1931, 15694, 15590, -2469, -19198, -13667, 9153, 22918, 8823, -16757, -22232, 707, 22946, 16657, -10524, -24439, -7900, 16730, 19558, -1305, -19488, -14225, 6824, 18431, 8980, -9499, -16546, -4947, 12285, 16422, 2156, -15155, -15792, 2393, 19762, 13466, -10734, -23111, -6873, 18704, 20317, -3860, -23264, -13048, 12926, 21791, 4133, -16776, -15975, 3305, 17074, 11155, -6240, -15448, -7759, 7903, 15402, 5490, -11483, -16117, -2023, 16022, 15373, -4149, -19433, -11598, 12019, 21810, 4414, -18580, -17887, 5537, 21800, 10496, -13318, -19878, -2562, 15972, 13870, -3484, -15722, -9366, 6105, 14880, 7238, -7636, -14275, -4936, 11057, 15718, 1253, -16038, -14490, 5526, 19270, 8901, -13391, -19559, -1381, 18095, 14523, -6512, -18721, -8065]
625h065J9910N090j4481j6453O70J6086J2039m889j6204q932Q369J6050N270j1334
639C126j5779j442J5263J4890l573j9781j1020J1523K0796L456j8368j6489N461
652a1937J9356Q963j0856j6501l186J2422J3508M3j3420j2001L324J5705R960
665A5380q269j7040n736J3376J6172p87j6959j2657O932J8413P473j2432j7403
678a3537o82J5907J3801n560j7182p474J0058J5421K273j2144j1982N29J2186
691A614J0687l733j3637r144P318J6005N835j2887j6294R09J8106J2411r087j8734
705a0631m745J4010J5004j792j5330j0457O101J4880O252r120j3688k748J1813
718d51J1705j196j3081r487N218J3705O162p667j3702m026J1952J3345j089j5697
$$ y = [-8065, 11845, 16935, 2454, -13999, -13329, 2757, 14796, 9907, -6297, -15229, -6860, 9190, 14460, 3126, -12653, -14095, 1168, 16058, 12485, -7296, -18316, -6793, 14003, 17459, -909, -17398, -11937, 7419, 16382, 5526, -10975, -14161, -1739, 11769, 11812, -1608, -13609, -10285, 5420, 15380, 7111, -9929, -15665, -2289, 13883, 13096, -3863, -16520, -9588, 8825, 16298, 3866, -13537, -14219, 1688, 15489, 9929, -7253, -14727, -4669, 10752, 13025, 881, -11101, -10572, 1614, 12301, 8568, -5069, -14213, -6895, 9110, 14945, 2058, -14236, -13327, 4779, 17190, 8103, -10631, -15376, -1366, 13638, 11846, -3484, -13941, -7840, 7040, 13292, 4172, -9516, -12264, -451, 11254, 10058, -3023, -12510, -7292, 6413, 12575, 4908, -8794, -12820, -868, 12477, 11388, -4309]
732d309j0975P618J7402N273j3964j4724K467J5699R493p277j4002n212R543J2547
746I579J453j0964j1288J915J3028Q541n802j3588n212R222J2832J114j1767j0573
760a1510K608J3766Q208p289j4105m249J0890J3666j010j4712r712O431J4743
773G725N099j0363j2987m12J2182J0460l705j2836o918O684J2383M111r813j1808
787a0198P1J2194R449m529j2492o357P840J2371K193j0381j0626J156J2115R348
801A2154n362j3565n690R599J3402M99j3097j0104M660J3388N520p601j1996k294
815a0487R880J0244q31j1571p925M612J1810N398q317j1161j185J0256Q987j979
829G731j1188p167M877J2098M749r104j1548j3J1586R353m654j2740n187Q157
$$ y = [-4309, -15284, -7666, 9736, 15009, 1045, -13679, -11212, 4487, 13980, 6703, -7299, -12511, -2968, 9579, 11032, 68, -11220, -9305, 3723, 12264, 6462, -7126, -12338, -3116, 9716, 10830, -937, -11510, -8902, 4864, 13072, 5783, -8322, -12571, -1681, 11985, 10975, -3737, -13449, -7018, 7725, 12824, 2461, -10526, -10938, 1244, 11704, 7999, -4837, -11755, -5071, 7312, 11423, 1610, -10198, -10127, 2067, 11516, 6987, -5505, -11862, -4022, 8349, 10542, 161, -10465, -9309, 2806, 12154, 6792, -6773, -12463, -2864, 10538, 11037, -2060, -12164, -7504, 5884, 11404, 3803, -8193, -10487, -607, 9637, 8806, -2765, -10690, -6078, 5732, 11130, 2813, -8348, -9533, 723, 9710, 7731, -3457, -10624, -5747, 6351, 11100, 1996, -9552, -9565, 2021, 11374, 6720, -6020, -11207, -3050]
843c050J1749R85j0056r447K411J0961O558n302j0868m000P853J0315O02j0019
857a308q354K862J1257O186o360j1359k832R082J0324j044j1370p548M551J1731
871E818M518p641j1025n60R980Q490k714j0562o165N582J0905K902q000r861L50
886g983R536P711l084j0959n259O663J0971J603r370q838J666J0424O292m902
900D471j0163l531P480R559N72r368q162K686J0201N599n853j0135k295Q081R112
915H254o64r653p016L683R971M667o620r822j272R006Q149k467r965n404N315
930c838R724K469o943q869k70R562O615l177r437m641N980R495J518p991q166
945g969J245R170O542m285r854l606P049Q734K89q263p679K889R494M437m921
$$ y = [-3050, 8699, 9684, -372, -9819, -7408, 3553, 10111, 4809, -6059, -10059, -2206, 8109, 8711, -1308, -9662, -6800, 4457, 10643, 4283, -7076, -9908, -826, 9498, 8454, -2916, -10464, -5913, 5818, 10336, 2695, -8330, -8890, 1090, 9580, 6866, -3696, -9861, -4279, 6626, 9528, 1528, -8333, -7983, 1553, 9264, 6180, -4779, -10038, -3375, 7596, 9199, -171, -9009, -7343, 3081, 9373, 4471, -5692, -9223, -1743, 7816, 8388, -980, -9142, -6456, 3745, 9344, 3491, -6644, -8939, -858, 8254, 7590, -2063, -9079, -5396, 4575, 9242, 2622, -7200, -8472, 534, 8683, 6216, -3749, -9153, -3838, 5886, 8355, 1412, -7457, -7727, 1835, 8450, 5273, -4164, -8805, -2825, 6670, 8188, 197, -7969, -6724, 2446, 8988, 4703, -5151, -8757, -1708, 7026, 7315, -948, -8627, -5738, 3756, 8193, 3272]
960C272r238k185P274Q535q51r034o107L677R018L917n935q675j225P601P710
975G754j775r030n230M246R489K628o883p946J48Q102O384l242q479m253N240
990b847Q576J521p311p608J581Q592N409m054q721l013O301P989L55p506o511
1005g247K091Q375M504m635q368k310O952P687p21p940n879L225Q059L822n272
1020B343q324q96P414O501j658p908n247M266Q594K013o190p433M83P159O259
1035G376k954p855m103N125P879J095o483o517J017P452N226l878p736k532N176
1050a712P770L08p226o202K284P812M025m097q197j494N995O937o50p131n671
1065g249L221P908L180n091p601l87O243N956j448p143m272L868P339K305n536
$$ y = [3272, -5966, -8151, -877, 7658, 6807, -2227, -8334, -4657, 4361, 8278, 2343, -6332, -7557, 44, 7754, 5979, -3051, -8281, -4035, 5454, 8082, 1199, -6747, -6599, 1503, 7887, 4645, -3834, -8087, -2847, 5729, 7250, -61, -7669, -6088, 2504, 7913, 3859, -4862, -7875, -1574, 6415, 6770, -736, -7247, -5156, 3219, 7723, 3088, -5280, -7590, -638, 7049, 6328, -1612, -7491, -4266, 3793, 7615, 2343, -5981, -6877, 537, 7038, 5380, -2528, -7775, -3509, 5085, 7098, 908, -6525, -6042, 1117, 7376, 4422, -3433, -7536, -2411, 5468, 6563, 80, -6437, -5420, 2032, 7258, 3380, -4356, -6888, -1712, 6058, 6366, -860, -7062, -4778, 3034, 7059, 2962, -5235, -6729, -734, 6203, 5553, -1578, -7249, -4028, 3880, 7060, 1969, -5632, -6019, 224, 6180, 4732, -2411, -6683, -2815, 4524, 6829, 1293]
1080A293p163J57O737N653k430p249l831M360P505J144n825o629J118P105M761
1095F706l274p581k369N130O754K23o262n575J995P065L467l735p133j304N253
1110f40O457p07o683m625K548O993K790m318o818o87N805O003j444p206l890L448
1126b974O811K207n170o191K22O072N012k395o554l076L770O532J425n507n609
1141e425P47O151M471k688o600k718M498O324O39o007n471K134O519L782l697
1156B659o854j477N294N599l36o151m433K424O068K937l961o084q65N398N299
1171E517j438o135l754L204O280J899m796n976K17O367L912j712o489k858M062
1186a700N720J096m888n116N03N810M080k500n945k508M262N443O60n468m916
$$ y = [1293, -5870, -5713, 1024, 6677, 4247, -3002, -6833, -2473, 5032, 6176, 351, -6278, -5160, 1945, 6706, 3432, -4149, -6518, -1388, 5366, 5589, -673, -6248, -4253, 2812, 6279, 2544, -4589, -5893, -640, 5817, 5110, -1573, -6198, -3650, 3343, 6133, 1815, -5003, -5690, 115, 6118, 4674, -2532, -6422, -2974, 3837, 6044, 874, -5317, -5095, 977, 5989, 3594, -2960, -6036, -2266, 4266, 5691, 184, -5425, -4678, 1473, 5944, 3256, -3344, -6062, -1564, 4760, 5399, -608, -6079, -3945, 2574, 6356, 2659, -4195, -5672, -378, 5221, 4885, -1266, -5699, -3275, 2793, 5730, 1769, -4315, -5180, 218, 5517, 4079, -2056, -5810, -2606, 3674, 5573, 777, -5199, -4982, 1385, 5297, 3585, -2904, -5762, -1700, 4020, 5116, 228, -4888, -4385, 1425, 5505, 3005, -2940, -5448, -1186, 4257, 4917, -551, -5467]
1201e467J451O093L563l268o280j622N557M892o06n660m251K816N810K406m079
1216A355n089r26M649M751p21n870l555K981N471K082m073n412j33N229M434j685
1232C488n723l064L464N943R07n025m735P47N986L189k913n394j511L824M550
1247C733L33m635l794R64N413K799k748n300j573M101N023l8m998m455K106N490
1263B421K513l388n695m49M702M921j636n265l010K884N067J139l450m814L10
1278c750M673L354j479m864k398K971M640J141l982m611P82M724L449k121n386
1293b857j899L546N080R6m690l556R25N189K569k529n000j071L414M863o03m520
1309a043l461K046M868J931l227m477p57M228L726p97m237l179K212M942J576
$$ y = [-5467, -4016, 2077, 5640, 2372, -3908, -5530, 27, 4919, 4313, -1347, -5598, -2782, 3028, 5434, 1355, -3734, -4660, -11, 4740, 4019, -1851, -5406, -2425, 3046, 5128, 1055, -4357, -4490, 739, 5173, 3488, -2235, -5299, -1835, 4108, 5015, -10, -4745, -3998, 1988, 5177, 2264, -3130, -4641, -817, 3733, 4066, -569, -4363, -3399, 2014, 4813, 2065, -3235, -4808, -707, 4316, 4278, -720, -5175, -3069, 2421, 4934, 1546, -4149, -4598, 104, 5025, 3389, -1876, -4886, -2002, 3065, 4204, 754, -4060, -3750, 923, 4277, 2798, -2066, -4464, -1493, 3147, 4288, 306, -4305, -3523, 1201, 4650, 2529, -2857, -4756, -1210, 3870, 3966, -724, -4280, -3355, 1834, 4403, 1874, -3126, -4197, -783, 4080, 3477, -1043, -4504, -2458, 2410, 4341, 1114, -3363, -4120, 108, 3834, 3037, -1200, -4379, -2167, 2775, 4351]
1324D351l697m367j1M681L197j551m326k248K437M570J073l412m570M38M606L168
1340D339k215m602k048L265M803m6m019l644J597M325K557k525m585j017L499
1355c16M006k17m183l520J650M532K048k437m248r81L845L501l72m649k756K156
1371a941M443J789l415m697J12M462L091j406m418j533K366L949O97l254l446
1386c201M87L809K853j657m117j739K375M298L85m389k829N59M798K437k541m302
1402b774m65K731M056n33l787l001J511M134J893k829l757o13L571L129p31l887
1418a352k086J564L913J603k804m063j78M075K977j033m292j925K390L957K66
1433C012l159k873K19L844K243j299m005j317K644L296K83k728l590R84L616K918
$$ y = [4351, 654, -3713, -3724, 957, 4154, 2603, -1723, -3971, -1534, 3036, 4109, 697, -3873, -3435, 1171, 4339, 2124, -2478, -4526, -1261, 3542, 3496, -523, -4167, -2570, 1755, 4312, 1787, -2798, -3815, -316, 3690, 3473, -710, -4230, -2580, 1952, 4000, 1563, -2685, -3666, 179, 3680, 3308, -1341, -4097, -1941, 2502, 4291, 876, -3821, -3709, 753, 3844, 2438, -1980, -3513, -1147, 2802, 3499, 245, -3201, -2714, 1095, 3948, 2291, -1826, -3565, -1190, 3108, 3493, -896, -3725, -3166, 1632, 4069, 1528, -2774, -3239, -508, 3548, 3015, -772, -3773, -2262, 1872, 3765, 936, -2821, -3434, 137, 3266, 2535, -1352, -3438, -1874, 2039, 3642, 838, -3225, -3403, 672, 3649, 2616, -1676, -3601, -1211, 2746, 3012, -147, -3020, -2801, 1043, 3286, 1987, -2018, -3335, -691, 2605, 2888, 160, -3430, -2446, 1170, 4088]
1449D088k341m026j290L152L577k37l594l011J684M066J287k774l180j08K763
1464E6L037q54l558j658J626L144J402k583l207l54K924L220o74l944k190K301
1480a312L576J054l222l664J080L803J959j678l482j276K361L400P7l075k585
1495b984R06L366J654j779l407o50K344L297m20k778k477Q32L450K033k281l639
1511b533o42L184L561j392l448j511J577K978J015k656k754K53K848K303r29l207
1527a353j523J883L196N96k536k937l5L237K290j008l798j171K445L244l6k705
1543b11k558R04L203J634j904l078l08K000L062n28k866k254J247K972J454j992
1559G77k716o79K615K550m01k876k474J849K920J234k435k624p7L163J758r58
$$ y = [4088, 1747, -2279, -3569, -417, 3160, 2923, -671, -3682, -1998, 2068, 3355, 581, -2599, -2707, 56, 3093, 2239, -1319, -2977, -1351, 1793, 3195, 612, -2595, -2949, -25, 3195, 2521, -1423, -3613, -1312, 2264, 3318, 96, -3568, -2488, 1315, 3274, 1596, -1886, -3162, -801, 2599, 2676, -399, -2984, -2078, 1288, 2942, 1163, -2244, -2894, -550, 2747, 2327, -451, -2928, -2096, 1354, 3387, 1106, -2533, -3175, 9, 3570, 2178, -1270, -2781, -1204, 1774, 2789, 133, -2621, -2368, 480, 2783, 1854, -1353, -2876, -993, 2203, 2799, 263, -2674, -2709, 528, 2818, 1810, -1988, -3159, -714, 2530, 2494, -211, -2769, -1865, 1338, 2972, 1068, -2010, -2318, -318, 2744, 2216, -650, -2904, -1657, 1315, 2769, 777, -1939, -2618, -3, 2547, 2146, -730, -3204, -1355, 1565, 2799, 364, -2260, -2337, 826, 2584, 1626]
1575A626k947j362J747L204J51k360k287M01K508J965j256k832r61J627K601P49
1591B574k570k647Q55K788J896j758k811r16K340K732l43k784k027J160L197J013
1607B699k004k792k35K420K413p18k627j549J217K867Q06j977k559k66K549K151
1623B395o01l140j377J428L619K45k438k351K91K785J787j250k934p40J685K593
1639A997P7k019k307L35L032J256j482k825n48K212K400l60k266j800J099K828
1655A629N10j474k331n81K429K275q47k411j269J086K093J141j809k301K78J909
1671C27K034o86k618j345J267L006j9j885k079P8K615J571j130k664n31J566K331
1688A838J64k329j969J075K465J162j602k382o21K016K302l43k294j775R32K461
$$ y = [1626, -1321, -2683, -936, 2268, 2419, 59, -2228, -1827, 681, 2646, 1390, -1442, -2403, -776, 1825, 2574, 4, -2643, -1788, 1000, 2896, 1138, -1673, -2589, -249, 2483, 2140, -644, -2671, -1511, 1686, 2699, 695, -2097, -2332, 88, 2501, 1783, -844, -2393, -1176, 1691, 2497, 520, -2039, -2305, 244, 2395, 1794, -1346, -2723, -1295, 2324, 2569, 131, -2220, -1929, 856, 2643, 1393, -1541, -2281, -596, 1997, 2074, 55, -2252, -1917, 1115, 2371, 889, -1936, -2484, -272, 2128, 1768, -498, -2298, -1199, 1629, 2139, 665, -1666, -2247, 182, 2457, 1610, -801, -2070, -984, 1109, 2250, 441, -1860, -1582, 327, 2361, 1675, -943, -2288, -1021, 1985, 1966, 81, -1998, -1920, 695, 2266, 1136, -1528, -2059, -493, 1838, 2002, -327, -2296, -1221, 1244, 2406, 804, -1578, -2199, -183, 2119, 1776, -518, -2293, -1361, 1100]
1704A100J355j948k120n03K382J830m46k355j635J105K621P71j842k400J43K664
1720G22J232o68k319j071J067K714K82j818j667j24K363J442j057k346r14K071
1736i1J649M65k265j727K69K513J241j243k300m58J791J840J41k297j214O35K181
1753A130Q29j425k182J70J248K119o08k059j364R30K404R47j780k033O0K226J498
1770B110r27k287q70J092K372J50j477k143P13J903J361j047j722j023J503J757
1786A465K72k002j364O19J984O77j025j905m35J283J981K27k291j171R29J775
1802A019J061j445j899m79J608J658rk203j048J036K016O25j629j840J57J683
1818C11J657q43k178p32J051K004J66j179j716P4J797J151m51k217l54J193J781
$$ y = [1100, 2455, 507, -1613, -2116, 266, 2096, 1650, -705, -2340, -1235, 1386, 2157, 315, -2085, -1942, 722, 1954, 1286, -1033, -2104, -1037, 1677, 1959, 141, -1526, -1650, 713, 2155, 1098, -1248, -2162, -91, 1558, 2023, -242, -1969, -1700, 813, 2054, 811, -1489, -1947, -156, 1684, 1825, -472, -1686, -1051, 1130, 1959, 534, -1648, -1478, -230, 1889, 1281, -778, -2142, -1212, 1192, 2139, 359, -1674, -1614, 612, 2110, 1183, -1104, -1974, -882, 1490, 1640, 163, -1980, -1267, 636, 1997, 950, -772, -1795, -292, 1465, 1737, -265, -1629, -1010, 974, 1651, 626, -1279, -1714, -431, 1550, 1777, -514, -1685, -756, 1019, 2080, 635, -1264, -1743, -135, 1523, 1514, -689, -1737, -701, 1315, 1940, 311, -1529, -1372, 311, 1968, 1125, -1053, -1785, -734, 1270, 1436, 257, -1459, -1385, 412, 1563, 1112, -1105, -1459, -266, 1515]
1835A515Q8j845j325J72J957J178j043j844n36J596J702k49j626j275N26J586
1851E77R66j149j708l2J402J393k42j927q22R07J452Q32j433j431k36J853Q67
1868A269j74k018r00J526J745o5j568j448N02J797R85o85j930n45J005J577K39
1885A312j527j240Q7J968J155j146j699o35J740J488j29j416j269O96J100J168
1901A653j509j423j93J808J003j36j906q59P29J947M85j470j407j09J760J010
1917A383k64j944p77R22J792K09j500j203J77J605Q15n83j749k64J026J732k56
1934A121j394j293K60J794Q51r12j544l90J031J662j7j728p92L37J789P96j263
1951C08j567j16J447J359o52j138j377J109J309J042j431j657J91J495J274p11
$$ y = [1515, 1603, -242, -1567, -1395, 562, 1740, 697, -1147, -1683, -87, 1615, 1366, -260, -1535, -1009, 577, 1543, 394, -1314, -1346, 56, 1449, 1207, -720, -1542, -635, 817, 1649, 216, -1215, -1451, 402, 1269, 1095, -923, -1823, -297, 1448, 1383, -185, -1633, -1131, 666, 1651, 966, -964, -1509, -504, 1073, 1312, -215, -1455, -1368, 600, 1755, 609, -1090, -1725, 15, 1503, 1374, -42, -1311, -615, 485, 1653, 144, -1279, -1472, 336, 1339, 1203, -703, -1562, -833, 1114, 1599, 129, -1278, -1387, 373, 1383, 1119, -825, -1602, -680, 1112, 1321, -179, -1382, -1205, 400, 1215, 632, -1117, -1381, -355, 1377, 1121, -273, -1566, -1306, 488, 1339, 427, -1117, -1507, -476, 1186, 1169, -559, -1351, -1014, 775, 1571, 308, -1259, -1375, 72, 1431, 779, -359, -1736, -627, 682, 1724, 293, -1364, -1173, 322, 1596, 885]
1967H85j545n31O53J436O66j282j504J44J391Q93j57j804m74O97J580L67j726
1984c11j237O56J379J008q60j616L6Q78J282m3j592r31L42J832Q14j343j402K08
2002i00Q85J178kj390j174Q57J185P75j205j279N7J120J151k57j916n03J215J424
2020A221J61j567q32Q0J250O82m08j479m10J225J035N3j099q94J02J425P50p16
2038E79j553k24R69J574k27j331q81L12J375N95j090j330N63J007N89m03q30r85
2056a291Q76J092K5m29j276K92M59J413l35j542l98N31J502K79j377j019J25J579
2074E06P41r22j401J88Q78Q36J90j497n02K84R88R37p78j055l86R87R22O8j132
2093a48p71J53J403P39j042j409J24J094R97l10j584l80N40J283L09q48r42L55
$$ y = [885, -660, -1191, -538, 898, 1564, 282, -1222, -1078, 313, 1206, 1049, -755, -1229, -532, 1048, 1415, -311, -1548, -892, 487, 1495, 635, -981, -945, -67, 1215, 1172, -420, -1351, -1009, 823, 1637, 294, -1108, -900, -15, 1163, 1161, -229, -1403, -546, 639, 1414, 209, -1070, -1013, 107, 1258, 1001, -915, -1418, -203, 1221, 1382, -185, -1017, -937, 313, 995, 587, -892, -1302, -77, 958, 1011, -88, -982, -880, 545, 1295, 579, -974, -1198, -229, 1345, 1118, -213, -1094, -782, 593, 1188, 98, -1232, -669, 338, 927, 524, -306, -1291, -415, 677, 702, 273, -1003, -711, -252, 1161, 826, -716, -1114, -583, 919, 1198, -179, -1198, -1073, 506, 1247, 325, -1076, -888, -10, 826, 1016, -481, -983, -699, 289, 1226, 448, -607, -993, -6, 916, 984, -148, -919, -766, 637, 1376, 334, -1075, -951, 143, 1140, 830, -754, -1134, -594, 689, 998, 150, -792, -437]
2111d37O15N74k19q83m51L10J287P9p37j250L19R33J147n55j568l40J072J222
2129A118l69r28p30L41J150L29p92r37J08R24M39K0p46p62P1J325K36m84j165
2148h52O9R50Q07K02j534p99P14J150M62j069j083K14J343L37m38j206j87R39
2166A9Q28j0q58n09k25J005Q18m95j025n62P37J068j37o91j022M38J195P89j070
2185B93j079m05J390R08m26j313J5M08O30L24q11n66j69O00Q65J87q31r32K9J442
2205E59L82o83j110J6J164N19k04j137q82R25J248J47q32p77L26Q86J01n55n29
2224d36J6L7O27L58l16j011L4R36P34j93j341m29R28R18j25j071k55K91J029J47
2244H78r58o71J46R28K48q3r41j83K71O97J28j34j061k01R16N83R9j111n11O22
$$ y = [-437, 178, 752, 533, -350, -801, -491, 796, 875, 138, -1112, -793, 140, 1287, 732, -836, -1176, -104, 1118, 749, -179, -909, -568, 582, 911, 119, -818, -710, 214, 653, 673, -73, -835, -764, 561, 797, 313, -852, -783, 167, 974, 1176, -358, -1157, -443, 707, 1169, 100, -983, -769, 574, 911, 473, -733, -920, 19, 847, 837, -21, -530, -755, 250, 1068, 573, -452, -1014, -277, 791, 654, -37, -1059, -621, 574, 1363, 293, -786, -1191, 199, 1107, 681, -632, -617, -209, 421, 745, -66, -632, -801, -201, 664, 851, 20, -912, -883, 559, 941, 258, -852, -836, 328, 847, 643, -494, -1376, -451, 797, 944, 112, -665, -339, 547, 648, 93, -436, -420, -383, 244, 602, 286, -725, -691, 245, 979, 786, -555, -984, -56, 862, 737, -334, -589, -298, 731, 878, -80, -751, -605, 323, 571, 488, -453, -636, -365, 332, 460, 326, -735, -936, -20, 563, 662, -449, -960, -338]
2264c38J403M6j327m87p8J335M68q43q05j40R40M23k71n87m95N27N5Q06k58m08
2284c4q14Q19O11P6o68j008L42J045R11p89j451L3J250O54o57j213j72O93J253
2303H81l52o33l88K56J61L45r0j73n70K49P11K15k12j107m2P14J076m69j345j81
2323i54Q42J347n94r89p84Q99R30k57l48o30M02K18J71J02l11m67k07O96O44m53
2343B57o08o20P53J279k6j153p94N93J160J17p55j028M76P74M69j043l29J93M30
2362A45l2r0j3k05k45J38Q39Oq30o17K36J083P10j023q86J89J045N09p76j187
2382a004N82N48M17k50o17j42K08O13k35q6Q2m93L59L43J69l33r45L54Q47N36
2402I53m65j281l21J537L44l19r88k65R40N01m07l92m81P70K68k34k62J9q4L13
$$ y = [-338, 1065, 1111, -216, -703, -781, 554, 1022, 179, -626, -766, 174, 597, 326, -261, -756, -229, -174, 632, 374, -34, -848, -29, 582, 658, -10, -1018, -676, 369, 1280, 491, -960, -927, 323, 977, 320, -893, -1065, -372, 881, 529, -104, -492, -236, -75, 270, 180, 7, -563, -314, 397, 612, 400, -707, -749, -35, 1041, 572, -773, -954, -112, 1235, 641, -348, -1132, -233, 697, 440, 92, -538, -136, 82, 253, 355, 44, -423, -630, 66, 710, 257, -351, -971, -218, 1061, 1035, -118, -912, -319, 841, 958, 203, -825, -349, 425, 894, -149, -478, -285, 145, 113, 23, 10, -195, -440, -302, 537, 543, -287, -904, -668, 415, 1125, 102, -784, -595, 450, 959, 183, -1004, -422, 126, 543, 293, -324, -466, -258, 355, 120, 34, 116, -377, -18, 325, 494, 161, -784, -430, 417, 953, 488, -793, -1114, 423, 767, 448, -540, -805, 135, 636, 229, -163, -644, 126, 394, 160, -102, -83, -167, 146]
2422A46j02M95m12k19m57L52Q48j53o99p28P74P60M7j079m99P78R53l42p34n44
2442h15N52Q46m74j8m28J48J78R3J31r3o17q9O37L70K89q41p93O02R90O0q11j218
2464a301P72J057J47o50o34M94L91K48m61L3m53J19L19J06j45j30l17m6O82P43
2484I74q96p44j25J297N12r14j019K17J078J46m32o06k38O29O91k91m65q9L16
2503D1M0j04J82Q1n19j91O31M42l04j140J84J050J22j9j457J55J190N47p24o68
2523d61j09Q69J41J63p57k70L16J78p0J22O4m14k35L72O26n9r59k91N52J193l45
2544F26j116n18Q86Q89p6p82q01P35O43k01n02j62K09K75L25r03P70j36m49L7
2564b51M68L41o17n22R1J050N8n90q69K75J207J52p40n58RQ95K14l76p35J60O10
$$ y = [146, 44, 539, 127, -92, -549, -197, 651, 498, -201, -929, -155, 605, 652, -427, -926, -148, 805, 463, -271, -815, -263, 583, 109, 91, -337, -189, -11, 82, 213, 120, -497, -586, 51, 421, 710, -131, -924, -322, 668, 728, -83, -1301, -529, 528, 675, 25, -609, -115, 276, 524, 63, 96, -357, -238, 81, 187, 42, -88, -405, -451, 231, 974, 78, -666, -791, 506, 1018, 104, -915, -698, 380, 526, 94, -512, -750, -121, 570, 279, -186, -275, 41, 81, -23, 159, 240, -279, -470, 161, 603, 299, -841, -657, 393, 515, 496, -961, -806, 384, 931, 207, -461, -570, 299, 440, 603, -154, -424, -108, 70, 0, 122, 186, -228, -463, -91, 535, 476, -483, -774, -222, 971, 626, -490, -1008, -122, 767, 691, -91, -892, -157, 486, 285, -217, -379, -170, 105, 430, -473, 297, 161, -288, -251, 217, 558, -59, -581, -490, 560, 618, 28, -841, -566, 641, 793, 53, -505, -496, 399, 613, 237, -498, -338, 272]
2585B72N1j39j69l17N01j69k43Q71k00j041PQ25P07p46r58l4J138O96p91j093
2605h32N39N93L36n45m44k4M41J28l40K54r0j42k35J14Q13j42p94k43N55Q02j56
2626E88j093k01R33P95l62j187k93Q96O88j98q26l00O61N23m60j30j60o8K30r6
2646f0o3N09l57n11J42P44K81p94j063R66R14K60j348l29N05J129k93q00k92O71
2666B11P2p0p74N15R4j19J5J66o1qk56l29P32M27k51j266L28R18M68j022l45L
2688e52Q05L95o20n59K99L67J13k1m53P3J40j62Q7M14l45m78J73J54R14k40r13
2709d09j32O10P09o32o66j38R00L53l52r99J56Q17O4l33l38L19P2j22j9J56K07
2730B23l75k67L37L40L12p90m71M67O69Q4r64l46Q23O62l66p27k13P80J41k53
$$ y = [272, 323, 184, 15, -302, 199, 30, -213, 658, 458, -583, -576, 249, 956, 210, -748, -782, 356, 1052, 261, -832, -293, 300, 636, 91, -353, -377, 64, 192, -148, 106, 16, -126, -361, -247, 566, 424, -370, -613, -58, 744, 588, -505, -706, 227, 1022, 660, -527, -820, 76, 764, 566, -260, -560, 101, 624, 164, 34, -126, -194, 36, -60, -123, 386, 29, -482, -340, 404, 685, -109, -1172, -206, 708, 968, -380, -709, -204, 925, 632, -168, -460, 211, 283, 213, -561, -46, 48, -71, -56, 110, 49, 41, -215, -544, 188, 615, 364, -902, -574, 344, 812, -210, -555, -552, 253, 648, 28, -531, -232, 135, 248, 227, -226, -153, -13, -175, -88, 326, -19, -497, -324, -170, 744, 504, -409, -541, 69, 778, 146, -520, -658, 242, 595, 243, -756, -600, 217, 281, -52, -390, -71, 1, -121, -140, 16, 223, -152, -419, -82, 258, 570, -220, -691, -224, 445, 529, -435, -781, 42, 704, 338, -389, -602, 178, 319, 66]
2750F6m34K19K38N2k77N0OJk08J66N09J25l82o93L15N14O57j266m26P51P23k9
2772F77p24n52K91O14L51r04l34O77j33O5J9L21l36m5m07P36k16K24o31j1K62
2793e6N47m55n36J70N35J73l86l59j10M26O46p93j94M09J97L9l28j01M03l59R4
2814c8M0L28op95J2L10O97O7j061k43P09N13l08q89K85M58L62j54n80n7L44J50
2836A44n8k12L26j29n56K84K34M79l85m82K42M64o0p28o8K71O19K86m89p97L96
2857b19Q52l37o90K04K23J69j12o6K82m9l16j29J07N50o82J6m2M63L14n05m94
2878d61J20N98N65n34q85L48Q26K72q49j66K39J11L7l05k92K45L28n8k18L91r0
2899B22m39k80P67M10o18o35k2O54O20n17p22J97L22K92j64m95j08N21K82l37
$$ y = [66, -368, -149, 89, 141, -136, -86, -80, -79, -287, -121, 388, 513, 131, -562, -247, 267, 924, -342, -768, -17, 706, 677, -47, -599, -308, 306, 657, -247, -581, 96, -37, 28, 47, 368, 32, -13, -420, 316, 100, 324, -307, -318, -56, 491, 36, -500, -330, 205, 378, -8, -367, -477, -51, 595, -198, -392, 17, 214, 253, -75, -176, 227, -132, -38, 2, 330, 324, -471, -459, -149, 548, 615, -446, -689, 20, 533, 225, -664, -379, 79, 441, 287, -293, -350, -6, 144, 86, -126, 200, 71, -485, -201, 33, 512, 127, -355, -113, 351, 291, -437, -505, -234, 385, 671, 182, -615, -219, 633, 296, -394, -190, 33, 202, 90, 24, 306, 257, -59, -188, -81, 469, -213, -197, -239, 224, 538, 33, -461, -341, 257, 822, 288, -597, -249, 577, 849, 0, -166, 73, 184, 221, -84, -376, -131, 197, 139, -79, 312, 222, -217, -497, 270, 680, 62, -573, -595, 59, 679, 162, -560, -363, -41, 251, 87, -408, -516, 5, 287, -50]
2919e0J8Ml52M44k3K34l86k3J22j12K73L19n79j74J10L02N4k85m17L94N64j98
2941B39n43MM01n2K24l30L6qJ39j02J69Kj71l03J38M65K1l60q7l35Q24j61k56
2964d6n11M07M55p7l88j42k4N70j34l46r8k7K06R5K09K11j22n79Q5O41k17p0p9
2987A9k09L19N55o19n26J9N51K56o37r6J23O83k93r7k86L74r6m4J84j28l96j01
3009d45K42L90N3k02j61j55N56K83l53o85K36L73K26k68m04J83N8K02n8k14K03
3030F0q2j1k81M50l60L05m06J35M17J49p78L16J15J97l6n08kM6J058o28m72k32
3052e48M09M09j67k26l40J86N31J22m28n4J47j87L34m81L78k49PM8N93M5p22k12
3074d05M31L63o9o16q1J61N13m0j63l17M4O02k78j0k72k53J34L80O3q3k4l44j03
$$ y = [-50, -32, -28, -380, 64, 41, 275, -111, -134, -12, -124, 149, 468, -111, -285, -175, 127, 181, -104, -521, -127, 437, 239, -304, -300, 101, 49, 273, -57, -21, -29, 110, 8, 177, 179, 8, -295, -157, 308, 329, -31, -118, -453, 371, 210, -46, -557, -150, 305, 228, -160, -302, -326, 244, 110, -236, -334, -361, -155, -60, 149, 360, 238, -341, -256, 385, 168, 98, 19, -190, 129, 684, 65, -461, -442, 109, 365, -272, -368, -245, 438, 145, 48, -238, 136, 40, -4, 180, 52, -344, -445, -203, 187, 240, 38, -123, -278, 278, 561, 208, -477, -241, 132, 358, 90, -314, -131, -73, 129, 71, -143, 60, -22, -33, -314, 136, -224, 81, -325, -190, 227, 376, -402, -86, 29, 226, 190, -318, -320, -274, 784, 156, -316, -548, -139, 270, 103, -123, -463, -277, 254, 376, -52, -106, 41, -146, 188, -293, 85, -164, -157, -109, 484, 529, -193, -405, 26, 389, 320, -296, -377, -216, 297, 257, 94, -223, -179, 423, 145, 135, -137, -390, -256, 124, 187, 104, 80, -264, -367]
3097c67O65k65J90o30K94L7M50l94q2k56N85K83o42l2J60M5M43n81J11L54l02
3118F6Q1j96K42q8p4n35L48Q3J61m43q6K55N34m06k41j0M36J60K39o95J23k1J94
3141A27k27K81m31J74J00j69k7M99m01l14J81K28K86l04m25M63K37o6l03q3j81
3162c55M96K59n61o1q6M84j54L85n93j55M50j5l47K10n8L1J09J4M74j73q13M16
3184d3J56k3J02p16J66M87J26m34l04J79M70J85m03K48o3l22m3O04k93k96K55
3205C8r8K82q9J21n28J69J22J82j34j98J94j99L49j64j22J44o7J51j50j08k16
3226c21L19K14n6k74J35J57l25J85J10k28p7l9L31J6J54j41j31k12M06L8m96n9
3248b94N51l88o9J43j48J84R0M25o70K10l65L75J61m43L64l19p8M67k08K38m54
$$ y = [-367, 298, 33, 223, -407, -113, -76, 374, -20, -102, -358, 227, 510, -132, -164, -4, 41, 484, -97, 14, 368, 66, 147, -49, 193, 105, 31, -504, -156, -73, 88, -355, -441, -186, 348, -58, -299, -309, 127, 287, 526, -169, -46, -67, 127, -100, 181, -250, -76, 24, -145, -172, 327, -74, -388, -207, 21, 307, 3, -422, 41, 278, 212, -91, -174, -355, 141, 400, -161, -222, -308, 176, 22, 407, -186, -341, 109, 94, -253, -43, -101, -70, 39, 53, 527, 354, -459, -43, 113, 90, 192, -524, -358, 129, 255, -179, -483, -304, 166, 351, -52, 196, 133, -189, -232, 372, 79, -217, 38, -60, 222, 133, 254, -274, -105, 17, 199, 65, -133, 61, -138, 211, 47, -75, 69, 2, 153, 3, -105, -321, -2, 212, 156, -118, 17, 174, -151, 34, 144, -84, -161, -200, 131, 147, 301, 160, 29, -183, 223, 261, -235, -294, 257, -131, -200, -57, -205, -21, 69, 494, -176, 34, -331, 44, 205, -238, 126, -193, -271, 196, -12, 226, -228]
3269b28k48N02J11J58l34k7j51M39k05J38k71j24J64K03j11L33n51K3L05j11J66
3290A81j15k89K86K98q1n24O6J85L28r5l45k22L08J92Q1j77j68Pk15L78J54k98
3312f5R7j00Q5L00l89K30o12J80M16O5j88j55n8j52O36k58k0l67M53K88j45k66
3334b5q0J84m0j26m9m3J4M61k7l40k32LN9L26J12m5j91J07j08q3K31k65K19l2
3358C0K30k79K39m72M0J96K51m47j2L18j14L9J23j81k80O2J79J03K21m47l4K70
3380C5Q8k74R3j02O2K06Rk99K4j27L25K08l8j18n8m4K9J03J22k11LP4j13n6K2
3405c7j66j08K08L8K38k94p5L81j66r8R4L8l28L0M56l84K18j69J35J65P2j87j01
3428d0k79K66Q6j10p9P1J78K43m68j38L02qL63l21m62J87J49J77jk08j55J87J64
$$ y = [-228, -476, 26, 137, 295, -39, -66, -217, 222, 17, 155, -116, -240, -76, 127, 16, 349, -202, -179, 126, 15, 181, 66, -223, 63, 361, 280, -244, -178, 7, 335, 240, -105, -327, -19, 173, 254, 77, -91, -84, -299, 79, 233, -65, 32, -68, 17, 317, -72, 158, -454, -274, 142, 207, 19, -136, -194, -346, 290, 32, 12, -355, 98, 386, 241, -25, -105, 79, 39, -87, -136, -179, -165, 296, 269, -71, -303, -300, -241, 85, 197, 152, -39, 68, -40, -123, 108, -157, 62, 30, 260, -19, 220, -252, -212, -16, 235, -212, -224, 94, -20, 19, 142, -39, -319, -257, -78, 25, 246, -201, -235, 35, 123, -151, -58, -160, -98, 108, 117, -182, -158, -285, 40, 248, 210, 92, 34, -10, 19, 122, 244, 33, 36, 110, -3, -59, -37, -203, -311, -103, -65, 173, -121, -196, 185, 19, -79, 15, 53, -275, -245, 211, -173, 45, -124, 11, 176, 248, 61, -40, -319, -53, 33, -77, -156, -85, 93, 336, -132, -270, 32, 24, 387, 66, -396, -209, -60, 117, 116, -92, -247, -60, 104]
3451A04L0M4l88K87k07J34M8k09l1N20k80J8L2J24o23O64k13J03j79m5O0j81J42
3474d6K6m0Q2j29J89K33m49l8J03J06l1m3K5l6j5K05j4j62l28K86K06L1j44%j94
3499a77Q8J71j07K6j42J95l0J07mk39J84K6j35l10K14J31n9j5K96j0k44K8K18
3522B12l95K01L1k12q5N7J51LR9r2K16m2k00J95j5K4N8n6j15K9o4Q5N0Rl37O1
3548a32J31J33rk54J41qj15K49p0k56K04N2P7J68m27J09M9J86l07l2J51k97L69
3571A12j33J29l03M23j06o9o8J56j76j27K49J27k44j32L80k30K57l84mK75k2P8
3593A88k10n1lj47J35K59j43l06L71j10j28N66m50o9K02j5Q0k74J75p4J8J5K82
3616C11l22j51J19J17P0k28N8k4J59L98l45o7k82K37j29L03r9j93k9L55j25O3
$$ y = [104, 134, 178, -210, 77, -130, 4, 52, -157, -188, 332, 52, 70, 102, 226, -397, 267, 54, 157, -22, -67, -7, -188, -46, -20, -60, 22, -107, 82, 315, -134, -172, -69, 37, 6, -37, -12, -48, -63, 142, 128, -34, -362, -76, 130, 161, 17, 17, -177, -89, 82, -25, 1, -141, 54, 24, 131, 127, -112, 72, 98, -37, -347, -133, -2, -61, -76, 220, 210, -34, -6, 212, -183, 18, 49, -163, -248, -191, -40, -37, 62, -30, 186, 144, -56, 139, 124, 148, 206, 150, 35, 64, 0, 85, 135, 144, -193, -132, -1, 132, 123, -131, 10, 2, -113, 136, 66, -190, 14, 66, 143, 311, -116, -7, 42, 228, -79, -111, 40, -257, 112, -21, 108, -195, 228, 122, 53, -15, 141, -35, -162, 87, 214, -30, -162, 218, -12, 245, -139, -143, 132, 110, 188, -22, -73, -76, -223, -88, 171, 28, -278, 93, -17, -145, 421, -29, -98, 104, 89, 169, -105, 70, -4, 14, 29, 311, -11, -162, -43, 74, 144, -84, -26, -50, 109, 507, 162, 95, -187, 50, -79, 224, 125, -68, -97, 258, 133, 196]
3638A96n05K88O5K44J04l74k69K91k36K50n0J24k58K71k03N1J73m25L12J45L69
3659E63n91M0k63K27n5M3M0l4j74N2K62p9j90J39K05j17l91K98r4o9MK99l4o8
3683A3n8J36K88l73R2k84KJ94M7K4k04M2J37j21N2J59k53J3K28m27L92m77K66
3706a12K20Nl1K5k7j93K62k48J55j74k21M64N6Nm7n35M32k9J14K49m75J58j59
3729a06J61K10l04j85M5K44J1m5R2j40PJ83o5l6l6J18j92p8m9p9J10K08J64m83
3753b45oL18j68J19M9j44J18k10J86J42k97j21K26m0L46N3o44J59j71L43J8k17
3775a86J68R1O9K5j60j18J21k21J95M94m36j9R3K8J3l07J67k69K29J18l17J27
3797i5L61l46qK56j76j51J47Qp4O2o7K81k84L29j67m10K51j07K29J97k19Lk84
$$ y = [196, -309, -21, 44, 288, 392, 18, -251, 40, -196, 54, 4, 128, -130, 141, -62, -11, 162, -263, 49, 194, 563, -28, 12, -251, -24, -79, -36, 4, -30, -204, -152, 110, 31, -159, -20, 185, 68, -323, -25, -119, -188, -184, 115, 81, 13, -45, 91, 379, 6, 98, -186, -184, 10, 57, 81, -123, -81, 56, -65, -13, 146, -107, -94, 134, -293, 99, -378, -112, 108, 113, 82, 107, 80, -113, 149, -99, 56, -118, -339, 125, 181, 186, 139, -396, 36, 7, 121, 370, -105, 53, -106, 55, 265, -39, -224, -179, 65, 76, 31, 123, -17, -10, 173, 108, 72, 36, 154, -38, -116, -165, -244, -134, 74, 238, -245, -251, 67, -101, 18, 67, -77, 41, -169, 17, 159, -138, -259, -33, -73, 273, 326, -318, -159, -330, 13, 31, -186, -18, 73, 142, 167, 7, -111, 10, -211, -16, 478, 42, 23, 116, 144, 157, -150, 17, -252, -23, 95, -222, -95, 266, -80, -88, 168, -8, -159, -12, -4, -78, -16, -83, 198, -86, 243, 76, -334, -83, -190, 39, 236, 17, 20, -264]
3820b64j43P11l52L3p1N6L3J41l7m9j33n8J38L1m0j93P4Q3r4K13oq3R1NJ25k62
3846e1K11l67K93J52l01jK19M9j48M0r3Lk7L89m71J31l57K37p8K11O4j20j18J49
3870A6O1j34R6k48L73j50m2J48j5L81m60r4J74j88J7N5L0L7k8j37K87l30L62l28
3894a17L28m81p5L74j52L51l51R5m8j34N87k61jp9M7j20p3J34J63j52R3m8p1j05
3918i6R5j22J41Jo3P1O1k51L5J87J82j47M1n4k74k7J38k0j37Q8J91r3k68K68J87
3943A34j40nJ31L9k05P0N7k1J37j39j56L00j04l25M16j68j64j15k01Q16o69Q4
3965b28M91l36K06k00J68k3j22P0K24o2l52RM1J61k80J46J26j64K45j58K06j74
3987fJ23pJ7m4K63l02l55K75K22Q7j60k95K79J78r1j79L3K38k90j1J69j74N4J0
$$ y = [-264, -407, 304, -48, -15, -86, -30, 3, 144, 107, 58, -75, -133, 5, 36, -4, -197, -123, -40, -134, 79, 73, -10, 81, 86, 211, -51, 160, -207, 86, 238, -63, -64, 155, 204, 56, 96, 3, 6, -21, 368, -103, 28, -329, -92, -170, 41, 105, -15, -133, 16, 77, -57, 39, -209, 164, 14, -28, 120, 105, 486, 26, -68, 106, -82, -65, -10, 20, 57, 29, -108, 179, -151, 211, -117, 211, -270, -345, 29, -123, 228, -123, -28, -76, -210, 377, 116, 115, 36, 83, -37, -110, 24, 187, 35, 128, 80, 9, -96, -1, -123, 18, 19, -44, 27, 88, -163, -128, 59, 241, 94, 135, 81, -193, -220, -82, -102, -239, -151, 40, -53, -321, -53, 134, -6, -11, 120, 159, -46, 24, 81, 60, 197, 58, -98, 202, 98, -227, 189, 21, -143, -258, -459, 357, -312, -228, 263, -73, 133, -67, 101, 78, -44, 26, 250, 188, -164, -155, -114, 47, -233, -87, 39, -125, 120, -38, 168, -6, 117, 110, 127, 83, 346, 44, -311, -36, 186, 273, 113, -182, 97, 275, 184, 5, 38, 276, -14, -25, 144, -30, 24, 34]
4011C4k19J48J8J5J17Qk9j65K69k75j54K27L38o0l64J92m39L10N0r9n6J49N4k16
4035a47K37J36k00k01M28m21R1K54q3l0l79L09j2L3J02k22M7l9J9K61pk31l6J34
4059D3n51O58l36J84n7l24K49L30M0k46j78K02M1K15l36j3J90k1J08k30R6l51
4081b87M06m58qO20k09j04R3j07j92L1L01k32J65n6K4J39l21K25m13M16k61J35
4103i3k21K28J47M9N1kK70l25o5l53M06j03L86k99j63J74k5j26L11N3k88k45M98
4126B65mJ14l34Ro9J51K0k81K12j41J83M0m00K27J3l2L10N2o17M75k63K17l43
4149a96mM27j80l90J92L22j63J33k23l3K68k34l83L33J62J6p6K81m22q0L87k1
4171A16m2J50m47K35j92L72j67j90l5K52l2j46L46o69M42j50ML48j88Jk59P2J25
$$ y = [34, -185, -37, -19, -4, 113, 121, 92, -73, 196, -79, -233, -6, 332, 272, -92, 100, -339, -29, 21, -78, -134, 15, 69, -147, 90, 226, 26, -175, 253, -168, -77, 177, 94, 64, -315, -6, -18, 15, 117, -105, -58, -97, -78, 183, 176, -55, -91, 43, -508, 150, -186, -2, -59, -383, -134, 196, 236, -10, -188, 14, 55, 270, -66, -79, 111, 90, 198, -32, 64, -287, 119, -339, -347, 273, 64, -40, 53, -54, -246, -215, 86, -146, 19, -37, -13, 126, -195, 30, -383, 33, -228, -93, -314, -86, 61, 110, 161, 159, 429, 104, 39, -314, 92, -11, 375, 76, -87, 87, 62, -64, 247, 300, 12, -233, 265, 261, 375, 41, 50, -19, 132, 152, -129, 83, -58, 125, 165, -235, -8, 5, -27, 283, 335, -282, 193, -70, 147, -196, -200, 227, 47, -343, -151, 171, 8, 141, -82, -115, 153, -81, -464, -131, 31, 47, -29, 252, -170, -250, 137, 116, 74, 224, -223, 12, -180, 192, 25, -165, -200, 52, 20, -126, 220, -449, -7, -157, -153, 195, 7, 8, -251, -179, -54]
4194e4m6K72J99m23Q6L2m05K45K45J36m65J99k12k4J74J34J34l83J19J54j7r1
4216Io3J88r9Q4O3l99j15L92L25j14j86m3o2K85J49m33r6MQ7J34M9n09K10O1J27
4241D8m4p4n9O5k9K90k46r7O2n0jR4j16l9L72j70j26l8N7r4M10l72K16j82J17
4266fn69M37J6J21L3n1p7J2l9Oj59K11J47l20M72q0j55O9P2r7o6M00n89K65K0
4291G3l39J31M9M26l12O8k53rJ18J34J2k34k09K62K80l06J08N8K3k52p5L87l06
4314a66j02K23J12M4j78P4j76Ml6L39k97N1K07P4k02l4K30j57k68L10m4n3k02
4337b47K04k3Qj07m5n7N42l97J64K93r5l60p6K27j93R9J04R5r9o2k1RJ1J25j62
4362f3k42N30l91J46j31O8pq1L43k13j49J23N4rJ96n3j38j89K18J47k21J11n9
$$ y = [-54, -100, 172, 371, -52, 34, 66, -339, -94, 151, 287, -178, 21, -191, -215, -41, 93, 227, -156, -37, 117, 100, 9, -54, 134, 35, 119, 182, -217, -332, 60, 385, 271, 85, 42, -20, 265, 414, -19, -115, -111, -24, 110, 159, -350, -140, -79, 48, 4, -70, -129, -64, -93, 197, -49, -146, -84, -134, -135, -41, -157, -196, 176, 6, -120, -158, -101, -195, 215, -157, 59, -123, -6, -575, -138, -122, -1, 32, -19, -96, -84, -123, -117, -276, -65, 82, -238, 234, 154, -1, 68, 140, 43, -23, 377, -212, 53, 73, -266, -135, -86, 340, 28, 96, -157, -166, -48, 86, 98, -136, -345, -83, 197, -109, -1, 57, 80, -172, -247, 140, -166, -268, -45, 67, 111, -67, 7, -169, -165, -201, 138, -159, -108, 99, 173, -29, -63, 167, 10, -258, 52, 8, -45, -247, -43, -66, -58, -165, -210, -267, 275, -122, 42, 335, 240, -120, -196, 31, -162, -63, 41, 136, 37, -25, -46, -37, -26, 99, -63, -305, 225, -166, -20, -151, -83, -90, -171, 172, -41, -190, -67, -13, -22, 174, 121, -17, -206, 12, 159, -62, 49, -10]
4385a0j84L97j70J75j17l05J61J64K9j48j21K39j10j62J42J6J60j38L5j56No0
4407a58J58K2o8j99P8K81j71N8r4J75j83R6l4J06j59K5J98k55J47o6j20J08p5
4430a30M3j5O6M3K06j64K4J99k28J49k83J09k33L0o8J64J32K7q0M7m2J57p4j14
4454c5K10k68n5J80P3l18J23J1M3m0J46k91K09k99L45J69j73k46QJ95l09M87j03
4477F2l45M24J36l45j47L08k05n6K89j00J9j55j8K29j30k72L41k64J08M3K51l31
4499a58K5J12j75J3J89p0K58l30p9J20L64l00J17l29L06q2J8O7J52J38k61l44
4521b49j23L15J49j01J08k04L28k32n7K40m2k18R6K23l20p2n4M41j67J36l52J80
4543B5J17j93JJ24j72K4P1j58J59RK44r9k38O4L48l08qN8J28n31J77J59L32qk08
$$ y = [-10, -194, 203, 33, 208, 91, -214, -53, 111, 140, -8, -129, 110, 0, -162, -20, -4, 156, 18, 53, -103, -98, -158, 0, 22, -46, -245, -167, 114, -57, 1, -93, 82, -101, -5, -39, 67, -92, -67, 131, -124, 23, -43, -163, -55, -130, -87, -102, -36, 7, 213, 49, 73, 272, 44, 193, -90, 19, -214, -184, -252, -88, 44, 71, -9, 38, -4, 153, 79, -35, 175, -93, -148, 32, 105, -213, -90, -79, -36, -76, 70, -221, -12, -311, 34, 203, 30, -216, -208, -13, -322, 165, 62, -283, 141, 277, -68, -215, 93, -112, -168, 121, 21, 40, -115, -133, 96, -34, -306, 35, -229, -121, -78, 173, -158, -133, -21, -196, -183, 6, -64, 194, -136, -215, -95, 269, -31, 86, -243, 63, -19, -1, 66, 218, 356, 95, -249, -372, -57, 92, -9, 99, -105, 223, -9, -66, 174, 132, -86, 10, 233, -87, -159, -213, 228, 61, 197, -155, 25, 142, -51, -50, 74, -98, -74, -3, -161, -2, 7, 251, 152, -86, -22, 326, 18, 10, 68, 196, -335, -158, 1, 333, 325, 117]
4568A17j76N3K6q3j0j9L2Jj2JJ29j45q1K86R9R8l70N7Pj7Q1M6k62L73l08N2j49
4595a74K90k0r8k53J45M1p7K9M7j04J18j69L62J64l52R6o6Rj91M9m1K22j31J46
4619D2k50K85q7%o2j33K28K98k66j31J04K8j52p4J47q5L6J70j54R6n8k0Mj25K08
4644D9k78M72j78j26J20j22j91L68j2N9m5l6J86m45K9L13k14N0P2L47j17k55M2
4667H8l6k7J77k83J13j86N4K00o5j25K9L42q8R0k02k8k49jK79m9j78Q2J09J4Q6
4692A46K67j28m32L05m31L87k14n6K5j76L89j51K67m57K90K2p6M8j09j7K08j54
4714d7JR6K44j46o8Q2M3l19M22ml63L00m60K36J58q6k2k40J5N2O0L43l33J9q1
4739i8J72l95K40M4J2M9j21k8K54R6Q8k39m4K96k05J62n86L91K64k34k97J74n
$$ y = [117, -59, -6, 20, -63, -73, -92, -60, -59, -71, -70, 59, -86, -167, 119, 218, 316, -54, 3, 10, -7, 74, 120, -142, 231, -77, -25, -174, 116, 96, -2, -255, -110, -69, -146, -117, -70, -174, -56, -225, 137, 301, -51, 45, -21, -12, -203, -154, -195, 27, -104, 42, -208, 77, -10, -10, -72, -205, 23, 321, 55, -76, 28, 56, -96, -170, -23, -108, -72, 98, -56, 40, -18, -38, -34, -159, 49, -229, 243, 65, -61, 59, -63, -254, 114, 102, 161, 116, 80, 266, -179, -150, 163, -51, -1, 71, 418, 301, 46, 88, 52, 25, 202, -81, 32, -154, -100, 100, 35, -90, -61, 281, 193, 283, 81, 53, -196, -197, 82, 33, -145, -63, 46, 60, 146, 413, 285, -147, 158, -273, 114, -100, -156, -131, -307, 82, -69, 198, -259, 31, 53, -23, 25, -84, -101, 107, -47, -46, 50, 294, 148, 80, 162, 205, -114, 308, 304, -59, 241, -219, 17, 175, 89, 67, -173, -158, -106, -46, 297, -36, -17, -98, 74, -321, -81, -37, -25, 24, -97, -125, 129, 225, 313, 74, 30, 326, 121, 283, -303, 88, 352, 118, -179, -5, -10]
4762a0J27o8l33M97k73K04l9j99M55k21l12j01L07n5j16j2j7P9P1o0k86O17J2
4785B67n04K01k01K0M63m34N72k10k27J56k35J09j6J9R4k24L48k04p2K59n2k74
4807a45J54j12m1P3L02k51M9K42J24m35k8M59n00O8j8K50Nl43N2M3o8J74l12M00
4831A42k0l4m45K42K04q6J72l71l2P0R1M8J5O6J88r4N0l60J71k21K62J28j58j47
4855a19J87O0k51K03J9m5J3lk1Q8k49J03K80m37L04n5m7K32n87M52l16J35M0N1
4879C7K36l07O9j11R4j4n3Q0k7n0K11O9m74M34l31K57j94J44J14k90j8J21rq0
4903i2N3L55k95k85K49L23j19m77L07J56k62o9P4l1k7J41l89L20N4k2J38j96N0
4926d4J23j40J84j83L45m29K3Q1L0k20L90j43L88o74L23j61K65j49j70K40q9J32
$$ y = [-10, 117, 49, -284, 213, -60, 144, 105, -94, 361, 140, -172, -273, 34, -21, -137, -149, -166, -87, -16, -76, -362, 255, 267, -237, -36, -237, -217, 246, -188, 384, 174, -53, 103, -132, -23, -39, -20, 74, -150, 198, -6, -78, 181, 129, -145, 9, -103, -144, -71, 231, -20, 29, 271, 395, -40, -68, 391, -109, -41, -59, 191, 196, -147, -95, -52, -120, 54, -258, 142, 122, 88, -357, -115, 89, 3, 175, -196, -228, -158, -67, -19, -4, 62, 250, 156, 206, -154, 17, -204, 58, 186, 28, -119, 68, 128, -123, 80, 99, 54, 67, 64, 43, 131, -118, -15, 265, -172, 132, 77, 30, 262, -325, 127, -189, -54, -14, 37, 273, -34, 35, -76, 18, 4, -49, 31, 4, -46, 165, 234, -240, 194, -137, 120, -74, 70, 184, -106, -124, -3, -12, -92, -39, 316, 21, -264, -15, 308, 189, -288, 19, 175, -87, -156, -82, -113, -140, 1, -388, -68, -14, -36, 102, -94, -44, 79, -61, 123, -60, 285, -144, -121, -40, -10, -230, 160, 17, 405, -269, 54, -107, 158, 9, -161, 79, -10, 122]
4948A22j26K9j09R2p3L33o63L43k35J93k4K15J48k50m2K16l08N4K27R0j53N9J66
4971C04m64J78J04l91N94m12J81l26m9K26j73K05J57J7l82K72j58J68K8J2l11
4992b20Q0M82l74J15j58J98k55K47K42o4m28k5L4K35q7n5m34M43N8k4r6J59j52
5015g9J48j67J0K74q0o4j61J88O0j2j26j3K90J33o38L29J07p6j86R4Kl20O17k62
5039F8M5j49M0m3MM1l3k34N64m73j12L13o5J40j37j56R1m6J49J14j04j49L93l28
5063f7n7j12L63j64q1l1N6J78j32R6J14o6K04k70j36O6J21o1l21L41k61K27k52
5086b45m6Q8K4j30J83R2K09j27k52L77n7Km7j25J61m14M99o0j40L34r0rk22n7
5110e2O8O4K50n07M48k40k08K45j04j37k3L29k29K88J1m19K85l04K64j27R3k46
$$ y = [122, -4, 25, -84, 8, -65, 268, -395, -52, -287, -94, -118, 97, 245, -5, -47, 169, -139, -85, 142, 232, 79, 138, 304, -160, 18, 122, -269, 325, -87, 94, -232, -281, -55, -228, -23, 134, 151, -231, 41, -117, 51, 79, 91, -220, -140, 342, -32, 83, -75, 123, -132, 115, 357, 293, -135, -160, -126, 109, 22, -33, -467, -24, 34, 10, -86, 73, -79, 69, -98, -88, 186, 106, 42, -119, 69, 129, 117, -9, -22, 268, 401, -237, 92, 199, 123, -63, 31, 33, -287, 330, 68, 113, -36, 4, -39, -35, 6, -27, -261, 303, -170, -282, 31, -34, 106, -31, -187, -96, -142, 7, 121, 17, -132, 261, -67, -124, -236, 127, -37, -118, -149, -93, 85, -47, 49, 163, 97, 301, 31, -105, -39, 82, 21, -300, 41, -220, 7, -245, -291, -203, -179, -309, -126, -34, 175, 48, -204, 173, 116, 118, 71, -54, 107, -307, 192, 132, -8, 326, 236, 227, 5, -52, 16, 80, 330, -177, 271, 31, -177, 68, -36, -173, -196, 133, -96, 192, 203, -216, 69, -235, 29, -98, -5, -251]
5132b51m6J01K46q4K59m04J23o4r3K25K66j80j49j02m1L00l2J32r2k01j09m1K49
5155A2M7m0j36K39j34j23K54JL2q44O63j98M22q5J59j29K7j95r6j86K44k03Q9
5178a80K98o4l18K32M00m57j9J43n6m6j48K41q2j64O1M28J77m58K76l42J11L11
5200C44l60j7j50N5M6R7Q7j04N0J10k12K08k62k8R3K2K01q4j94N54l37Q2pJ1m50
5225b45K35J6m4kpp2m5J98K25j94K3K05l12K86m39J23K0k33K57K7K5Q7j57r9J98
5250G6J67l59J38N3J53n60N6K85Kn8l5l9n8K59k81L93L9j47j91K04p2P6K3J8N7
5275A99pj45q9M8l37K15M20k14K6n5l9n3j35N46n45K34k08J52k55L90k81J22M5
5298C4j09nk49M84j59P9j40l41K05M56l49K25j34J38j09r3J45k02Q7J95k54J12
$$ y = [-251, -297, -196, 50, -34, 225, -179, -56, -120, -213, 12, 278, 98, -51, -153, -194, 106, 74, 206, 114, -87, -196, -237, 12, 59, 19, -117, 122, -12, -135, 119, 120, 152, -692, -29, -227, 195, 110, 269, 140, 167, -28, -124, -310, -66, -269, -180, 118, 54, -264, -32, 368, -89, -108, 35, -21, -67, -215, 26, -56, -220, -159, 269, 446, -12, 264, -78, 33, 344, -16, -33, -183, -128, -82, 15, 102, -2, 48, 158, -54, 154, -108, -136, -43, -21, 180, 96, -98, 456, 119, 201, 194, 205, -245, -10, 6, -38, -40, -47, -119, -164, 34, 259, 65, 88, 293, -19, 267, -172, -49, -29, -262, -5, 22, 47, 134, -23, -122, 76, 243, -116, 22, 75, 228, -332, -276, 9, 11, -47, -82, -121, -179, 80, -201, 192, 231, 84, -107, 97, 25, 101, 124, 142, 199, 192, 47, -42, 6, -331, -116, 304, 90, 116, 61, 22, -31, -166, 380, -165, 69, -139, 13, -242, 148, -133, -11, 34, -75, -80, -329, 155, -4, 75, -65, -406, -201, 255, -94, 131, -3, 135, 26, -67, 78, -124, -37, 158, -96, 16]
5320A6K51j51r8pn7K3l24J52K89k56J46L4j7k51N14m02J10J19k41K62j12N9k32
5343a73J00N6k9L60l13K50k96J35k07J55K58l60J73k55K12j79L5R6l2MJ2K5K80
5366C07k5k46j46K6K56l2j25k1J89k17L46m85qR7K32m39J32L68m03Q9L53l20N7
5389a5j87J58j49K31j59j41j43L29L5J97j21k26J72o6J71k59L9lJ36R0k38K51
5411A02p9m02L10J52l91O7k8K00N1R1N0j31J19k20j31L45j18j1O7J08mj4P1j05
5435I9Q5j16k54mk3K53P7j21mO5J61m71J17J58L97m34k31k4J59K45J3j32P2o4
5459B3r7o4L91k51J64j43o8L9j43K45m33O41k02k63M23k95N7K8p1KL9p9J96q%
5484A31L5j17l3J41k51J28L38m15p0P4k1K01j18k21L71m92K26j39K10J80j72J9
$$ y = [16, 267, 116, 18, 11, -46, -23, -347, -195, 94, -162, -16, 18, 1, -250, 264, -138, -28, 91, -150, 112, 0, 59, -173, -73, -17, -46, 314, 1, 251, -45, 90, -117, 38, 296, -64, 109, -146, 66, -113, -78, 18, -14, -10, 2, 27, 307, 282, 36, -110, -84, 172, 140, 15, -6, 183, -34, 312, -173, -181, -84, 148, -291, -159, 209, -194, -105, 248, -72, -15, -202, -44, -193, 38, -121, -262, -405, -76, -41, 156, 35, -191, -19, -85, 86, -173, -134, -137, -1, 89, -149, 102, 23, -379, -69, 83, -308, -241, -269, -69, -18, 73, 123, -8, 111, -109, -240, 105, -13, -24, 43, 151, 147, 133, 204, 99, 184, 68, -186, -190, -213, 40, 117, -4, -8, 57, 218, -253, -136, 22, 419, -15, -246, -270, -111, 134, 147, 15, 87, 23, -74, -138, 253, 2, 166, 23, -45, -6, -149, 96, -337, 304, 102, -161, 262, -33, 24, 52, -19, -17, 22, -57, 139, 131, 131, 166, 49, 16, 157, -94, 34, 372, -43, -113, -39, -60, 141, 23, -198, 173, -319, -93, -232, -22, 158, -14, 5]
5506EL3N0k50rL77J77n01L19j55j80K17j43J69j5J38q6k10P6N4j16M23k29l8j88
5530h2L24l48J9J29l33K67j76M00l14J33l7N8l4L38m04N6p2Q6q7j60N08l59k13
5553c01L01K60j18j27L48l40j60R4m9o2L57j52N7K4m59J34J95j65J64k9J22J19
5575B13L6j96q1J03j1k9l5l03K44l1J66P2l60j43N13l18M4M8k37M42l80L17L1
5598A05L1nk32L03j28j33J6j19L83j94j26J66j98j62L21j24M4R1l22K53J05k56
5620a81j3J22kJ11P4n1q5K71k06j12J44q9QJ34m3L4j91J4J73l08L42k29j38r5
5644c16M00k0j44p4K94Q3q7l63Q7K91j14o0m0J3L09m12J99rj44K55l8J2r8K33
5668B57j30j6j01J44r9k40J43m1j67K41p2K59p2l06L71k08r7J37j49L2kK27q2
$$ y = [5, 38, 88, -162, -171, 206, 383, -118, 201, 46, -134, 83, -60, 109, 94, 232, 146, -64, 12, 66, -50, 373, 144, 106, -82, 242, -106, -87, 42, -291, -24, -200, 200, -114, 19, -18, 40, 6, 344, -60, -4, -76, 10, -77, -237, 271, -88, -301, 0, 260, 142, 15, 363, 23, -137, -43, -92, -154, 203, 51, 108, 132, -327, -193, 2, -163, 1, -28, 94, 213, 249, 53, -28, 75, 64, 35, 0, -303, -59, -90, 76, 148, -212, -355, 158, -160, -116, -68, -305, 137, -243, 74, 105, 136, 131, -101, 202, 74, -59, -43, -162, 221, 27, -99, 67, -131, -293, 28, -96, -52, 39, -283, -30, 75, -181, -194, -72, -74, 37, 111, 60, -25, 246, 40, -72, 72, -17, -9, 125, 82, 116, -75, -61, 112, -196, 146, -83, -221, -316, 84, 64, -80, -154, 140, 223, 136, -227, -140, 151, 37, -23, -63, -50, 259, -153, 46, 37, -107, 148, 110, 122, 24, 257, 127, 111, 10, 154, 55, -185, -42, -83, -250, -9, -81, 178, 106, -200, 171, -37, -134, 3, -146, -114, -116, 111, 29]
5691B9N5m3j7P5k59L21k10q4K75j61j37K06m38J95J34K29k49l34Q11o21j57M38
5713E8Lj57K88n03L52K15p7m90L26O1k49M18l24M10k79nr3J96J6j34R2k87J53
5736a0J47L0J03p1l62K48j83j20L80K8o8l14L74l7j31j40L0J46K39j32j63p4R0
5759A0j9j81p8M88k34l5J68j62j8O1O1O5k40r4L91l38L45j36k2P3q0j23K24j5
5783A11k5k32J80J46k59R8k33M13k92q0k23L04j83L07K77j3j09k9j36l0J57m04
5805b55J29J00j90M20L7m9k85K03k11J12j37J45M0l65M53k06J07K11k91Q4l06
5826b54N41m86L83j69j48J28l2K18l41K26R1K8k74n7K98n08M53J09l60L06k20
5847f8K52l4K1o3K9j07k22L47N4l41r1L25m23L37j3k0j4L27k16l84N67j13m41
$$ y = [29, 84, 41, 24, 99, -160, 161, -49, -133, 142, -19, -156, 50, -388, -193, -59, 170, -79, -413, 398, -223, -380, 58, 61, -96, 192, -311, 41, 256, 179, -311, 15, 76, -173, 245, -79, 331, 52, 47, -46, 150, 166, 32, 124, -163, -10, 137, 167, 270, 199, -163, 85, -98, -218, 162, 190, 122, -192, 182, 145, 14, -126, -96, 50, 289, 157, -6, -80, 10, -9, -190, -268, 220, -14, -49, 119, -43, -61, 0, 61, 126, -114, -208, 183, -155, 190, 54, 32, 105, 25, -98, 126, 111, 86, -146, 34, 180, -79, 19, -214, 199, -93, -173, -396, -92, -275, 32, 309, 296, 187, 158, 22, -8, 149, -255, -126, -26, -216, 204, 241, 192, -93, 110, -101, 11, -126, 19, 59, -306, 147, -59, 48, 259, -32, 52, -254, 287, -199, 184, 15, -133, -5, -37, 181, -160, 66, 157, 185, -89, -146, 152, -356, 97, 206, -154, 152, -68, 184, 150, 171, 108, 137, 30, -192, 155, 209, -132, -223, 102, -321, 16, 3, -17, -31, 296, 80, -304, 263, 150, -291]
5870b91N07o3J80n50K95k54R9R5n5J9K19j37L6j83k41L10O8J30j97k73K65J94
5892A73q5k07m6L88N7k33j54k3J12j52K39j83J9J02K12Mj17k21J06n4m11Q08k70
5915F4j16O9q7j9K8J69k79J81M81n51O1J2o2J04J46j47l14J55J24k6K28k89K3
5938d5q4K05j00M6J95J39k66j72J21J6j32J25j38L22l44K79j21o8n17N31L24n10
5960a94M67k4j89j06J60l65l6K08K60j93N0L9j05k9p4K08l1O5n0r1K74k43J33
5983A34k3m23K95k03K78j72K08j36O6K5l10K50l09K65J19q7J9R8n3J01k57j4m8
6006a77O1J01n4R0P2k87L72K6k72L9l0p1KL07j50l5r6o1j0K39l16N8K90J21l17
6031i8l6J58l01L54k43L60l88N28q7k08j49O0q8N40l76J66n1k05K56l95J11K99
$$ y = [-291, 216, 153, 333, -217, 78, -176, -77, 18, -37, -18, 201, 64, 100, -83, -324, -14, 54, 184, -13, -286, -21, 173, 88, -119, -165, 223, 280, 47, -107, -130, -18, -170, 69, -114, -95, 7, 219, 223, 106, -115, -9, -63, -474, 334, 64, -52, 17, -70, -89, -61, 108, -171, 10, 491, -60, 1, 13, -49, 55, 201, 54, -260, -105, 19, -7, 221, -68, -45, -129, 76, -24, 22, 217, 356, 90, -82, 39, 55, -77, 48, -90, 232, -112, 167, 46, -22, -539, -8, 316, -194, 273, 249, 60, -46, 114, -251, -287, -79, 181, -12, 38, 77, -28, -57, -131, 77, 46, 111, 61, -30, 244, 1, 134, 111, -312, -17, -220, 58, -114, 94, -42, 24, 49, -261, -11, -320, -55, 64, -23, -4, 94, 41, 142, -115, -129, -177, -116, -15, -69, 21, 93, -194, 178, 204, -68, -29, -59, -130, -128, 179, 29, -6, -102, -163, -173, 66, -250, -192, 98, 219, -98, -134, 24, -277, 77, -166, 194, -194, 334, 247, 39, -110, -50, -138, 402, 26, 192, 141, -64, 192, -203, -92, 207]
6053B07l85L9J07rk8L27j46k29J19j4J28j10O8l20K73K1Q9l07j9J3N0J27l21M92
6077A72j26k03L48l87P3k12J72K33o7n0K26j64j60K08K46j92j28n1J3J12L87n90
6099a40K30j45k2K31J6k6j52j88K67n4o1J51j69J36j4j60K37j16R8M8j57j62K19
6122F7K10m30M1rJ38K9l20K88m7j69J51l6J93p0%J40m92K15j62M47m6k9O4j40
6146C3L4p9J69l1k83l4J90L37l31j07J33j71j06J89O0K88j92j19RK92k64j75M8
6169a10k18L69k70J05N1p4k6j67M45m78L71q9M26j93N0l37K87j6p6j12p6J24M6
6192C2nJ15l72K57j98m0K96%L5K1l68J81K53k39j5R0J20j1j48l3j22L5j05K76
6216E5K01o46K75J14Q1m8k71L01J44m79L01k5j01M5j50K36J77j28k06J29j21k25
$$ y = [207, -178, -139, -32, -41, -69, 258, 112, -117, 2, -12, 116, 6, 74, -246, 27, 48, 137, -170, -189, -176, -126, 1, -320, 172, 46, -157, 191, -196, -123, -335, -163, 70, 3, -47, 179, 15, -145, 63, 309, 117, -11, -62, -49, 63, 450, -140, 90, -55, -77, 154, 170, 144, -8, -196, 71, 17, -44, 107, -62, 74, 60, -100, 137, 21, 119, 167, 10, -152, 67, 277, -153, -112, -121, 17, 46, -274, 14, -33, -202, -51, -87, 106, 36, 36, 176, -316, -101, -263, 184, 138, 109, 173, 33, 67, -12, 157, 126, -157, -191, -1, 336, 5, -102, 31, -140, -246, -57, 3, 291, 99, -20, -11, 281, 17, -158, -110, -328, 41, -229, -124, -73, -147, -173, -340, 105, -373, -2, -91, 335, 142, 192, -145, 142, 126, 50, -62, -138, -14, 32, 27, 142, -230, 27, -171, -211, 85, 85, 120, 141, -227, -46, 207, -32, -47, 43, 163, 152, 4, -29, -151, -116, -221, 55, 256, -390, -115, -1, 80, 32, -239, 62, 206, -273, 28, 3, -98, -53, -203, 33, 210, 82, -124, 5, -116, -341]
6238c41K65M2j76L58l05j92L20K41k25l47M73j88L57l69k8pL62j55J78j65r6J2
6260A4L4J71j46M7l7K84k61m47O23l06K1O4k05M02k81L85l76L58m03J26j34P6
6282Ip3J86r8J33J6k63L7J75k59K09J08m10K97k38L59j19j16J19j8j04l12M82
6304A20j8J76n35P2N4r3N17l47j74P4M88k84j64L59l6k26r8k01M15j73K83k31
6326b2l9j85J60n1K76j23k1M8p3Q7k15J08J03q6L2k45J45j79K90K04L2k16P3j93
6350i0j7M3N1N9K5Q5j98j16L00l15J01k9j30N29k59J4j59K68j64l9J05k08j0J83
6374B9Q1j77L28n19J95lJ30P4j5j16J48k13J6j96L12Q5j47J59k80J94p9K76l28
6397d6j75K51k75K08L0K99k04L4k34p3L06l1k40K06m01M30l18J93M4k22R7o9L79
$$ y = [-341, -76, -34, -210, 148, -157, -349, -29, 212, -13, -360, 113, -75, 282, -87, -115, -122, 240, 85, 263, 98, 2, 14, 48, 219, 73, 120, 83, 367, 106, -341, 282, -24, -3, 61, -144, 258, -23, 362, -14, 344, -59, 67, -67, 9, -64, 122, 24, 157, 173, -90, -53, 122, -137, 72, 180, -230, 67, -171, 188, 69, -47, 72, 54, -50, -362, 120, 102, 278, -257, -185, -131, -224, 293, -54, -228, -154, 334, 50, -114, 245, 209, -17, -115, -316, 99, -74, 209, -22, -61, -246, -86, -137, 139, 16, -5, 43, -30, 57, -158, -50, 53, -33, -1, -246, -101, -280, 10, 214, 246, 30, 103, -90, -107, -64, -13, 46, 71, 156, -42, -158, 142, -173, -72, -101, -231, 298, 39, 53, -106, 162, -2, -41, 64, -144, -154, 29, 110, -67, 261, -258, -63, -66, 64, 138, 123, 7, 155, -58, -42, -238, 74, 159, 12, 171, -109, 85, 6, 282, -46, -221, 30, -245, -37, -7, 292, 88, 122, -112, -185, 121, 90, -150, 56, -345, 85, -233, -40, 4, -218, -121, -190, 189]
6420A89j68k71l3L32J32j48J5Q0j67j46J7P8L71k27j45j77M30j89J98k26K06j00
6442E1j70L5J1N5k25J99K28k36j16R3j38J63K73Kl79M9Q0J52j5j70J11j77J73
6465D9K04j52J33m38K11j27oM2J77k47K95j62j54K75j74J48m0j14K86m81K45q2
6487a12J57K93n22J86r4p8K13l0r4K22k7j90k02N29J7k26j01K13o7k60K32O8k19
6510i2k08K3L06j73L00n7k0N5k74O9K04k04R4j10j80R0L43J85k12j73Kk98N23
6533A93k82M5K14j42K4j96P9R0p2j94PJ64N08o54L80O9j85K5j22n2J3J46j77K7
6557i2K97Q2o6j79j91O3Q7N6j25K17l52R7K18kk88NJ39j28j29J32J69j33M1j73
6581b55M23oJ10j38K33m68J69j03j03R7n2r7K08p5j55N0k6r7K62m2O5j82K38J28
$$ y = [189, 21, -250, -283, 49, 181, 33, 48, 128, -39, -185, -168, -90, 281, 54, -91, -268, 162, -27, 171, -55, 151, 51, -119, -84, -73, -18, -243, -44, 184, -52, -168, -75, -213, -50, 223, 225, -154, -105, -25, 127, 112, -58, 53, -124, 49, 253, 101, 234, -204, 7, -120, -126, -84, 93, -154, 141, -21, -175, 100, -74, 74, 34, -80, 206, -275, -30, -112, 45, 338, -184, 2, -92, -170, 43, 13, -81, 141, 114, -76, -278, 251, 268, 42, -59, 154, 87, -173, 59, 127, -92, -300, -277, 29, -144, 156, 99, 79, 134, -140, -71, 133, -71, 23, -87, -267, -177, 166, 351, 139, -34, -32, -330, 193, -89, -44, 170, 28, 52, -144, -65, 25, -47, -241, -234, -70, 438, -216, 164, 233, 48, 73, -49, -101, -88, 58, -119, -92, 205, 287, 221, 42, -149, -86, 1, 57, -68, 149, -203, -106, 112, 110, -178, -173, -34, -162, -291, -159, 10, -123, -82, -255, 168, 162, 272, 134, 367, -101, 68, -35, -138, -41, -93, -190, 18, -57, -212, -162, -188, -285, -23, -65, 0, -182, 56, 184]
6605A84j72j1P5k97J33J06k33J69K2J11j63L48k69LK6J0J21om41K28J60j62k28
6628b86K5J28K7P1Q3O1L87n16J98k27K7j32N1L4K4M29n7k00r1l2m3J22k48O7R5
6653cj04o1M7L97l52J74J07j31q0P3o7J20k55p7M06j40k2J39k67J36m4Rj3K87
6677B79j40m8m04L80k55K40M0j94J21r1O1j40K93p17O62n0j01L4Oq8J47R9k08
6700g4j20K09j22r1n4M18j63j13P7j40K75K24m01K77j58o5J71R3m36L19k44J01
6722a7K07k87Q3j35L43j64k04J38p8K47l3l38ML60o7l49J27J49nM10l00J6q2k50
6746b25K50n6J28j62O2j2j22J87J65l79k2R1M8K7O6j27R0j42O4L81l37J21L1j02
6770B5P7k43K06K3j35J5J21l8n0J96l34L06L9k00j1l1j31K60k36J94r5R0n5M6
$$ y = [184, 12, 1, 76, -221, -88, 18, -215, -46, -24, 87, -76, 272, 3, 6, 32, 42, 163, 157, -284, -56, 104, -58, -286, -261, -133, -106, -35, 48, 109, 496, -20, 178, -49, -22, -154, -103, -69, -45, 384, 327, 127, 36, 4, -39, 83, -165, -98, -3, -107, -168, -121, 276, -76, 98, 205, 74, -6, 67, 0, 120, -135, -212, 194, 54, 32, 171, -96, 40, -4, 5, -8, 279, 139, 91, -313, 67, -188, 52, 92, -102, 19, -72, -11, -151, 142, -575, 87, 37, -64, -30, -24, -112, 35, 134, -74, -194, 15, -107, -198, -252, 166, 3, -110, -33, -173, 102, 326, -75, 202, 44, -21, 150, 243, -193, 126, -118, -17, 190, -97, -14, -149, 194, 30, -174, -36, -114, 133, 100, -238, -234, 126, 59, -290, -163, -14, -19, 391, 91, 107, 25, -225, 25, -31, 97, -65, -3, -15, -137, 50, 215, -164, -186, -95, -47, -20, 46, -81, 9, -133, -69, 312, -25, 96, 127, 25, 102, -141, 65, 88, -47, -32, 89, 51, 1, 197, -137, 169, 208, 8, -3, -34, -165, 95, -141, 53, -42, 48, -7, 39]
6794C9j69j15K88J65k72K85k24p9J92n8K08l94J99j25K77l42L79N9m27l3K96j47
6816Bj87N6J55n0n1L72l91j22K18K78k35lk53J6L64l66N72k03j11K42k56J54j60
6839D1j23K48j14j89K13r6Op2J47j80qJ91N7l25J37J60j43M8j89j51K44l4j7M
6863a45J49j81N6k3J22l61M14J30J03j82k22K69J40l77R9j02m2K98m0m72L69J52
6885A54n6l26O1J43J40O5L02m44j36M1q3K78l42N21k78l21L12J33k86J77K49j22
6907A82p5m8j27L19Q7k23q4Q1k45L01l62J1M41j54n8K99m87K5j41K42l7L83j35
6930A95j71K09k01p6J32j59j8L39n9n1q7K6k60J73K9j75M0lO5L7k70J10J05K87
6954B17k6ok28k42P3k65L29J86k10J86j98J56O8k62K40k69J99K8k52L83k27k78
$$ y = [39, -130, -245, 43, 208, -64, 221, -3, -82, 110, 52, 260, -134, 65, -60, 217, -125, 254, 313, -114, -147, 149, 2, -185, -129, 26, -24, -75, 297, -94, -216, 2, 280, 45, 42, -211, -195, 169, -197, 375, 172, 61, 303, 47, 201, 41, -82, 166, 52, -137, 76, -20, -14, -86, 61, -119, -127, 64, 121, -204, -67, 93, -50, -2, -191, -342, -98, -132, -149, -145, 4, -177, -121, -144, -22, -383, 31, 161, 264, 82, -140, 129, 269, -108, -9, -111, -153, 145, 105, -367, 2, 154, 98, -228, -167, -24, 116, 181, 483, 39, -97, -56, -139, 139, -203, 318, 40, -281, 31, 164, -122, 55, 304, 182, 107, 59, -68, 251, 338, 115, 31, 112, -133, 168, -194, -183, 258, 104, 46, 345, -142, -117, -258, -16, -53, 330, 195, 24, 233, 32, -44, 88, -71, -89, 250, 191, 140, 53, 79, -181, -8, 21, -154, -114, -117, -52, -15, -285, -175, -70, 217, 191, 185, -43, -285, -212, -477, -148, 38, -172, 14, -184, -28, 40, -222, 18, -251, -52, -24, -276, 107, -120, -398]
6976c98M72p4o2j2L3K14k07j19K1J79j16j5N3j25j82j03O45k09j17L09l25K60
6998A22k00J64k68n3J24J02k05j1O1N5p4R2O8L2j49K69j24J29l9J60k73N6n6Q
7022a0m5J73j26j98J86K75k82j9m0K67j41L3P7l17J81o5J70J01l8n5j66O0k28
7045b07J60J3m6j3K1Q2L9Q3l25J28%p2J64J7k00r0K61j48K51j8O0l7K17l27j25
7070a12L08k14J91j51j40K80j45K7o1J71k37j3K99m2k84n6N14k22M3l68K98nj59
7093g8j57J56K97j21j46M1P1k2k24K08j50M07k46k19J48M4o1Q7J4pP9k90K23k54
7117b00j42L79J21k29J42n5ml67J85K22N7N8j01k46J35o4M0j18L89k18p8q4P3
7140a05Q9r0K25k87j1O1p2P5j79M15L6l13K69j42p8K06r2k30M58l53M46k89k31
$$ y = [-398, 74, 0, -62, -74, -41, 173, -34, -153, -132, 47, -69, -84, -31, -156, -338, -441, 204, -5, -122, 187, -138, 122, -78, 86, -182, -235, -111, -9, -214, -225, -164, -109, -183, -91, -23, 9, -140, 129, 5, 134, 95, 255, -18, 38, -18, -10, -55, 118, -8, -206, -20, 255, -27, -46, -86, 181, 40, 73, 150, -167, 14, -51, 119, 220, 182, 127, -39, 21, -207, -47, -34, -80, -93, -72, 10, 49, 132, -193, -65, -65, -137, 27, 44, -156, -246, 15, -133, 118, 100, 160, 123, 340, 13, -112, 196, -18, 173, 22, -118, 162, 17, 44, -17, 154, -83, -96, 203, 161, -123, -179, 335, 113, 156, -212, 86, 81, -78, -235, -79, 218, 97, -49, -8, 63, 41, -183, 25, -125, 282, 36, -183, -35, 9, -52, 35, 49, 42, 121, -169, 54, -200, -342, 37, 158, -71, 71, 16, 12, -355, -170, 52, 109, 167, 66, -180, -45, -109, -69, -187, 202, -16, -94, -178, -105, -16, -106, 119, -168, -179, -118, -190, -115, -294, 121, 157, -156, 113, -29, -107, 99, 7, -223, 235, -118, 328, 39, -192]
7163a92J12J53j99K32j44n2K53R7n23K67N4m09K68M7Q9j25J54J05l7j51qj25L78
7186B44j57j94M5J39J79k03m48K29M48l44%O7r4O0J71k44q1L22k83J29K8j9%p1
7210g7J49j28K03q1p1P7m2J16m53M99l69J01Q9j56K71J85k40j97J98j74%K07m3
7233F4n3j61J69J30R9k19k54K42o4k0L06m79M13l97M42k65J45j95k04M33j24m6
7255c8O6O1j58J19p1k2M3K57l02J2j86J01J05N8o2J89k37J35k58Q2M11k56k1K01
7279B29k08j4j28J81o7l1J35P3k42L68l25L11k24j07k75K83k1J31J9Q4m58L42
7301E6k01K7K60j30q4n6J84j02K25l53J9j3j6J53N5J42p7j27P2l46K78M00m59
7324i3P8Q3j64R9J76j93Q1K00j30M1k05P9j16J88j56J48q5K4j04J57r2j10K44
$$ y = [-192, -80, 73, -126, 106, -38, -90, 163, 260, -263, 4, 58, -351, -83, -36, 53, -72, 82, 187, 150, -1, -9, -134, 244, 87, -107, -62, 77, 256, 53, -395, -166, 282, -62, -62, 5, -89, -29, 142, -102, -183, 139, -144, -15, 13, -6, -6, -77, 72, -56, 147, 66, -5, 72, 30, 146, -307, 192, -177, -76, 13, -143, 128, 313, 73, -124, 74, -100, -100, 107, 64, 11, -150, 19, 149, 248, 29, -225, 17, -47, -67, 239, -240, 173, -224, 218, -47, 98, -97, -301, 132, 8, -38, 28, 89, -69, 50, -21, -43, 0, 257, -45, -33, -219, -118, -13, 45, -17, 172, -65, 70, -188, -106, 305, 49, 28, 229, 21, 7, -121, 60, -7, -38, 97, 170, -72, 296, -29, 282, 58, -49, -324, -41, -62, 69, 88, 172, -286, 56, -145, -118, 142, 12, -72, -128, 56, -46, 179, -174, -155, -168, -184, -31, 24, 166, 89, -38, 34, -312, -34, 366, -93, -15, 68, -96, 3, 179, -14, 67, 267, 137, 178, -27, 52, -64, 124, -32, 116, 31, 55, -49, 108, 16, -94, 150]
7347A50j95P4p6nJ04J65m03J09J78jk04j61L29l36M44l41J71K75k88j9q3J12j13
7370a14J03l7K11l32K01Olk84R5K67l28p9L38l8lN2p7J45J6r8P2j86J15J38m6
7395A34j36K8O7K08j93j91j00O2K42J70j81r0n7J9J45n5Q7J95l97J15J6J27k76
7418f1k9k10M77L2j47J3q7m3L6J61k65L75k21k24j79L39j72M08Jl23K18K0J14
7441B33j95k48K60k47J53J44j4j18j05K62l18K44J24j54l0J89l0j11J4j13K84
7462B24m24M30l09L3J16j5k07n0R3K32m6j20k5L36j53j66K39Q7l32k9N0j35k6
7485a97LJ70J37k17k6J48j38J6n5K27k07O7L7m2J22j30K33l90J09j87K83m1j21
7508a99J26J43r7l07L58J72l3p7o2L6j19p9J25K4n0k06J89J22k54K28j36K51m40
$$ y = [150, -45, 29, -47, -52, 52, 217, -186, -77, 101, 100, -104, -265, 64, -272, 172, -169, 2, 277, -11, -30, -113, -1, -114, -11, -48, 163, -169, 32, 38, 35, -249, -154, 113, -215, -294, 44, 6, 3, 55, -22, 123, 139, 41, 113, -73, 42, 180, 134, -2, 26, 93, 301, 108, -83, -183, -121, 121, 291, 110, 20, -37, -18, 127, 72, 159, 354, -43, 72, 88, 215, -61, -90, -300, 177, 209, 62, 75, -12, -55, -19, 142, -123, 252, 31, -193, -372, -33, -205, 203, 204, -119, 99, 119, 233, 38, -210, 50, -197, -44, 100, 86, -32, -137, 125, -193, 51, 175, 21, -9, 180, 150, 39, 53, -60, 224, -200, 230, -79, -46, 70, 55, -152, -202, -109, 123, 77, -43, -68, 268, 115, -51, 188, 275, -57, -86, -36, -171, -197, -194, -24, 113, -104, -130, 18, -120, -104, -159, 68, -139, -72, -35, -77, 45, -85, 148, -242, -133, -320, -37, -78, -199, -73, 70, -27, -334, 24, 196, 163, 86, 24, 60, -59, -138, -13, 11, -39, -245, -56, 66, -188, 40, -96, 155, -285]
7531b85N50m70J09R3Q4k80L39P6J05k56j12l12K65J19J13l1N8k88J20j22L96m54
7553a83K17Q4O0l56J16k81J4M10l6O2j86J18K6J73q3l65J66O5OM3qP9j18k47P1
7578a53K45M4J68l44J25k78J22K47n45K37Q3k10M58k69K43k09j30K11j07N8Pk89
7600b86M17j61K67k14k09o7R6j4L98J64m62K34l73K18r2l6o8O31n78M5J82J86
7622B78m67J45j27J18J54j5P8j50R3o4n0j65J22J06L8l83L56j29J26k39q0K03
7644e2L75k56o2MN5q0L9J13k45L31k22q1j07L18j02k75O41m47K23Q0k95J50M3
7667A48jN6j84J11K37l64J95j41j4K10l69j8q1L21q9J08r7p5k79M86j06p2j80
7690a98J64K07k88J09k27L04n4k28l7N23o40M50r4J46k62K39m4J42j32j10K01
$$ y = [-285, 265, -205, -96, -3, 81, -199, 140, 216, 321, 65, -47, -359, -94, 25, 138, 107, 165, -123, -3, -125, 271, -183, 34, 118, 178, -178, -62, -343, -329, 81, 45, 107, -79, 39, 65, 238, 155, -210, -44, 21, 27, 70, 62, 141, 23, -224, -153, 92, 136, 304, -40, 85, -193, -71, 176, -369, -132, -49, -259, 199, -70, 173, -36, -166, 45, -62, -4, 3, -286, 131, -30, 237, 23, -186, -253, -157, -171, 227, 391, -71, 163, -210, 8, -84, -120, -188, 443, -135, -90, 92, 278, -189, -44, -171, -53, 101, 86, 164, 14, 107, 43, -7, -172, -50, 56, 94, -289, 67, -62, 64, -175, -255, -52, 323, 67, 5, 9, 64, -16, 23, 136, -109, 222, 0, -81, -188, 130, 28, -247, 394, -53, 170, 250, -45, 105, 148, 147, 203, 19, 130, 367, 3, 198, 57, 43, 253, -116, -134, -215, 106, 17, 125, 28, -47, -326, 160, 54, -18, -198, -34, 173, -115, -6, -233, 71, 17, -211, -248, 275, -365, 85, -9, 137, -125, 114, 70, 212, 80, -30, 171]
7711A71P6k77j11M60m73L32j41J17j24Qk65J75J0L62m49K29j07Q3j78J46J58j06
7733I6K16l34l35J63L01j72J8K98k59j48J88k36k9N50k99R6m46J52K48k31J91
7754B8n4l2J83j76NN5j56L9L8m4o7J53m8J42l1Q4k8k1k35N33l87K72l17J76n9
7779E3O7m3q5j21R1J15j3j96L23k44K10j1j26o0M4J03k21N7k9J09l05L06J41k33
7803f8J34l82K55j44J76J07k72J68j71J63K17m89J46L09m58J49J3L83j6k88l2
7824a00K86l03J93R9l42K09L35l05r7j25K9M05m53R7K20j97J70k61K45K01j65
7845A41k5j76O2J18k93jJ38k3R5R6l01K34J18j10j93R7j06J28N3K27n88N19l38
7868a28J8K08j5K49n02Rq2L78k25K9rKK81l03m7J77j26N8J9L09l22L3O0j24J67
$$ y = [171, 247, -30, -141, 319, -154, 178, 37, 154, 30, 38, -227, -52, -42, 320, -129, 100, -7, 76, -102, 44, 202, 96, 312, -22, -357, -194, 107, -65, -47, 251, -8, -156, 32, -204, -233, 317, 18, 114, -332, -180, 68, -163, 28, -26, -58, 125, -51, -46, 9, -147, -108, -70, -114, -181, -28, -76, 66, 35, 119, 91, 70, -165, 368, -19, 253, -64, 112, 53, 120, 77, -8, -129, -38, 77, 64, -132, 191, -53, 157, 146, 20, -40, 4, 107, -114, -57, -86, 23, -282, 24, 165, -68, 66, -316, -61, -205, -29, 78, -194, -26, -197, -34, 183, -306, -160, 149, -309, -160, -147, 236, 220, -68, -100, 186, -117, 76, 175, -167, 42, 377, 72, -25, -150, -121, 284, -169, -72, 148, -49, 121, -140, 105, 306, 141, 116, -60, 2, 120, -173, -174, -36, -59, 36, 132, -169, 65, 183, 73, -120, -23, -129, -1, 52, 279, -309, 210, -128, -110, 98, 83, 332, -170, -161, -243, 135, -90, -61, -70, -68, 213, -90, -137, 40, -86, -28, -9, 300, -22, 11, 71, -53, 114]
7893A14p0o4k2K07N7k42j09K43m64K20K46p9q6o4L9M7J81p8k09J01j38l49M89
7916c0L5J05k80L42k48L0j4j52J14q2L43Q4m34L00j22K13Q5j23o3J53l10P4r7
7939g7j7n5K68l93J60J15oJ64o9k24K25o5k25R1J6LnJ03K0J6L2L9j01%JJ8J50
7966A84J41m86L3J06K16k01j66J27k07L39R8n78M09k7L80q3j80P8j24m2o2J1O3
7989B9Q9j83j9P0K02k16l73K29J16j86K88k9j78N1j8j20J06j0K75k61R7J19q2
8012do7J62k41K12l32K78n1m68P52j47J01m00J46K44l1l79q8J89J50J44k96K62
8034A36p9l11J18J53J24l28n7J08j51M90j41rj71J67j77L30k48k08oM02k39Kk23
8057c18L04M8j32K7K00k94J72J06k6q1m71M55K58l35r6Q1n0M6K09j04k26J70N8
$$ y = [114, 44, -20, -42, 165, 222, -20, -129, 114, -350, -130, 116, 37, -49, -113, -74, -27, 154, 76, -133, -32, -170, -519, -30, 5, 110, -170, 172, -76, -46, -60, -212, -98, -180, 163, 247, -187, 113, -9, 204, 289, 166, 103, 256, -54, 20, -77, -94, -149, 119, -274, -114, 1, -5, 159, 90, -134, 91, 26, -199, -108, -92, -89, -94, 9, 29, 45, 77, 116, 15, 15, 16, 34, 184, 325, -161, -128, -22, 194, -7, -173, -46, -253, 86, 184, -394, 15, -12, 368, 285, 105, 183, 59, 17, -45, -34, 29, 118, -65, -84, -14, 188, -28, -401, -172, -56, -242, 46, 17, -161, -110, -128, -248, -142, -152, 123, -138, -41, 78, -4, -71, 91, -150, 62, -270, 8, -43, -511, 241, 94, 195, -205, -59, 185, 154, -225, -313, -124, 26, 170, -126, 136, 57, -254, -136, 17, 141, -187, -244, -136, -287, 203, 62, 53, -118, 49, -128, 202, -46, -254, -260, 142, -97, -95, -318, -14, 34, -98, -71, 129, -165, 7, 113, 87, 6, -465, -10, 248, -87, -183, -102, -152, -106, 103, -1, -227, -57, 1]
8080AJ51k8j85k1j63J70N0K9J66K05m26M58l61k72J55J80k07J35k27L40m37L03
8102A6Jm3K82j89M4o0q8M4j96J45j53N8L03l10J14J18q8R9j17K26p8n6P6l8l66
8127b56K74k09J38L77n37M50J3k01J77k41P4J76j59m4m9J63k60K00k12j9K82q5
8149E2Ol66K92k83M23j84N4n2r5J05K12j57K9k10O5J82k42J21j44N94l17n6o8
8172c9J40J68J89n92n8J78o0K55k5L3l99K60J06l53J03N7J33M6k56
$$ y = [1, 152, 124, -61, -82, -245, -75, -25, 4, 170, 375, -51, 407, 46, -226, -71, 109, -98, 37, -190, 150, -287, 16, 17, -26, 256, 67, 111, 51, -37, 7, -189, -44, -197, -139, 164, -146, -32, 86, -2, 97, -20, 206, 128, 72, 148, 110, -256, 18, -191, -53, 324, -213, 237, 250, 49, 226, -15, 59, 235, 76, 32, -17, 146, -114, 86, -126, -145, 137, 52, 58, -308, -16, -299, 124, -60, -6, -58, -153, -48, 164, 7, 36, -174, -109, 73, -169, -48, -192, 402, 85, 29, -39, 101, 269, 458, -134, -192, -14, -74, 181, 156, 189, -210, 50, 156, -197, -94, -37, 96, 142, -114]
8191a14
$$ Imaginary data points
##PAGE= N=2
##DATA TABLE= (X++(I..I)), XYDATA
0@%%%%%%%%%%qJ6j6J6j6K3l1L2l9M7n5O4p3Q7r7J09j25J44j66J87k10K36k64K93
34A54l28L69m12M57n06N61o21O88p63Q43r32J037j153J283j435J608j814K062
52A098k362K741l237L912m893O457r340J6419o6948r5584J35097J24682l0183
65G7859j33762m2220P2191Q3244m80n1849m4379K077L6584M2225L905l8398m9109
78d2112n604M7433N5816o808p4832o0875M0814J04943L4103r4404j00358L4759
90f7125J28378M7399r2256j01677K1038J00725M5752n5526p3869r058M8811M3513
102C6105p43l5699l5782n832L3589M7792J1302n0257o0684J1123Q5465N2447o0550
115B8276j00277l711R9787O6251n5414r7489j3271P5219O1724j8938o4430l4366
$$ y = [0, 0, 0, 0, 0, 0, 0, 0, 0, 0, 0, -8, 8, -8, 8, -8, 15, -16, 16, -23, 24, -31, 33, -40, 47, -50, 59, -66, 78, -88, 99, -111, 125, -139, 154, -174, 195, -217, 240, -266, 295, -326, 362, -401, 442, -490, 547, -606, 677, -758, 850, -964, 1098, -1264, 1477, -1760, 2152, -2741, 3716, -5624, 10795, -56153, -151737, -16640, 108042, 77859, -55903, -98123, -25932, 57312, 56832, 4983, -39396, -37319, -735, 41490, 45395, 6997, -42112, -47716, -283, 55533, 48725, -26107, -86982, -46168, 58775, 92878, -1526, -101884, -67125, 61253, 108652, 16396, -85281, -64243, 36482, 82234, 26708, -47161, -56219, -7408, 36105, 35362, -337, -36119, -41951, -8362, 39430, 50732, 475, -60209, -49086, 36379, 88826, 28276, -72001, -75712, 24075, 90326, 34912, -62577, -75848, -629, 61095, 42157, -22273, -56639]
127e6639K8533N6104K4351l1431n0926j3007L7296M6602N753m3968m9413r45N7272
140I582N3086k4831q3060l4493O8555Q4697j4234r3884m3242O1942P6698m740
152E6076o5247l8545K0799M4339K1647j5994l8438k7445J5176M8099K6414l1617
164A5264n6929j1852N3254N7687j0291p0482m2761M3084P8335J0414p2205o1371
176f7853K8664P6296K2504n3575n5240O611M8730L1918j2945l6692k2871J1529
188b2924L6488K6696j4271m5396k5573L0182N5298J1452n4638n6904J6453P2872
200B9735L4919n2271p0998M523P1783M3130l6403n9965q816M3745L8062m385l4631
213a572k8198L192L1714K9393q161m1297k9218K0636M9404J9465l8051n1301K22
$$ y = [-56639, -28106, 27998, 52349, 20918, -30008, -43015, -5719, 40883, 46636, 2668, -46745, -47690, 9582, 62668, 37837, -45223, -79716, -11161, 73536, 59302, -34582, -77824, -15882, 60816, 56076, -9171, -47716, -26917, 17422, 39069, 23075, -15363, -42808, -27632, 20467, 46881, 15264, -41665, -53517, -263, 57424, 47133, -23349, -66110, -23026, 55309, 65723, -6482, -67853, -39189, 37107, 59611, 6036, -49204, -42593, 6137, 38055, 25110, -11582, -34453, -22924, 13564, 40260, 25989, -19407, -44980, -14798, 40500, 51952, -2686, -59590, -43137, 29735, 64654, 12383, -58615, -54092, 17691, 60821, 24418, -35547, -44363, -618, 37444, 33059, -1572, -29770, -26578, 5136, 34529, 26368, -14929, -44147, -23511, 25893, 45358, 7307, -43994, -43772]
226d3772N5918M4436k5377o5023k0068N1310N4734j2340n9588k9238L2223M5283
238B8498N790l2189l0936r05K6175L0479K681l2446l3078P721M5781K9430k6743
251B0258n2498j2529M5460M6886j2424n6825l0768L4945N4766L975m8400l6672
263d3826J8070M4866J7077k3759l2253p735K1119K8429Q478k3698l4509m457L5715
276C517L4754j1806m8549k5096L2731N1234M208m9197l9052K0751N4377J8146
288D6018l8869m3324N083M2532K4629j8378l3959j1795J6604K5263J0916j4858
300I862k9450j2211K4815L7033K748l9782l3385J7693M9404J7481l7281m5994
312c9067M812M7894K9826k5423m7221r071L6921L3114q487l3916j7812J3863K6645
$$ y = [-43772, 12146, 56582, 31205, -33818, -53886, -2576, 52158, 39818, -19770, -49008, -16785, 28498, 34288, 2099, -28837, -29742, -3567, 26912, 29593, -2853, -35931, -28210, 17571, 47001, 20258, -32240, -44769, 691, 47577, 35153, -21672, -52440, -17495, 37271, 41246, -7154, -43826, -25756, 19110, 36187, 12428, -19825, -27560, -6441, 21988, 30466, 6768, -27741, -32198, 3517, 38271, 26465, -22084, -47180, -14449, 36785, 40993, -8204, -47256, -26505, 27872, 46018, 7149, -36175, -31092, 11440, 36069, 17691, -16268, -28063, -11459, 13804, 24720, 9862, -19588, -31799, -6984, 30049, 32797, -6985, -40370, -22677, 26727, 44208, 6927, -39067, -34255, 13639, 43465, 18042, -29179, -38250, -1329, 31785, 23298, -10618, -28430, -14567, 12078]
325A2078J2958j1744k4755j4494J4966L1918J1423k8360l6579J868M2230K8774
337D0283k3604m6917r536M0305L7585j1559m4349j9782K7102L7744K515l0659
349h72k5440Q129K6065J5433q768k2974j5633Q396K7149J6445j7255l4906p564
362c1795L2608L4303r527m2615k1183K8466M1485J454l9327k8992J5971L7610
374A8458J2435k5135k9251k94K4554K0538m148k1237j6949M978K3518J7926r496
387A5897l0134j5213K1593L5067K638l6295k9289J5959M0448J3112l0458l4447
399c1122N220L5326K1111j6637l0958p815K1352K2979P41j9707j8495J136J9144
412B275J8994l846k5560j9232J2511L2591J1661k6099l2518L923L6736K2766k0440
$$ y = [12078, 25036, 13292, -11463, -25957, -10991, 20927, 32350, 3990, -32589, -30721, 11509, 40283, 16679, -30238, -39774, 531, 38116, 26557, -17792, -37574, -10472, 27272, 29787, -872, -26312, -18183, 7882, 23315, 14547, -8427, -24060, -15664, 11485, 27930, 10675, -24231, -31795, 813, 35116, 25589, -17026, -38209, -9743, 31742, 33196, -6131, -35123, -19152, 18458, 30893, 5758, -23493, -23787, 767, 21305, 17157, -4080, -21029, -16051, 7467, 25393, 15897, -14237, -29450, -7857, 27210, 29848, -6447, -35736, -19777, 20671, 33783, 3325, -31122, -25902, 9424, 30535, 13898, -17060, -24875, -3523, 19456, 20197, 490, -18005, -16869, 2275, 21269, 17423, -8137, -27369, -14858, 17733, 29394, 3295, -29223, -25300, 11436, 34202, 13762]
425A3762l6433o097L0178K7218q693l0842j4792J5909K4304N817j6556j9978k449
438a8652J6682J9061J010k0103k0297N313K7339J7825j6288l2909o708K9322K8158
451B9753r453l4778j6140K2022L0621J552k7755k0505R300K5440J1631j3084k0740
464a2136n960J3584J9133M238j6175k0662r63K2231K0571q151k9526j3784K0246
477g354L0257J239k9490k2688J2869L1256J0392k1716k5691J406K3973J6849q632
490A2670k1742r976J0138J9179P660j2721j9391n387J7599K1220p45k4272j9090
503b4858J2305K8924R115k2312k6115K979K8010J6927j4750k5940o492J9255K0616
516A7664j717j9631j4483N824J9124J1587q585j9505r125J3204K1033M711k0489
$$ y = [13762, -22671, -28768, 1410, 28628, 19935, -10907, -25699, -9790, 14514, 20331, 3775, -16203, -18652, -1970, 17091, 18101, -2002, -22299, -16986, 10353, 28178, 11890, -21019, -27727, 1595, 29753, 20300, -14478, -30618, -8596, 22025, 23577, -4178, -24683, -15383, 10057, 21688, 8604, -12136, -18096, -4512, 14621, 18859, 2684, -17978, -18941, 3290, 23861, 15710, -13816, -27600, -7354, 22903, 24142, -5348, -28036, -15167, 16089, 26481, 4765, -20926, -19520, 4453, 21302, 12670, -9072, -19048, -8910, 10269, 17929, 5208, -14183, -19570, -1971, 19249, 18504, -5768, -24858, -12553, 16371, 25486, 3174, -22941, -19962, 8048, 24975, 10225, -15715, -22207, -2952, 17664, 15947, -3684, -18167, -12343, 6781, 18368, 9783, -9722, -18847, -5643, 15390, 20101, -388]
529c88k1209M983K6058J4732j5741k6624l971K2954K1056o724k5073j1155J3762
542g340K1610L940j6540j6988J115J7068J2924m191j7205j2083P659K0088R402
555A9459j4313k1720l159K1765K0786q135k6596j1642J8973K4125o8k3869j6359
568b0753R603K1587P340j3438j7103k258J3751J4161j83j4216j3195K617J7408
581E321J2569q283k0228q332J5215K1201O38k2293j7936J0036K5121Q452j8703
594B778k1596K246K2174J3749j0242j9643o007J3033J5779J240j3063j2760P84
607a1528J3438J2407l355j7352j1364R249K0235O614j6585j9684K508K2128J3816
620B0527j1509k1974m812J6541J7992k704j9132j2051Q658J7442O412j1373j5940
$$ y = [-388, -21597, -16614, 9444, 24176, 8435, -18189, -22160, 794, 21850, 15126, -9947, -21102, -7340, 14270, 18210, 1670, -15318, -14203, 2865, 15789, 11598, -5607, -17690, -10031, 10057, 19459, 5146, -16574, -19733, 2032, 22818, 14683, -11913, -23555, -4582, 19543, 19475, -4394, -20753, -11150, 10437, 17777, 4339, -12764, -15022, -1271, 12890, 12707, -1509, -14704, -12087, 5321, 17890, 9607, -10621, -18953, -3738, 17463, 18101, -4192, -22128, -12092, 13029, 21481, 2778, -18818, -16572, 5602, 19351, 9109, -10534, -16541, -3508, 12271, 13511, 448, -12312, -11528, 1910, 14317, 10962, -6390, -17754, -8505, 11730, 18344, 1759, -17925, -15417, 6711, 20527, 9018, -12956, -17768, -1227, 16765, 14061, -5071, -17122, -8464, 8978, 15390, 4017, -11923]
633a1923j966J3376J3745j587j5020j1725N820J7069R106j0575j8847l760J6765
646D78J7216m844k0916j0773J2475J9931J486j5878j4106L899J6322Q980o551
659G719j5182o576R205J5616L227j3059j4520J103J6657J1933p757j8163o686
672a6483J3213J6915O51j6855j3769O509J8383P743j1637j6770j255J4419J2815
685A3879m208j4850p840O649J3671N116q762j3067l582J1966J3955j069j5629
698c771j1580P389J8449O095j4403j6776J612J7758J1349q827j6664m700J1414
711b655J3599K02j2775j0635L280J3996P950p048j4023m286R892J2925O31j2131
725a078j1128K664J3985R344p001j6333n325J2865J5588j360j6965j0604Q548
$$ y = [-11923, -13889, -513, 13232, 11645, -3375, -15100, -9280, 7789, 16895, 6320, -12527, -16287, 478, 17694, 12850, -8066, -18839, -6364, 13567, 15053, -825, -14931, -11032, 5290, 14270, 7719, -7463, -14039, -4834, 10782, 14009, 950, -13570, -12467, 4190, 16123, 8366, -9797, -16483, -3270, 13645, 14296, -2559, -16328, -9819, 8564, 16307, 4670, -12100, -13355, 1064, 13879, 9671, -5179, -13019, -6370, 7301, 12417, 3655, -9412, -12994, -1028, 12927, 11858, -3771, -15351, -7962, 10487, 16582, 2179, -14597, -12985, 4773, 16122, 7295, -9369, -14069, -2655, 10944, 11146, -1629, -12264, -8984, 5012, 12962, 5914, -8109, -12395, -2503, 10422, 11053, -1078, -12206, -9542, 4443, 13787, 6786, -9547, -14872, -2007, 13581, 12221, -4744, -15348, -6800]
738f800J6410M193j2481j3067J193J3209R469m193j3071p134P265J3368L316j0340
752A337j2261L70J2945J0023m771j3654o288P868J3577L112j1682j2207J640J3864
766C873R552o596j5348m276J0822J3410l94j3987r721N551J3548N558q022j2842
780h872j906J0669J0471j290j1857q992N092J3422M619q791j2103r57J1499R922
794A0926k774j2354p127O053J2358M468r090j2401j29J2408J0122n000j4335n435
808a2310R519J2348P40j1756r209L119J1668O669n479j1962l824Q580J0968J56
822I227j0991r009L731J1844N807o731j1279k565Q999J0854l82j2355q371M625
836f596J3143N090r095j1756l25J1093R146l518j2220n769P118J0829K398q913
$$ y = [-6800, 9610, 13803, 1322, -11745, -10552, 2657, 12126, 7933, -5138, -12272, -5007, 8361, 11677, 1337, -10924, -10554, 2391, 12414, 7643, -6011, -12299, -4431, 9146, 12258, 576, -11631, -9991, 3873, 13425, 6829, -8519, -12795, -1973, 11437, 11043, -2944, -12665, -7114, 6434, 11992, 3970, -8872, -10778, -109, 10362, 9072, -2785, -11777, -6685, 6737, 11356, 2565, -9538, -10495, 1004, 10926, 8152, -4202, -11329, -5276, 7082, 11550, 2460, -9941, -10070, 2338, 12460, 7460, -6875, -12310, -2791, 9557, 10297, -1459, -10668, -7549, 4119, 10788, 5309, -6653, -10477, -1897, 9071, 9227, -1764, -10773, -7042, 4802, 10609, 3878, -7401, -9966, -967, 9887, 9505, -2850, -11221, -6596, 6547, 11637, 2542, -9214, -9539, 1554, 10700, 7182, -5038, -10807, -3689, 7140, 9538, 625]
850F25j0181J352J0567P659l954j1276m923O961J1096J876r697r779K012J1122
864C460P005n604j1584l376Q082J0811l14j0039q487L439J1302N833o946j0961
878g379j560Q893Q928j497j0324o466M275J0363M466p069j0538j280R851R013
892I676k899j0939n502N890J0400K591q368q887O03R631P254l624j0917m420O424
907c087J0104J426q826q169J460J0360O292m979j0259l210P024R778J95r378p838
922i107L088J0363M826n830j0139j681Q407P969j151r232o323L868J0153L595
936H806o570q915j045Q251P708j714r906n403M963R418K962p404r034N45R509
951B171O440l644r594l947O042Q964J620q127p785J575R064N701m453r282l095
$$ y = [625, -9556, -8204, 2363, 10022, 6068, -5208, -10131, -3170, 7926, 9802, 105, -9674, -7662, 3460, 10465, 4861, -6723, -10099, -2017, 8794, 8480, -1559, -10046, -6607, 4695, 10528, 3582, -7379, -8939, -46, 8882, 7385, -2939, -9405, -5130, 5233, 9699, 2630, -7908, -9188, 663, 9676, 6777, -4162, -9664, -3774, 6626, 9217, 849, -8038, -7435, 2196, 9450, 5826, -5091, -9511, -3087, 7017, 8443, -383, -8552, -7092, 3268, 9560, 4581, -5678, -8888, -1864, 7914, 8109, -1269, -9107, -6019, 4344, 9170, 3340, -6799, -8480, -73, 7896, 6745, -2487, -8810, -4942, 5211, 8806, 2236, -6679, -7724, 527, 8235, 6521, -3385, -8788, -3825, 5593, 8555, 1151, -7883, -7338, 2171, 8611, 4967, -4627, -8574, -2532, 6432, 8052, -75, -7860, -6285, 2779, 8480, 4027, -5255, -8350]
966h350O851Q461j59p897p171K875R031M470m879q819k225P317Q123j103q757
981b232n964L834Q894L366o275q051p78P868O935j857q818n091M790Q607K330
996G558o716p582R5Q110O385l187q978l854N674Q355J505p391p394J958Q116M799
1012G453l785q798k383O185P676jp518o286K511Q660L884m931q242j495O713P140
1028F783p69q178n452L581Q145L253n458p768q10P552O391k182q096m519M442
1043c085P911K174o256p079L45P224N855k708p953l460N084P183J553o567o750
1058f529J312P237N128l588p767l035N794P386K9p282n621K376P886L620m389
1073B557p379j618O090O548p53p258m943L203P214L099n207o765r28O599N925
$$ y = [-8350, -1499, 6962, 6803, -1094, -8265, -5390, 3641, 8111, 3232, -5587, -7812, -495, 7628, 6525, -2232, -8196, -4362, 4532, 7898, 1623, -6428, -7206, 662, 7597, 5740, -3078, -8169, -3379, 5228, 7558, 842, -6740, -6645, 1465, 7850, 4663, -4315, -8169, -2495, 5860, 7365, -26, -7420, -5462, 2654, 7453, 3668, -5130, -7513, -1328, 6348, 6347, -1171, -7457, -4946, 3714, 7598, 2667, -5575, -7070, -357, 6783, 6014, -2164, -7616, -4035, 4110, 7363, 1905, -5863, -6673, 879, 7270, 5088, -3008, -7527, -3085, 4826, 7000, 744, -6335, -5990, 1234, 7089, 4381, -3572, -7032, -1948, 5235, 6788, 221, -6529, -5217, 2020, 7148, 3560, -4207, -7242, -1448, 5938, 5967, -1315, -6936, -4560, 3326, 6946, 2557, -4822, -6440, -350, 6198, 5445, -1813, -6756, -3553, 3661, 6760, 1553, -5212, -6140, 459, 6384]
1088F384j645p174m552M237P292K032n901o616P56O812M757k816o996l070M560
1103a940O835R82n731n932J053O772M350l284o917k373M997O443L71o443n432
1118f249K069O975L712m171o670j705N941N651n80o819m301L271O602K391m718
1133A399o285m32N774N413j904o006m190L241O928J811n001n792J59O151M765
1148F031k308o738l137M393O528P25n735n262J383O302L656k919o642k058M758
1163a023O135k72n750m525J667O194L537l838o151j332M955N590o89n854m476
1178e832K778O267K406m194n914l57N514M779j494n841l653L301N669K061m708
1193G82n470q1N660M334j844n999k678L415N902J286n540m939J177N919L644l111
$$ y = [6384, 4739, -2435, -6987, -2750, 4542, 6574, 673, -5943, -5187, 1625, 6382, 3566, -3430, -6500, -1940, 4895, 5877, 146, -5786, -4733, 2039, 6389, 3105, -3812, -6185, -1188, 5255, 5626, -817, -6249, -4180, 2795, 6507, 2336, -4334, -6039, -98, 5553, 4973, -1846, -6147, -2876, 3726, 6117, 1399, -4886, -5318, 456, 5869, 3965, -2041, -6231, -2990, 3938, 5749, 748, -5044, -4885, 1266, 6031, 3723, -3015, -6152, -1759, 4769, 5494, -241, -5503, -4120, 2182, 5838, 2919, -3723, -5781, -1023, 5112, 4840, -910, -5435, -3768, 2426, 5963, 2125, -4026, -5358, -403, 5187, 4498, -1356, -5832, -3054, 3213, 5619, 1425, -4489, -4846, 668, 5447, 3953, -1888, -5541, -2240, 3429, 5490, 782, -4688, -4769, 891, 5225, 3381, -2618, -5296, -1881, 4021, 5307, -233, -5172, -3995, 1924, 5568, 2457]
1209B457n946j890M482N133O2n166m205J706N415L360l752n025j590M305N097
1224D443k55n102m092K095N790K453l657n856p98N575M773j515n761l610L438
1239b079N768J060m698m415O29M862L362j381n383k277L107N025P60m126m423
1254d209M63N306L274k371n346k088L696N579j31m628m432J564N491K857l616
1269A409n160j044M818M616r19n035l376K460M646K049l139m761k71L930M059
1284D282r69n032l029K483N168J565l853m548pM874L836k011n193k296L023N078
1300C371Q07l942m448P30N031L105k496m801j572L559M639j55m320l444J325M559
1316A948K518k620m688j360L922M108j92m813l588K452N091J332l014m145m96
$$ y = [2457, -3489, -5379, -897, 4236, 4298, -868, -5073, -3367, 2048, 5408, 1656, -3369, -4959, -654, 4443, 4188, -914, -5006, -2911, 2879, 5332, 1675, -4181, -4979, 596, 5369, 3854, -1907, -5517, -2079, 3689, 4749, 51, -4364, -3735, 1127, 4489, 3108, -2275, -4552, -1445, 3580, 4340, 214, -4209, -3746, 1560, 4834, 2463, -2883, -4971, -1275, 4304, 4173, -455, -4887, -3323, 2168, 5025, 1409, -3751, -4795, 23, 4639, 3720, -1315, -4691, -2231, 2415, 4464, 1325, -3436, -3707, 223, 4282, 3313, -1719, -4748, -2265, 2903, 4468, 615, -3933, -3940, 934, 4770, 2759, -2434, -4730, -1707, 3371, 4178, 236, -4212, -3482, 1549, 4654, 2158, -2643, -4215, -656, 3983, 3828, -492, -3936, -2611, 1948, 4466, 1846, -2842, -4202, -280, 3828, 3636, -1177, -4765, -2313, 2778, 4110, 1096, -3049, -3545]
1331c545L728L623o69m694k598K076M782J801l854m378R3M359L499j719m895j820
1347d211L258L933P31l796l790R18M304K711k050m431j642L211M152J38l706l655
1363c925J344M344K339k332m339j232L570L776o6m327l133J678M353K115l253
1378I12m459k8M367K902r84m252k188J902M160J027k642m048j72L871L400j196
1394B572m243k336K729M371O84l995l351J017L876K457j763m105j727K952L975
1409C113M5l589l039J178M054J768k551l341p49K495L810k49l704k607J335L932
1425A901J724k662l762k25L495L184j040m295j913K500L454Q40k769l333o5L490
1441E24K817j249l570k080K312L807Q75l258l554N54L541K829j541m445j044K570
$$ y = [-3545, 183, 3806, 3137, -1557, -4155, -2079, 2703, 4504, 650, -3728, -3635, 724, 4223, 2504, -2391, -4211, -953, 2980, 3711, -85, -3875, -2957, 1347, 4058, 2008, -2423, -4065, -854, 3298, 3436, -270, -3925, -2581, 1763, 4102, 1770, -2569, -3801, -231, 3545, 3479, -848, -3981, -2303, 2050, 4165, 912, -3547, -3575, 792, 3694, 2710, -1542, -3730, -1828, 2332, 3359, 717, -3331, -3503, 368, 3768, 2572, -1671, -4007, -1278, 3093, 3777, -218, -3569, -2552, 1324, 3781, 2018, -2087, -3814, -862, 3113, 3158, -431, -3470, -2292, 1762, 3530, 979, -2362, -3111, -616, 3194, 2945, -759, -3366, -2031, 1901, 3625, 963, -2799, -3024, 471, 3655, 2615, -1680, -3593, -1093, 2361, 3201, 432, -2901, -2966, 524, 3341, 2092, -1478, -3558, -1246, 2561, 3436, 178, -3376, -2822, 719, 3548, 2007, -2438, -3482, -912]
1457i12M034l45l230k417P75L595J735k128l208r71K924K683K2l056k649J174
1473a974L488J725k019l700m94L146L106p15l932k211K177L825Q04l060l171N53
1489b452K855K698j295l762j090K316K683O07k523l158J015L009J854r73l394
1504a610j635K316L401M65k950l077Q65L754J907k163l720n51L130K687p43l046
1520i70k397J861L094J224k171k835m83K978K141l58l257j719J567L051J041k453
1536C14l045mL398K176r41l426j670K463K774O38k826k647O47L327J777j230l345
1553a620j063K154K760K10k742k139L81L172J637j429l195r11K555K519J11l286
1569h86j875J401K972J212k002l018l97K986K218q73k748j677J611K791P04k138
$$ y = [-912, 3122, 2777, -453, -2870, -2095, 1500, 3235, 1107, -2101, -3072, -148, 2535, 2557, -499, -3148, -1974, 1514, 3239, 1220, -2480, -2974, 172, 3278, 2563, -1369, -3580, -1403, 2422, 3226, 166, -3005, -2452, 403, 3101, 1806, -1956, -3046, -730, 1953, 2560, 37, -3121, -2106, 903, 2757, 1784, -1610, -3245, -929, 2472, 2937, -13, -3090, -2225, 1529, 3436, 1273, -2447, -2998, 132, 2819, 2076, -970, -3367, -1506, 1588, 2812, 641, -2194, -2677, 301, 2442, 2084, -1173, -2892, -1325, 1726, 2767, 314, -2731, -2735, 663, 2839, 1898, -1528, -3198, -735, 2039, 2677, -149, -2796, -2149, 1178, 2955, 1725, -1620, -2683, -529, 2231, 2441, -301, -2440, -2059, 1113, 2750, 1321, -1874, -2785, -230, 2289, 2400, -886, -2761, -1360, 1612, 2824, 822, -2196, -2593, 393, 2611, 1738, -1010, -2687, -1076, 1715, 2419, 281]
1585B81k335j00K607K042r24k651j759J714L103M79k214k572K15K792K138j225
1601A591l354j042K274K866o9k483k109M11L014J537j628k968m99K347K179K76
1617B343k793k091J210K525J347j873k784l19K896J965n97k826j319J364K845
1632A893L27k343k164M92K670J509r28k633j217J738K391M10k061k638Q39K319
1648F04J936j292k952l70J651K413L46k737k068Q91K514J340j398k653l42J967
1664a50J867R6k168k026R37K644R97j691k111k38J912K283p42k153k036J614K275
1681A310J013k166k381M19K408J985j146k651r77J497K451N6j704k199L01K358
1697E74J568q39k729m46J183K358k6k181j624P05K451J209j522k526k74J891K013
$$ y = [281, -2054, -2154, 453, 2495, 1571, -1080, -2839, -1125, 1978, 2457, 243, -2329, -2114, 678, 2816, 1591, -1763, -2805, -531, 2335, 2266, -217, -2326, -1915, 1099, 2636, 1008, -1960, -2459, -112, 2067, 2343, -450, -2541, -1331, 1194, 2541, 668, -2116, -2435, 461, 2426, 1829, -997, -2316, -952, 1893, 2220, -123, -2287, -1795, 875, 2384, 1456, -1177, -2394, -656, 1735, 2145, 84, -2554, -1715, 604, 2540, 1248, -1704, -2074, -423, 1990, 2336, -401, -2469, -1578, 936, 2276, 878, -1775, -2117, -150, 1717, 1813, -355, -2381, -1444, 1200, 2197, 506, -1605, -1843, 69, 2352, 1610, -543, -2579, -965, 1310, 2323, 157, -2224, -1805, 603, 2588, 1442, -1209, -2186, -689, 1762, 1818, 114, -2085, -1784, 574, 2142, 1303, -1426, -1872, -689, 1669, 1643, -538, -2162, -1457, 994, 2203, 681, -1845, -2119, -228, 1785]
1714A785R6k507j500R58K493Q54j617k405p3K150J496k44k235j247Q85K353Q23
1731B065j761k016j60K200J959p74k532q49J112K311M43j830k182M87K041J468
1747A982q88k225j081J830J961K02j773j936P74K000J108j255j766q31J827J819
1763A748q3k197j369Q28K222R24j820j807r8J759J803p58j912j154Q58K218Q66
1780B028j565k210K55J931J132n98k028q10J083K459Mj566j910L55J893J393q68
1797I78j916q87J360K044J02k067j522O74J968J237j119k398n8J320K187j20k620
1814h37p84O60J892Q30j473j652j21J618J505l75j985j180J128K014M31j504j865
1831a698K17K021J229p61j733r43J315J842J60j733j620M00J721J456j314j604
$$ y = [1785, 1881, -626, -2126, -1168, 1325, 2179, 562, -1843, -1916, 234, 1730, 1486, -749, -1996, -1111, 1242, 2065, 304, -1712, -1872, 328, 2287, 1513, -1019, -1868, -756, 1555, 1998, 168, -2014, -1527, 514, 1982, 1094, -1131, -2212, -382, 1579, 1781, 8, -1928, -1154, 846, 1954, 699, -1067, -1898, -71, 1748, 1665, -532, -1901, -1073, 1149, 2073, 253, -1554, -1652, 107, 1910, 1152, -760, -1914, -1056, 1162, 2028, 463, -1747, -1492, 439, 1571, 973, -1055, -1865, -782, 1677, 1681, 115, -1795, -1440, 453, 1846, 978, -938, -1825, -465, 1579, 1681, -386, -1908, -1234, 734, 1971, 852, -1546, -1604, -284, 1903, 1783, -837, -1621, -961, 931, 1761, 288, -1364, -1485, 133, 1638, 1263, -722, -1902, -774, 1240, 1671, 167, -1698, -1481, 540, 1769, 1008, -725, -1668, -353, 1489, 1649, -84, -1704, -1304, 417, 1873, 559, -1045]
1847a045o84J397J765m2j462j733N58K240N75r19j784m27J647J660k87j974j195
1864a710Q05J750R38j275j853J2J538J247l33j678j355J557J602M50j463j584
1880a352j68J506J361m90j742p80J237J428N99j822j132J78J635J173q70j732
1896i71l79J284J306j07j389j308Q19J390J019j334j253n27J466J233j97j531
1912d79q84P02J507P53j486j466l14J918J251l79j454j076P59J928J59j277j504
1929a342P1J565J120q64j367n52Q66J524K88j318j382L44J453J041q13j583o88
1946a637J396J491q4j518p96k0J787Q11j294j032m12J441J160K3j806r13P84J269
1964F50O88p33j649M1R44J506n13j635m73P95J291N38j257j322M9J452J116q32
$$ y = [-1045, -1729, -332, 1433, 1391, -71, -1804, -1246, 994, 1569, 650, -1134, -1561, 86, 1746, 1459, -515, -1710, -905, 845, 1783, 508, -1345, -1333, 205, 1452, 1119, -559, -1914, -357, 1245, 1695, 232, -1352, -1520, -14, 1347, 857, -885, -1665, -428, 1000, 1599, -223, -1355, -1177, 458, 1631, 761, -971, -1350, -66, 1240, 1133, -256, -1564, -745, 645, 1664, 330, -923, -1450, 16, 1249, 1052, -479, -1363, -661, 846, 1599, 113, -1353, -1667, 251, 1502, 1123, -331, -1407, -648, 1280, 1439, 162, -1342, -1271, 294, 1414, 550, -817, -1369, -503, 1021, 1309, -9, -1391, -1047, 406, 1447, 634, -949, -1637, -241, 1250, 1166, -352, -1148, -1168, 619, 1430, 136, -896, -1308, 133, 1293, 1316, -490, -1403, -619, 650, 1338, 605, -1044, -1003, -59, 1447, 934, -701, -1174, -379, 912, 1450, 193, -1129, -1080, 372, 1488, 656]
1982F56j315o01J046J313n7j092j191M73J187R67n93j681m55J207J468j05j224
1999Cj253M38J616K99o73j176l44J171J006j06j325r67O69J173Q87j062j534L4
2017a144J190J046j66j754k70P07J168K33j008r34Q6J052R14n21r80q22J015J069
2035H81J85q92j551M44J316J061o96j673l30J065J148Oj323q28N32J505L90o34
2053F06j593m8J284N19qj128p83M41J416M82p62j316l07J165Q11K07j210j122
2071a346P97J371M70r01j342K77R01P11n01j232k73R50P96K11p51j162K87J154
2089D17O84n40j196l83N94J472J10j178j390P43J410O55j410q92P6Q66R95m40
2107E93j204k09J48J351K80o94j025j85J035O11q3q18j185O97J316N03r82j024
$$ y = [656, -659, -1260, -214, 1099, 1042, -50, -1241, -768, 419, 1386, 793, -888, -1343, -136, 1332, 1227, 3, -1250, -812, 804, 1103, 430, -746, -1090, 81, 1087, 981, -344, -1311, -642, 531, 1418, 356, -1178, -1144, 46, 1092, 926, -828, -1098, -391, 777, 1010, 2, -932, -846, 206, 1120, 599, -381, -1203, -188, 881, 1066, 174, -1377, -933, 383, 1444, 748, -925, -1255, -190, 958, 964, -359, -1187, -655, 850, 1240, 606, -987, -1035, 249, 768, 760, -368, -1151, -710, 706, 1188, 426, -890, -1197, -32, 779, 986, -224, -1346, -549, 822, 1292, 391, -951, -674, 227, 938, 437, -795, -1068, -118, 678, 889, 138, -1024, -737, 417, 1101, 561, -635, -1018, -424, 1048, 1158, -20, -1410, -667, 743, 1398, -12, -904, -828, 38, 1033, 593, -611, -820, -672, 679, 959, 265, -760, -945, 90, 701, 618, -200, -1385, -688, 628, 1131, 149, -875]
2125h75M4R26J197p41q29r93J227R16Oj131o09L01Q82N94n91r56k26O20J000J9
2145G81n79r28j98J130R27m53j482k8R29J062k05j321j031Q25J376Q6p76j093
2163i78K95R04L66l8j100l11M56J051K29p64j112KJ175O02l3j125p11P30J486
2182A124Q8j599m90J37J343M44r49p71j76Q80O81k39q03l43K64P41N64m66q36
2201d06l30N13R93Qq43j043N07J181L11o83j309L07J141N77k98j458kQ49M81j63
2221C33k12p52K8Q93J86m3j123q6N27P75M16o39r47j71J005Q95m41j490QO73J291
2242A126m12j082o20O87R81j51n29o79N55K97K78J55n64n76P0J065l7m47o56k17
2262g56R13Q02k80j100m97P23P75M93j364o03L81Q16M90n35o81k24M26N42K34
$$ y = [-875, -831, 95, 1292, 551, -278, -1271, -44, 872, 878, -253, -862, -561, 321, 915, 324, -632, -858, -238, 762, 781, 202, -726, -924, 206, 1133, 680, -802, -830, 99, 1161, 956, -365, -1396, -571, 805, 891, 115, -978, -683, 221, 587, 549, -551, -862, -406, 645, 874, 110, -1002, -1000, 175, 777, 744, -381, -1092, -362, 1124, 1212, -387, -877, -740, 603, 1047, 98, -673, -849, 31, 712, 473, -330, -673, -409, 332, 896, 430, -406, -736, -223, 770, 778, -65, -1108, -601, 580, 891, 208, -1101, -794, 347, 924, 626, -832, -834, 15, 496, 333, 121, -631, -603, 290, 476, 433, -690, -776, -249, 526, 942, 303, -644, -815, 190, 1085, 644, -846, -838, -165, 1126, 714, -368, -988, -301, 680, 529, 0, -679, -124, 173, 451, 606, 42, -534, -464, 601, 564, 117, -539, -756, 157, 959, 679, -421, -918, -195, 580, 1073, -291, -894, -513, 303, 793, 258, -423, -647, -221, 321, 555]
2281E55k58q30J4O17P14k71r74m12O17R07J23j068j004N80J222L94q02j144K24
2300g96J310L24p36p47J63M31L64j13mk37m93N97L77J68q79o75L13J002N11p59
2320A21r33J50R33O46n11j054OP53P25l35j009RL20N38K59l49l94m70M85L28O14
2341H32o81p60N0O69O88m58r89k75J092O12j75j152o44J151Q25k90p61k90L79
2360a77N71K5l86k00n8j0O68J64n11m92l35N68J149J24j200j109P87J271j25r35
2380b11o67N93Q70m7o64l89n1O17J70j76m01P0j81O63J48l55k70r1K02M86O44
2401I60r02q71J51J297M81j005r69K41J157M45q40q17QQ94L58o80j02k54K18K91
2421F1L63p4k80p21K70N10O35o23q83J20Q51M46k19j200j03Q26N98k70p63j7L32
$$ y = [555, 297, -533, -519, 98, 812, 541, -433, -845, -228, 679, 802, -266, -1270, -690, 532, 926, 124, -1020, -796, 514, 838, 102, -645, -482, -51, 313, 200, 196, -41, -534, 63, 440, 608, -271, -946, -633, 369, 880, 121, -812, -662, 271, 917, 406, -648, -642, 111, 836, 501, -508, -499, -179, 359, 618, 269, -125, -595, -110, 218, 832, 151, -609, -559, 110, 798, 340, -649, -924, 168, 780, 605, -547, -1191, -40, 785, 495, -266, -556, -177, 394, 419, 33, -167, -225, -235, 433, 597, 86, -406, -741, -173, 976, 1100, -100, -1209, -422, 849, 724, -211, -878, -285, 585, 538, -126, -515, -566, 51, 221, 45, -356, -286, -467, 196, 344, -11, -281, -372, -170, 316, 960, 58, -813, -662, 635, 1116, 111, -858, -617, 540, 985, 145, -672, -664, 230, 588, -92, -194, -448, -230, 61, 424, 350, 70, -651, -381, 129, 764, 141, -742, -622, 229, 675, 456, -744, -847, -21, 577, 307, -456, -473, -141]
$$ [...]
8191e6
##END NTUPLES=NMR FID
##END=
