##TITLE=1H_CA-8570-3-2
 DMSO, 8 sc, 
 9.4.2019
##JCAMPDX= 6.0         $$ Bruker NMR JCAMP-DX V2.0
##DATA TYPE= NMR FID
##DATA CLASS= NTUPLES
##ORIGIN= UXNMR, Bruker Analytische Messtechnik GmbH
##OWNER= root
$$ XWIN-NMR		Version 3.5
$$ Tue Apr  9 14:28:15 2019 Russian Standard Time (UT+4h)  she@DPX200
##.OBSERVE FREQUENCY= 200.1315
##.OBSERVE NUCLEUS= ^1H
##.DELAY= (6, 6)
##.ACQUISITION MODE= SIMULTANEOUS
##.ACQUISITION SCHEME= undefined
##.AVERAGES= 8
##.DIGITISER RES= 18
##SPECTROMETER/DATA SYSTEM= spect
##.PULSE SEQUENCE= zg30
##.SOLVENT NAME= DMSO
##.SHIFT REFERENCE= (INTERNAL, DMSO, 0, 15.7039)
##AUDIT TRAIL= $$ (NUMBER, WHEN, WHO, WHERE, WHAT)
$$ ##TITLE= Audit trail, XWIN-NMR		Version 3.5
$$ ##JCAMPDX= 5.01
$$ ##ORIGIN= Bruker BioSpin GmbH
$$ ##OWNER= she
$$ F:/spectra/data/she/nmr/H-F/1/audita.txt
$$ ##AUDIT TRAIL=  $$ (NUMBER, WHEN, WHO, WHERE, WHAT)
(   1,<2019-04-09 14:26:27.06 +0400>,<she>,<DPX200>,
      <created by zg, POWCHK disabled, PULCHK disabled
       configuration hash MD5:
       00 E9 B6 7A A2 85 ED C7 34 08 36 98 17 FE 4E 26
       data hash MD5: 16K
       42 CE 44 14 84 F2 B8 10 9F B0 3F C8 DA 72 78 5A>)
$$ ##END=
$$ 
$$ hash MD5
$$ AF 24 0B D0 83 A3 6D AC EA 26 A9 6E EB 97 A8 1F
##$RELAX= 
##$RELAX= 
##$RELAX= 
##$RELAX= 
##$RELAX= 
##$RELAX= 
$$ Bruker specific parameters
$$ --------------------------
##$DU= <F:/spectra>
##$EXPNO= 1
##$NAME= <H-F>
##$PROCNO= 1
##$TYPE= <nmr>
##$USER= <she>
##$AMP= (0..31)
100 100 100 100 100 100 100 100 100 100 100 100 100 100 100 100 100 100 
100 100 100 100 100 100 100 100 100 100 100 100 100 100 
##$AQSEQ= 0
##$AQ_mod= 1
##$AUNM= <au_zg>
##$AUTOPOS= <>
##$BF1= 200.13
##$BF2= 200.13
##$BF3= 200.13
##$BF4= 200.13
##$BF5= 200.13
##$BF6= 200.13
##$BF7= 200.13
##$BF8= 200.13
##$BYTORDA= 1
##$CFDGTYP= 0
##$CFRGTYP= 5
##$CHEMSTR= <none>
##$CNST= (0..31)
1 1 145 1 1 1 1 1 1 1 1 1 1 1 1 1 1 1 1 1 1 1 1 1 1 1 1 1 1 1 1 1 
##$CPDPRG= <>
##$CPDPRG1= <>
##$CPDPRG2= <>
##$CPDPRG3= <>
##$CPDPRG4= <mlev>
##$CPDPRG5= <mlev>
##$CPDPRG6= <mlev>
##$CPDPRG7= <mlev>
##$CPDPRG8= <mlev>
##$CPDPRGB= <>
##$CPDPRGT= <>
##$D= (0..31)
0 1.2 0 0 0 0 0 0 0 0 0 0.03 0 0 0 0 0 0 0 0 0 0 0 0 0 0 0 0 0 0 0 0 
##$DATE= 1554805586
##$DBL= (0..7)
120 120 120 120 120 120 120 120 
##$DBP= (0..7)
150 150 150 150 150 150 150 150 
##$DBP07= 0
##$DBPNAM0= <>
##$DBPNAM1= <>
##$DBPNAM2= <>
##$DBPNAM3= <>
##$DBPNAM4= <>
##$DBPNAM5= <>
##$DBPNAM6= <>
##$DBPNAM7= <>
##$DBPOAL= (0..7)
0.5 0.5 0.5 0.5 0.5 0.5 0.5 0.5 
##$DBPOFFS= (0..7)
0 0 0 0 0 0 0 0 
##$DE= 6
##$DECBNUC= <off>
##$DECIM= 24
##$DECNUC= <off>
##$DECSTAT= 4
##$DIGMOD= 1
##$DIGTYP= 9
##$DL= (0..7)
0 120 120 120 120 120 120 120 
##$DP= (0..7)
150 150 150 150 150 150 150 150 
##$DP07= 0
##$DPNAME0= <>
##$DPNAME1= <>
##$DPNAME2= <>
##$DPNAME3= <>
##$DPNAME4= <>
##$DPNAME5= <>
##$DPNAME6= <>
##$DPNAME7= <>
##$DPOAL= (0..7)
0.5 0.5 0.5 0.5 0.5 0.5 0.5 0.5 
##$DPOFFS= (0..7)
0 0 0 0 0 0 0 0 
##$DQDMODE= 0
##$DR= 18
##$DS= 0
##$DSLIST= <SSSSSSSSSSSSSSS>
##$DSPFIRM= 0
$$ [...]
##$SUBNAM2= <"">
##$SUBNAM3= <"">
##$SUBNAM4= <"">
##$SUBNAM5= <"">
##$SUBNAM6= <"">
##$SUBNAM7= <"">
##$SUBNAM8= <"">
##$SUBNAM9= <"">
##$SW= 24.9337058887773
##$SWIBOX= (0..15)
0 0 2 0 0 0 0 0 0 0 0 0 0 0 0 0 
##$SW_h= 4990.01996007984
##$TD= 16384
##$TD0= 1
##$TE= 0
##$TE2= 300
##$TE3= 300
##$TEG= 300
##$TL= (0..7)
0 120 120 120 120 120 120 120 
##$TP= (0..7)
150 150 150 150 150 150 150 150 
##$TP07= 0
##$TPNAME0= <>
##$TPNAME1= <>
##$TPNAME2= <>
##$TPNAME3= <>
##$TPNAME4= <>
##$TPNAME5= <>
##$TPNAME6= <>
##$TPNAME7= <>
##$TPOAL= (0..7)
0.5 0.5 0.5 0.5 0.5 0.5 0.5 0.5 
##$TPOFFS= (0..7)
0 0 0 0 0 0 0 0 
##$TUNHIN= 0
##$TUNHOUT= 0
##$TUNXOUT= 0
##$USERA1= <user>
##$USERA2= <user>
##$USERA3= <user>
##$USERA4= <user>
##$USERA5= <user>
##$V9= 5
##$VALIST= <valist>
##$VCLIST= <CCCCCCCCCCCCCCC>
##$VD= 0
##$VDLIST= <DDDDDDDDDDDDDDD>
##$VPLIST= <PPPPPPPPPPPPPPP>
##$VTLIST= <TTTTTTTTTTTTTTT>
##$WBST= 1024
##$WBSW= 4
##$XGAIN= (0..3)
0 0 0 0 
##$XL= 0
##$YL= 0
##$YMAX_a= 538386
##$YMIN_a= -421844
##$ZGOPTNS= <>
##$ZL1= 120
##$ZL2= 120
##$ZL3= 120
##$ZL4= 120
##$ABSF1= 10
##$ABSF2= 0
##$ABSG= 5
##$ABSL= 3
##$ALPHA= 0
##$AQORDER= 0
##$ASSFAC= 0
##$ASSFACI= 0
##$ASSFACX= 0
##$ASSWID= 0
##$AUNMP= <proc_1d>
##$AZFE= 0.1
##$AZFW= 0.1
##$BCFW= 1
##$BC_mod= 2
##$BYTORDP= 1
##$COROFFS= 0
##$CY= 11.3945322036743
##$DATMOD= 1
##$DC= 2
##$DFILT= <>
##$DTYPP= 0
##$F1P= 18.9103706918063
##$F2P= -1.10871071338519
##$FCOR= 0.5
##$FTSIZE= 0
##$FT_mod= 4
##$GAMMA= 1
##$GB= 0.15
##$INTBC= 1
##$INTSCL= 1
##$ISEN= 128
##$LB= 0.24
##$LEV0= 0
##$LPBIN= 0
##$MAXI= 10000
##$MC2= 0
##$MEAN= 0
##$ME_mod= 0
##$MI= 1.114404
##$NCOEF= 0
##$NC_proc= 0
##$NLEV= 6
##$NOISF1= 3.799351
##$NOISF2= 2.8
##$NSP= 1
##$NTH_PI= 0
##$NZP= 0
##$OFFSET= 15.70392
##$PC= 1
##$PHC0= -8849.835
##$PHC1= 4.400257
##$PH_mod= 1
##$PKNL= yes
##$PPARMOD= 0
##$PSCAL= 0
##$PSIGN= 0
##$REVERSE= no
##$SF= 200.130013532006
##$SI= 16384
##$SIGF1= 3
##$SIGF2= 2
##$SINO= 400
##$SIOLD= 16384
##$SREGLST= <1H.CDCl3>
##$SSB= 0
##$STSI= 0
##$STSR= 0
##$SW_p= 3612.71676300578
##$SYMM= 0
##$S_DEV= 0
##$TDeff= 0
##$TDoff= 0
##$TI= <>
##$TILT= no
##$TM1= 0
##$TM2= 0
##$TOPLEV= 0
##$USERP1= <user>
##$USERP2= <user>
##$USERP3= <user>
##$USERP4= <user>
##$USERP5= <user>
##$WDW= 1
##$XDIM= 8192
##$YMAX_p= 0
##$YMIN_p= 0
$$ End of Bruker specific parameters
$$ ---------------------------------
##NTUPLES= NMR FID
##VAR_NAME=  TIME,          FID/REAL,        FID/IMAG
##SYMBOL=    X,             R,               I
##VAR_TYPE=  INDEPENDENT,   DEPENDENT,       DEPENDENT
##VAR_FORM=  AFFN,          ASDF,            ASDF
##VAR_DIM=   8192,          8192,            8192
##UNITS=     SECONDS,       ARBITRARY UNITS, ARBITRARY UNITS
##FACTOR=    0.0002004,     1,               1
##FIRST=     0,             0,               0
##LAST=      1.6414764,     0,               0
##MIN=       0,             -421844,         0
##MAX=       1.6414764,     538386,          0
$$ Real data points
##PAGE= N=1
##DATA TABLE= (X++(R..R)), XYDATA
$$ [...]
1982b79M20kk66K48l01K60l81J53J71K69j36k04j72M46J16n43L37l12p0L02j74
2003a18jL50j48p7m3k41J85mK06k56L4L52k70P6K21j53m35j37M30M1J50q3k00
2026a21KJ38k23J33P5L08l15k7l37O40j34O1l08p1J87J11Q1K48q94N65K1j54j20
2049a34j03k5P2L93l19j24Q3L83L15m14l44J88l3Q3j40J47R5J10j58N9l57L26
2071A03M2o7J02k06J87k31j23K90k60J56qM1J47j94k3J63M49o89k93L98J48K25
2093C57k59k75R4K19M6p2q1l14L78m9j71n4P8L24k45j76J06R3J75R7j60l13J69
2116c3J02N5Q7l71P4K09j33j07n8M5j56N22m50l2L25k25J65j88L5P8J03o2L11
2139B96m68J49M46n47J26m30J54M65l23L60m95P5N9QK17k93j80L79K95k33k94
$$ plain form
1982 -279 141 139 -127 121 -180 80 -301 -148 23 292 156 -48 -220 226 342 -201 136 -176 -246 56 -118
2003 -118 -119 231 83 6 -37 -278 -93 -97 109 -147 -113 239 -31 45 266 113 -322 -459 -29 12 162 79 -121
2026 -121 -119 19 -204 -71 4 312 -3 -30 -367 273 139 200 -108 -179 8 119 200 448 -446 119 140 -14 -134
2049 -134 -237 -262 -190 203 -116 -240 -157 226 541 127 -217 -29 -62 21 -119 28 123 233 75 134 -223 103
2071 103 145 78 180 -26 161 -70 -193 97 -163 -7 -15 26 173 -21 -44 119 568 -121 -414 -16 132 357
2093 357 98 -177 -83 136 182 110 29 -285 93 44 -127 -181 -103 221 -24 -200 -94 -1 174 271 111 -202 -33
2116 -33 69 124 211 -160 -86 123 -10 -117 -175 -130 -286 236 -214 -246 79 -146 19 -169 -134 -56 47 -15 296
2139 296 -172 -23 423 -124 2 -428 -274 191 -132 228 -267 -192 -133 -125 92 -201 -381 -2 293 60 -234
2160b34m0M29M6l75p0J48M13r5k50k00J51K17nO0l50J59M03j85J48p44J98j46
2182c22L33l00J8J23L13M9m51j41M48J52m4k82J95l01K23j09M6j18j20J82N87
2203D81q76L52j05K35K87m64j72J62N21m20q1k45lL99O9l37J01j30J95K02j3o65
2225e07K18L24j6km2j96J25L11J81n59j05J67L30k66m47K47J69J90J41k45k58
2246b40M55J42m42r9m2K72J50m47K02j67J73N3K23l69j59P3L84q6k18j02K87K11
2268B54R5n93J7K96p1Pj81k01N34m0K15m74j50K70L19m3m23K2J03K81q3k37p9
2291a62J72J27Ql88k40N49L01j45o21N0P56j12k43q5k72L72N35n93k91Q8M3M65
2313C14r0o18L46n5L00J1l62K7RL44n6l28k67K28M56J63m96J9J84n1kl43R3J6
$$ plain form
2160 -234 -274 155 201 -174 -244 -96 317 222 -28 -228 -77 140 135 195 -155 4 407 222 370 -374 -176 -322
2182 -322 11 -289 -271 -148 165 214 -237 -378 70 222 178 -104 91 -210 13 -96 -50 -168 -288 -106 481
2203 481 -395 -43 -148 87 374 -90 -262 -100 421 1 -80 -325 -328 71 140 -197 -96 -226 -31 171 158 -507
2225 -507 -289 35 19 17 -25 -221 -96 215 396 -163 -268 -101 229 -37 -484 -237 -68 122 263 18 -240
2246 -240 215 357 -85 -184 -226 46 196 -251 -49 -216 -43 10 233 -136 -295 -222 162 76 -142 -244 43 254
2268 254 349 -244 -227 69 -2 5 -176 -377 157 117 332 -142 -292 -22 297 254 -169 -147 -44 237 154 -83 -162
2291 -162 10 137 145 -243 -483 66 367 222 -399 -349 407 295 52 -33 -305 67 602 9 -282 -194 -151 314
2313 314 224 -394 -48 -103 197 208 -154 -127 -118 226 170 -158 -425 -197 259 422 -74 -55 129 78 76 -267 -174 -158
2337a58M64j25k87K64l88O35L5n59l32L17N47l34j51j41K39L39r7n26q00P48O13
2358C03j90l48k5n2M27K26m18j79P3O22j81l26r9K04J17L10j085L14J6L01L85
2379C95l84j49p9O34J1n08N2k36K20M18j65p04N10J09P0J32m78J35K81q8m07j29
2401c60K37M17j14l46J08K69K07k66l27o4J39K44mL1n83K39K26J43J92q19K32
2422a99O23l75J56p15M10K60K23k39m43J81L75L1k33l16o2M92L4j23k74J15RM07
2444C37j86n42P2L55PJ03p24J12N80K61l63l87J29LN59m62j29J60J85M36m17m20
2466c31L35r2K92l63o2Q0J62L85n29j93N48j98J29J08p84NM56M50m79k00j7M20
2488A22M52o16k34p7N68K30m08l36J19L9O89j97n42KO43j14L7q17L0N48L33J1
$$ plain form
2337 -158 306 181 -106 158 -230 405 440 -119 -451 -134 413 79 -72 -213 26 365 268 -258 -1058 -310 303
2358 303 113 -235 -260 -312 115 341 -77 -256 -183 439 258 -68 -167 37 154 464 -621 -307 -291 10 395
2379 395 11 -138 -217 417 428 -80 -28 -264 -44 374 209 -495 15 124 194 326 -152 -17 264 176 -231 -360
2401 -360 -123 294 180 -166 -58 211 418 152 -175 -239 -100 144 140 171 -412 -173 53 196 388 -431 -199
2422 -199 424 49 205 -510 -100 160 383 144 -299 -118 257 288 55 -261 -323 169 203 80 -194 -79 -70 337
2444 337 151 -391 -319 36 43 146 -578 -466 114 375 12 -375 -246 -243 316 -146 -275 -115 70 506 89 -331
2466 -331 4 -88 204 -159 -221 -141 21 406 -123 -316 232 34 163 271 -513 -508 -52 398 -81 -281 -298 122
2488 122 574 -42 -276 -353 215 445 37 -299 -180 -141 548 351 -191 -189 454 340 377 -440 -410 138 471 482
2510D82n94k48J23N57j92m83k63P04l0J77k81l17P86m00o1l72o9L55M03k77J5
2531A5l68J72M10m13L3j96L86L66n4p39k05P03N14n60n19j76N37K75N7l30l26
2552d18L31M89j4p36n31Q52Q05n76m40%K99m4j6l02l8K37M49k55k65k77N84K81
2574D15k01m36r0N19m2J43n75J41l9O11j91k56l95K65Q46l59l24o15P24P7J02
2595C20l79n87P17K78k43l46j6K79L40j25n88j3L61L24j74k93j55J46M60O6p40
2616c68M5K58N55m70k76j98K36O79l97k36k15K05O88j94m73l23L11L6N73p58p7
2637c99J31M93Q2l56k10L8N89k85n79m5N28O28l39m87j76J67P42N6l80p34M91
2658d5N50j59j1m09j59M87k09o1o25K61P78k62j82l15M22qM05o16r2r2J45L18
$$ plain form
2510 482 -112 -360 -237 320 128 -355 -618 86 56 233 -48 -365 421 21 -40 -412 -481 -126 277 0 15
2531 15 -353 -181 229 -184 -151 -347 39 405 351 -388 -593 110 624 64 -455 -631 -94 181 238 -92 -418
2552 -418 -87 402 388 -348 -879 -27 778 202 -238 -238 61 17 1 -301 -339 -102 347 92 -173 -450 134 415
2574 415 214 -222 -312 207 165 308 -267 -126 -165 446 255 -1 -396 -131 715 356 32 -583 141 218 320
2595 320 -59 -646 71 349 106 -240 -256 23 363 238 -350 -363 -2 322 148 -145 -300 -154 306 372 -368
2616 -368 -323 -65 490 20 -256 -454 -218 461 64 -172 -387 -182 506 312 -161 -484 -173 -137 436 -322 -399
2637 -399 -268 225 307 -49 -259 -221 368 83 -496 -541 -13 615 276 -211 -387 -220 522 578 198 -536 -45
2658 -45 505 346 335 -74 -233 254 45 -16 -641 -380 398 136 -46 -361 61 53 458 -158 -250 -342 -197 121
2680A21j03m21M33l61L24l5l91M47j6J76l47P2O5K20K19n16k56L58M28j00m45
2701a28l93R5Q32J40q26P3PN40p4k98k70M7N16j69j39l28K15K47K08j79m17L35
2723C4L13j32j15k04j38K38O64q56p2r0O56J11j95n11k03Q72pl23m96K8P39K3
2745C36l99m70K24J69L20m47P9o6O50j39l37r8j92M52K29m11j18l20O96J37m58
2766a63j72J62N04J33k85m16M2J55N35l72n68pN66L77m37k35j49L87K17k46l10
2787b82j87L90K78k76k0j69L59j01M12n42j1K14R4k44j49j85L21O75k96l57l05
2808c81O17j90J55o96K18J97N04k36k72k04K59J81J00m69l04P83l48J05j81m44
2828f06O49K11j21m71K34J37L36j39k14l44N14k7m80K36j52L07M2R5l96j4P3L36
$$ plain form
2680 121 18 -403 30 -331 -7 -42 -433 14 -2 174 -173 -101 -36 184 403 -113 -369 -11 417 317 -128
2701 -128 -521 -426 406 546 -280 -207 -200 340 266 -32 -302 -255 261 92 -47 -375 -160 87 295 116 -301 34
2723 34 347 215 100 -104 -242 -4 660 -196 -268 -358 298 409 214 -297 -500 372 365 42 -454 -426 313 336
2745 336 -63 -533 -309 -140 180 -267 -188 -254 396 257 -80 -178 -370 82 311 -100 -218 -538 158 295 -163
2766 -163 -335 -173 331 464 179 -237 -195 -40 495 123 -445 -452 114 491 54 -181 -330 57 274 28 -282
2787 -282 -469 -79 199 -77 -97 -266 93 -8 404 -138 -149 65 159 -85 -234 -419 -98 577 281 -76 -381
2808 -381 236 46 201 -495 -277 -80 424 188 -84 -288 -29 152 252 -217 -521 262 -86 19 -162 -606
2828 -606 43 254 133 -338 -104 33 369 230 16 -328 186 159 -321 -85 -237 70 112 207 -189 -203 -130 206
2850B06J46n38j53M03k7K69r75K69J18M60K18m58j06K62J08K2k56k48J86K59K5
2871A90j94p9L6K66j11k52r8K75R3k59j9K92l07L88j66j64l98L94K45O6j92k92
2893b86K93J23Q7j59n75N93K30k03k07k19J4O77j41m23k27N82k17K76l05O8n7
2914g6J61L30l99P3m1L0Q8k18J29K03m85M37k38l42J04L17L18n94k23K87J32K23
2936B16k17J7J15j74N62n34j02p0J25L38k66m56L66J54J74l35o2Q8K08L05n60
2957a08k98N30K17l25J32k66k7K26L07o94K11j14L13J09l25k50K19L15l05J12
2977b1k12J07L0J16J03o78M94K61l42J0j86N8J51K05l89K75l53O33j72j55J36
2998G1j74M45k58R4l81j50P60j85k43k30K29J19j3l89p2M49o4j6K7p4l9L35k01
$$ plain form
2850 206 352 -186 -339 64 37 306 -669 -400 -282 178 396 -62 -168 94 202 224 -32 -280 -94 165 190
2871 190 -4 -83 -47 219 108 -144 -242 33 126 -133 -152 140 -167 221 55 -109 -507 -113 132 198 6 -286
2893 -286 7 130 217 58 -517 76 306 103 -104 -323 -309 368 227 -196 -423 159 -58 218 -87 -19 -76
2914 -76 85 415 16 89 48 78 166 -52 77 280 -205 232 -6 -348 -244 73 391 -203 -426 -139 -7 216
2936 216 -1 16 131 -43 519 -15 -117 -187 -62 276 10 -446 -80 74 248 -87 -149 -61 147 452 -108
2957 -108 -406 124 341 16 148 -118 -145 81 388 -306 -95 -209 104 213 -112 -362 -143 172 -133 -21
2977 -21 -233 -126 -96 20 123 -555 -61 200 -142 -132 -318 -260 -109 96 -293 -18 -371 262 90 -65 71
2998 71 -103 342 84 178 -203 -353 407 222 -21 -251 -22 97 84 -305 -377 72 8 -8 19 -55 -94 241 40
3021D0N1m7l5J21J84k67m03Q74n30J71j27l52j18O46k13q8J42j83P20o47p0M3
3043h8N1J1K36q3lm6l72P03k84o1j17J47l4pk18l9K40K01k88L87m69L47J69n46
3067a63J33M0O8Kj31l14O07j47n1m5J7L8j3L02j98l20J90O2Q1O4k37Q4k17K92
3091A44m32N0K10K51j3m40r2M28%j18J10k00k83L49L36l90k24L86k32L02j78l02
3113c38Qj1N74j9j17r9r5J6J00l42J84M4L01j33k15k20L10o1M7L11m26K50J21
3136A90L3q3m69M00j3m3p3N8K41k51L7j43j00L1L64m39R4j4J41J75k17K00k41
3159a22L42j11j85J22j09K89r1k78J26N1o1kj48J47P8M6j69J04k45K77j22J9n7
3182i9O4Mj82M18J77l90J14J55j75m4k03J07L3N2r5k02L80j17r5L07j13k41J07
$$ plain form
3021 40 91 44 9 130 314 47 -356 518 -12 159 32 -320 -438 208 -5 -93 49 -134 586 -61 -131 -88
3043 -88 -37 -26 210 127 124 78 -294 409 125 64 -53 94 60 53 -165 -204 36 237 -51 336 -133 214 383 -163
3067 -163 -30 10 78 80 -51 -365 242 95 44 -1 16 54 41 343 145 -175 15 77 158 222 -15 69 -148 144
3091 144 -288 -238 -28 223 210 -230 -322 106 106 -12 98 -102 -385 -36 300 -90 -314 72 -160 142 -36 -338
3113 -338 -330 -341 233 214 97 -2 -97 -81 19 -323 -139 -95 206 73 -142 -362 -52 -113 -66 245 -181 69 190
3136 190 223 140 -329 71 58 15 -58 0 241 -10 27 -116 -216 -185 179 -260 -166 -180 -39 136 -81 119 -122
3159 -122 220 109 -76 46 -63 226 135 -143 -17 34 -27 -29 -177 -30 48 94 -75 29 -216 61 -61 -42 -99
3182 -99 -35 -31 -213 205 382 -8 106 261 86 42 -161 -54 -21 31 -64 -266 114 -3 -98 209 96 -145 -38
3205c8k44M61j40j63K60l60L42m0j51O5J56j39j56n8L3K41n5Q8m59M41J09k77
3227h4r8M25l90l4K95j53K13k28K51k41K5P8j52K40m2k40o0L58N1r8n21K84L4
3250h7L69m31J06r8K23j76J91j54K38m44J22P5k54M68j15k15L01P4k22R8j72P2
3272c1K28k87J95o5J83j88pJ35m29M1O7J15n4j8R2M3J11k33K13K23l39Q5m7P3
3296A06q3J17j70p6P9o3P5l3j16K59J28j96L3L2M3k35L1K78j95Q4K5j02J04m00
3320b75L83qk50N8K31j66n7jJ79j65j48K27O4j40N1J41J59k41k2J11j13Kl3j01
3344a14QL55m21K97k82J68j17L11j40L8j56R9M4k71L74m07j7M1K37k88J57L73
3366B89k74N1K7J03j14o6j38K52m04J21M92j73m63J42j49p0J61K30J81k19J59
$$ plain form
3205 -38 -282 179 39 -124 136 -224 118 78 -73 -8 148 9 -147 -205 -172 69 14 102 -357 84 193 -84
3227 -84 -182 243 -147 -181 114 -39 174 -54 197 -44 -19 59 -93 147 105 -135 -195 163 214 116 -405 -121 -87
3250 -87 282 -149 -43 -141 82 -94 97 -57 181 -263 -141 -66 -320 148 33 -182 119 193 -29 69 -103 -31
3272 -31 197 -90 105 40 223 35 28 163 -266 -225 -158 -43 -97 -115 -23 20 131 -102 111 334 -5 80 33 106
3296 106 23 140 -30 -106 -27 -90 -15 -48 -164 95 223 27 60 92 135 -100 -69 209 14 98 123 21 125 -275
3320 -275 108 100 -150 -92 139 -27 -84 -85 94 -71 -219 8 72 -68 -17 124 283 42 20 131 18 20 -13 -114
3344 -114 -106 249 -172 125 -157 11 -106 205 65 103 -53 46 90 -181 193 -214 -231 -190 47 -241 -84 289
3366 289 15 66 93 196 82 16 -122 130 -274 -153 339 166 -297 -155 -304 -374 -213 17 198 -21 138
3387A38k84J28n1n5J80o9j51O07m51K16k55n1J73qm3L8j7n4p9J50N8j66R6J6j30
3412f4J73q2O8K7J65k56J57j90n3R6pp0J22M9l18K27j27L25l47K18j15J76j97
3435b3n1J4j87L11L7rk92J30lN8Qk0o9NL02j13J7O1m01J92J07J17k21o5L41n03
3461b57L12j47K89m73K29P9Np1R1j52l4R1j5n9K84%j05j43j34N36m18J28J04k50
3485a10j5L13J62k25l41K14q2L7k11J57j00K52J18l87L59l09K88m1k14K21j26
3506d0K19j64j62M03j83j10j22K42o7j37J09j08L76l18K05j6k2O4k92J85O8m69
3528c39L71Q0Pj61J66r9O2k21J07N09o85J85J10k86J73N2j62K42J04k1k07l37
3550c50M21j44j27N07k94Q3q3j50J43J06k41R0J03L4J4p8m6J83J9O3j77m3PJ49
$$ plain form
3387 138 -146 -18 -69 -124 56 -13 -164 443 -8 208 -47 -98 75 67 24 62 45 -9 -88 62 120 -46 50 66 -64
3412 -64 109 27 95 122 287 31 188 -2 -55 41 34 -36 86 135 -183 44 -83 242 -105 113 -2 174 -23
3435 -23 -74 -60 -247 64 101 92 -200 -70 -73 -15 -7 -27 -96 -91 211 98 115 176 -225 -33 74 191 -30 -95 246 -257
3461 -257 55 -92 197 -276 -47 32 37 -34 57 -95 -129 -38 -53 -112 172 172 67 -76 -210 326 -92 36 140 -110
3485 -110 -125 188 350 125 -216 -2 -84 -47 -258 -101 -201 51 169 -218 141 -168 120 79 -135 86 -40
3506 -40 179 15 -147 256 73 -37 -159 83 16 -121 -12 -120 256 -62 143 127 105 169 -123 62 130 -339
3528 -339 32 112 119 -42 124 25 87 -134 -27 482 -203 -18 92 -194 -21 31 -131 111 215 194 -13 -350
3550 -350 71 -73 -200 307 13 96 13 -137 6 112 -129 -39 64 98 112 34 -12 171 190 253 76 33 40 189
3574A89l04K93k16O6J58l50K48K79m04J2j44J60qJ09p2q9K20p9J66l60k00J54
3596a72J29K17j00p4J13J61k19j54k2J26j06o1K81r4M7k65L3j87O61m42L29k70
3618f9l42L05Q2J07J3k4oNM3m24P3J25r8J51P4k54K23K5k46L99k14J6O5j85O4
3643i2K37L0p9l59J37k9k16K95L83j19j10m44M70j38L81j98l00N7NJ25K0k3j11
3666g8K42k38j29j55K54R3m8j83L18j53J17L8n6k54o7M32j11m7O4l88K85J10k80
3689b34J22Q1J78n9K6k7k79J50L50j97j51J91k47k1m8L60l51k48M57jj39k65N24
3712A72j08j31L01l36j2J47J72l41n1K19P2k9MMj02R9K7m0j04N3O0q1N4j32K04
3737A21l15J82k8J06R3j58K66k77l66L00o3QK16K20j91K27n86M90j84J38K07l15
$$ plain form
3574 189 -115 178 -38 28 186 -164 84 363 -41 -29 -173 -13 -21 88 16 -73 147 68 234 -126 -326 -172
3596 -172 -43 174 74 0 113 274 55 -99 -121 5 -101 -162 119 25 72 -193 -160 -347 314 -128 201 -69
3618 -69 -411 -106 -24 83 96 72 66 71 114 -310 -237 -112 -210 -59 15 -239 -16 9 -237 162 -52 -36 29 -156 -92
3643 -92 145 175 96 -263 -126 -155 -371 -76 307 188 78 -366 104 -34 347 149 -151 -94 -89 36 56 33 -78
3666 -78 164 -74 -203 -358 -104 -11 -59 -242 76 -77 40 78 22 -232 -299 133 22 -25 39 -349 -64 46 -234
3689 -234 -112 -31 147 88 114 87 -192 -42 308 111 -40 151 -96 -117 -165 195 -156 -404 53 52 -87 -352 172
3712 172 64 -67 234 -102 -114 33 205 -136 -187 32 104 75 79 83 -19 80 107 67 -37 16 76 -5 49 -83 121
3737 121 -194 -12 -40 66 159 1 267 -10 -376 -76 -139 -131 85 305 114 341 -245 245 61 199 406 91
3759I1j7l66M10r4M5L01n10J6R6p1M05n70J86L87k25k70L88p9j42k02M29m0j01
3782F7k15J46K3l04M61k25j01k01L23K17m37M05j28l00R5M82m7j86J48l3j1k6
3804A53k26Q6RJ25m27J93l5J23k9l8O3R4r0Q3j36J16N8j82j93L08r9J1j65O8K93
3829A63j52j94K91j64k27M52o78N98J79l67K62j38R8j97K16N8l47K24J06j58R6
3850A21q2O1k6J45k03o1k07J6J21K82r7q8j22j61J52J60l7J22j6o2m6K33K3k7
3874B01l1N4j53J36N0k54J0k60Q1K46K8l3J25k78J94p1q5L4R5k79M10m53J19K16
3898A02r3J75k84j6N9J50k22J29P9l47J88j7J91Lj75kN8j8j42K15O0p4K2q2l39
3923c80L67J61r2l7K5l7j65pJ20l1l6K50k1L9J18k69p3j6L31m42Q8k90J19m0M56
$$ plain form
3759 91 74 -292 118 24 69 370 -140 -124 -28 -99 306 -264 -78 309 84 -186 202 123 -19 -221 208 168 67
3782 67 -148 -2 21 -283 178 -47 -148 -349 -26 191 -246 159 31 -269 -174 308 261 75 223 190 179 153
3804 153 -73 13 22 147 -280 -87 -122 1 -28 -66 -3 91 1 84 -52 64 122 -60 -253 55 -44 -33 -198 -130 163
3829 163 11 -183 108 -56 -283 169 -509 89 268 -99 163 25 123 -74 142 200 -147 77 183 25 121
3850 121 39 100 74 219 16 -45 -252 -236 -115 167 70 -18 -140 -301 -149 11 -26 96 80 18 -28 205 228 201
3874 201 170 224 71 207 257 3 13 -247 -166 80 108 75 200 -78 116 45 -40 -6 89 -190 220 -233 -114 102
3898 102 9 184 -100 -116 -57 93 -129 0 79 -268 -80 -97 94 97 -78 -80 -22 -40 -182 33 93 19 41 -41 -380
3923 -380 -13 148 56 19 44 7 -158 -165 -45 -76 -112 138 117 156 274 5 -68 -84 247 -195 -107 -397 -278 -318 138
3948A38l74jK07n4K84k54K83j86K70j33k72p8M1j61L62l98N02J2m21L58R0l22
3970a07K40J26P2k73l4N4J18j85p1K38l23J15K51n32J65J18l49L43j18K27j01
3991b6j12K16j9j23j88K12K48j42j34j24L19k54L00k79Q4m0P5j12L49q0j27L80
4013D23l51j74J58J85k24N2j36N1P8j82K02n4j10o6J68J73l32L58N7k71l83L41
4035c7R2l31N32n51L08k38P7K51K14j74j01J5j39r0R1O1O2J17r5J03k30O1j14
4058a16q4J6j9K09J32m30N67l51J28j27Q5JJ53k56M42m12O6n6ML84l22p4m0J03
4082CP6k10M5j1J65r5j27J86k40K67j13L28j56j45k36J40R7j53K68M6k50L0L0
4105e5L78k50j43M3j29M04k01j06K08J66k94j04J93j86J6k09L29k63N85m09Lo6
$$ plain form
3948 138 -236 -237 -30 -84 200 -54 229 43 313 180 -92 -170 -129 -290 72 -326 176 188 -233 125 215 -107
3970 -107 133 259 331 58 24 78 196 11 -60 178 -145 -30 221 -311 -146 -28 -377 -34 -152 75 -26
3991 -26 -138 78 59 -64 -252 -40 208 66 -68 -192 127 -127 173 -106 -22 -62 13 -99 250 170 43 423
4013 423 72 -102 56 241 17 69 -67 -16 62 -120 82 28 -82 -148 20 193 -139 219 276 5 -378 -37
4035 -37 55 -276 256 -295 13 -225 -148 103 317 143 42 57 -82 -172 -81 -20 42 159 64 167 -63 -2 -116
4058 -116 -200 -184 -203 6 138 -292 275 -76 52 -75 10 11 164 -92 350 -62 4 -52 -48 336 14 -60 -100 3
4082 3 79 -131 -86 -97 68 -27 -154 32 -208 59 -54 274 118 -27 -263 -123 -26 -179 89 135 -115 -85 -55
4105 -55 323 73 -70 -27 -156 248 47 -59 149 315 21 -83 110 -76 -60 -269 60 -203 382 -27 -24 -90
4127i0K75j88j03J97l65M32l43J56J97j5k70Pj08N3L65l14j47J98K24m28J99j07
4149a75J90j4O8J80j62R2l49K55J90j96L3j80r9L3L29j84k04L02K6jm59M35k83
4172a73L30j40l9J0Q7J1L4k26J47l13K23M1rJ97k58J10m6O2o9J82k30K50l75K79
4196H5k38L2J53J32k51pQ8J6k6p4q6P8q0M17J95m54k63M22K1j03K62m8k75J32
4220A28j30j2o5k6L30j78j28L17j06Qk5j6k7j6K07m47N5r1K06R6m87M32J39m9
4244A15j81K05l06M19k78p8K49j14J66l2J33j60J6J2l02P7J25m4j88J03J17l80
4266c26K54j57N32l80J30k6M3J14m5k43K11J83k58m4j10K4o1L45k26J03k57O09
4288D15q4k18l17L86K7r2j19j0K52l74j22J84J16Q8l61j14K59K39J53m45J7R9
$$ plain form
4127 -90 185 -3 -106 91 -274 158 -185 -29 168 153 -117 -110 -218 -165 200 -114 -261 -63 161 -267 -68 -175
4149 -175 15 1 69 249 87 179 -170 85 275 79 112 -68 -167 -134 195 11 -193 109 135 134 -325 110 -173
4172 -173 157 17 -22 -12 75 86 120 -106 41 -272 -49 -8 -17 180 -78 32 -14 48 -21 161 -69 181 -194 85
4196 85 -153 -121 32 164 -87 -94 -6 10 -16 -90 -176 -98 -178 239 434 -20 -283 139 160 57 319 271 -4 128
4220 128 -2 -14 -79 -105 225 47 -81 236 130 138 113 97 70 54 261 -186 -131 -222 -16 80 -407 25 164 115
4244 115 -66 139 -167 252 -26 -104 145 31 197 165 298 138 154 166 -136 -59 66 22 -166 -63 54 -326
4266 -326 -72 -229 303 -77 53 27 70 184 139 -104 107 290 32 -12 -122 -98 -159 186 -40 63 -194 415
4288 415 331 113 -204 182 209 117 -2 -12 240 -134 -256 -72 44 132 -229 -343 -84 155 308 -137 -120 -21
4310b1k69M32m40K11J92N2p1k57L17j91L82p04K34K08K2k33K81l71K45q6J39J61
4332B33k97k37K40J1j15K32k21L53q5l34K61J86j94N3j90M37l54J13j9J08j82
4353ak5Q1kj74L82n74M72k6j85J94R8k40r2J20K5R9m7l42M35k39J79j79l4J87
4377A12K33m52J51Q2k91K52k67N92m76J86p8Ok37K16j33Q0o8J04J27k13j57O1
4399a70L59m64L64k53O8R9k7O0J83j96L53m14q2J36J74k25J03o1J4J34j93J8j39
4422a59J72j28J92J22O3m5j64k0L72j44k63m9M9K10J02n98N96k60M4j21J61L4
4444A66j63k9J97rJ08j18k40J48k02N6O9L31k31m9k17K68Mm7m6J11o4j53J18N
4468A3L2o7P8K78k95J9o4j9p7o0L33j58K03l30M1L33l71K41j23j02R7J20j51k02
$$ plain form
4310 -21 -290 142 -298 -87 105 157 86 -171 146 -45 337 -367 -133 75 97 -136 145 -226 19 -67 72 233
4332 233 -64 -301 -61 -50 -165 67 -154 199 114 -220 41 227 33 86 -104 333 -21 92 73 181 -1
4353 -1 -26 55 53 -121 261 -313 159 133 -52 142 240 0 -92 28 53 152 105 -237 198 -41 138 -41 -75 112
4377 112 345 -107 44 126 -165 87 -180 412 -64 122 44 50 -187 29 -104 -24 -92 12 139 -74 -231 -170
4399 -170 189 -275 89 -164 -96 3 -24 36 219 23 376 -38 -120 16 190 -35 68 7 21 155 -38 -20 -159
4422 -159 13 -115 77 199 262 217 53 33 405 261 -2 -51 -2 208 310 -288 308 48 92 -29 132 166
4444 166 3 -26 171 162 270 152 -88 60 -142 -86 -17 314 83 34 -183 85 89 42 -4 107 43 -110 8 13
4468 13 45 -22 56 334 39 58 -6 -25 -102 -162 171 13 216 -114 -73 260 -111 130 7 -95 2 122 -29 -231
4492b31J81M3Q2k95N16l96r4J89o9K64j63J87J3j72k21J32J09l56p9J60J16J59
4514G5M1j4l37K40j81K8m9k5M97l01J83m33M17k74K02O4l10qK84k43J65R6l95
4537b78M92k47jJ75k84J38q8J85j9kq7R3J11j7K03j80jk87O6m6K72k35K08Ro5
4562A15j59J73j37L8J63L3j24k69M67j72j70j25rK75k44m0L24l41K87j02K60n97
4584c54N65k26n9K44l02M09k35%j27J46J2j9r7K02m05J85j64K96j49O4k45L20
4606F1k13L2J08J59k65N8J52m40J97j0K17j72m6k2N3j2O4Q1O7j32j74M16k57J36
4630E8k68L00l3J14l49L87j47k71K69l71M19l61N09r9k23J31k14O5j06L43K32
4651C85l95J64r0J12k91J81K41m85O27m05j50Mj52L58l36J36O38l59l56K2J32
$$ plain form
4492 -231 -50 -7 75 -220 296 -100 -194 -5 -74 190 27 214 227 55 -166 -34 75 -281 -360 -200 -84 75
4514 75 116 102 -235 5 -176 -148 -197 -222 275 -26 157 -276 141 -133 69 133 -177 -185 99 -144 21 117 -278
4537 -278 214 -33 -34 141 -143 -5 -93 92 73 71 -16 77 188 171 374 194 193 -94 -28 -74 198 -37 171 180 115
4562 115 -44 129 -8 30 193 226 102 -167 300 128 -42 -167 -176 99 -145 -185 139 -202 85 -17 243 -354
4584 -354 211 -15 -74 170 -132 277 42 42 -85 61 73 54 -43 159 -246 -61 -225 71 -78 -14 -259 61
4606 61 -152 -120 -12 147 -118 -60 92 -348 -151 -161 56 -116 -162 -184 -131 -143 -79 2 69 -63 -237 179 -78 58
4630 58 -210 90 57 171 -178 209 62 -209 60 -311 108 -253 256 157 -66 65 -149 -84 -190 153 385
4651 385 -10 154 64 176 -115 66 307 -178 449 44 -106 -102 -254 104 -232 -96 542 183 -173 -151 -19
4672a9n9J3J50j30L7o0R4k43K1J91j17K15k69k1mN0k29L09M4N7R8J52j11r9k49
4697a79L76l26O6O6lM5j95J18q5ok21L19j2L44l72J81q8k1J21Rj29o3j64L27P4
4722A82j27l2J29k03RP4k85Q0J43J96O9j31j43M9J89ql21R7K07k82K01j22J06
4745G7k60P4M4j74K93N6l34O9R0J47J05j17r9k1J62j42O2k38L30m30K17M9J43
4768A03l10Q8L44l70M04m26M01k40j15J68r7N7J41l36O90l36L3j06k25J00Q8M3
4790I9j90j33R3J84k18J32J04O3J10l49K83j18K3l19J80Q0J48j80R8J37R7l33
4812iP7M8k22j02r4KL81j54J98j37j03J44Pr5j97J70J31j34N5L64l77J07L1k54
4836a63K99J16l80K38K0j46K70j59k26K03n2k1L4L28m62j26K71R3l61O76n01J81
$$ plain form
4672 -19 -78 -65 85 -45 -8 -68 26 -217 -196 -5 -122 93 -176 -197 -201 -151 -380 -71 -27 30 128 280 169 70 -179
4697 -179 197 -129 -63 3 0 45 -150 -32 -117 -123 -344 -25 -37 307 -65 116 28 7 128 137 8 -55 -219 108 182
4722 182 55 23 152 -51 -42 32 -253 -173 -30 166 235 104 -39 10 199 191 -130 -33 174 -108 93 -29 77
4745 77 -183 -109 -65 -239 54 110 -224 -155 -65 82 187 70 -29 -50 112 -30 32 -206 124 -306 -89 -40 103
4768 103 -207 -119 225 -145 259 -167 234 -6 -121 47 -50 7 148 -188 502 166 199 93 -132 -32 56 99
4790 99 -91 -224 -131 53 -165 -33 71 134 244 -105 178 60 83 -236 -56 24 172 -8 90 227 324 -9
4812 -9 68 116 -106 -208 -302 -300 81 -73 125 -12 -115 29 36 -59 -256 -86 45 -89 -34 330 -47 60 91 -163
4836 -163 136 252 -128 110 130 -16 254 95 -131 72 20 -1 33 361 -101 -227 44 137 -224 452 -49 132
4858A32o3j61J45m1l7l5p9n4k5J52J26K6j00K37k90J69j50K05p0j55J07o6j0J11
4882G4j90K9Mj74L69J12k0j57j56L0K48l24J49OJ11j33J68j11J64j67k84L57j3
4905I2j20J17J44j76N4k92L5K49m19N16l98N18l54L95l79k37M44j20K16k73m65
4926d53K84J83l81N15k7l70L77o4m2R1j25j79k0K33K59k29j15P3n4J45k45P8L65
4949B99l37j09P5J34r9j3r2J39j90K98k9j00j85N21m57OK5K67j90J05K4k11K0
4972i9j27L29q3r3K28m52L04k16K95K1l01L28j78J06Q6k26q7l2R7J33KP3k89M81
4996C00l08N6o1K58j19j74K2J50j28j57L03j82J51l62K30O4M8j02P0j84m5q5J89
5019f6J02m6j95L1L89l6k03k93K78qJ77l12K93L19k28k07K67k11k1q5m9pk8K42
$$ plain form
4858 132 69 -92 53 12 -25 -60 -139 -193 -218 -66 60 86 -14 223 -67 102 -48 157 87 -68 39 -27 -37 74
4882 74 -116 -87 -83 -257 112 224 204 47 -109 -79 169 -155 -6 0 111 -22 146 35 199 32 -252 105 92
4905 92 -28 89 233 57 111 -181 -146 103 -316 200 -198 320 -34 361 -18 -255 189 69 285 12 -453
4926 -453 -169 14 -367 148 121 -249 128 64 22 113 -12 -191 -211 22 281 52 -63 10 -44 101 -144 -66 299
4949 299 -38 -147 -72 62 -37 -50 -142 -3 -193 105 76 -24 -209 312 -145 -139 -114 153 -37 68 92 -119 -99
4972 -99 -226 103 20 -73 155 -297 7 -209 86 107 -194 134 -44 62 148 -78 -165 -197 -100 33 35 108 -181 300
4996 300 -8 48 -13 245 126 -48 -26 124 -4 -161 142 -40 111 -251 -21 43 91 -11 59 -125 -170 -255 -66
5019 -66 36 -10 -205 -174 215 179 -24 -317 -39 -47 130 -182 111 430 202 -5 262 51 30 -55 -104 -111 -139 103
5043A03JP5k48N9n6k20J69J48K58k38l30L54j70N42m5l34J27j63j9k25K1L78j84
5066CK3m9J93o4n07M18p0K53k30R8J32k42L0K32k0k50J51k39K08j75L09j63k61
5089b20N00m7m64L2K6J78j22K27j07L9k31L66n1j90J07R0j70pL4j43O1K54l28
5112a66J08k62K08J87k17K19j15K2M2K05k35J30K2j76r4n6J12r0k8J49j64M92
5134B93j48R9j27j67J73oo3J1k57J31J50o4K12k94N1K1J2j26m10O15Q3k85j61
5157b57Q8P7jQ2J41L9k69K67k21m6K80l54p8K47P8j54J01nj33K81p6J12k03O2
5181E8R5l39N68k23k47PJ23O9K6J29m6j50j34K1k2P2J41j29k93J81K88M5o58M44
5205B6LQK09j01j06R8j3K6M2j83N8O4L22p15L56j13J60l44K20K73k42NJ42l24
$$ plain form
5043 103 104 179 -69 -10 -66 -286 -117 31 289 51 -279 75 -95 447 402 68 195 32 13 -212 -191 187 3
5066 3 26 -23 170 106 -401 17 -53 200 -30 68 200 -42 -12 220 200 -50 101 -138 70 -105 204 41 -220
5089 -220 280 233 -231 -199 -173 5 -117 110 3 42 -189 177 126 -64 43 133 -37 -44 -10 -153 -92 162 -166
5112 -166 -58 -320 -112 75 -142 77 -38 -16 26 231 -4 126 148 -28 -122 -178 -66 -156 -184 -35 -199 293
5134 293 145 244 117 -50 123 117 54 65 -192 -61 89 25 237 -57 -6 15 27 -99 -509 106 189 -96 -257
5157 -257 -169 -92 -93 -11 130 169 -100 167 -54 -100 180 -174 -252 -5 73 -81 20 15 -118 163 87 199 -4 58
5181 58 153 -186 382 159 -88 -81 42 111 137 266 220 70 -64 -43 -65 7 148 19 -274 -93 195 240 -418 26
5205 26 29 37 246 145 39 137 124 150 192 9 67 131 453 -262 94 -19 141 -203 17 290 48 53 195 -129
5229a29L12M3m19J24j62K68j29K33n06N04r8j94M7L42k87k23M67Q9l36J37M5j34
5251fj83K68J55K0m97M00l84K89j07Q0j59M16l36PJ18j09P7M3l43K75k00L47J09
5274B80n8l45j08M90l0o6j35N4k78J39N1j43O7QN9J5O0J03j43J12j08K3N5j32
5298c0J4P1k69L80m09L35K2j23j47nR7pK04j24o4J64p1L03m89O2RQ5q2J51J27
5323B04j27M4n14K03L33l62J56l22L49K7j56J06N1K01k44L36k40J14j96N3l3J02
5345H5J34j17k45J48n1J4J49j09P6r1J35k52M11k44l39J96l5K25k43J76J6Jj07
5368f7p6K18k00K65l44Q0l5N7K47n24L01J25j59J90l43L05l1P5K1k03N4j09J59
5391Fm9JL0M0j70o2K56o3j34O1J35N8k4k32J96n2rJ46O1k82O1K84k24k96J44K54
$$ plain form
5229 -129 183 226 -193 -69 -231 37 -92 141 -365 139 41 -153 -106 236 -51 -274 193 282 -54 83 128 -6
5251 -6 -189 79 234 254 -243 157 -227 62 -45 35 -124 292 -44 -37 81 -28 49 92 -251 24 -176 171 280
5274 280 222 -123 -231 259 229 163 28 82 -196 -57 -6 -149 -82 -74 -15 0 60 163 20 132 24 47 102 -30
5298 -30 -16 55 -214 166 -243 92 114 -9 -156 -161 -64 -71 133 9 -55 109 38 341 -148 -86 -77 8 -74 77 204
5323 204 77 121 -393 -190 143 -219 -63 -385 -36 -9 -165 -59 -8 193 -51 285 45 159 -37 16 -17 85
5345 85 219 102 -143 5 -46 -32 117 8 84 -7 128 -124 287 43 -296 -100 -135 90 -153 23 39 40 -67
5368 -67 -143 75 -125 140 -204 -124 -159 -102 145 -379 -78 47 -112 78 -265 40 9 84 105 -98 -44 -153 6
5391 6 -43 -42 -12 28 -142 -204 52 -11 -145 -84 51 109 85 -147 49 -3 -12 134 195 -87 -26 258 34 -262 -118 136
5417A36J8l32j63N68k67L40n60M11j67k18L61l40j1M37j47j7J9j80J10m1Nk08
5439b46K92K29m12L30k94m8L21j20k30K03n0PQ4l27J84K30k40L33k07pP9l21M44
5462B34k70p6J76j16j49J55K89m4k05l6r7j3j36J93K08r9J17j14k02j87K37R7
5484c8J79l60K37K94n01N1j46L16k32L67j84J07p9j22j52J48J77J43k81L31l14
5505e9J87j53PK12L9l72L17L0m53K00N5o3J8K77m72L27j31k05K71j29KP9J24j75
5529f7k9M5R8qJ13jl23K47o5J39p3J1j08r4J02q6J30j40j1M51k48j51M7m0O5j9
5555a5J54k46Q1K76k4k86N3K22r5n9J0m1o4k68K50r4J17Jj10J52q9J59J78k97
5579c5J40l36L03k30K65l58J72J54j44J02q7r3J05j55K27K02l21j12M12j79k06
$$ plain form
5417 136 154 -178 -341 227 -40 300 -260 151 -16 -234 127 -213 -224 213 66 49 68 -112 -2 -43 -38 -246
5439 -246 46 275 -137 193 -101 -149 172 52 -178 25 -25 -18 66 -261 -77 153 -87 246 39 32 111 -210 234
5462 234 -36 -112 64 -52 -201 -46 243 199 -6 -42 -139 -152 -288 -95 113 14 131 17 -185 -372 -135 -38
5484 -38 141 -219 18 312 -189 -138 -284 32 -200 167 -17 90 11 -111 -263 -115 62 205 -76 255 -59
5505 -59 128 -25 -18 194 233 -139 178 208 -245 -45 10 -53 -35 242 -230 97 -34 -239 32 -97 -95 -16 108 -67
5529 -67 -96 -51 47 39 152 151 -172 75 10 149 76 87 -21 -115 -13 -99 31 -109 -120 331 83 -68 -21 -61 4 -15
5555 -15 139 -107 -26 250 226 -60 -7 215 120 61 71 30 -34 -302 -52 -146 -29 -28 -138 14 -75 84 262 -35
5579 -35 105 -231 72 -158 107 -251 -79 75 -69 33 -54 -147 -42 -197 30 232 -89 -201 211 32 -174
5600a74J85k14K02K0K58m30N10m01Q9L10k15j69J69k34k84J19M58n35K93J66k39
5621a16J86M5k12K3K75n32N56l96Q5k2q3J34M1O9K2k84M1p6L56j08Q3m27K81L16
5645B57j59n1j07J01l5o2o7J27L0L8m49L78j62M1J19J08j42K00l36N8J85l76L53
5668D9l3m9N9k21K74n7J98k37K5J36k19K13J82m22L18j05j22r7J13L52K0l2l29
5691A6lR7j0n6L05k64j81j5M1L50l36K4K73m75L33m03K22O9o0O7K02r6mP3m55
5716b86K44o3K47l28N8n8J49J6l0J2J59%J09l27n3L77l70M27l97J30J61j27j33
5739h3J72q2P9k4l8k13J20J66k00J24K89p6r7j61L00n93L79nj43K37K8J1l80j24
5763c14pR6K95K17o01R7L28r0J37l01N75m38L06m03o6K64M9M1k47L79m79Q1L3
$$ plain form
5600 -174 11 -203 -1 19 277 -153 357 -44 45 355 140 -29 140 -94 -378 -259 199 -336 -43 123 -116
5621 -116 70 115 -97 -74 201 -331 225 -171 -86 -108 -191 -57 -16 53 75 -209 -168 -244 112 4 87 -340 -59 257
5645 257 98 47 -60 41 6 -56 -123 4 34 72 -377 1 -161 -120 -1 107 -35 165 -171 -113 72 -304 49
5668 49 16 -33 26 -195 79 22 220 -17 8 144 -75 138 320 -102 216 111 -11 -108 5 357 377 345 16
5691 16 13 110 100 44 349 85 -96 -111 -70 280 -56 -32 241 -234 99 -304 -82 -13 -73 -6 196 100 96 169 -286
5716 -286 -42 -105 142 -186 -128 -186 -37 -21 -51 -39 120 120 229 -98 -151 226 -144 283 -114 16 177 50 -83
5739 -83 89 7 86 62 24 -189 -69 97 -103 21 310 234 137 -24 276 -317 62 57 -86 151 179 190 -190 -314
5763 -314 -321 -225 70 287 -314 -217 111 21 158 -143 432 -6 300 -103 -169 95 144 185 -62 317 -162 -81 -48
5786d8K3j7K55k24j07L1J96r2K36m04j08K43J10m8l39M23R7l30J14k7K02k21k0
5809e5L01j80k3j18O1M2q0K53n84M01J01R7k03J84J96k04l14N35k75k31k2K04
5831H6q2J93p2k75K95k90K84k4n2k02j91K86j5J1j25k2J87K57p7k96L81m86L73
5854A44r9J8K4j6K4k58K40j66j8J31J57P9j61k41L71k04K39j97Mq6OR7k4K10m38
5879a64J13L0K11p4k23N74l89j14J19n4L2j64N9q0M6R0P4J25N6j56q2K3l4l37
5903c19N3L00q9K48j68L8l5Lj06J30m5N4j04K74j73r8j2o5J94n2j59N46k57j26
5927C2k26J35K29j23R5J62j51k56J80k27L26j21j50j43K27K2J7j23J79n63M33
5948d6pPj2O2M99l53k54j57L64j84L6L96k43J72r0j23k51K76mm29J17K00k2j90
$$ plain form
5786 -48 -25 -42 213 -11 -118 -87 109 17 253 -151 -259 -16 94 46 -293 130 227 -103 11 -16 186 -35 -55
5809 -55 246 66 43 -75 -14 28 -52 201 -383 18 119 216 13 197 393 189 -125 410 135 -96 -118 86
5831 86 4 197 125 -150 145 -145 139 115 63 -139 -330 -44 -59 -48 -173 -195 -8 249 172 -124 257 -229 144
5854 144 45 63 87 71 95 -163 77 -89 -107 24 181 260 99 -142 229 25 264 67 71 -15 -9 88 64 274 -164
5879 -164 -51 -21 190 116 -107 467 78 -36 83 29 61 -103 -44 -124 -78 12 86 211 267 111 29 52 18 -319
5903 -319 -266 34 -55 193 25 63 28 31 -75 55 10 64 -40 234 61 -37 -49 -114 80 28 -131 415 158 32
5927 32 -194 -59 170 47 142 304 153 -103 77 -150 176 55 -95 -238 -11 11 28 -95 84 -479 -46
5948 -46 -53 -46 -58 4 503 150 -104 -261 103 -81 -45 351 108 280 190 67 -184 92 88 -341 -224 -24 -46 -236
5972b36J43K52j15k33K67l3j39K54k54L07k69l01M91P0P9n00J82L5J5k7m5K93
5994B36l09J6P4k35K15L8l06L23Q4j89MJ20j89L23m71K02k05K25J75n6kj84R3
6017a8Q3J79k66k22K69l39K64M04l06r2J74j55k12M74L23o22j35J79k78K12J08
6038B4m4K47k09l3K4j02n6p5K42k46J92j50J61K33j96K15j88M9Ql22J33N5j6n0
6062a04n7K6K40j2j43j8j30L38r8K87k90k05K46k66K56rN7j90j42M55j37m29J06
6085b19K99l03J47K61j05j85K42j16Kj05l54K87K90j24l79L86q6k49L90l25L04
6106E8k10P4R6q5o2j88N93j34k05J66j73O4r3J59Q4P5p1r6J43k58M15k50j32K76
6130B46j8n85L26J87j14L4j03P5K20j85j52J27k32O3N1Q8j9j32M97n22L51k64
$$ plain form
5972 -236 -93 159 44 -189 78 45 -94 160 -94 213 -56 -357 134 204 283 -217 -35 0 15 -12 -57 236
5994 236 -73 -57 17 -218 -3 35 -271 52 136 -53 -49 71 -118 205 -266 -64 -269 -44 131 75 73 -111 -18
6017 -18 65 244 -22 -244 25 -314 -50 354 48 -44 130 -25 -237 237 560 -62 -197 -18 -296 -84 24
6038 24 -20 227 18 -15 9 -93 -149 -224 18 -228 -36 -186 -25 208 12 227 39 88 96 -226 -93 -38 -54 -104
6062 -104 -161 -135 105 93 -50 -68 -198 140 42 329 39 -166 80 -186 70 61 118 -72 -214 241 104 -325 -219
6085 -219 80 -223 -76 185 80 -105 137 21 23 -82 -436 -149 141 17 -362 24 -62 -311 79 -246 58
6106 58 -152 -78 18 -67 -129 -317 276 142 -63 103 -70 -6 -99 60 144 219 148 52 195 -63 352 102 -30 246
6130 246 228 -357 -31 156 42 76 -27 48 268 83 -69 58 -174 -111 -60 28 9 -123 374 -148 203 -61
6152f1J27j16J20j27J14q5p1J35n2k2k16N07k76k44J23j96J04M26l04j68K93J8
6174B9j75N3L18m07J54J39o6j28j21J6J81K13j56j18J41j38k30L27J56j93k29
6195b34L82j8l81L23l70M78l29P7j8K5O4k51J96q8P1J12j6m0L6L4L1k02J97k10
6219a31Q6K66p8k48l69M40J02m69Q3L56k29J63N9l90N63j91q9j39O8K36j10L5
6241A4j10O9J53j8k51K5K90j60J09j88J93j48K05j40M3k57K82k0Pr9M6N8k78M07
6265B32k30L06n34O2q8L39J50l03m05L65L0J88J1N6k95k29J29O57n03j03J6L47
6287A98m11lJ28k71L39J89j21N4j56J21M7ln0k6k33L19p0M9J4j52J62k27K65j1
6311A51k59n3L07Q4l74J19k08L93p3k05n4r0L77L3k16l1J60n2j99J68O9m2P9j57
$$ plain form
6152 -61 66 -50 70 -57 57 -28 -99 36 -16 -38 -254 253 -23 -267 -144 -340 -236 190 -114 -282 11 29
6174 29 -146 -93 225 -182 -28 111 45 -83 -204 -188 -7 206 50 -68 73 -65 -295 32 188 -5 -234
6195 -234 148 130 -251 72 -298 180 -149 -72 -90 -65 -1 -252 -56 -144 -73 39 23 -17 19 53 84 -118 79 -131
6219 -131 -45 221 143 -105 -474 -34 68 -401 -318 38 -191 -28 31 -359 204 13 -76 -215 -147 89 -21 14
6241 14 -96 -27 126 108 -143 -118 172 12 121 -67 126 -22 183 43 86 -171 111 91 98 -1 45 103 -175 232
6265 232 2 308 -226 -164 -252 87 237 -66 -471 -106 -76 112 123 179 -116 -345 -216 441 -62 -165 -149 198
6287 198 -213 -216 -88 -359 -20 169 48 102 -54 67 114 111 61 35 -198 121 51 100 114 -38 124 -103 162 151
6311 151 -108 -161 146 230 -144 -25 -233 160 87 -118 -172 -262 115 148 -68 -99 61 9 -190 -22 47 5 84 -73
6335g3r2J56K5M4P5o8Nl8M3J08j35p2J13m29J93J24j68J90j93J84Q4l2p7O8j43
6360a08kJ54p7J22k2j69PL31l29k54M35r8k84K03K74j13K58m95J01j1R6r3j04
6383a78K02J82l40j9K78j42R2p5k36M47o6j53K01k61j70J02L21m00K17J13l61
6404b46K26K27J4k69j26K98j68K21k85m0J03k11L72l3K15k65j90L45l34n3NL66
6426A72ok29Jj87l8M14q5q1k63M28K2P9m99J36K66j07k7r8K20j83j25M1k64N97
6450A84p8j53J9j35J1J27K89j11k70K31k70K18J25p6k63q4K37j68L04R9j22l72
6472b58M69r1p7l6j53L6K49m14L36J16n24M15r3J54J3l75K39N61p04J3m05L51
6494a78K34J32k10j41K28J1j24Q4l7r4m1K44j4q9K29l4l09j76J05M3J56j77J71
$$ plain form
6335 -73 -165 -9 16 60 135 67 72 34 77 185 50 -22 91 -338 -145 -21 -189 1 -192 -8 76 44 -33 35 -108
6360 -108 -110 44 -33 89 67 -102 -95 236 -93 -347 88 -10 -294 -91 183 70 328 -167 -66 -77 19 -74 -178
6383 -178 24 206 -134 -153 125 -17 75 0 -236 211 145 -8 193 -68 -238 -136 185 -215 2 115 -246
6404 -246 -20 207 221 -48 -174 124 -44 177 -108 -148 -45 -256 116 83 298 33 -157 188 -146 -199 -194 172
6426 172 166 -63 -62 -249 -287 127 42 -39 -302 126 148 227 -272 -136 130 23 -4 -102 118 -65 -190 -149 -413 184
6450 184 106 -47 -28 -163 -152 -25 264 153 -117 114 -156 62 187 111 -152 -236 1 -167 137 236 114 -258
6472 -258 211 120 43 7 -146 -110 139 -275 61 177 -347 68 -25 129 142 -233 6 567 -137 -124 -529 -178
6494 -178 56 188 -22 -163 65 76 -48 36 -1 -95 -136 108 94 5 234 200 -109 -285 -180 -137 19 -158 13
6517A3N6r2K81p8j42K16j22k68J47J58k29J84j1j89j82L22R5k10K58j7J38m95
6539a67J76qm9J71L0m36K57P1j05k42K32J8J2j61J36Q4j84K21j59J5N4J40m6k0
6563D0J35J32k09k9j55J07j54P5K36j6k30P3j0l4M63k75j31j65o8J48L41k71K20
6586B23k49l27M65q4j88L9K85k74Pj20O71l69J4n6o9J20k28J93o6J26J6j42k86
6609b99L24k91J07K51l02K24k26j6J68j72m7J24R0j28m2O4r6M42l29J05r3K74
6631A32l9l7K85k63k15K91J60l45Qp2O7k46N33n5l97L42j16l72K65j16O8p5M9
6654a48K81k02j05p2L30J13K1j01n6l09L63j0k11Mp4R1Q5nR6L2Qj26J24l13J27
6679e7J01l1j64J76p2M6p6Q0k5R9p4k08J46R9q3K52p4k7j27j32J64N7j87q4M4
$$ plain form
6517 13 69 -23 258 180 38 254 132 -136 11 169 -60 124 113 -76 -258 64 159 -51 207 190 328 -167
6539 -167 9 1 -48 123 153 -283 -26 45 -60 -302 -70 -52 -40 -201 -65 19 -165 56 -103 -88 -34 106 60 40
6563 40 175 307 98 69 -86 21 -133 -58 178 162 -68 5 -5 -39 424 149 18 -147 -215 -67 274 3 223
6586 223 -26 -353 112 28 -160 -121 164 -110 -103 -223 448 79 93 37 -32 88 -140 53 -13 113 129 -13 -299
6609 -299 25 -266 -159 92 -210 14 -212 -228 -60 -232 -279 -155 -65 -193 -235 -171 -267 175 -154 -49 -142 132
6631 132 93 56 341 78 -137 154 314 -31 -23 -95 -28 -274 259 204 -193 149 33 -339 -74 -190 -122 -197 -148
6654 -148 133 -69 -174 -246 84 197 218 117 61 -248 115 105 -106 -102 -176 -85 0 -5 91 123 131 5 129 -184 -57
6679 -57 44 13 -151 25 -47 -1 -77 3 -22 77 3 -205 -59 40 -43 209 135 108 -19 -151 13 70 -117 -201 -157
6704a57M59r3j03j72L1K91p26O71l28Q0J27L6j98m0K57l79n9J82O7n0Nk27N6M66
6728A96k21r4m7L88J23n13N5Q3J34llr8K0j4O5j55L9J50j18K15k65J24R4J27p04
6753d22K11M25k20r1J74N9j21k97K36J30k19M74k53j18q7J74j30J28k38K84r6
6774CM25m29j7l51M49N7p7k27N5J4P0K8k02N09n04M24l03K39l26K46q6K87n6k88
6798f0J36k80J99j75M7J21k07J44k00KK57k15J65K75P4r9k70k41P42l18p4J09
6820A32j11k7O9j10o1M0l70L51K6Q6J0q1k20L63j28k11J48J50j78O8j93M41j72
6843B2j49M88k51k58L25l7l27L96J4k78J71k01Q9P9j2j20j4J34k6k50L96l19K15
6866H7j44K22j36N6j03J84r9j46m3J27J90l04J58k04J54j58L1L73k26k41K49J31
$$ plain form
6704 -157 302 209 106 -66 -35 256 -470 201 -127 -47 80 116 -82 -122 135 -244 -303 -121 -54 -104 -99 -326 -270 196
6728 196 -25 -119 -166 222 345 -168 -113 -30 104 101 98 0 20 6 71 -84 -45 105 -13 202 -63 61 155 282 -422
6753 -422 -211 214 -6 -97 77 136 15 -282 -46 84 -135 339 86 -32 -119 55 -75 53 -185 99 3
6774 3 428 -1 -18 -369 80 137 60 -167 -112 -98 -28 0 -202 307 -197 227 -76 163 -163 83 -3 284 228 -60
6798 -60 76 -204 -5 -180 -133 -12 -219 -75 -275 -273 -16 -231 -66 209 283 184 -86 -327 415 97 23 132
6820 132 21 -6 63 -47 -108 -68 -438 -87 -61 25 35 -46 -266 97 -31 -242 -94 56 -122 -54 -247 194 22
6843 22 -127 361 110 -148 177 140 -187 209 223 -55 116 -85 4 83 71 -49 -63 71 45 -205 191 -128 87
6866 87 -57 165 29 85 -18 166 67 -79 -122 5 195 -109 49 -155 -1 -159 -128 245 19 -222 27 158
6888A58nl75J87o6%K8Np6J80P4j01P6m00K28j3PJ96l89Q00m83J84M1k96rnp4L26
6915A98l58K73k33P0K66k68k24L77p1j25k1K97l90K99k96J95K53j03j40J15k30
6936a16J07j12J96K0j40O6r7K46L4k22j58K71J8m5j6O7j22P8R4k59J30L4l04J46
6960h4L50m57M42j3n64M24l13M17j97J47j45K41k41J40k47j15n9N32m22J7K31
6981H4k88J90j74J97n3K36k56K60j05k5J73n3j63J18j28q5j32K83R5k67J97j37
7003c3J11J56k08J12k34J38j62k8R4J24R2K8p1k90N4K6J13r4K50l31J83J91p7
7026A44j10j99l9K77n6J48J17l39j50L1J62n1J8K1k0L9L6k85p6R5L23k13K1o9
7050a75QN9J55J97m37K10j99K77j02n0l62J44M43j40N6m20K09N3j06l5K40k67
$$ plain form
6888 158 153 -222 -35 -101 -101 -73 -68 -144 36 110 9 85 -315 -87 -100 -93 103 -286 514 31 215 256 -40 -49 -54 -128 198
6915 198 -160 113 -120 -50 216 -52 -276 101 30 -95 -116 181 -209 90 -206 -11 242 139 -1 114 -116
6936 -116 -9 -121 75 95 -45 21 -76 170 204 -18 -176 95 113 68 52 119 -3 75 169 -90 40 74 -230 -84
6960 -84 266 -191 251 238 -326 98 -215 202 5 152 7 248 7 147 -100 -215 -274 258 -164 -147 84
6981 84 -204 -14 -188 9 -44 192 -64 196 91 66 239 186 23 141 13 -72 -204 79 174 -93 104 -33
7003 -33 78 234 26 138 -96 42 -120 -148 -54 70 162 190 119 -171 -117 -91 22 -72 178 -153 30 221 144
7026 144 34 -165 -204 73 17 165 282 -57 -207 -176 -14 -65 -47 -26 -46 -7 29 -256 -332 -237 86 -127 -106 -175
7050 -175 -167 -108 47 244 -193 17 -182 95 -7 -57 -419 -275 168 28 84 -336 -127 -74 -180 -215 25 -242
7072b42K60o6J10n15M83Q0l20K76l64L72r4m47O35k95N3L52k98P5k31K87j69M86
7094D28m63l7K67k12k10J44L86o06K36J53Q9K8l40L29k00K04k01J86l86K68k13
7115a50R6R1J94j68J9J57k78j34J39k2r6J78J67j5k27j36jR4J5J07r9m3K4j1J70
7140G1o0K08k65j13R7m6J52Q0m08ML20j47J52k49K88N7j78m1l6K55j09J09m67
7163c26L25j9M8j68L11l30K09j5p5o7l8J4K72k64K93j04k62J89J10k93K89K50
7185C49m13q2J96j32L3J26j71J55j80J79q9j2n7L91n27M76m32J82k8J56j05q2
7207f7M38n62K51q1K0J98l81J2J56L39m42M51k04j91j23p1M77l07J28l18L59J83
7229B65n19M46l53J66m0j49J07J88j8J24j68L4R1n26L84M50n68O7o4P6J20l32
$$ plain form
7072 -242 18 -48 62 -453 30 110 -210 66 -298 74 -20 -467 168 -127 -74 278 -20 55 -176 111 -58 428
7094 428 -35 -72 195 -17 -227 -83 303 -303 -67 86 175 203 -137 192 -8 196 -5 181 -205 63 -150
7115 -150 -54 37 231 63 82 239 -39 -173 -34 -56 -152 26 193 178 -49 -185 -186 -92 -77 30 -69 -112 -88 -99 71
7140 71 11 219 -46 -159 -62 -108 44 124 -284 -280 40 -107 45 -204 84 141 -37 -78 -114 141 32 141 -326
7163 -326 -1 -20 28 -140 171 -159 50 35 -40 -107 -145 -131 141 -123 170 66 -196 -7 103 -190 99 349
7185 349 -64 -146 50 -82 -49 77 -94 61 -119 60 -29 -41 -98 293 -234 242 -190 -8 -36 120 15 -67
7207 -67 371 -191 60 -21 -1 197 -184 -172 -16 323 -119 332 128 -63 -186 -257 220 -87 41 -277 82 265
7229 265 -254 192 -161 5 -35 -184 -77 111 93 217 49 83 174 -352 32 482 -86 -19 -83 -7 113 -219
7251b19J98l07L93k34O2L02R1l20%l5J28J28N3Q8l43k9J22N6j92J38j84l06O00
7274A90k68J14j19l2j93K07L43l35K5J83q8j02qJ41l8j56L8J72q4J65k42P2k24
7297b39J56j32N5j92K74K05k4j63J57L25l73O4n42N03j94k5L00k27K97k66M3k17
7319b15K55k66O1N22o38Q5K82k5Kk40L12j88L26j49j66Jl12K45J65K2k99K99Q9
7342A68m02L50J61k50j47Q0o9J35r3J29L5l68L06R1k51J63J07j67K32k58P5k6
7364Ak26K60M0k75m1L37r1R3p0k10K95j6K51j35k27J81j67O5j35J21J62O4Lm54
7388a74l8J21N6K10l04J52j34K70k17Q0Q6j69n8J38kk62J56J96k12L25l39J57
7410C8p4K02l36M7Q9M3j79J2R0M16m65j5j58O76l69k10K11Q2J16m01J17j91L09
$$ plain form
7251 -219 -21 -328 65 -169 -107 195 286 -34 -34 -69 59 187 240 328 -15 -44 78 134 -58 80 -104 -410 190
7274 190 -78 36 -83 -115 -308 -101 242 -93 -68 115 27 -75 -83 58 20 -136 -98 74 -10 155 -87 -15 -239
7297 -239 -83 -215 -160 -352 -78 127 103 -60 97 422 49 113 -429 74 -120 -145 155 -72 225 -41 2 -215
7319 -215 40 -226 -165 357 -281 -196 86 61 63 -177 135 -53 273 124 -42 -41 -353 -108 57 79 -220 79 168
7342 168 -234 116 277 27 -120 -40 -109 26 -67 62 97 -271 35 126 -125 38 145 -22 210 -48 27 1
7364 1 -225 35 75 -200 -241 96 5 98 28 -182 113 97 348 213 -14 167 0 65 -70 51 213 277 280 -174
7388 -174 -212 -91 -35 175 -129 23 -111 159 -58 22 108 -61 -119 19 17 -245 -89 107 -105 220 -119 38
7410 38 -36 166 -170 -123 -34 9 -170 -158 -68 348 -117 -132 -290 386 17 -193 18 100 216 -185 -68 -259 50
7433E0K16K9j74j4r8k40J67j46K33K48j83j71k66K17K2J54q3M2J61q0q9l04L60
7456E1j24j95J43J76k51J37K47k16J07K47k23o8j43J42j20L10k63J99p3%Q6k05
7478c6O9M4O6k09J55R8l15k50L40K57j62j71L23k47j58J66P4n0L3j47rK29J23
7501B23p0k93K22j70J62j65J33j1n5Q2K61n47K70P6l30O10m01j75L75k07j51J23
7523c8J20k0j0k14L21nJ0j69j34M61l95M9K23k71M5j8J30N7m35K47K24l24L59
7546B13k03k10K97M2k20l3L3j4L21k37q3J33J60j30k23N0J72k28J03jJ08M13m06
7569E7k34L69o60N37o6j0J68k05j99J21K01j5j6L84k31n7k21J71K71l53q6K66
7591A92k11J17j95J09p4K22n0j74J51j67J95j78J02j94L31l58M0K67j9J4J46k24
$$ plain form
7433 50 266 295 121 107 9 -231 -64 -210 23 271 88 -83 -349 -132 -110 44 -39 3 164 84 -5 -309 51
7456 51 -73 -268 -125 51 -200 -63 184 -32 75 322 99 31 -112 30 -90 220 -43 156 83 83 169 -36
7478 -36 33 77 143 -66 89 187 -128 -378 -38 219 57 -114 209 -38 -196 -30 44 -6 27 -120 -129 100 223
7501 223 153 -140 82 -88 74 -91 42 31 -24 58 319 -228 42 118 -212 398 -3 -178 197 -10 -161 -38
7523 -38 82 62 52 -162 159 154 164 -5 -139 322 -73 -24 199 -72 -27 -45 85 142 -293 -46 178 -146 213
7546 213 10 -200 97 139 -81 -114 -81 -95 226 -11 -94 39 199 69 -154 -104 68 -160 -57 -58 50 463 57
7569 57 -177 192 -468 69 3 -7 161 -44 -243 -122 79 64 48 432 201 144 -77 94 365 12 -74 192
7591 192 -19 98 -97 12 -62 160 110 -64 87 -80 115 -63 39 -155 176 -182 -142 125 106 120 266 42
7613D2k31J35j0j39M78n30Q9K20J55j89k06J66J68l14k4K2K78pj88j14N87o45
7635b57K36nj06K74l28J92n7K36j26j1r4r7Q2Q3j52J10j54L19j90K87q00K90L21
7658E3l03K56j10J65n3M31k48j25O5j8j49K3r0j3%L73l82K54k13K37k10K45j48
7681D0q5n0K8l6r3J94O5k2K67j91k23j36M87j70k12M61k38J4l24N14l54J57N9
7704A52q5j28M1kJ18j48J15j27K49l62J45j03K05Q9r4L13j89l39O5K39k66K84
7726A72l5j05l0N4P6J04l9k6j24J4k39M17k9m24L82j03N2m9J25l5k03K66r8j13
7750A0J09L8N9m21K42j56L19k70l25k7K97O5j10K84l84J66K22j23Q9J52k11O5
7772I0k87J65P6M8J5k87M87m18j9J50k15N42l81K1J31O7nj34k50L5Q2L12j15J91
$$ plain form
7613 42 -189 -54 -64 -203 275 -255 -166 54 209 20 -186 -20 148 -166 -190 -168 110 103 -85 -199 388 -257
7635 -257 -21 -26 -132 142 -186 6 -51 185 59 48 -46 -143 -61 22 -130 -20 -174 145 -45 242 -558 -268 53
7658 53 -250 6 -104 61 8 439 191 66 131 113 -36 -13 -103 -116 -116 257 -125 129 -84 153 -57 188 40
7681 40 -45 -95 -67 -103 -196 -2 63 41 308 117 -106 -242 245 75 -137 324 86 100 -224 290 -64 93 152
7704 152 67 -61 -20 -22 96 -52 63 -64 185 -177 -32 -135 70 159 65 378 189 -150 -85 154 -112 172
7726 172 137 32 2 56 132 236 197 171 47 61 -178 239 210 -214 168 65 117 68 193 158 -45 221 123 10
7750 10 119 157 216 -205 37 -119 200 -70 -395 -422 -125 -60 -170 114 -270 -104 118 -5 84 236 25 90
7772 90 -197 -32 44 92 107 -180 307 -111 -130 20 -195 347 -34 -13 118 185 180 46 -204 -169 -87 225 110 301
7796C01q6j61m6K14k30j24J31p3j60J55J88m47L57J11k39L11k11j54J87m30L80
7817b6J62j23j19j18N22k33J2J3j48QK4l70N83j57o2J48k73J34j37Q7j56K18l28
7840c39K58P9k15J30K87o1k90L80l65L42l17J28O3p5k92M65k48m69M36j41N21
7861B77q9j25J1Kl14M45l73J68K96k03l21M32k54N6j36L27Q5k87J99k67j1J94
7883A12k02L2L79o19J85M7j6L66j82j74K88l39oj39K37K37j33K55m51o6m2QO6
7906a57pO7J2PN6J04J9J61k99J66k49rK32j56K12j00o1J75k71J95j09K38r2M1
7930A75m34J40L0j65K85O2l44K92Q1k86L19k05J89p6j01J9J87l26L22n8q0J52
7952A78j20j99J68n6k1J18j80Q0j2K25lj74r9J17l74K42J23K79j19j31j65N0J24
$$ plain form
7796 301 215 54 8 222 -8 -132 -1 -74 -234 -79 109 -338 19 130 -109 202 -9 -163 24 -406 -26
7817 -26 136 13 -106 -224 298 65 77 90 -58 -50 -26 -396 187 30 -32 116 -157 -23 -160 -73 -229 -11 -339
7840 -339 -81 -2 -217 -87 200 139 -151 229 -136 206 -111 17 80 5 -287 178 -70 -539 -103 -244 277
7861 277 188 63 74 76 -238 207 -166 2 298 95 -226 206 -48 8 -128 199 284 -3 196 -71 -82 112
7883 112 -90 -58 321 -298 -113 -66 -82 284 102 -72 216 -123 -129 -268 -31 206 73 328 -123 -189 -231 -223 -157
7906 -157 -164 -97 -85 -78 -22 82 101 262 -37 129 -120 -129 103 -53 159 59 -2 173 -98 97 -12 226 134 175
7930 175 -259 -119 -89 -254 31 93 -251 41 122 -164 155 -50 139 63 -38 -19 168 -158 164 106 26 178
7952 178 58 -141 27 -29 -50 68 -112 -32 -44 181 178 4 -95 22 -352 -110 13 292 173 42 -123 -73 51
7975E1k7J28j31k76L14n8jr2J04P5N4M4j50M9m5j48j33J76j64R0LqJ34K04p6n16
8001c99N02k51m4M02l37J93k94L21q9m1K45j54K04q7k42P6R0q9K09l81LJ37J81
8024A55l42Q3k4J49K73j58l37J60m8J06j00jn6K63k85J05K91l94J03j35n0J99
8046d3j13O0K33j44P4j8J25j01l01L37j10j41L01j66N7j42J05K5j82J28J2J36
8068A32k73K38j6j98M5K81r0J0j01J01j98L05l9m96J59J97k07L69o1j80L01l38
8090e9J96l4j74J54K6J00m41qM19k05l4r3j43L35J42l41j5J51Q7l9O0m06L44p2
8114e0j23R0L9N1l35M39J33k94L51m15k94N74l15K88Q9J45k09n3k68J86mJ5k51
8137b11l6M5K54q4J61p2j3j28K83j18J46k56o2k52L26r4j06O6J97l12L21Q0j18
$$ plain form
7975 51 24 152 21 -255 59 1 0 -92 12 87 141 185 35 84 39 -109 -242 -66 -230 -140 -137 -145 -11 193 117 -399
8001 -399 103 -148 -192 210 -127 66 -228 93 4 -37 208 54 258 171 -71 5 95 6 215 -166 -163 -26 155
8024 155 -187 -104 -128 21 294 136 -201 -41 -89 17 -83 -84 -140 123 -162 -57 234 -160 -57 -192 -242 -43
8046 -43 -156 -96 137 -7 67 49 174 73 -228 109 -1 -142 159 -7 50 -92 13 38 -144 -16 -4 132
8068 132 -141 97 81 -117 -72 209 119 129 28 129 -69 236 197 -299 -140 57 -150 219 158 -22 279 -59
8090 -59 137 103 -71 83 109 209 -232 -240 179 -26 -60 -153 -296 39 181 -160 -175 -24 63 24 84 -322 22 -50
8114 -50 -173 -83 -44 7 -328 111 244 -50 301 -114 -408 166 -149 139 228 373 164 111 -157 29 25 40 -211
8137 -211 -247 -202 52 -32 129 57 44 -84 199 81 227 -29 -91 -343 -17 -111 -217 -151 46 -266 55 135 17
8160A7k06J82N6m9j2k21O41n35k35O49k83k2J99n8n5k06J44k8J04Ql11K43J81
8183B03j47j87j90L60j84K58J52m20
$$ plain form
8160 17 -189 -7 49 0 -12 -233 408 -127 -362 287 4 -18 181 123 68 -138 6 -22 82 90 -221 22 203
8183 203 56 -131 -321 39 -145 113 265 -155
8191a55
$$ Imaginary data points
##PAGE= N=2
##DATA TABLE= (X++(I..I)), XYDATA
0@%%%%qQqJ6j6K4l2M0m8N6o9Q2j01J20j40J64j92K24k61L02l46L98m57N19n85
29c10O61p44Q36r41J053j174J310j458J619j799J995k208K443k705K996l320L682
46A936m089M552n083N698o420P286q343R668j1385J3714j7072K2362l1991N5116
60C5949k08259k49534M56692M44846N8692l18309j35474J70573J92590j21308
70C26458k88064j88278J2998N0507k330o5888o8885l6583P3041J60504J19568
81I3048m8627j10865K6776J83925J09355j11113j86902k3932J28263O8093j02240
92B5781j41746k2376Q9241P3345j2345n9337k6540M3452Q4020M3154m4641p2902
104b0894M486Q2102L5054q1281r2489K1569Q4216m418r9833m1591Q0592O9940
$$ plain form
0 0 0 0 0 0 -8 0 -8 8 -8 16 -16 24 -24 32 -37 45 -56 64 -76 88 -104 120 -141 161 -185 213 -244 275 -310
29 -310 351 -393 443 -498 555 -619 691 -767 852 -947 1048 -1160 1283 -1422 1574 -1746 1936
46 1936 -2153 2399 -2684 3014 -3406 3880 -4463 5205 -6180 7534 -9538 12824 -19167 35949
60 35949 -172310 -421844 34848 479694 538386 220077 84603 255176 447766 326458
70 326458 38394 -149884 -136886 -86379 -88709 -154597 -223482 -260065 -187024 -26520 93048
81 93048 44421 -66444 -39668 144257 253612 142499 -44403 -68335 59928 128021 25781
92 25781 -115965 -138341 -49100 24245 11900 -47437 -73977 -30525 53495 96649 52008 -20894
104 -20894 -16408 65694 100748 19467 -73022 -51453 32763 28345 -71488 -113079 -32487 37453
116C7453n0515p7587L9937J07975J5067q4824k7645Q5749O4149n6258p6169K7959
128E291P0579k2995q8358j2134P2956J1746r4238n6388P8596Q8912n1805j16820
140a14658R171J37347O9293r0544r9396M7103J26339L2169q6235p1355K8282O5812
152E3328J6014l8747m7907k5632Q663M1245K9691l5066p5514j5770Q0216P7538
164F8059l2351r7796k3604Q9090Q3282k6066r0008l4705N4045O7703M277n7423
176D503n6427J418O1324N7255k1351q5815m1860P0879R9145j1046j13257n7104
188i2336Q0502J00156k6122j13003l9385P6937O6281l7542p2252r25N5466K1562
200A9339k6370j1740K5506J5644j5820l423K9581J8018k8299l2221J3661L3407
$$ plain form
116 37453 -13062 -90649 -50712 57263 72330 -12494 -40139 45610 109759 53501 -22668 5291
128 5291 75870 52875 -35483 -47617 25339 37085 -57153 -113541 -34945 53967 2162 -114658
140 -114658 -105487 31860 101153 10609 -88787 -41684 84655 116824 30589 -40766 -12484 53328
152 53328 69342 30595 -17312 -42944 -34281 6964 36655 1589 -73925 -89695 -9479 68059
164 68059 35708 -62088 -85692 3398 86680 60614 -29394 -64099 -10054 57649 61926 4503
176 4503 -51924 -50506 10818 68073 46722 -39093 -80953 -10074 89071 78025 -35232 -92336
188 -92336 -11834 88322 62200 -50803 -90188 -13251 53030 15488 -56764 -57689 -2223 19339
200 19339 -7031 -18771 6735 22379 6559 3136 32717 50735 22436 -9785 3876 37283
212C7283p373m4030k0347K0665J3830j9399j8173J1100J4462j0908r355K4489
224g756L0798q760l1083N048M7143K3032l4428m0216J2284M0680N264l9527l1048
237b8569R523K3993K858j7291j5570k499J1208J7799R078j2841k0580N401L3636
250A6146J8230k6621l4006J0748M0071Q283l8288k6312K3313L4468q079l4935
262a6982l995L1165J7070k0214k1256J2250K2366l469k1470p648J1420N084r681
275e360r784P31J987j822K976Q655p5r785K418K2077J5805j3275j9935Q804K9108
290C2525N192k9680k2931J3202K3125p499l1488j3595J6103J4016q208j4877J325
303b2790J3404O578jK540N664J770J06N773O465m113r100j386O971j279j2438
$$ plain form
212 37283 29910 -14120 -34467 -13802 28 -19371 -37544 -26444 -11982 -22890 -32245 -7756
224 -7756 23042 14282 -16801 -11753 35390 58422 23994 -16222 -3938 36742 42006 2479 -28569
237 -28569 -19046 4947 7805 -9486 -25056 -27555 -16347 1452 10530 -2311 -22891 -17490 16146
250 16146 34376 7755 -26251 -15503 24568 32851 -5437 -31749 -8436 26032 17953 -16982
262 -16982 -20977 10188 27258 7044 -14212 -1962 20404 16935 -4535 -12183 -763 4321 -5360
275 -5360 -15144 -14413 -12426 -14248 -11272 -2617 -2692 -12477 -10059 12018 27823 14548 -5387 3417 32525
290 32525 37717 8037 -14894 -1692 21433 13934 -17554 -31149 -15046 -1030 -9238 -24115 -22790
303 -22790 -9386 -2808 -2809 -269 5395 7165 7271 13044 19509 15396 6296 4910 11881 10602 -1836
318a836p240N844N029q397j0420N684J3346j047j3847j852J8021J1987j1507j6697
332a2932N635K0226M769j8741j4683R353J7406J48j5087q353P334J1642M380n705
346E392p416j343P664R843q07j4062j1807O366J6173q01k1818j4250J3092K1479
360G705j822k2111q515J9501K2508k831j8805l860J7221J6148m552j6528n816
373a757P707P750m061j2707r703O09P656L535p473j1739J242J4847J0889o657
387A38j2222L727J9148R816j0757j4345M338J5845L766j4515j2924L855J0671
400F541j27j1145p987M687Q359Q11n627l679L551O376L495k942n092o29N544M435
416F571l175q341k059P463O328m929r005Q79J0636N481o697p889M340J0267P70
$$ plain form
318 -1836 -9076 -3232 1797 -6600 -17020 -11336 2010 963 -12884 -14736 3285 15272 3765 -12932
332 -12932 -7297 12929 17698 -1043 -15726 -6373 11033 11181 -3906 -12259 -4925 6717 11097 5392
346 5392 -2024 -3367 4297 14140 13333 -729 -12536 -6170 10003 9202 -12616 -26866 -13774 7705
360 7705 5883 -16228 -24743 -5242 17266 14435 -4370 -8230 8991 25139 20587 4059 -1757
373 -1757 5950 13700 9639 -3068 -12771 -12162 -4506 -971 -8444 -20183 -18941 -4094 6795 138
387 138 -12084 -8357 10791 20607 9850 -4495 -157 15688 19454 4939 -7985 -4130 6541
400 6541 6414 -4731 -12718 -8031 328 1139 -4488 -8167 -4616 1760 5255 2313 -2779 -3408 2136 6571
416 6571 3396 -4945 -7004 459 6787 1858 -7147 -6268 4368 9849 3152 -4737 -397 9870 10640
431A0640r372o239M632O481k616r621m527M058N480j474o208k042M905P191J918
446C206l145k490L928Q907L525o168p221J897Q493J727j0560j1487J236J0382
460B230K803j1932j0998M094J3552M532r237p753N438J3372N309o741p873K438
474g66R253M921n715r699k517O238N898l532j0663m098O808Q685j730q815m037
489i769P712Q684j524p744l085N992N931k909o861j349N434K635l433l848Q12
504c322N083K410k736l014J844M607K096k573m663p56L733K762l784p023k664
519h000M987M633l012p421j951O962P397n45o453j644O831P868L27o497l972K685
535B195N599Q38n346o477j813L286K807j886n863k868K911N745J481l385j741
$$ plain form
431 10640 1268 -4971 -339 6142 3526 -6095 -10622 -6564 -1084 -2558 -8766 -10808 -5903 1288 3206
446 3206 61 -2429 1499 10406 13931 7763 542 2439 10932 12659 2099 -9388 -8152 2230
460 2230 5033 -6899 -17897 -13803 -251 4281 -4956 -12709 -7271 6101 11410 4669 -3204 -766
474 -766 8487 13408 7693 -2006 -4523 1715 7613 4081 -6582 -10680 -3872 4813 3083 -5732 -9769
489 -9769 -2057 6627 5103 -2641 -5726 266 6197 3288 -3573 -4922 512 3147 -286 -4134 -3322
504 -3322 1761 4171 1435 -1579 265 4872 6968 4395 -268 -1024 2709 5471 1687 -5336 -8000
519 -8000 -3013 1620 -1392 -8813 -10764 -3802 3595 3050 -3403 -5047 1784 9652 9979 3482 -490 2195
535 2195 7794 8632 3286 -3191 -5004 -1718 1089 -797 -6660 -9528 -6617 -872 609 -2776 -4517
550d517K808M483J728r79p91Km83J69J708P28l147n479j073O110M227m217q778
567g501j678R817P911m222j1064k605R333R522k676j1165n179O548R301L82q542
582a818p337L062Q648M690m216p816j021P410P344j056q178l998L401O955Q19
597F889p146o481P30N438K854l391n681j264N225N113n80l657j413M295M357j59
613E129k880m32K677L19l321k487K944K094l803p852Q4P953M854p198j0291K650
629i560J3195O244q445j1086K710J3620O474q046j1554N95J0160N993n622r503
643d825k564N727O311L34n277n978j18P100O637j859r059n321O050J0481J095
658H734j0041r271L816J1572M263q548r997J210J0796O470n067r435k35P943O496
$$ plain form
550 -4517 -1709 2774 4502 3523 2732 2734 2251 2420 4128 4856 1709 -3770 -4843 1267 5494 1277 -7501
567 -7501 -9179 638 8549 4327 -6737 -9342 -9 9513 6837 -4328 -9507 -2959 6342 6724 -1818
582 -1818 -9155 -6093 2555 7245 3029 -4787 -5808 1602 8946 7890 -288 -4286 -885 6070 6889
597 6889 -257 -6738 -6008 -570 2284 -1107 -6788 -8052 -2827 2286 1706 -1951 -3364 931 5288 5129
613 5129 2249 1817 4494 4813 1492 -995 1949 4043 240 -7612 -7528 425 5279 -1919 -12210 -9560
629 -9560 3635 9879 1434 -9652 -6942 6678 13152 5106 -6448 -5853 4307 10300 4678 -4825
643 -4825 -7389 -1662 4649 4983 -294 -6272 -6390 710 7347 5488 -3571 -8892 -2842 7639 8734
658 8734 -1307 -10578 -6762 4810 9073 525 -9472 -8262 2534 9004 3937 -5498 -5733 2210 8706
673H706k871p559k031M607M129k228m571j212J436K53j225M5J869n08l417m93
689e070N842N015k910o407l99Q420M877n138p448k29P295K866n668n613R51M427
705H11o47l376K73K691l75k965J30N274L225m134n584K011Q206K312o931o959
721f038K168Q587K221o452o945J202O754L592k971n677j183L517M404J186l161
736A204m653q25M120M790o76n746m829J697P603L703m735q163j306R251Q547l193
752F789j1624m445R592J0894j781j2987p238Q288J1521j166j2452o518O168R996
766E037J82q058n432M058O852J754l012l071j43K131K720J834j985m235j579L520
782E73L985j405o985k629N261M880j558o653j454N334M722k033m786r3M384K376
$$ plain form
673 8706 5835 -1724 -3755 852 4981 2753 -1818 -3030 -1594 -1341 -2566 -2521 -652 -1160 -4577 -5070
689 -5070 772 5787 2877 -3530 -3929 4491 9368 4230 -3218 -3447 3848 6714 1046 -4567 -3616 811
705 811 164 -3212 -2939 -248 -623 -3588 -3458 1816 5041 907 -4677 -2666 5540 7852 921 -6038
721 -6038 -3870 4717 6938 486 -6459 -5257 1497 5089 2118 -3559 -4742 -1225 3179 4365 1204
736 1204 -3449 -4274 -154 4636 3960 -1786 -6615 -4918 2685 6388 1653 -6510 -7816 1435 9982 6789
752 6789 -4835 -9280 312 11206 9425 -3562 -10800 -2512 9009 7843 -4609 -11127 -4959 5037
766 5037 5219 -2839 -8271 -4213 2639 4393 1381 -1690 -1833 298 3018 4852 2867 -1368 -2947 573
782 573 4558 3153 -3832 -6461 -1200 3680 2122 -4531 -5985 -651 4071 2038 -2748 -2841 1543 3919
798C919k564k931Q06K991M35k787j736J076K594k66k809j336J635L087q6k972
814i44j916J748L658N38l429k720J049L344J162k446l090N51K151J565k25j230
830b34j484K33K408K275j94l520k241J941N207K82n457m675L076N922Q05o239
846a895m680K745O077J362m835l463J846M876J787j923k520q81J920K583Q06k556
862A249l018o09K915K410j541m046j931L231L909p58m013j603K726L515M06k952
878a10k226Q26L156J564j870l174m79K518K089n68l147j439K304K619m02k683
894a022m61J326K104o76j398r35R01P45o14p33L09K48p15K42P92R7q14n7P95J041
914A175m63j172K76J652J81j045j327P73J210q90j459k03Q50O78j294m74J88J612
$$ plain form
798 3919 1355 -1576 -770 2221 2656 -131 -1867 -791 1803 1537 -1272 -2608 -973 2114 2028 -944
814 -944 -2860 -1112 2546 3084 -345 -3065 -2016 1328 2490 44 -3046 -2495 -344 1221 996 -234
830 -234 -1718 -1485 923 3198 3004 -516 -2757 -816 4391 4673 -784 -5459 -2383 3539 4344 -1895
846 -1895 -6575 -3830 2247 3609 -1226 -4689 -2843 2033 3820 1897 -623 -1504 416 2999 3805 1249
862 1249 -1769 -2378 537 2947 1406 -2640 -4571 -1340 2569 1811 -2202 -3805 -1079 2436 2842 -110
878 -110 -2336 -1510 1646 3210 1340 -1834 -2313 205 2294 1726 -1421 -2860 -556 2063 1661 -1022
894 -1022 -1483 -157 1947 1271 -127 -1062 -161 584 -30 -763 -454 -206 -921 -679 113 210 -604 -661 134 1175
914 1175 712 -460 -184 1468 1649 604 -723 50 1260 370 -1089 -1292 -442 236 -1058 -1532 -1344 268
932B68Q5o09k7N47N58K2k31R7O1o51K17K88k3p80q06J46J269k59j039n66Q19J027
954D13n36MML76L68n49K12R6l53l72O78K65k14j012o1Q39N32m21j316K20J313
975D86K46n24k88j68P13k62k40l02J65j29m31J22Q94l66o99p8P71P67m50q07M37
996a43R93K68j104R7N94J4q7m14o60L07j72j11j50J91n79P2K48Q35K0o33O4O41
1018B91R76m10m57k82M09N60p57p60L08P9J21m90k90K44J20J29K47k22J36L1p2
1039h9P61j14n66l60L84N62j79n84k54M19M44m10l19P4N70k77K3j36R3j87J03
1060d2L51j72l23L21m95N88K2n09m64J92O58j11j71k90N59M55m19K50k41K47q2
1081C24q6j25J87J55r27L10J81J93r49j78L86O44k16p97M41N93M36o03k27J26
$$ plain form
932 268 353 -256 -283 264 822 844 613 710 771 120 337 625 602 -178 -984 -838 431 172 -867 -1433 -614 413
954 413 -123 -119 -115 261 629 80 292 388 35 -337 341 606 392 -620 -681 158 690 269 -1047 -827 486
975 486 732 208 -80 -248 465 203 -37 -339 -174 -303 -734 -612 282 -84 -783 -861 -90 677 227 -580 -143
996 -143 850 1118 14 111 705 719 632 218 -442 -135 -307 -418 -568 -377 -956 -884 -636 199 219 -414 -350 291
1018 291 1267 857 400 118 527 1087 330 -430 -122 -43 78 -412 -702 -458 -338 -209 38 -184 -48 -17 -89
1039 -89 672 558 -8 -368 16 578 399 -185 -439 -20 424 14 -305 -231 339 62 85 -51 42 -145 -42
1060 -42 309 137 -186 135 -360 228 250 -259 -723 -531 127 16 -155 -445 114 569 150 400 159 406 324
1081 324 238 113 300 455 -472 -162 19 212 -737 -915 -529 115 -101 -898 -457 136 572 -31 -258 -132
1101a32P08r8k82k08L24k90j17J94PJ54l65o57N47J77q8r6j70Q61J1l71l64N28
1123B73L43m75l27J13l22Q94n38k83J48n67M60N18n7Ql92j65P03L05m60n81K43
1144a59J89N74j50r27Q9L77k17p1k9L90j11j8L28N3m98K37l5P95no79n17J35O35
1167C86N31j203m92M68N65P1n22k77o0N75K5pM5l9r9J36N02k24l19k00K19M37
1189E18j67o63J66j50K73l7l37K97M09l31k92LO27k77j08j38M57K31l98o9j3J21
1211A22j97K94j73M2l77K28O00m8j58l86m28O39O02m60p32j74Q76L70n44p03j14
1232g21M97O07k95o41O7O49k7M01k78n89j33P61M94m41q34L5M66R55p43o80m33
1253h83L50P68j20j56n52K62L78L99K42q72o2J66L46M68l87q29oO28M73l57p24
$$ plain form
1101 -132 576 478 196 -12 312 22 -95 99 106 260 -105 -762 -215 -38 -126 -222 -392 469 480 109 -255 273
1123 273 616 141 -186 -73 -395 499 -39 -322 -174 -741 -281 237 180 188 -204 -369 334 639 179 -402 -159
1144 -159 30 604 454 -473 -384 -7 -224 -295 -324 66 -45 -63 265 318 -180 57 22 817 812 133 -384 -249 386
1167 386 917 -286 -778 -310 255 326 -196 -473 -533 42 67 60 105 66 -33 103 605 381 62 -138 81 518
1189 518 351 -312 -146 -296 -23 -60 -397 -100 309 -22 -314 -311 316 39 -69 -207 250 481 83 14 1 122
1211 122 -75 219 46 88 -289 -61 539 491 333 -53 -481 158 760 300 -432 -606 270 640 96 -607 -721
1232 -721 -224 383 88 -553 -486 163 136 537 259 -330 -463 298 792 351 -483 -448 18 973 230 -450 -883
1253 -883 -533 235 115 -41 -593 -331 47 446 688 -184 -246 -80 266 734 347 -482 -488 140 613 256 -468
1274d68p3N68N42k04q38j70M53M12J16m8n18j14L36K15N10o79k78l70P69M83o13
1295C1q71M81P67L44n66p82M18O14j55j96n8K4K05l6l23o6J26j95J22n4J96L0
1317E6J09J4m74R9J74K21J69m39m97P67N57l73j170K57R07J80l11j063j08Q05
1337a20N77j21l81k0j15K75Q9j13j08l35P9J040J32p71m58R7Q71K77o59j105N55
1358c14P76K56j180j90Q2Q58J35m74m77N16L59k48N1M9j88j44M2M64k87j50j91
1379b55p1P78n04j05K18j32p6L1M59k9j50p2m14Q54j81n88k74N06J86L37o64k96
1401d42K40M72R0l10j77j03j19L85M62r0p27Pj3P37J69p79n70M74J024m89l12
1422g1k68O5O59kp22K27O47l52m90M39K04j1m36k33O38O6l98m06K63N14K2m07
$$ plain form
1274 -468 -541 27 569 365 -473 -643 -190 222 338 290 -228 -342 -6 209 719 40 -238 -608 161 644 31
1295 31 -840 -359 408 752 186 -596 -178 436 281 85 27 51 256 220 -103 -169 -43 -238 -116 -170 26 56
1317 56 165 179 -295 -196 -22 199 368 -71 -568 199 756 383 -787 -530 377 557 246 -817 -925 -120
1337 -120 457 336 -45 -65 -180 95 184 71 -37 -372 -293 747 879 108 -350 -253 618 895 236 -869 -314
1358 -314 462 718 -462 -652 -570 288 423 -51 -528 -12 347 99 150 199 11 -133 -91 373 86 -64 -255
1379 -255 -326 452 -52 -157 61 -71 -147 -116 343 314 164 92 -322 532 351 -237 -511 -5 181 518 -146 -442
1401 -442 -202 270 360 50 -127 -230 -349 36 498 408 -319 -312 -325 412 581 -198 -768 -294 730 241 -71
1422 -71 -339 -274 385 383 -339 -112 535 183 -307 132 336 325 -111 -344 294 360 -38 -444 -181 333 355 -52
1444e2l30M19K8K24k2l68m5J88J73jm11n1k56R23k90k8l76J26M30o7o0p60L18
1467b88N86k35l36o5J45J95n9q4J49j13j63K94P9Lm73O5K89N90o83J42j1J35K24
1490C86o65N3L52N14m43o48l4Q11K10k54n97j11L31O61n57k24m5N4M32Rm76K19
1512b2k38L85K08l53m9k92M48N06l36p11J60P66k0k16n20oM77M77k34m77O5l69
1534c51P12l20J43l20Ll2L77L05n09J21l07O84n50J46P9l48M43k15k75J89K06
1555A81j58j49J37j61L60k76QJ58K26j84l84L1N52j30n24l89O74J96p3j04j1L82
1577C62k04n02J95M67l79j16j36K63O7j24k5J16K97j26m77M01K29l21j69j98M78
1598I8N0R0m40k88M34J4J81m02K19J57J44l05j95K27k23K40J66k62j64L1K61K59
$$ plain form
1444 -52 -382 37 65 289 267 -101 -146 42 215 214 -197 -248 -504 419 129 101 -275 -149 281 214 154 -606 -288
1467 -288 298 63 -273 -338 -193 2 -57 -141 8 -105 -268 26 105 108 -365 -300 -11 579 -104 38 27 162 386
1490 386 -279 -226 126 640 197 -451 -485 326 536 282 -315 -426 -95 566 9 -215 -260 -206 226 235 -241 -22
1512 -22 -260 125 333 -20 -69 -361 87 593 257 -454 -294 472 452 236 -284 -290 187 664 430 -47 18 -351
1534 -351 361 41 184 -136 -133 -165 212 517 8 129 -178 506 -44 102 181 -167 276 61 -214 -25 181
1555 181 23 -126 11 -150 210 -66 -58 100 326 142 -242 -211 341 211 -313 -702 -28 168 95 -9 -20 362
1577 362 158 -344 -149 318 -61 -177 -313 -50 17 -107 -132 -16 281 155 -322 79 308 -13 -182 -380 98
1598 98 148 238 -202 -490 -56 -42 139 -263 -44 113 257 -48 -243 -16 -239 1 167 -95 -259 -228 33 292
1620B92N8o19J41J95J86p2l77j03K80N80m09m69L94n1j39J39m92N43l78K68M13
1641C80k97Q1m9n5R1K38n31k24K46M32M6m35p1K5L58j81j01N9K77k35k90K62p1
1664d5J90k15l4J32K6L9l17k54O11k09k03Q5j3%M77l80J4K29l60n6O69m03K2j63
1688a58p4L90n3l10K8J91R2j57q2J42K17l21j15K35Lj9J9m8j27J07j3p1K70k25
1712g9L7L05o4j21k67k89M21n2L41k03j82O7L92l72J38k1j6K8j16q4R8J29J99
1735B89l22j84M62l03P4k21M33j00j93N7L39j84j31r9L29j33Nj70k5j8k1L27k30
1758a9k7J7j80M7r4K20p7L02m51K45J32j95K89j26k42k1n5J57K83k60K5j4R6j6
1782C6k85L8M09r4l31K26K6M1J19p2N4o7J61r9l34K18j8Qk51NL50k61K60k71j09
$$ plain form
1620 292 350 -269 -128 67 253 181 -196 -299 -19 561 152 -317 77 26 -113 26 -466 77 -301 -33 380
1641 380 83 164 115 60 151 389 -142 -366 -120 312 358 -77 -148 -123 235 54 -47 12 289 54 -236 26 -45
1664 -45 145 -70 -104 28 54 93 -224 -478 133 -76 -279 -194 -207 -207 270 -110 -96 133 -227 -283 386 -17 5 -158
1688 -158 -232 158 105 -205 -177 14 106 -51 -133 9 226 -95 -210 25 28 9 28 -20 -147 -40 -53 -124 146 -79
1712 -79 -42 263 199 78 -189 -478 -57 -109 232 29 -153 -86 306 -66 72 51 35 63 -53 -137 -39 90 289
1735 289 -33 -217 245 -58 16 -205 228 128 -65 -8 331 147 16 -83 246 113 118 -52 -77 -95 -116 211 -19
1758 -19 -46 -29 -209 -162 -256 -36 -113 189 -262 -17 115 -80 209 83 -159 -180 -235 -78 205 -55 -30 -44 52 36
1782 36 -249 -211 198 104 -227 -1 25 66 185 113 167 100 261 162 -172 46 28 36 -215 -210 140 -121 139 -132 -241
1807b41L23p0jj1j92K57L6j32L91j61n1k02m8K69m03L46N8j35K95k69M4k73K26
1830E6K03j87j60j77M20N4k09J71l71K17k3J96q9m3J37m21j1l2M10l19J87K1k30
1853b00r8M11R1j38p5M9j04l0j49j23M21j80K26n2j28L66l61k44K92KK62k03j77
1876a42J9J75m5O5l54M08l3j10l05J56L96J2l01o3J31K84j51k88L87M6n80J94
1898i9K7k23L07L1R5j08J28o2k82J2l91Q81l13k24L87l54Q9n3K56p5m25O40o6
1921A78l43K25n3n7M75l33l34J68L82k63N3k72L61k89j7K47j7l43L48j93n5K37
1943A05J07K8m7q1j46P6m20K96J22J43k08k48M4M28j65n0l80M70j81l09K81k2
1965a57Q1J83m23J15l7K11l1n6J33mk20K00o7L4J86l22N63k58J2p9j4k21m6p9
$$ plain form
1807 -241 82 12 11 0 -192 65 101 -31 360 199 148 -54 -102 167 -236 110 168 33 328 59 103 -170 56
1830 56 259 72 -88 -265 155 209 0 171 -200 17 -6 190 101 58 195 -226 -237 -269 141 -178 9 30 -200
1853 -200 -298 113 204 66 -9 40 -64 -94 -243 -366 55 -125 101 49 -79 287 -74 -318 -26 -24 238 35 -142
1876 -142 -123 52 7 72 -282 126 93 -17 -322 -166 230 242 -59 -122 9 293 142 -146 241 287 -293 -99
1898 -99 -72 -295 12 43 138 30 158 96 -186 -174 -565 316 3 -221 166 -188 -99 -152 104 29 -396 244 178
1921 178 -165 60 7 -50 425 92 -242 -74 308 45 98 -174 187 -102 -119 128 111 -232 116 -77 -132 105
1943 105 212 240 193 112 -34 42 -378 -82 40 183 -25 -273 -229 199 34 -16 -396 74 -107 -416 -135 -157
1965 -157 -76 107 -316 -201 -238 -27 -58 -114 19 15 -205 -5 -72 -38 148 -174 389 131 143 64 50 -171 -217 -296
1989b96J39r8L9L46p6k23M80m38m59K22O82l29Q1j51n8L20j88p6J27K01n96L83
2011C2J05k73k54M73j70qJ82k82J55J34j56N2P5j50J85o2j72K49J7K27o5p4m13
2034a93L94M5p9j6l12J73K06j23n25K92K83P3j35J37k84M2L81m05j57n6m1M32
2056A32l40%NJ48J85J66l68k68J54L36j14q4j12J77K33k30k54K20k1n6L77j09
2078A77p6J56j46k50K03m55K35J66P6j70J71k34J56j74K40k93R5K49J84l74J73
2099A09k09J78Ml6k24M6K34J23m22J15j19K05k58O3O3n8L08j87j1Q4N2j18K7j24
2123a55j35L2M84k96J12m00M14L47n22M8K01l87K97k3L1j58K10o3M6m3J73m84
2145b71N2K83K43l38Q8K41n80K35r7M9J9pj40J94J3J37Q9j32j76J12J93k8j2j84
$$ plain form
1989 -296 -157 -255 -216 130 54 -169 311 -127 -586 -364 318 -11 70 -81 -139 181 -7 -83 44 245 -351 32
2011 32 137 -136 -390 83 -87 -95 87 -195 -40 94 -62 -10 65 -85 100 38 -134 115 132 359 294 220 -193
2034 -193 201 246 167 151 -161 12 218 95 -430 -138 145 218 83 220 -64 -22 359 -46 -203 -259 -300 132
2056 132 -208 -208 -203 -55 130 296 -72 -340 -186 150 36 -48 -160 17 250 20 -234 -14 -35 -91 286 177
2078 177 101 257 111 -139 64 -391 -156 10 86 -84 87 -147 9 -165 75 -218 -123 126 310 -64 109
2099 109 -100 78 82 46 -178 -132 102 225 -197 -82 -201 4 -254 -191 -128 -186 122 -65 -76 8 60 -58 -31 -155
2123 -155 -290 -258 226 -70 42 -358 56 403 -119 -71 130 -257 40 17 48 -110 100 37 83 40 213 -271
2145 -271 -219 64 307 -31 57 298 -282 -47 -144 -95 -76 -83 -223 -29 -16 121 210 78 -98 14 207 179 167 -17
2169a7n2rK62J23k62k06M51j32l04N6J40K49l0l06j42k5Q7Q6J7j52K65r1K80k51
2193C7k54L71K30j21k06n90J74O32j30q0m06M1N00l3j86j47k00M59N2pl27J9J36
2216c6P6p6r6J31lK89l68l61J5O41J48j53m67J17K44J04l05J99m54K88N86n01
2238A8k26J9K83K72o22J00j79M49p0n7l37M39K49j68o9j4m00M30J56k00j06k98
2260c31L06R1j82j66n3L59J46k73JJ88k11L93k54l13K71K10j34J44j45l12M68
2281B03J19l76j12K3l20L27L88m57L7M63n0k06l81L32J76j43L52p53L18L21j03
2302A58L28q17K52L03m1M56r35K77J52J01k13k17N1K32Q2j72jl27M41l09K44m58
2324d13QK23M54J10o90m3L43J88j25n49M2N74L19m60J2n8J82J8l6k19q6J87J54
$$ plain form
2169 -17 -69 -78 184 307 45 -161 290 158 -146 -90 50 299 269 -37 -179 -204 -117 -31 -14 -166 99 8 288 37
2193 37 -217 154 384 263 57 -533 -359 273 143 63 -343 -302 198 165 -21 -168 -368 91 143 136 -191 -172 -36
2216 -36 40 -36 -132 -1 -4 285 -83 -444 -429 212 360 207 -260 -143 101 205 -100 99 -355 -67 519 18
2238 18 -208 -189 94 366 -256 -156 -335 114 44 -13 -350 89 338 170 101 87 -313 117 273 73 -33 -331
2260 -331 -25 66 -116 -282 -335 24 170 -103 -102 86 -125 268 14 -299 -28 182 48 192 47 -265 203
2281 203 322 -54 -166 -143 -463 -136 252 -205 -168 295 245 39 -342 -10 166 23 375 -378 -60 261 158
2302 158 486 -331 -79 224 183 639 -296 -19 133 234 21 -196 -145 87 169 -3 -4 -331 110 -199 45 -413
2324 -413 -405 -182 272 382 -308 -351 -8 180 55 -494 -452 122 441 -19 -7 -65 117 135 99 -120 -206 -19 135
2347A35K37m34l64J65O41k51l36r1K42K98m9m97oM01Q9n9n00J75J69J74J37m43
2369a67p8K77L21R7n68L8L40L6K2m30j19MN08l6M8q00M54N89k28l86l29L13L68
2392B74m7l74j69K62P2J54j48n19M84M08l68J8l14J40L18J82n18l20P62j97J61
2413B61k74o16P42J48rm09j90K28L85O1m70j17L50L49k21n41q8L27K55L01q07
2434c35l84K20R14j62m68j14j9M99J34j45l64l0O18mj52l87N8K34O5j64k00K01
2456A5K9M20l24n38K15J68L95o09J08K01J73K90p21j9p6O57j53k14j59L06L50
2477E14k24l68m31K66O95j3m89m24M98Q4k30J19m96K69M92L09l91n41PM65K3k29
2499i5m08J34M91K81n73J16j27R10m44m93J30M7K75J04k86l31M3K94J71k0m86
$$ plain form
2347 135 372 -62 -426 -261 380 129 -207 -298 -56 242 193 -304 -310 91 180 121 -379 -204 -35 139 276 -167
2369 -167 -245 32 353 450 -118 -80 260 296 318 -112 -231 -227 281 245 293 -507 -53 536 308 -78 -407 -94 274
2392 274 227 -147 -316 -54 18 172 24 -495 -11 397 29 47 -267 -127 191 373 -145 -465 297 100 261
2413 261 -13 -629 113 261 252 -157 -347 -119 266 327 -143 -260 90 439 218 -323 -411 -84 171 472 -335
2434 -335 -719 -499 415 253 -215 -329 -348 151 285 140 -224 -254 364 360 208 -179 -121 113 178 14 -186 15
2456 15 44 464 140 -398 -183 -15 380 -229 -121 80 253 543 -178 -197 -273 384 231 17 -142 164 514
2477 514 290 -78 -509 -243 452 439 -50 -474 24 108 -122 -3 -499 -230 262 571 180 -361 -354 111 134 -95
2499 -95 -503 -369 122 403 -170 -54 -181 729 285 -208 -78 -31 244 348 62 -269 -226 68 239 219 -267
2520b67K35K94J13k57n40L9N50O1l19k20J00N39m5K14o94J08O6J54l69j68Q9M38
2542A21L31m0n68n8M65r2R3m29N8L50K15o52k92L10K91M72n08j06p8N39J75k48
2564C49q56L3N49M20o66J26m10Q17k3m53q5r0J05M22J7n10k33M73K40n34p6n5
2586d40L52L81k09l25j32O92J6q1o33j6K51N79m92j83j12L88K63j95j39l67O23
2607B21J1L1l46j01J69M89l69m33j75N65M17j82n03r1O54K46l76n52J58lN07k94
2629D3j50l13M46O31n26m86k38N40K64j35p0m33N25J93o1m88K7l08O96n8K0l96
2651b77K18J82k54j87N2L28N3K06m71l55P35J38o7n44lM09L92l66o17J78K37O11
2673E98k77n93k60O06K65n0l03n80L76M72P1n16l86O45L07Pk56o24O27M83k97
$$ plain form
2520 -267 -32 262 375 118 -422 -383 167 228 -91 -311 -211 328 283 497 -197 -89 -23 131 -238 -406 -317 121
2542 121 452 412 -156 -214 251 159 252 -177 -119 231 446 -206 -498 -188 103 575 67 -39 -117 422 597 349
2564 349 -507 -474 75 495 -171 -45 -455 362 339 -114 -199 -289 -184 238 255 -255 -488 -15 225 -309 -385 -440
2586 -440 -88 293 84 -241 -373 319 335 254 -379 -395 -144 435 -57 -240 -352 36 299 104 -35 -402 221
2607 221 232 263 -83 -184 -15 474 105 -328 -503 62 479 297 -206 -297 357 603 227 -325 -167 -170 337 43
2629 43 -107 -420 26 657 131 -355 -593 -53 211 76 6 -427 98 291 230 -258 -231 -539 157 99 119 -277
2651 -277 -59 123 -131 -318 -266 62 115 321 -150 -505 230 368 301 -243 -246 163 555 189 -428 -250 -13 598
2673 598 321 -272 -532 74 339 289 -14 -594 -218 254 325 -191 -577 68 375 382 126 -498 129 612 315
2694C15m34L8O6J27qp6m66L36N41j43k19k44L15K70j26n03j99K35M64j71j49j84
2716b15j12P52j05k98l27K87K81j85k49Q0M1P6J65k98j71j40M47P2j05m51K57
2737a98M94O1m45k47M28K51k96l45k4J29L14k11m0j47j00N15O9k06m54M34K32
2758B14J87n23o0r0L13K87n94J08P2L43o2m39rr6O33n9l71k02K78J64K09q9l19
2781a05L6k7M58k92k29K4K09K36k00j42j49O12k09j55j46R4k40N48k72q52M29
2802c72L83J4j7n7l04M86R2k51l22K31J76K97j79l33J9K62K76n01n2k9P7M62k73
2825H5k42k28N98K7l99n3k43M90N61m17o70N89k92L97N3p21P8O56q9M7k64p5K62
2848A50K34m85j33l3K66K45k05k05J49n0K45j54j44o3K59j29K50l45J3K27rK48
$$ plain form
2694 315 -119 -81 -15 112 104 28 -438 -102 439 296 77 -167 148 418 292 -211 -410 -175 289 118 -31 -215
2716 -215 -327 425 320 22 -305 -18 263 78 -171 -91 -50 26 191 -107 -278 -418 29 101 -4 -455 -198
2737 -198 296 357 -88 -335 93 344 48 -297 -321 -192 122 -89 -129 -276 -376 139 208 2 -452 -18 214
2758 214 401 -122 -182 -272 41 328 -266 -158 -86 257 195 -244 -253 -349 284 225 -146 -348 -70 94 303 214 -105
2781 -105 -69 -96 362 70 -159 -135 74 310 110 -32 -181 431 222 67 -79 15 -225 323 51 -801 -372
2802 -372 11 25 8 -49 -353 133 225 -26 -348 -117 59 356 177 -156 -137 125 401 -100 -152 -181 -104 358 85
2825 85 -157 -385 213 240 -159 -212 -455 35 596 179 -491 98 -194 203 256 -465 -387 269 180 227 -37 -112 150
2848 150 384 -101 -234 -267 -1 244 39 -166 -17 -67 178 24 -120 -183 76 -53 197 -148 -135 92 83 331
2870C31l85o0L18J0K5l31l57N07K83j69k85l60J015k10l75j12n3L45j29J03m82
2891c71j4K82M5J29k77L3O73l44j48k17J42r8N08r9o10J20J29L69l35L2k62K81
2913c2L34j19n24K76k07M15j46k79P3K85LJ9j52k78K66R9J61k40J57r8J78J05
2935B96l48j44K54L0K9j34l10L14R2K67j62m33K13L10j05j18l59L74l5Qk0l65
2957c46K07K48j53j12J61j84N38j61l20J63j04Q2J30k88k11K44K56%j96l03M68
2978A19k28L09k18l31M14J57l40J75q3j80L59k00J16k56J14K76k11p3j84L04J03
2999A42J25k83k06K16j18K84j89l1j68N07k93k98k8O6L89K6j10J0O6j0K54k13
3021A38k21Q2j5O2j2k59L0J35L94p68M32l0K90j59j56O9N3R2k01R1k31P5M40l44
$$ plain form
2870 331 -54 -114 204 214 239 -92 -449 58 341 172 -113 -473 542 332 -43 -155 -208 137 8 111 -371
2891 -371 -385 -103 -58 71 -206 -173 500 156 8 -209 -67 -165 343 244 -366 -246 -117 252 -83 -51 -313 -32
2913 -32 302 183 -341 -65 -272 143 -3 -282 -209 76 79 98 -54 -332 -66 33 194 -46 111 13 191 296
2935 296 -52 -196 58 88 117 -17 -327 -13 79 346 184 -249 -36 274 169 51 -308 66 31 39 19 -346
2957 -346 -139 109 -44 -156 5 -179 359 198 -122 41 -63 19 149 -139 -350 -106 150 150 -46 -349 119
2978 119 -109 200 -18 -349 65 222 -118 57 -26 -206 153 -47 69 -187 -73 203 -8 -81 -265 39 142
2999 142 267 -16 -222 -6 -124 160 -29 -60 -228 279 -14 -312 -340 -274 115 141 31 41 107 97 351 138
3021 138 -83 -1 -16 46 34 -225 -195 -60 334 -434 -2 -32 258 99 -57 12 65 157 -44 47 -184 -109 331 -13
3045a3k23J95K03Mk65n1K14PJ84J49k89j54Q9J07o6k29N6J03J59o3k85K00kJ30
3069A60Q5k18k06K18j72N19o59J36q1N73K5m77rQ7j27M39k56l7j88M9K49K0l05
3092a75J54K73k20O9p8L35j57k43o7J30J22j0j51j06K55l08K80Jl15N8Q7M09k39
3115A04j14j95K98O4k66K53j13k13K86j60K32j60k18L89j14j4q8K04j4l91K62
3136C2l42M39L02l71j82J14J08L6J15k03j29q1P4L06j31l85N33j93k18L69m46
3157b53J91L1J57J5j80l79L59L85k76o2j24J33J28k66K17j11L5L7n1n9q3oL81
3180B19l40k2J89l29J66O7L1K2m4J92j25l0j09P9J91k99o2Q5L04m80K70l27k2
3203c74M22j47J74r0N6j42N4k2P5J06K4m5j29K41k02K12j63jj14j40K19j35P0
$$ plain form
3045 -13 -236 -41 162 166 -99 -150 64 71 255 404 115 -39 50 157 91 -138 -82 21 180 117 -168 32 30 160
3069 160 245 27 -179 39 -133 386 -273 -137 -218 355 380 -97 -106 -19 -146 293 37 0 -188 -139 110 130 -175
3092 -175 -21 252 32 101 23 358 201 -42 -109 21 143 133 -18 -124 131 -177 103 104 -211 -153 -66 343 104
3115 104 -10 -205 93 157 -109 144 31 -182 104 -56 176 16 -202 187 73 59 -29 175 161 -230 32
3136 32 -310 129 431 60 -122 -8 100 136 251 48 -81 -162 -88 218 87 -298 235 42 -176 193 -253
3157 -253 -62 -31 126 141 -39 -418 -59 326 50 -12 -136 -3 125 -141 76 -35 0 37 -14 -73 -156 -162 219
3180 219 -121 -143 46 -283 -117 -50 -19 3 -41 151 26 -4 -113 -34 157 -142 -204 -119 185 -295 -25 -352 -374
3203 -374 48 -99 75 -15 41 -101 -47 -69 6 112 136 91 -38 203 1 213 50 49 -65 -205 14 -121 -51
3226e1j55L58Qk2p6N3j33K18m57K77K52m50J54J21k68K10r3%J87p3k56pL89Nm78
3251b87J59M6K63J16l08R9o4j44J24O3rPL4k5K7n7l4M3k4r4ok3N1j7L32m85J20
3278i3K37j0j19j32J72j97nK3j46K98L03m38M02n49K72k1j28L30m91J75J97m1
3300C9j00J03l89O10j00k55J13K42l32J05Q5l77L22l24N3K71j19J31k0r8R1k4
3322B7l44O1L99j66j85J19n5N1K44N8k08j63L5L4O3J05j33J77n34K89J38k46O36
3345D02Km33L49k82N9o7K1j08kK22k19R2j35j47K06J13k8o1L9R7M2l54L90n35
3369c37J95N85m16o9J52j2j38J43Mp9Q6l5r3j39J02p4l19N13j16R3J3N4J82j37
3393A58m62J01J44N6L2j57J81M8K9j76J32j31p9L19j37J41j72j98J76J13M8k06
$$ plain form
3226 -51 -206 152 160 138 62 115 -18 200 -257 20 272 -178 -24 97 -171 39 -54 -54 133 60 -196 -203 186 191 -287
3251 -287 -128 -82 181 297 -11 88 24 -120 4 67 58 65 99 74 101 44 10 53 29 -65 -71 -94 -43 -60 272 -213 -93
3278 -93 144 134 15 -117 55 -142 -147 -124 -270 28 331 -107 295 -254 18 -3 -131 199 -292 -117 80 39
3300 39 -61 42 -347 263 163 -92 21 263 -69 36 121 -256 66 -258 -205 66 -53 78 58 -40 51 27
3322 27 -317 -256 143 -23 -208 -89 -144 -93 151 209 1 -162 -127 -93 -30 75 -58 119 -415 -126 12 -234 402
3345 402 404 -29 320 38 97 30 51 -57 -59 163 -56 36 -99 -246 -40 73 45 -16 23 120 162 -192 198 -337
3369 -337 -142 443 27 -42 110 98 -40 103 107 28 114 79 -14 -153 -51 -125 -444 69 -47 46 59 113 295 158
3393 158 -304 -203 -59 -3 29 -128 53 101 130 -46 86 -45 -124 195 58 199 27 -171 5 118 166 -40
3415d0P5j70O0J25j55K11J43o57K12N3K10%L32k67k69J14M5o0N7j16K44l91K46
3438BM13j94k32O1j15k7K34k41K94N4n67K95K5j0M27m18K53k41o1J26k75J78l4
3461e3Q8p1Q8Mj30J42J13l78L92J4j50P3j85N5Jr4K2K50L2j66J8r1j60K54j32
3486f4R4R7k31L83j72m7J18k64L38m58L71l67K76j5J29l26K74Rk18K27k08L56
3508C02l29N7no2P4j99M6KJ14K5j8j78L39M8k44mJ49O5m1o6q5k34M86j09j06R4
3534A21N1k51L5L53k26L70k53j81J16j25k35J93l11O4L99k06k01J67J97J13J06
3555B96k75K07R7l30k13J90M22k07k44J53k97L42k77K43J48m28R8k4q2L45j27
3576C7O5k37N2J43k03M78l17K15j55j03L84l88j53K27l57L31J36k31N1%l36K63
$$ plain form
3415 -40 35 -135 -75 50 -105 106 249 -408 -196 -143 67 67 399 132 -137 -23 22 -38 19 -97 147 -244 2
3438 2 415 221 -11 50 -65 -92 142 -99 195 249 -318 -23 2 -8 419 1 254 13 -48 78 -197 -19 -53
3461 -53 35 -36 52 56 -74 68 181 -197 195 209 59 132 -53 2 3 -91 -69 181 213 47 65 -26 -186 68 -64
3486 -64 30 127 -104 279 107 60 178 -86 252 -206 165 -202 74 59 188 -138 136 145 -73 154 -54 302
3508 302 -27 30 25 -37 37 -162 -116 -114 0 25 7 -171 168 216 -28 -32 117 182 141 75 -10 -244 242 133 27 121
3534 121 172 -79 -44 309 83 453 200 19 135 10 -225 -32 -343 -279 120 -86 -287 -120 77 190 296
3555 296 21 228 325 -5 -218 -28 394 187 -57 96 -201 141 -136 107 255 -173 -75 -99 -181 164 37
3576 37 102 -135 -83 60 -143 335 18 233 78 -25 359 -29 -182 45 -312 19 155 -76 -25 -25 -361 -98
3598i8K7j30M52m76J26K84k81j51M00l83m8L83m72K52j35K96m5j33J83l4p9J14
3620E2j32L1K5p8K09J65l19K15j05j75L7L61j21m84M94m09L13n7j79J7K31J6J6
3643A23J20J63n20J16J67k55qM4K35k11N8M7j12J00j1J1k37K5N1Q6q0K29k28N1
3667c6j14J35r0M75l56j02L36j14j81O4j6J60Qo26N24l72L11J44j28L2k78K01
3689b3J79J18j62j63Q2j11J1N6J17J3j78o2j11NK98j9J2o2L3j02K56j92Q9L16
3713D00m59k68M16j77J30j42J52jl12J75J67J61K06l15o5p4K44l02j48J39o8M21
3735B80k27K39k34m2O7r0l47L82mM9l90J68L16j2j12n4k22RM57j62k08L39J33
3758C35j89k58l2K69M7k85K02j47K79pk57j09K30M10r04N58k55K08J90r0o48M53
$$ plain form
3598 -98 -71 -201 251 -225 -99 185 -96 -247 153 -230 -278 105 -367 -115 -250 46 1 -132 51 17 -62 52
3620 52 -80 -49 -24 -102 107 272 -47 168 63 -112 -75 286 165 -319 175 -234 79 22 -157 -140 91 107 123
3643 123 243 406 -114 2 169 -86 -94 -50 185 -26 32 79 -33 67 56 67 -170 -145 -94 -8 -88 141 -87 -36
3667 -36 -150 -15 -105 370 14 -88 248 134 -47 17 1 161 169 -457 67 -305 6 150 22 54 -224 -23
3689 -23 156 274 112 -51 31 -80 -69 -13 104 117 -61 -123 -234 -229 69 50 62 0 33 -69 187 -5 84 400
3713 400 -59 -327 89 -88 42 -100 52 51 -261 -86 81 242 448 133 68 -6 238 -64 -212 -73 -141 280
3735 280 53 292 58 16 83 -7 -354 28 24 73 -317 -149 167 155 43 -11 -233 -224 233 71 -137 202 335
3758 335 146 -112 -144 125 172 -113 89 -58 221 214 -43 -152 78 488 -416 142 -113 95 285 195 -453 0
3780@L3L00l91M5k73J74K16j71R3j29n1M44k26k15K61P3k67K53k8l43L33m3j4
3803G4n18L06K87j76K60l26q6K59K8k76L26k58j13M20m49K65M7R6j9k40l6J23
3825fj93J50J52O6K3j64m27M33R0l28J58l51L51j39K49j48L8L5r8N05l82Q7k55
3848a54L39k86L11j84N6Q8k71j7j31L59j6j86P0L6p4J33R2R7m33L18k14j05K08
3871C6L4q1o3m0N6p9J28O2j49k68J57K66j36K95m21K14j82J1L80k75j13L91j91
3894C2j59j40M6K31k2p8J83j28J10j13M2L30n81j7J66j88L54J7k55J50m83O57
3916A54k62M89l26J1l7L4K33m95J49l32J36K60q9J07K63n15J8k6K54q5j53L25
3938A13r3n3J57J55m5m00J66n7k09J18K14J09j11k04P4R6M5J38k49K60m08Q4q1
$$ plain form
3780 0 33 333 -58 -13 -286 -112 104 -67 26 -103 -154 290 64 -151 110 183 -84 169 141 -202 131 88 74
3803 74 -444 -138 149 -27 233 -93 -179 80 108 -168 158 -100 -213 207 -242 23 70 166 147 -93 -129 -6
3825 -6 -199 -49 103 169 192 28 -399 34 124 -204 -46 -397 -46 -185 64 -84 -46 -11 -109 396 14 101 -154
3848 -154 185 -101 210 26 82 170 -101 -118 -249 110 94 -92 -22 14 -60 73 165 262 -171 147 -67 -172 36
3871 36 70 -11 -74 -114 -58 -137 -9 53 -96 -364 -207 59 -77 218 -203 11 -171 -160 220 -55 -168 223 32
3894 32 -127 -267 -221 10 -12 -90 93 -35 75 -38 4 334 -247 -264 -98 -286 68 85 -170 -20 -503 154
3916 154 -108 381 55 66 29 63 296 -199 -50 -382 -246 14 -75 32 295 -220 -202 -228 26 -59 -212 113
3938 113 20 -33 124 279 234 -166 0 -57 -266 -148 66 175 64 -140 -66 30 75 213 -36 224 -184 -100 -181
3961a81L88j51O0pp7l39L98l34M69Ml25K37K5q2j7j40R8k22K16k18K69j57N1J48
3985A13j17J13K31l12k51K49J50K4k52O4M3j0n7K87l18j70K02J37m8p9j60P0K38
4008A47j31K9pL11l67J05l5j76K1K87k02qJ59j38k6J41k07O0J41o11L45J12K1
4031b9R4J22j00J68l97L68m14J93o5p0J53j60J46j59K1Q4k04L36L2j66L87k79
4053F1N6j44k84J96J51R2k28p8K76J33q8jJ3j69m8l05O6L73J47k83K28j05j63
4076a04j9J04J28k00J02j74J22L42k86L35k04l13R0j97N09k21l5K04l02J12J01
4097I4j84K62k79P1%k27K54K08l78J52J08P4o3j66q4n1K63k57M04J93l05k36K37
4120I0k14J66j29J83k04J16j89K02j85L2LJ39K05m03O4K40k93M0l3K99j42Q0M2
$$ plain form
3961 -181 207 56 116 109 32 -307 91 -243 226 230 -95 142 167 85 68 -72 26 -196 20 -198 71 -86 -35 113
3985 113 -4 109 340 28 -223 26 176 200 -52 12 55 45 -12 275 -43 -213 -11 126 78 -1 -161 -91 147
4008 147 16 45 38 349 -18 87 52 -124 -103 184 -18 -26 133 -5 -31 110 -97 -37 104 -507 -162 -50 -29
4031 -29 65 187 87 255 -142 226 -188 5 -60 -130 23 -137 9 -150 -129 -45 -249 87 119 -47 340 61
4053 61 117 -27 -311 -115 36 128 -100 -178 98 231 143 142 155 -14 -62 -367 -301 72 219 -64 164 59 -104
4076 -104 -123 -19 109 -91 11 -163 -41 301 15 350 146 -167 -77 -274 235 14 -21 183 -119 -7 94
4097 94 -90 172 -107 -36 -36 -263 -9 199 -179 -27 81 155 92 -74 -158 -209 54 -203 201 394 89 -147 90
4120 90 -124 42 -87 96 -108 8 -181 21 -164 -132 -129 10 215 -188 -124 116 -177 -137 -170 129 -13 67 109
4143A09J49n48J81P3oj29K12M5k67K47m7R5j82K36j36o3J51P2j9r5M7j63M1R7
4167A00j81K08J35k45m9j65K24j04J20j82K74j60q5K9J02j47M4M32k68k12M16
4188B86mm10R4L29j09r0j14J33j50J77N8j65L5j56J79k20L42j94l65K40K20k43
4210a27J05o2J34Jl38J46L42j09j1o7q8J82k24j04K05k5o3K86m28K6J30J15J20
4233A46j88R2o7k12L76k87p1K90k47J50j18O9J96j12l3J67P3j46j57l8K54l40
4255b03r0L57K6l11J22Q6O8k8j78M02j23k31J62j4k0r5O0J11K6Nk70K59j98k09
4279b86L95l0j97J61N7l0pj31j5M86l30j0Kq4k55L42k38J14n8J27M7Q8j18j01
4303g1j44L11M8J9p0l87N44l9L0k83j64L76l9j60K43j92J53j96j96j16O22m52
$$ plain form
4143 109 258 -290 -109 -36 -42 -171 41 86 -181 66 19 114 -68 168 32 -31 120 192 173 78 125 -38 3 100
4167 100 -81 127 262 17 -32 -197 27 -77 43 -139 135 -25 -110 -81 21 -126 -82 350 82 -130 286
4188 286 282 -128 -34 295 186 96 -18 115 -35 142 200 35 70 -86 93 -127 215 21 -344 -104 116 -127
4210 -127 -22 -84 50 51 -287 -141 201 92 81 14 -74 108 -116 -220 -15 -40 -103 183 -245 -219 -89 26 146
4233 146 -42 50 -17 -229 147 -140 -211 79 -168 -18 -136 -67 129 17 -16 151 224 78 -79 -117 137 -203
4255 -203 -293 64 90 -221 -99 -13 55 27 -151 251 128 -103 59 45 25 -70 -10 101 127 132 -138 121 -77 -286
4279 -286 109 79 -118 43 100 70 63 -68 -83 403 73 63 65 -19 -274 68 -170 -56 -114 13 60 148 30 -71
4303 -71 -215 96 144 163 93 -294 250 211 241 -42 -206 170 131 -29 214 22 175 -21 -217 -333 289 -163
4325a63J06L23k92K8L51j38k95l7K05l5k84l0K43O7m0J0N6k97M13l72J01K6j27
4348a81M9R6o0k54M70Q7j37%j77M33l08k02K63j74M22l19J08O5j24J08k01J78
4370A42k36r4J53l1L19k39J1J58j24k80J58J51K7J51l03J44j79j14K78k92n5M67
4392B12k58L96k14O0l36l6k1M43k05o1l38M26l08N2L64o6j63K4j85L76O3k35j14
4415a24R4R0j72oj11L37k85L34q5j08l8J02J1j18J2Q7k61M13j76k04K54k02L28
4438A72J22m03L26j82k19j29N82l1m16j15J23M52k59k1J17P8q1P7m93K82l2q7
4460a37p2K02M10m51L57n28M43l69m3L05o4p9j83K08j30O3K79l66J67j04J15j21
4482i8o4o0j72N48k09R2l18M67N4k09J66l34P5L74m49K56k15J60K68l77K19m02
$$ plain form
4325 -163 -57 266 -26 2 353 215 -80 -117 88 53 -231 -261 -18 49 9 19 75 -222 191 -181 -80 -54 -181
4348 -181 -132 -36 -96 -350 120 207 70 70 -107 326 18 -184 79 -95 327 8 116 181 57 165 -36 142
4370 142 -94 -188 -35 -66 253 14 25 183 59 -221 -63 88 115 266 -37 107 -72 -186 92 -200 -255 212
4392 212 -46 350 136 196 -140 -176 -197 246 41 -20 -358 68 -240 -188 176 110 -53 -29 -214 162 225 -10 -124
4415 -124 -30 60 -112 -118 -229 108 -177 157 72 -36 -74 28 39 -79 -67 20 -241 172 -4 -208 46 -156 172
4438 172 294 -109 217 35 -184 -313 269 238 -178 -293 -170 282 23 2 119 197 116 193 -300 -18 -50 -137
4460 -137 -209 -7 403 -48 309 -219 224 -145 -188 117 53 -26 -209 -1 -131 -68 211 -155 12 -92 23 -98
4482 -98 -162 -222 -394 154 -55 37 -281 186 240 31 197 -137 -62 312 -137 119 -96 64 332 -45 174 -228
4504b28M61j18K1J45l51K48l27m3L79j06k41L3J79J05J22k9k91M4K9k05o0L31
4526I8R9j05j76J09N7o6N5j87R6j81J55K15j21j29K35j62L7k37J29j4J26j11P6
4549bk94L45k37J53J57j52J55j66L09k64R2k13K16j06k0o7m0R5J32j35L27l49
4571f4L29k41N1j18J91r4o0m9K45k20pk82K26k5L62k00j2mJ55j83j99L06N0k98
4595a41k7L70o1j41P0j62K18j0J87n72L07j76K17kQ2m78OO40n39n2J84p6J97K05
4619B46k54k7K94l95J53N4K81o06N19k95k83K46j00M37J56l05j91Kk39L74p1J29
4641A25J83j81K10o96K62N9J44j45j50K99k94R9J93p9r4j66M42k39l9j76L49M63
4663E69n08j99L0J50p8m1J95k74j08L33k24M9j05J41J96l34L6P6K85p8L8j58J42
$$ plain form
4504 -228 233 115 136 281 -70 178 -149 -192 187 81 -160 -127 52 157 279 250 -41 3 32 -173 -233 98
4526 98 197 92 -84 25 82 16 71 -116 -20 -201 -46 169 48 -81 154 -8 29 -208 -79 -93 33 -78 -2
4549 -2 -296 49 -188 -35 122 -30 125 -41 268 4 96 -117 99 -7 -27 -94 -134 -39 93 -42 285 -64
4571 -64 265 24 75 -43 148 54 -6 -55 190 -30 -37 -319 -93 -118 244 44 32 28 183 0 -199 107 157 -141
4595 -141 -168 202 141 0 70 -92 126 116 303 -269 38 -138 79 77 159 -319 -313 327 -212 -264 -80 -156 41 246
4619 246 -8 -35 259 -136 17 71 352 -254 265 -30 -313 -67 -167 270 426 121 -70 -68 -307 67 -4 125
4641 125 308 127 337 -359 -97 -38 106 -39 -189 110 -184 -85 108 29 -65 -231 211 -28 -67 -243 106 569
4663 569 61 -138 -108 42 -36 -77 118 -156 -264 69 -155 -106 -211 -70 126 -208 -172 -96 189 111 149 -9 133
4686A33l13K40k02J33L7M4j06o5P0K71k60J42j25J42j75K8k8j01j1R4pK4J74o6
4710G3l12J74r4K10J3j56K6L21k47P5R5m37M2K35r1K45Kj85o4l3J47J08k25j59
4734b37L38l43L52m11M10j49l59J42L26M3j46K98l37r2L62r8pJ6j21j20L42o9
4756A40k45p1J92j07J31m9Q2J36l67Q4J77q2k53J99N9j7P4j09%P7j49j16M34k39
4780a9P0J06o0j82o1rK49j54l7J60o0J11L8j97m23N80Nl73K44R6O1m05J72j91
4804b79L31k94K18J4l6K19q3j08JK03l40K24J18j60L0n6Q1M3k88L52m17M03k66
4827i0J75j59KJ56K17l04J10j99K4Q1o8l62L28J54j03mq7J76J48l67j1L42m0o
4851A13j36j68K48K21l45P9k33O88n68J2K25k58J0n9M29l15J26j81m3k04K23q
$$ plain form
4686 133 -180 60 -142 -9 28 72 -34 -99 -29 242 -18 124 -1 141 -34 -6 -34 -135 -146 -52 -59 -35 139 73
4710 73 -239 -65 -159 51 64 -92 -66 255 8 83 178 -259 -217 18 -73 172 174 -11 -75 -108 39 147 -78 -237
4734 -237 101 -242 110 -301 109 -40 -399 -257 69 112 -34 264 -73 -165 197 99 92 108 -13 -133 209 140
4756 140 -105 -176 16 -91 40 -9 73 209 -158 -74 103 21 -232 -33 26 9 83 -26 -26 51 -98 -214 220 -19
4780 -19 51 157 97 -85 -146 -155 94 -60 -97 63 3 114 152 -45 -468 112 117 -256 -12 84 145 -260 -88 -279
4804 -279 52 -242 -24 -10 -46 173 90 -18 -17 186 -154 70 188 28 58 2 83 126 -162 190 -227 176 -90
4827 -90 85 -74 -72 84 301 -3 107 -92 -68 13 -55 -417 -89 65 -38 -42 -129 47 195 -172 -183 159 119 113
4851 113 -23 -191 57 278 -67 12 -221 467 -101 -89 136 -122 -112 -171 258 -57 69 -112 -155 -359 -136 -144
4873a44J47q2j72J99j76L69J29j28j15K92l63K1N5q8J7R1k50PJ54J46R5l54r7
4896b47K29L1o4k90J71J98l4j98N84q03K68Q2R3M1m5j9O5j09R2k0q3J4n8j13k57
4921d72J35M30n2K4k42K26l9k58J87K51k14r3L74J16o16L05o9O5J03n3ljj6p5
4945A3o2L83l73J13Qk56M57l39m7J28N4k40K21j59M23r9R2k34Mo6o8j89Q2L51
4969A97l50L8J45J33k22Q3j35q3N61l16k77L83j17J95j00j88K53j16j54L51m82
4990b01M55n07L01P6k36r3r6L26Nn4l40N5J81J98j96K7J17o8N1J6k81O25l33j64
5014a36m0j49K73j78P9kM82p5p7l10J04P5K04l3j84J70j80J72k09K35q1K92l67
5037F5o2j83K04J56k71J36l74L49Q5j69J51N4j68m6K12m05K46k64L00j76n3M65
$$ plain form
4873 -144 3 -79 -251 -52 -228 141 270 142 27 319 -44 -23 32 -56 -39 52 -198 -191 -37 109 204 -150 -247
4896 -247 -18 13 -51 -341 -170 28 -6 -204 380 -423 -155 -73 20 61 16 -3 62 -47 45 25 -58 -44 -102 -215 -472
4921 -472 -337 93 41 65 -177 49 10 -248 -61 190 -24 -117 257 373 -243 62 -7 58 161 108 105 104 88 13
4945 13 -49 334 -39 74 82 -174 283 -56 -103 25 79 -161 60 -99 324 225 317 83 87 21 -47 -236 -154 197
4969 197 -153 -115 30 163 -59 24 -111 -194 367 51 -226 157 40 235 135 -53 200 84 -70 281 -201
4990 -201 254 -253 48 124 -112 -205 -301 25 30 -24 -364 -309 -128 70 -126 -99 18 -50 1 17 -264 361 28 -136
5014 -136 -176 -325 -52 -230 -151 -153 329 254 177 -133 -29 46 250 217 33 203 23 195 -14 221 140 432 65
5037 65 3 -180 24 180 -91 45 -329 20 105 -64 87 141 -27 -73 139 -266 -20 -284 16 -160 -213 252
5059B52l2j58l44M49j31k64M92r0L8n40N6J79J10n5p2L0j42K19k06K47j21jK43
5082A59l52M13l07K9o7j77K18J73J82k26k11K43j55O2Q2J05j30j02K28k55K41
5103A53J50l21k81N49k65j2Q7p4P1J35j83J54j26j34J09k8J96l87L19m3j38rK41
5126A63j15J72k43j1n4N8l9J8m3J15J62ON5p9n0j03j67J73J07l27J62K22k01J49
5150A30J0l7j18J3p8L77j14k88j03K68l4k66L61j88k2j90K55n8M02l25L8l3p1
5173g1J83J91l13K41k45p6l09N09l63L47p1J04Qk12R6q7J28j12j45L04m02M25
5195A30k34N4r1L51o8k70k8j7L58k17j04N09m09J16R4k32P0N1m0j83M32j88M6
5218A30j17j44J50m9J67k73J36kK16m70K35L0K7J4j17J8M11l45J05l18J28j10
$$ plain form
5059 252 220 62 -282 167 36 -228 264 174 212 -328 -272 -93 17 -38 -110 -80 -222 -3 -209 38 -83 -84 159
5082 159 -193 220 -87 -58 -125 -302 -84 89 271 45 -166 77 -78 -16 66 171 41 -61 167 -88 153
5103 153 303 -18 -299 250 -15 -27 60 -14 57 192 9 163 37 -97 12 -16 180 -207 112 69 -69 -78 163
5126 163 48 220 -23 -34 -88 -30 -69 -51 -94 21 183 189 244 165 115 12 -155 18 125 -202 -40 182 -19 130
5150 130 140 103 -15 -2 -80 297 183 -105 -208 60 26 -240 121 -67 -89 -279 -24 -82 320 -5 33 0 -71
5173 -71 112 303 -10 231 -14 -90 -399 110 -253 94 23 127 135 -77 19 -68 60 -52 -197 107 -295 130
5195 130 -104 -50 -141 210 142 -128 -156 -173 185 -32 -136 373 -36 80 174 -58 12 63 23 -160 272 84 130
5218 130 13 -131 19 -30 137 -136 0 -2 214 -256 -21 9 36 50 -67 -49 362 17 122 -196 -68 -178
5240a78K54j21N7J27J08j88j97K34k80K80k28J57N1P2j25p2L01k30k68L67q7m45
5262d11J72O58l67j73K02r2K16j66Q4j41q0j07L44k4j98N34l87j16Q9j34K96j50
5284D9j56K35j19j83R0K79j31k41J93N3q3ok71L0J51J1K46j41O5Q9l51Q0L53j04
5308A38j05k01K08J6N6O0m19K39K9O4p8j40K20k66K65j73M6J46k62J90J48r9n3
5331B9R1J26k58k7L60J43m59r7K69l77J93L48l84o1j45K63K31j20J75l23p4J78
5353H1J53k89L12m19K86K0j55k5o2K48k27q9J22P8k74k8L76l9k1q0Q6j80L81l01
5377d6J41k19N9J8p0J02l3R5J3J26l47p2L83j71L75m59L12k96j54K98j27L39l84
5400a17K03o7LjN8k99L88j22k28M04r3j63K20m7n4k41K51O5o0k88K00R1l19L21
$$ plain form
5240 -178 76 -45 12 139 247 59 -138 96 -184 96 -132 25 76 148 23 -49 252 22 -246 121 34 -411
5262 -411 -239 419 52 -121 81 -11 205 39 123 -18 -98 -205 139 115 -83 451 64 -52 37 -97 199 49
5284 49 -107 128 9 -174 -84 195 64 -177 16 69 -14 -20 -291 -261 -110 -99 147 6 71 160 -191 -111 242 138
5308 138 33 -168 40 56 112 172 -247 -8 21 85 7 -133 87 -179 86 -87 -41 105 -157 33 181 82 29
5331 29 120 246 -12 -39 321 464 5 -92 177 -200 -7 341 -43 -104 -249 14 245 125 300 -23 -97 81
5353 81 234 -55 257 -162 124 144 -11 -36 -98 150 -77 -166 -44 34 -240 -268 108 69 48 -32 54 -126 255 -46
5377 -46 95 -124 -65 -47 -117 -15 -48 47 60 186 -161 -233 150 -21 354 -105 207 -89 -243 55 -72 267 -117
5400 -117 86 19 22 21 79 -220 168 46 -182 222 129 -34 186 139 85 -156 95 160 100 -188 12 103 -216 105
5424A05k33L95m84J85J17j65j98N57m32J95J9l36J17J07M1n7o3K81j16j71K94
5445A58k83L02k07m2K77j43p5J80m08K8J84m0Q3k10L26n2M2l05J50O9j23J91k25
5468a23K43j67m9L9R0j33K20k23J78qQ8j27K23k42Q4P0l62M42l59K77k33J04j42
5491a10J24M23n04K14k27O0J50J45j83K14l54oK1k09L45j02O0R2k31k0K19m80
5513c59O49k84l3j1L6r0R9j23mK02k24K24oj19j39K38Q3l0l60L60j21l4k33M61
5537A82r6r8q6O5k6J80l6K9j31P8j50J20J60m84J22K85l94J94J62j67NJ01j78
5560a63J41j5K74qp1m6J37l95Q1O6J8J33J99l32l55L90l52J99M40n35J90R6K41
5583C33k93Q3NJ59n25J97J46K21J75o33L3L21k71j29M43k84mM9j06K39k76k8n
$$ plain form
5424 105 -128 267 -217 -32 85 -80 -278 279 -153 42 61 -275 -158 -51 -10 -67 -130 151 35 -136 158
5445 158 -125 177 -30 -72 205 62 -13 167 -241 -213 -29 -69 14 -196 130 78 120 -185 -35 34 -89 102 -123
5468 -123 120 -47 -96 -57 33 -100 120 -103 75 67 155 28 251 9 93 163 -199 243 -116 161 -72 32 -110
5491 -110 14 437 -67 147 -80 -20 130 275 92 306 -48 -54 -33 -242 103 1 61 153 -78 -98 121 -359
5513 -359 290 6 -27 -38 -2 -92 7 -116 -120 82 -142 82 76 -43 -182 56 139 109 -251 109 -12 -46 -279 182
5537 182 86 -12 -98 -33 -59 121 85 114 -17 61 -89 31 191 -293 -171 114 -280 -86 76 -91 -86 15 -163
5560 -163 -22 -37 237 229 158 112 249 -146 -65 1 19 152 351 19 -336 54 -298 -99 341 -194 -4 92 333
5583 333 40 123 128 287 -238 -41 105 326 501 -132 -99 222 -49 -178 265 -19 -23 26 -80 159 -117 -145 -150
5606a50K52j40m2K44k32k1j97M42k82K91k37p9J31L46k77N5k23j51K09J69rJ31
5628B30r6J4q3N7K6l35J97J13k14K69j14j88k6O4j9L48l57j95L16j43j48L61k6
5651E1j24n5l0K06j50K02P7k08K44J56n16j43L04M8N8p1J35l30N81l01r6p8j73
5674b13K39j53j10J02o5K78l4K41l89K96k63L5j2q2M26n67oL79J5l13J59J45j16
5697hJl25J36K79j12J07m2p3p3K90k13j84K25q4k3M20l18L07j64l4j86K92k54
5720c6L4jL09l07J5L55k00j30r3O6k50J53M38k64l91M53r2l1J73m36K97r0k28
5743b56K21J37j23l5K53l6qj5%k86K70l04K26q0JK42l05K63J5m39M17J52k94j80
5767a64K11lj6J64k01J12k86M59j02l04N5L2L2k4j79K52r0n2O5R9J5j96J05J51
$$ plain form
5606 -150 102 -38 -80 164 -68 -89 -286 156 -126 165 -72 -151 -20 326 49 104 -119 -270 -61 108 99 230
5628 230 134 148 65 122 148 -187 10 123 -91 178 64 -124 -150 -86 -105 243 -114 -309 7 -136 -284 77 51
5651 51 -73 -128 -158 48 -102 100 177 -31 213 369 -147 -290 14 62 120 49 184 -146 435 134 38 -40 -213
5674 -213 26 -127 -237 -135 -200 78 44 285 -104 192 -71 -36 -48 -130 296 -271 -277 102 117 -196 -37 108 -8
5697 -8 -7 -332 -196 83 -29 78 36 -37 -110 180 -33 -217 8 -76 -99 321 3 310 146 112 -74 218 -36
5720 -36 -2 -3 306 -1 14 369 169 39 -54 12 -238 -85 353 89 -302 151 59 28 201 -235 62 -28 -256
5743 -256 -35 102 -21 -56 197 161 153 138 138 -148 122 -182 44 -36 -35 207 -98 165 180 -259 158 310 16 -164
5767 -164 47 44 28 192 -9 103 -183 276 174 -130 -75 -43 -11 -35 -214 38 -52 -104 -39 60 75 -121 -16 135
5791A35l03J72J3m3J22R8l03L44l24Q8M3j35l03N57o4k93n4K01M9j28L77l39J70
5814H0M1P4j36k99J18K06m8o8K42l64M71l31K01Q8k53r8J0J19j75J02M7l9l7J98
5838A49m66M53lk10k7O7L42k79l98L82m48L84o8K72l40L82N9m11L05J10k03M6
5860I8m2P0j84J56k58m0O4R7j27K39Qk40L04l04J15QnK94l10P6J8J06l07j50Q0
5885b34j2L77j40P5j44O1M03l51j57J98k7j78K99J43r7j99j0j6j9J41j86J89j05
5908A1J00L0l52L05j81o9PR5j08K59k24Q1L37l87J40K53l11J33K3%P5l66J23M9
5932B3k0L7J9m4Pj87K08j76K59k87o4K87j52k8K0J01L2K02k26J22k80nr5K85l01
5957b63M72k21J13J99j19P1q4j47J60J1o0k07K01P0j48k88M06j96J00J22m44M37
$$ plain form
5791 135 -168 4 17 -26 96 194 -109 235 -89 -1 42 -93 -396 161 97 -196 -250 -49 0 -128 249 -90 80
5814 80 121 195 59 -240 -122 84 36 -32 210 -154 317 -14 187 275 22 -76 -66 53 -122 -20 27 -12 -49 149
5838 149 -317 136 133 -77 -104 -37 305 26 -372 10 -438 -54 -122 150 -190 192 251 -160 145 255 52 98
5860 98 56 126 -58 98 -160 -200 -136 -39 -166 73 81 -159 145 -159 -44 -36 -41 253 -57 19 37 143 -164 -314 -234
5885 -234 -246 131 -9 66 -78 -17 386 35 -122 76 49 -129 170 313 216 17 7 -9 -28 113 -73 116 11
5908 11 111 141 -211 94 -87 -156 -149 -54 -162 97 -127 -46 291 -96 44 297 -14 119 142 142 217 -149 -26 23
5932 23 3 40 59 15 22 -165 43 -133 126 -161 -225 62 -90 -118 -98 3 35 237 11 133 -147 -152 -247 38 -263
5957 -263 209 -12 101 300 181 252 168 21 181 192 132 -75 126 196 48 -240 166 -30 70 192 -252 185
$$ [...]
8191D5
##END NTUPLES=NMR FID
##END=
