##TITLE=1H_CA-8570-22
 DMSO, 8 sc, 
 7.5.2019
##JCAMPDX= 6.0         $$ Bruker NMR JCAMP-DX V2.0
##DATA TYPE= NMR FID
##DATA CLASS= NTUPLES
##ORIGIN= UXNMR, Bruker Analytische Messtechnik GmbH
##OWNER= root
$$ XWIN-NMR		Version 3.5
$$ Tue May  7 15:47:07 2019 Russian Standard Time (UT+4h)  she@DPX200
##.OBSERVE FREQUENCY= 200.1315
##.OBSERVE NUCLEUS= ^1H
##.DELAY= (6, 6)
##.ACQUISITION MODE= SIMULTANEOUS
##.ACQUISITION SCHEME= undefined
##.AVERAGES= 8
##.DIGITISER RES= 18
##SPECTROMETER/DATA SYSTEM= spect
##.PULSE SEQUENCE= zg30
##.SOLVENT NAME= DMSO
##.SHIFT REFERENCE= (INTERNAL, DMSO, 0, 15.7039)
##AUDIT TRAIL= $$ (NUMBER, WHEN, WHO, WHERE, WHAT)
$$ ##TITLE= Audit trail, XWIN-NMR		Version 3.5
$$ ##JCAMPDX= 5.01
$$ ##ORIGIN= Bruker BioSpin GmbH
$$ ##OWNER= she
$$ F:/spectra/data/she/nmr/H-F/1/audita.txt
$$ ##AUDIT TRAIL=  $$ (NUMBER, WHEN, WHO, WHERE, WHAT)
(   1,<2019-05-07 15:45:34.98 +0400>,<she>,<DPX200>,
      <created by zg, POWCHK disabled, PULCHK disabled
       configuration hash MD5:
       00 E9 B6 7A A2 85 ED C7 34 08 36 98 17 FE 4E 26
       data hash MD5: 16K
       D2 CD BB 48 0E 30 96 7E CB 20 6D CE F6 DD C0 E9>)
$$ ##END=
$$ 
$$ hash MD5
$$ B8 2A B8 42 9D 27 AF 35 CF 24 16 AB 86 87 EF 50
##$RELAX= 
##$RELAX= 
##$RELAX= 
##$RELAX= 
##$RELAX= 
##$RELAX= 
$$ Bruker specific parameters
$$ --------------------------
##$DU= <F:/spectra>
##$EXPNO= 1
##$NAME= <H-F>
##$PROCNO= 1
##$TYPE= <nmr>
##$USER= <she>
##$AMP= (0..31)
100 100 100 100 100 100 100 100 100 100 100 100 100 100 100 100 100 100 
100 100 100 100 100 100 100 100 100 100 100 100 100 100 
##$AQSEQ= 0
##$AQ_mod= 1
##$AUNM= <au_zg>
##$AUTOPOS= <>
##$BF1= 200.13
##$BF2= 200.13
##$BF3= 200.13
##$BF4= 200.13
##$BF5= 200.13
##$BF6= 200.13
##$BF7= 200.13
##$BF8= 200.13
##$BYTORDA= 1
##$CFDGTYP= 0
##$CFRGTYP= 5
##$CHEMSTR= <none>
##$CNST= (0..31)
1 1 145 1 1 1 1 1 1 1 1 1 1 1 1 1 1 1 1 1 1 1 1 1 1 1 1 1 1 1 1 1 
##$CPDPRG= <>
##$CPDPRG1= <>
##$CPDPRG2= <>
##$CPDPRG3= <>
##$CPDPRG4= <mlev>
##$CPDPRG5= <mlev>
##$CPDPRG6= <mlev>
##$CPDPRG7= <mlev>
##$CPDPRG8= <mlev>
##$CPDPRGB= <>
##$CPDPRGT= <>
##$D= (0..31)
0 1.2 0 0 0 0 0 0 0 0 0 0.03 0 0 0 0 0 0 0 0 0 0 0 0 0 0 0 0 0 0 0 0 
##$DATE= 1557229534
##$DBL= (0..7)
120 120 120 120 120 120 120 120 
##$DBP= (0..7)
150 150 150 150 150 150 150 150 
##$DBP07= 0
##$DBPNAM0= <>
##$DBPNAM1= <>
##$DBPNAM2= <>
##$DBPNAM3= <>
##$DBPNAM4= <>
##$DBPNAM5= <>
##$DBPNAM6= <>
##$DBPNAM7= <>
##$DBPOAL= (0..7)
0.5 0.5 0.5 0.5 0.5 0.5 0.5 0.5 
##$DBPOFFS= (0..7)
0 0 0 0 0 0 0 0 
##$DE= 6
##$DECBNUC= <off>
##$DECIM= 24
##$DECNUC= <off>
##$DECSTAT= 4
##$DIGMOD= 1
##$DIGTYP= 9
##$DL= (0..7)
0 120 120 120 120 120 120 120 
##$DP= (0..7)
150 150 150 150 150 150 150 150 
##$DP07= 0
##$DPNAME0= <>
##$DPNAME1= <>
##$DPNAME2= <>
##$DPNAME3= <>
##$DPNAME4= <>
##$DPNAME5= <>
##$DPNAME6= <>
##$DPNAME7= <>
##$DPOAL= (0..7)
0.5 0.5 0.5 0.5 0.5 0.5 0.5 0.5 
##$DPOFFS= (0..7)
0 0 0 0 0 0 0 0 
##$DQDMODE= 0
##$DR= 18
##$DS= 0
##$DSLIST= <SSSSSSSSSSSSSSS>
##$DSPFIRM= 0
$$ [...]
##$SUBNAM2= <"">
##$SUBNAM3= <"">
##$SUBNAM4= <"">
##$SUBNAM5= <"">
##$SUBNAM6= <"">
##$SUBNAM7= <"">
##$SUBNAM8= <"">
##$SUBNAM9= <"">
##$SW= 24.9337058887773
##$SWIBOX= (0..15)
0 0 2 0 0 0 0 0 0 0 0 0 0 0 0 0 
##$SW_h= 4990.01996007984
##$TD= 16384
##$TD0= 1
##$TE= 0
##$TE2= 300
##$TE3= 300
##$TEG= 300
##$TL= (0..7)
0 120 120 120 120 120 120 120 
##$TP= (0..7)
150 150 150 150 150 150 150 150 
##$TP07= 0
##$TPNAME0= <>
##$TPNAME1= <>
##$TPNAME2= <>
##$TPNAME3= <>
##$TPNAME4= <>
##$TPNAME5= <>
##$TPNAME6= <>
##$TPNAME7= <>
##$TPOAL= (0..7)
0.5 0.5 0.5 0.5 0.5 0.5 0.5 0.5 
##$TPOFFS= (0..7)
0 0 0 0 0 0 0 0 
##$TUNHIN= 0
##$TUNHOUT= 0
##$TUNXOUT= 0
##$USERA1= <user>
##$USERA2= <user>
##$USERA3= <user>
##$USERA4= <user>
##$USERA5= <user>
##$V9= 5
##$VALIST= <valist>
##$VCLIST= <CCCCCCCCCCCCCCC>
##$VD= 0
##$VDLIST= <DDDDDDDDDDDDDDD>
##$VPLIST= <PPPPPPPPPPPPPPP>
##$VTLIST= <TTTTTTTTTTTTTTT>
##$WBST= 1024
##$WBSW= 4
##$XGAIN= (0..3)
0 0 0 0 
##$XL= 0
##$YL= 0
##$YMAX_a= 407173
##$YMIN_a= -778755
##$ZGOPTNS= <>
##$ZL1= 120
##$ZL2= 120
##$ZL3= 120
##$ZL4= 120
##$ABSF1= 10
##$ABSF2= 0
##$ABSG= 5
##$ABSL= 3
##$ALPHA= 0
##$AQORDER= 0
##$ASSFAC= 0
##$ASSFACI= 0
##$ASSFACX= 0
##$ASSWID= 0
##$AUNMP= <proc_1d>
##$AZFE= 0.1
##$AZFW= 0.1
##$BCFW= 1
##$BC_mod= 2
##$BYTORDP= 1
##$COROFFS= 0
##$CY= 11.3945322036743
##$DATMOD= 1
##$DC= 2
##$DFILT= <>
##$DTYPP= 0
##$F1P= 18.9103706918063
##$F2P= -1.10871071338519
##$FCOR= 0.5
##$FTSIZE= 0
##$FT_mod= 4
##$GAMMA= 1
##$GB= 0.15
##$INTBC= 1
##$INTSCL= 1
##$ISEN= 128
##$LB= 0.24
##$LEV0= 0
##$LPBIN= 0
##$MAXI= 10000
##$MC2= 0
##$MEAN= 0
##$ME_mod= 0
##$MI= 1.114404
##$NCOEF= 0
##$NC_proc= 0
##$NLEV= 6
##$NOISF1= 3.799351
##$NOISF2= 2.8
##$NSP= 1
##$NTH_PI= 0
##$NZP= 0
##$OFFSET= 15.70392
##$PC= 1
##$PHC0= -8859.091
##$PHC1= 14.60026
##$PH_mod= 1
##$PKNL= yes
##$PPARMOD= 0
##$PSCAL= 0
##$PSIGN= 0
##$REVERSE= no
##$SF= 200.130013532006
##$SI= 16384
##$SIGF1= 3
##$SIGF2= 2
##$SINO= 400
##$SIOLD= 16384
##$SREGLST= <1H.CDCl3>
##$SSB= 0
##$STSI= 0
##$STSR= 0
##$SW_p= 3612.71676300578
##$SYMM= 0
##$S_DEV= 0
##$TDeff= 0
##$TDoff= 0
##$TI= <>
##$TILT= no
##$TM1= 0
##$TM2= 0
##$TOPLEV= 0
##$USERP1= <user>
##$USERP2= <user>
##$USERP3= <user>
##$USERP4= <user>
##$USERP5= <user>
##$WDW= 1
##$XDIM= 8192
##$YMAX_p= 0
##$YMIN_p= 0
$$ End of Bruker specific parameters
$$ ---------------------------------
##NTUPLES= NMR FID
##VAR_NAME=  TIME,          FID/REAL,        FID/IMAG
##SYMBOL=    X,             R,               I
##VAR_TYPE=  INDEPENDENT,   DEPENDENT,       DEPENDENT
##VAR_FORM=  AFFN,          ASDF,            ASDF
##VAR_DIM=   8192,          8192,            8192
##UNITS=     SECONDS,       ARBITRARY UNITS, ARBITRARY UNITS
##FACTOR=    0.0002004,     1,               1
##FIRST=     0,             0,               0
##LAST=      1.6414764,     0,               0
##MIN=       0,             -778755,         0
##MAX=       1.6414764,     407173,          0
$$ Real data points
##PAGE= N=1
##DATA TABLE= (X++(R..R)), XYDATA
$$ plain form
0 0 0 0 0 -8 8 -8 8 -16 17 -24 32 -40 52 -64 80 -96 113 -136 161 -192 222 -261 302 -348 400 -460 521
27 521 -595 676 -762 859 -967 1083 -1212 1353 -1506 1676 -1863 2066 -2292 2539 -2811 3112
43 3112 -3444 3815 -4234 4704 -5236 5851 -6564 7403 -8409 9643 -11192 13213 -15971
56 -15971 19976 -26362 38182 -67498 292948 260041 -469671 -412372 15001 404214 271863
67 271863 -13220 -169867 -58879 41586 81662 68468 94851 34764 -96921 -185198 -54823
78 -54823 148271 174457 -68044 -283188 -213202 77442 231667 95715 -150532 -214391 -67601
89 -67601 102515 124397 29838 -67715 -96874 -72722 -9930 68605 116463 72119 -43630 -119414
101 -119414 -59414 81966 149725 62885 -82259 -126769 -27542 103149 132491 41227 -72365
$$ packed form
0@%%%qJ6j6J6k4L3m1N6p2R2j16J44j76K09k49K97l53M14m83N63o50P48q60R81
27E21j116J271j438J621j826K050k295K565k859L182l539L929m358M831n350N923
43C112o556P259q049Q938r940J1087j2415J3967j5812J8052k0835K4405k9184
56a5971L5947m6338O4544j05680L60446l2907p29712N7299M27373L89213j32351
67B71863k85083j56647J10988J00465M0076j3194K6383o0087j31685q8277J30375
78e4823K03094K6186k42501k15144O9986K90644J54225j35952k46247o3859J46790
89f7601J70116K1882r4559r7553k9159K4152O2792P8535M7858m4344j15749p5784
101a19414O0000J41380O7759q6840j45144m4510R9227J30691K9342r1264j13592
$$ plain form
112 -72365 -99871 -24137 72168 92103 19631 -70784 -96619 -44466 31032 70246 49216 -14810
124 -14810 -76244 -83349 -19482 62681 82198 10163 -90018 -114418 -30336 79194 98584 7253
136 7253 -92984 -93069 -8 82087 72645 -3641 -69443 -72364 -17914 51416 81850 41971 -41904
149 -41904 -92631 -53487 44031 102178 60017 -41787 -99413 -56665 37866 86797 49910 -28125
161 -28125 -72833 -52275 9929 64895 65253 2397 -74560 -86699 -10979 78959 83601 -5459 -91714
174 -91714 -81917 7741 77043 58411 -17921 -70347 -57179 -6316 33919 39048 16628 -21949
186 -21949 -56693 -54403 -1141 61428 62738 -12039 -88126 -78112 12913 89734 69603 -26913
198 -26913 -97602 -68353 28212 90300 55770 -33076 -80696 -44173 29422 63630 35708 -16461
$$ packed form
112g2365k7506P5734R6305J9935p2472r0415k5835N2153P5498L9214k1030o4026
124a4810o1434p105O3867Q2163J9517p2035j00181k4400Q4082J09530J9390r1331
136G253j00237q5R3061Q2095r442p6286o5802k921N4450O9330L0434l9879q3875
149d1904n0727L9144R7518N8147m2161j01804n7626M2748R4531M8931l6887p8035
161b8125m4708K0558O2204N4966L58o2856p6957j2139P5720Q9938M642q9060q6255
174i1714R797Q9658O9302j8632p6332n2426J3168N0863M0235N129k2420l8577
186b1949l4744K290N3262O2569J310p4777p6087J0014R1025P6821k0131r6516
198b6913p0689K9249R6565O2088l4530q8846m7620L6523P3595L4208k7922n2169
$$ plain form
210 -16461 -42404 -29878 3611 31030 38786 20708 -16208 -47787 -37912 18419 68949 51945
222 51945 -26623 -79857 -43097 44188 81299 28173 -49261 -65967 -15123 38231 43158 11083
234 11083 -18297 -28296 -24858 -10811 18546 43062 24881 -34550 -72367 -31538 51802 78570
246 78570 10692 -74446 -76359 4896 71615 52541 -20663 -62247 -35945 16457 37904 18989
258 18989 -6994 -16651 -16328 -14091 -1257 23261 33391 6549 -36401 -44342 -1323 49605 50825
271 50825 -2403 -54332 -48718 9989 59784 46809 -15145 -58304 -37463 20466 51012 27199
283 27199 -17661 -37643 -21377 7181 23637 20627 5970 -14461 -28801 -23782 6629 37700
295 37700 32499 -13426 -52814 -35961 23733 56905 23397 -36255 -53006 -13136 33277 37909
$$ packed form
210a6461k5943J2526L3489K7419P756j8078l6916l1579R875N6331N0530j7004
222E1945p8568n3234L6760Q7285L7111n3126p7434j6706N0844N3354M927l2075
234A1083k9380r999L438J4047K9357K4516j8181n9431l7817M0829Q3340K6768
246G8570o7878q5138j913Q1255O6719j9074p3204m1584K6302N2402K1447j8915
258A8989k5983r657L23K237J2834K4518J0130k6842m2950p941M3019N0928J220
271E0825n3228n1929N614N8707M9795j2975o1954m3159K0841N7929L0546k3813
283B7199m4860j9982J6266K8558J6456l010j4657k0431j4340N019L0411L1071
295C7700n201m5925l9388J6853N9694L3172l3508n9652j6751L9870M6413M632
$$ plain form
307 37909 5377 -25590 -27709 -9052 10897 20075 16057 1021 -18187 -25104 -7624 23020 34040
320 34040 9063 -26971 -33503 -3637 29238 33114 7361 -21532 -29824 -10369 20996 35678 16522
333 16522 -20490 -37270 -14799 23739 37932 13361 -23309 -33929 -10817 20363 28175 8738
345 8738 -15066 -22758 -12553 4811 19641 19848 410 -25094 -28013 1041 31008 27035 -7463
358 -7463 -32265 -21600 8968 25118 14572 -6314 -16668 -12224 -902 8550 13586 10288 -3414
371 -3414 -20092 -19027 5988 29841 24505 -9239 -33339 -20079 14449 33675 19071 -12572 -29776
384 -29776 -16917 13425 31574 17621 -14196 -30126 -12982 16928 26493 8050 -15802 -20091
396 -20091 -4256 10294 9248 678 -1270 94 -5676 -13270 -5675 16026 24222 -331 -31436 -26819
$$ packed form
307C7909l2532l0967k119J8657J9949R178m018j5036j9208o917J7480L0644J1020
320C4040k4977l6034o532K9866L2875L876k5753k8893q292J9455L1365J4682j9156
333A6522l7012j6780K2471L8538J4193k4571l6670j0620K3112L1180P812j9437
345H738k3804p692J0205J7364J4830K07j9438k5504k919K9054K9967l973l4498
358g463k4802J0665L0568J6150j0546k0886j0354M444J1322R452N036l298j3702
371c414j6678J065K5015K3853n336l3744k4100J3260L4528J9226j4604l1643j7204
384b9776J2859L0342J8149j3953l1817j5930J7144K9910R565j8443k3852m289
396b0091J5835J4550j046q570j948J364n770p594P595K1701Q196k4553l1105M617
$$ plain form
410 -26819 11765 37689 18199 -22594 -35000 -7734 24507 25683 442 -19382 -14548 1568
422 1568 9272 7594 5321 2928 -6238 -14484 -6834 14482 24413 6101 -20416 -22665 2054 24609
436 24609 20140 -3342 -19811 -13969 4838 16797 12053 -1758 -11509 -10393 -1086 7695 10105 4477
450 4477 -6114 -11728 -7583 3114 10824 8507 -1801 -12168 -14422 -2671 13944 17539 353
463 353 -20839 -19976 4270 22996 14395 -9614 -20734 -8405 9743 13674 3679 -5328 -5559 -2500
477 -2500 -1529 1188 8409 11319 -247 -15922 -13875 7962 24067 11780 -14798 -22752 -2469 19152
491 19152 17386 -2104 -14418 -8914 3406 8548 4026 -446 -1571 -2298 -5031 -4246 3310 9687 4778
506 4778 -7201 -12989 -4869 7403 11642 3976 -7818 -13909 -7881 6795 16124 7863 -11347 -19691
$$ packed form
410b6819L8584K5924j9490m0793j2406K7266L2241J176k5241j9824M834J6116
422A568P704j678k273k393r166q246P650K1316R931j8312k6517k249K4719K2555
436B4609m469k3482j6469N842J8807J1959m744j3811r751J116R307Q781K410n628
450D477j0591n614M145J0697P710k317j0308j0367k254J1751J6615L595j7186
463C53k1192Q63K4246J8726q601k4009j1120J2329J8148L931r995r007k31L059
477b500R71K717P221K910j1566j5675K047K1837J6105j2287k6578p954K0283K1621
491A9152j766j9490j2314N504J2320N142m522m472j125p27k733P85P556O377m909
506D778j1979n788Q120J2272M239p666j1794o091O028J4676R329q261j9210q344
$$ plain form
520 -19691 -6668 14483 18573 1761 -16580 -15275 2664 15130 9586 -4763 -9745 -2971 3820
533 3820 3232 782 2779 3638 -2536 -8197 -3226 8027 10972 1882 -9016 -8452 1093 8607 7660 525
549 525 -5577 -7230 -3339 4060 8371 5770 -4278 -12196 -8074 5906 14468 5991 -10838 -15150 -2508
564 -2508 10702 9806 -843 -8794 -7488 -1697 3478 6333 3913 -2818 -8232 -5397 3822 9499 5182
579 5182 -3930 -8454 -2682 5464 5996 964 -1846 134 604 -2186 -2236 5126 9967 2436 -10436 -10117
595 -10117 4728 15592 7617 -9288 -14329 -2357 11076 10360 -1213 -9151 -5777 1947 5066 2376
609 2376 150 -529 -2885 -5034 -2507 4896 6733 -706 -8536 -7011 1726 6922 4524 -1666 -4712
624 -4712 -5036 -1268 4396 6087 1759 -5926 -7774 -995 7192 7396 -345 -7145 -5054 3323 6283 1666
$$ packed form
520a9691J3023K1151M090j6812j8341J305J7939J2466n544j4349m982O774O791
533C820n88k450J997Q59o174n661M971J1253K945r090j0898N64R545P514r47p135
549E25o102j653L891P399M311k601j0048p918M122J3980Q562q477j6829m312J2642
564b508J3210q96j0649p951J306N791N175K855k420o731n414K835R219N677m317
579E182r112m524N772Q146N32n032k810J980M70k790n0P362M841p531j2872L19
595a0117J4845J0864p975j6905n041J1972J3433p16j1573p938L374P724L119k690
609B376k226o79k356k149K527P403J837p439p830J525Q737N196k398o190l046
624d712l24L768N664J691m328p685j848O779Q187K04p741o800K091Q377K960m617
$$ plain form
640 1666 -3039 -540 2526 14 -3953 -906 7592 7364 -4032 -11691 -3908 10589 12276 -1196 -12253
655 -12253 -8508 5129 11319 3808 -6324 -7864 -1173 3411 2867 676 -372 -1886 -4449 -3223 3215
670 3215 6822 1342 -7087 -6807 1636 6210 2126 -3770 -3629 618 1502 -1062 -1642 1526 3472 276
686 276 -4883 -4118 3123 7947 2981 -5446 -6696 461 6957 5305 144 -3663 -3560 -954 3285 6572
702 6572 3455 -4390 -8267 -1740 8435 8399 -1936 -9603 -5495 4620 8253 920 -7214 -5276 2618
717 2618 4913 -1393 -5400 -593 5502 2077 -6026 -6147 2452 7734 2249 -5694 -6300 699 5360 3808
733 3808 -985 -3652 -2687 102 2360 3571 2405 -1338 -4760 -2427 4170 7441 2348 -5766 -5573 2289
749 2289 7576 3546 -3894 -3939 1542 2913 118 -1124 1265 2517 -678 -4103 -1858 3500 4640 -758
$$ packed form
640A666m705K499L066k512l967L047Q498k28j1396p659P783J4497J687j3472j1057
655a2253L745J3637O190p511j0132j540O691M584n44k191j048j514k563J226O438
670C215L607n480q429K80Q443M574m084n896J41M247Q84k564n80L168J946l196
686B76n159P65P241M824m966q427j250P157O496j652n161l807J03K606M239L287
702F572l117p845l877O527J0175l6j0335p667M108J0115L633p333q134J938P894
717B618K295o306m007M807O095l425q103j21Q599N282n485p943o06O999M661j552
733C808m793k667R65K789K258J211j166l743l422K333O597L271n093q114J93P862
749B289N287m030p440m5N481J371k795j242K389J252l195l425K245N358J140n398
$$ plain form
765 -758 -5577 -3771 2505 4623 322 -3750 -2672 943 1122 -1623 -881 1812 1286 -3326 -4772 706
781 706 5572 2464 -3621 -5520 -624 4154 3298 -643 -2350 -1135 636 684 426 2040 1859 -1426 -4064
798 -4064 -1280 4906 5802 -1146 -6791 -2985 4300 6303 59 -4738 -2713 1740 2487 232 -937 193
814 193 803 -1100 -1694 94 2212 1172 -1983 -2985 -460 2101 538 -2313 -880 847 -783 -3115
830 -3115 -1727 3373 4134 -2302 -7145 -2728 5900 7123 -1023 -7920 -4877 4501 7850 1538 -5409
845 -5409 -4629 1697 4904 2103 -2046 -1841 575 918 -312 241 1498 591 -1666 -1337 1710 1637 -683
862 -683 -2065 851 2664 -193 -3310 -2199 2656 3912 -482 -5615 -3849 3334 6592 704 -6398
877 -6398 -5697 2094 5890 1755 -4298 -4439 527 2250 902 -456 -650 -1117 -1249 -30 1750 2125 -270
$$ packed form
765g58m819J806O276K118m301m072J078L615J79k745P42K693n26m612j446N478
781G06M866l108o085j899M896M778q56l941j707J215J771M8k58J614j81l285k638
798d064K784O186Q96o948n645L806P285K003o244m797K025M453P47k255j169J130
814A93O10j903n94J788K118j040l155j002K525K561j563k851J433J727j630k332
830c115J388N100P61o436m843M417Q628J223q146o897L043R378L349o312o947
845e409P80O326L207k801m149K05K416L43j230N53J257r07k257L29L047p3k320
862f83j382K916J813k857l117J111M855J256m394n133J766P183L258n888p102
877f398P01P791L796m135o053j41M966J723j348j358j94m67j32J219J780L75k395
$$ plain form
894 -270 -2601 -1210 2003 3040 -47 -2458 -994 2624 2232 -1422 -2322 1097 4354 1149 -4070 -3221
910 -3221 2931 5499 174 -4718 -3102 2172 3899 265 -2659 -1715 705 1053 5 -715 410 546
926 546 -1401 -2193 119 2960 1689 -3118 -4021 268 3542 1569 -2206 -2693 696 1653 -11 -1199
942 -1199 95 1493 -511 -1899 -856 2001 2416 -623 -2780 -829 2640 2808 -425 -2621 -190 3071
958 3071 1375 -1863 -1571 1750 2810 -678 -3147 -732 2990 2736 -1304 -3282 -1210 1594 1535 -25
974 -25 -1665 -1151 -204 21 241 974 486 -2168 -3012 246 3402 2279 -2650 -4819 -152 4571 3169
991 3169 -3000 -4608 401 4328 1867 -2694 -3071 1175 3591 896 -2990 -2294 1448 3309 944 -2259
1007 -2259 -2072 759 2179 640 -472 -523 -234 -536 828 2306 1716 -1658 -3542 21 4175 3026
$$ packed form
894b70k331J391L213J037l087k411J464L618l92l654r00L419L257l205n219Q49
910c221O152K568n325m892J616N274J727l634k924R44K420L48j048p20J125J36
926E46j947p92K312K841j271m807r03M289L274j973l775m87L389R57j664j188
942a199J294J398k004j388J043K857M15l039k157J951L469J68l233k196K431L261
958C071j696l238K92L321J060l488k469K415L722k54m040j978K072K804n9j560
974b5j640N14R47K25K20P33m88k654q44L258L156j123m929k169M667M723j402
991C169o169j608N009L927k461m561l77M246K416k695l886O96L742J861k365l203
1007b259J87K831J420j539j112n1K89l02J364J478n90l374j884L563M154j149
$$ plain form
1023 3026 -2386 -4721 -995 4183 3791 -1640 -4595 -1474 3010 2804 -1352 -3284 -587 2022 1378 -1957
1039 -1957 -2049 516 1619 180 -1298 -259 660 52 -456 681 828 -270 -1657 -157 2519 2006 -1277
1056 -1277 -2958 -1053 2990 3936 -870 -3833 -1599 3272 3851 -808 -3439 -1029 2880 2264 -1088 -1996
1072 -1996 822 1460 66 -1320 10 1704 1051 -835 -1394 41 1809 460 -1551 -1484 637 1391
1088 1391 -178 -2060 -142 1831 741 -2232 -1835 1478 2397 54 -2280 -1107 1597 1940 -466 -1715
1104 -1715 104 1628 688 -1044 -489 1333 1531 -890 -1997 -372 3025 2202 -1789 -3432 22 3159
1120 3159 2036 -1656 -2724 398 1813 610 -1172 -663 356 -101 -462 -252 619 256 -903 -830 180
1137 180 1359 122 -1666 -1594 1271 2047 -417 -3086 -1336 2249 2681 -1560 -4194 -705 3489 2950
$$ packed form
1023C026n412k335L726N178l92n431k955L121M484k06m156j932K697K609o44l335
1039a957r2K565J103j439j478J039R19o08n08J137J47j098j387J500K676n13l283
1056a277j681J905M043R46m806k963K234M871N79m659k631K410L909o16l352r08
1072a996K818O38j394j386J330J694o53j886n59J435J768j349k011O7K121P54
1088A391j569j882J918J973j090k973L97L313R19k343k334J173K704L43k406j249
1104a715J819J524r40j732N55J822J98k421j107J625L397q23l991j643L454L137
1120C159j123l692j068L122J415j203j782N09J019m57l61K10Q71l63j159P3J010
1137A80J179j237j788P2K865P76k464k669J750L585M32m241k634L489M194n39
$$ plain form
1153 2950 -1404 -3524 -820 2660 2318 -657 -2279 -1030 1415 1543 -29 -670 -346 -175 -148 397 1289
1170 1289 496 -1378 -1929 1241 2917 460 -2917 -2277 1753 3323 -219 -3532 -2109 2207 3590 -485
1186 -485 -3759 -1810 1889 2831 -251 -3322 -1896 1745 2624 -518 -2195 -1028 599 685 -76 -127 165
1203 165 -680 -1314 180 1904 799 -1592 -1865 924 2785 699 -2027 -2295 606 2550 1217 -1981
1219 -1981 -1754 1162 2561 297 -2229 -1011 1968 1983 -636 -1857 -359 1807 890 -1070 -956 728
1235 728 747 -527 -810 461 905 -7 -1935 -843 1273 1995 -167 -2323 -1026 1704 1905 -975 -2273
1252 -2273 -330 1946 863 -1371 -1238 666 1469 -437 -1606 81 1893 826 -1406 -1765 725 2111
1268 2111 333 -1687 -1168 736 1894 15 -1996 -803 1594 1449 -798 -1564 101 1520 583 -1252
$$ packed form
1153B950m354k120K704L480l42k975j622J249K445J28j572o41L24J71K7N45Q92
1170A289p93j874n51L170J676k457l377O40M030J570l542l313J423M316J383m075
1186d85l274J949L699R42l082l071J426L641Q79l142j677J167J627Q6p61n1K92
1203A65q45o34J494J724j105k391k73K789J861k086k726k68K901J944j333l198
1219a981K27K916J399k264k526J218K979J5k619j221J498K166r17j960J14J684
1235G28J9j274k83J271M44r12j928J092K116P22k162k156J297K730K01k880j298
1252b273J943K276j083k234J33J904Q03j906j169J687J812j067k232l59K490J386
1268B111j778k020N19J904J158j879k011J193K397j45k247p66J665J419r37j835
$$ plain form
1284 -1252 -765 670 352 -520 -404 427 513 -540 -1145 469 1457 433 -2031 -1693 521 2590 589
1301 589 -2525 -2785 1284 3223 555 -2793 -2152 1616 3229 282 -2700 -1548 1455 1965 -69 -1250
1317 -1250 -761 850 663 237 -397 38 288 -65 -65 753 900 -842 -1421 197 2075 1422 -1915 -2327 855
1336 855 3326 1206 -2428 -2930 703 2938 1014 -2033 -2463 197 2240 669 -1302 -1420 278 1307
1352 1307 10 -802 -60 240 -118 -278 356 1172 136 -1335 -469 1272 1663 -552 -2172 -183 2642
1369 2642 1786 -1194 -2539 -364 2701 1730 -1525 -2586 -205 2537 1644 -1264 -1982 272 1681 406
1385 406 -1081 -1034 707 766 -851 -500 944 624 -534 -1118 40 1031 723 -922 -607 172 1228 -195
1403 -195 -1414 -945 783 1634 -604 -1799 -544 1625 1076 -1167 -1613 602 1782 77 -1536 -868
$$ packed form
1284a252M87J435l18q72J16Q31Q6j053o05J614R88j024k464L38K214K069k001
1301E89l114k60M069J939k668l348O41L768J613k947k982J152L003N10k034j181
1317a250M89J611j87m26o34M35K50l53%Q18J47j742n79J618J878o53l337m12L182
1336H55K471k120l634n02L633K235j924l047m30K660K043j571j971j18J698J029
1352A307j297q12P42L00l58j60O34Q16j036j471Q66J741L91k215j620J989K825
1369B642q56k980j345K175L065r71l255j061K381K742q93k908p18K254J409j275
1385D06j487M7J741N9j617L51J444l20j158n84J158R91l08j645L15P79J056j423
1403a95j219M69J728Q51k238j195J255K169n49k243m46K215J180j705j613O68
$$ plain form
1419 -868 1370 1516 -720 -1506 206 1827 822 -1116 -1324 632 2111 312 -1774 -1114 974 2350
1435 2350 212 -1765 -722 1175 1036 -673 -1194 103 611 -164 -601 160 725 161 -1240 -448 1117
1452 1117 1282 -520 -1566 -537 1256 1699 -1016 -2184 -260 2069 1272 -1517 -1970 212 2000 678
1468 678 -1557 -1773 394 1526 656 -648 -424 229 294 74 313 579 -148 -934 -745 774 1665 47
1486 47 -1693 -1109 1680 2440 -249 -2576 -1276 2238 2260 -873 -2545 -970 2151 1882 -897 -2470 -726
1503 -726 1530 1210 -594 -1741 -512 908 759 -729 -573 -17 309 -112 -19 443 290 -1095 -1183 770
1521 770 1917 59 -1854 -1591 1096 2116 -101 -1902 -1449 1233 1987 -34 -1881 -889 1231 1533
1537 1533 -246 -1344 -312 1215 822 -978 -893 357 794 -333 -710 280 754 58 -1081 -469 1120
$$ packed form
1419h68K238J46k236p86J712J621j005j938k08J956J479j799k086O60K088J376
1435B350k138j977J043J897j39j709n21J297N08p75m37P61N65n64j401P92J565
1452A117J65j802j046J029J793M43k715j168J924K329p97k789m53K182J788j322
1468F78k235k16K167J132q70j304K24O53O5k20K39K66p27p86J89J519Q91j618
1486D7j740N84K789P60k689k327J300L514K2l133j672J575L121k69k779j573J744
1503g26K256l20j804j147J229J420j49j488J56N56L26m21R3M62j53j385q8J953
1521G70J147j858j913K63K687J020k217j801M53K682P54k021j847R92K120L02
1537A533j779j098J032J527l93j800Q5J250M37j127l77R90M74o96j139O12J589
$$ plain form
1554 1120 842 -489 -1768 -373 1399 819 -1061 -1370 135 1419 586 -1380 -1043 559 1284 -64
1570 -64 -1258 -376 1149 855 -957 -951 641 1123 -171 -1325 -339 1196 1028 -28 -867 -42 1323 966
1588 966 -585 -1228 174 1426 161 -973 -870 725 828 -428 -806 34 984 -78 -930 -156 921
1605 921 691 -699 -1051 336 1137 258 -1083 -1181 652 1673 -302 -2005 -1968 829 1956 4 -1967
1622 -1967 -1046 1208 1787 -325 -1205 -101 488 602 -259 -344 -14 182 -265 167 528 75 -415 -576 158
1641 158 1216 611 -1396 -1206 532 1710 624 -1830 -1404 806 2153 612 -1947 -1420 1159 1888
1657 1888 129 -1388 -1191 718 948 -140 -800 -577 105 596 -48 138 189 -11 -545 -413 601 1123
1675 1123 -429 -1009 -185 1016 1350 -1087 -1666 -65 1696 1078 -882 -1510 52 1576 381 -1102
$$ packed form
1554A120k78j331j279J395J772n80j880l09J505J284q33j966L37J602P25j348
1570f4j194Q82J525k94j812OJ592M82j294j154R86J535j68j056q39Q25J365l57
1588I66j551o43J402J252j265j134J03J595J03j256l78Q40R50j062q52P74J077
1605I21k30j390l52J387Q01q79j341r8J833J021j975j703L7K797J127j952j971
1622a967R21K254N79k112q80J104N89J14q61q5L30J96m47M32L61m53m90j61P34
1641A58J058o05k007J90J738J178j086k454M26K210J347j541k559N27K579P29
1657A888j759j517J97J909K30j088o60K23O82M91o44J86N1k00n34J32J014N22
1675A123j552n80Q24J201L34k437n79J601J761o18j960o28J562J524j195j483
$$ plain form
1691 -1102 -1272 279 1436 356 -847 -539 559 651 39 -511 59 542 184 -565 -23 630 -65 -872
1709 -872 -628 783 1430 -126 -1213 -372 1191 871 -648 -1323 -112 926 651 -547 -1060 10 1042
1726 1042 149 -1253 -502 530 907 -286 -711 166 1048 439 -763 -613 597 975 137 -990 -494 805
1744 805 972 -193 -1267 -10 818 571 -693 -935 -175 843 -227 -762 -271 735 172 -694 -638 593
1762 593 693 -609 -1078 27 1209 775 -820 -1274 7 1559 746 -972 -1282 69 1182 432 -1096
1779 -1096 -1002 762 1222 346 -630 -545 165 545 -125 -156 -33 320 -429 -342 333 448 -377 -1089 -360 1155
1799 1155 875 -829 -1462 -434 1177 1201 -699 -1752 -153 1665 1321 -988 -1470 -4 1522 448
1815 448 -653 -596 98 527 292 -302 -173 -129 -21 -1 -114 269 242 -526 -671 302 856 26 -1173 -632 710
$$ packed form
1691a102j70J551J157j080j203L08J098R2o12n50N70M83l58p49N42O53o95q07
1709h72K44J411O47j556j087Q41J563l20j519o75J211J038k75j198n13J070J032
1726A042q93j402P51J032L77j193m25Q77Q82o09j202J50J210L78q38j127M96J299
1744H05J67j165j074J257Q28k47j264k42P60J018j070n35M91J006n63q66N6J231
1762E93J00j302m69J105J182m34j595m54J281J552q13j718l10J351J113p50j528
1779a096R4J764M60q76r76Q5P10L80o70l1J23L53p49Q7O75J15q25p12P29J515
1799A155k80j704o33J028J611K4j900j053J599J818l44k309m82J466J526j074
1815D48j101N7O94M29k35n94J29M4J08K0j13L83k7p68j45R73N54q30j199N41J342
$$ plain form
1836 710 1000 -282 -1470 -751 1546 833 -378 -1444 -267 1152 1011 -451 -1092 -72 860 352 -301
1853 -301 -527 372 674 168 -592 -167 532 256 -588 -252 768 563 -760 -1004 172 867 382 -1006 -1148
1872 -1148 251 1300 128 -1068 -952 638 1108 -73 -851 -405 445 360 -582 -533 394 650 188 -1009
1890 -1009 -194 655 394 -566 -476 285 830 79 -784 -454 315 515 -216 -562 117 558 432 -195 -728 14
1910 14 779 122 -642 -3 269 382 -579 -671 460 909 -171 -1196 -362 838 854 -275 -995 -269 810
1929 810 741 -638 -1121 -252 847 771 -529 -942 115 528 374 -526 -441 196 147 -169 -111 -92 -16 -313 -583
1950 -583 470 645 306 -793 -505 678 1006 242 -1248 -848 684 1080 -27 -1404 -700 1150 1314
1967 1314 -13 -1080 -572 685 777 -99 -485 -141 435 353 -122 -160 91 -391 -345 -263 676 197 -72 -943
$$ packed form
1836G10K90j282j188P19K297p13j211j066J177J419j41j462o41J020R32n08o53
1853c01k26Q99L02n06p60M25O99k76q44L36J020k05j323k44J176O95m85j388j42
1872a148J399J049j172j196J16J590M70j181p78M46Q50q5r42M9R27K56m62j197
1890a009Q15Q49k61r60R0P61N45p51q63L30P69K00p31l46O79M41j26o27n33P42
1910A4P65o57p64O39K72J13r61r2J131M49j080j025Q34J200J6j129p20P26J079
1929H10o9j379m83Q69J099p6j300m13J057M13j54r00Q5O37m9l16N8J9P6k97k70
1950e83J053J75l39j099K88J183L28p64j490M00J532L96j107j377P04J850J64
1967A314j327j067N08J257R2q76l86L44N76q2m75l8K51m82M6Q2R39m79k69q71
$$ plain form
1987 -943 222 355 602 -744 -1073 411 1005 428 -1297 -967 388 1244 356 -1168 -749 570 841 -345
2005 -345 -1044 -305 17 168 19 -142 171 310 255 -313 -137 393 0 -615 -276 144 819 -238 -1039 -139
2025 -139 825 354 -552 -904 86 843 375 -631 -916 163 586 270 -559 -418 477 466 -127 -588 -248 429
2045 429 155 -586 -769 444 519 -125 -504 -315 719 367 -383 -401 332 648 178 -285 -518 224 588 -183
2065 -183 -290 -21 203 408 -533 -271 584 772 -262 -659 -133 665 498 -788 -855 338 834 196 -963
2084 -963 -714 812 941 101 -597 -306 622 586 129 -737 -229 271 434 -21 -511 246 261 -126 -404 53
2104 53 696 -121 -551 -12 889 726 -717 -808 316 838 484 -470 -1022 407 852 560 -443 -994 204
2123 204 938 347 -610 -639 -34 628 66 -708 12 493 -202 -105 -211 316 -6 -322 -247 160 387 -161 -702
$$ packed form
1987i43J165J33K47j346l29J484N94n77j725L30J355Q56q88j524M19J319K71j186
2005c45o99P39L22J51j49j61L13J39n5n68J76N30l93o15L39M20O75j057q01R00
2025a39R64m71r06l52R90P57m68j006k85J079M23l16q29J41Q95j1n93m61L40O77
2045D29k74p41j83J213P5o44l79J89J034l52p50j8P33L16m70m63k33P42L64p71
2065a83j07K69K24K05r41K62Q55J88j034l97N26P98j67j286o7J193M96o38j159
2084i63K49J526J29q40o98K91R28l6m57q66N08N00J63m55m90P57J5l87k78M57
2104E3O43q17m30N39R01j63j443r1J124N22l54r54n52J429M45k92j003n51J198
2123B04P34n91r57k9O05O62n62p74P20M81o95R7j06N27l22l16P5M07K27n48n41
$$ plain form
2144 -702 -442 814 761 -289 -1030 -479 936 1061 -635 -1117 176 1032 547 -679 -977 172 945 315
2162 315 -571 -568 127 525 9 -330 -51 -6 111 142 -290 160 336 -243 -442 333 723 -11 -569 -197 488
2183 488 604 -128 -896 -420 893 373 -563 -638 -22 296 310 -554 -557 229 440 -77 -305 -1 412 300 -246
2204 -246 -285 179 895 182 -621 -319 474 630 -288 -792 23 668 566 -212 -340 283 209 -93 -93 -14 279 25
2226 25 12 -393 -211 240 -90 -458 106 113 406 -180 -602 -446 540 40 -531 -752 -71 715 360 -562 -323
2247 -323 307 266 134 -495 -91 231 356 -314 -262 399 293 -199 -271 -29 512 181 -462 -307 444 850 4
2268 4 -801 -202 480 869 -463 -931 -582 560 805 -16 -1026 -503 751 830 -362 -515 -138 99 582
2287 582 -77 -315 -120 142 -13 375 379 -67 -364 -420 77 524 57 -585 -288 424 541 -97 -829 -52 506
$$ packed form
2144g02K60J256n3j050p41N51J415J25j696m82J293Q56m85j226k98J149P73o30
2162C15q86LO95L98n16l39K79M5J17L1m32M50J76n79j99P75L90p34n58L72O85
2183D88J16p32p68M76J313n20r36p5O16L18J4q64lP86K11n17k28L04M13j12n46
2204b46l9M64P16p13q03L02P93J56r18n04Q15O45j02p78j28O23p4l02%P9K93k54
2226B5j3m05J82M51l30l68N64PK93n86m22J56R86n00n71k21O81P86l55r22K39
2247c23O30m1j32o29M04L22J25o70N2O61j06m92p2K42N41l31o43J55P51M06q46
2268Dq05N99O82L89j332m68L49J142K45q21j010N23J254P9j192j53L77K37M83
2287E82o59k38J95K62j55L88Mm46k97n6M97M47m67o42K97P12J17o38p32P77N58
$$ plain form
2308 506 661 -121 -865 -174 583 747 -157 -570 305 488 336 -314 -292 43 298 -100 -380 -119 508 165
2328 165 -528 -266 396 484 10 -745 23 724 443 -464 -763 -172 751 536 -307 -680 84 555 102 -219
2348 -219 -263 -77 259 153 2 128 113 21 -316 -251 135 -13 -390 -274 95 455 -106 -382 -247 376 705
2369 705 -167 -485 -104 648 371 -366 -701 270 751 50 -425 -392 359 743 -20 -580 -42 754 634 -390
2389 -390 -604 64 1011 225 -447 -628 120 765 168 -538 -403 400 323 -142 -295 -413 139 219 -65 -258 -164
2410 -164 -246 120 342 -79 -236 -153 -214 297 161 132 -514 -395 177 702 -70 -753 -613 412 922 -138 -475
2431 -475 -235 795 714 -329 -558 -223 301 448 -436 -666 123 508 73 -171 -189 271 192 -146 -338 -89
2451 -89 198 111 -547 -224 265 462 -39 -340 -306 463 727 -135 -482 132 651 322 -319 -607 -266 486 78
$$ packed form
2308E06J55p82p44O91P57J64r04m13Q75J83j52o50K2L35K55l98k80K61O27l43
2328A65o93K62O62Q8m74p55P68P01k81r07k99N91R23k15q43l73P64M71m53l21
2348b19m4J86L36j06j51J26j5r2l37O5L86j48l77J16L69L60n61k76J35O23L29
2369G05q72l18L81P52k77p37l35R71M81p01m75L3P51L84p63n60N38P96j20j024
2389c90k14O68R47p86o72j81P48O45n97p06J35Q03p7m65j53j18N52Q0k84j93R4
2410a64q2L66K22m21j57Q3o1N11j36k9o46J19N72N25p72o83J40J025N10j060l37
2431d75K40J030q1j043k29L35N24J47q84k30P89L85m35k44j8M60p9l38j92K49
2451h9K87q7o58L23M89J97n01l01L4P69K64q62l47O14N19l29o41k88L41P52m08
$$ plain form
2472 78 65 -195 -233 268 -183 -310 -44 -76 -315 -260 95 254 -181 -493 -219 367 209 -85 -581 172 484 406
2494 406 -397 -983 -231 775 338 -284 -396 -16 584 355 -480 -580 215 548 -31 -470 -157 95 165 27
2514 27 -274 -29 457 176 -152 -664 305 576 22 -476 148 368 436 -189 -43 -181 266 -120 30 24 139
2535 139 165 -164 -13 -35 315 92 -411 -4 678 -79 -507 -144 -74 763 70 -600 -284 491 749 -35 -349
2556 -349 -21 215 279 -118 -778 -148 393 355 -204 -170 6 400 189 -499 -72 197 152 4 -360 -98 507
2577 507 80 -271 -9 206 203 95 -703 -88 208 250 -51 -169 -51 221 48 -512 -356 -294 82 133 72 -8
2599 -8 -16 50 -377 59 529 77 -222 -175 431 404 -139 -766 2 306 545 -139 -907 -102 699 416 -318 -466
2621 -466 -17 532 485 -255 -715 -115 749 618 -247 -556 165 617 180 -256 -260 21 244 56 83 32 226 364
$$ packed form
2472G8j3k60l8N01m51j27K66l2k39N5L55J59m35l12K74N86j58k94m96P53L12p8
2494D06q03n86P52J006m37o22j12L80O00k29q35j00P95L33n79m39L13K52P0j38
2514B7l01K45M86k81l28n12R69K71n54m98O24K20O8o25J46j38M47l86J50oJ15
2535A39K6l29J51k2L50k23n03M07O82p57m28L63P0Q37o93o70L16P75K58p84l14
2556c49L28K36O4l97o60O30N41l8n59L4J76L94k11o88M27K69m5j48l64K62O05
2577E07m27l51K62K15lj08p98O15K96M2l01j18J18K72j73n60J56O2L76N1o1q0
2599hqO6m27M36M70m52k99M7O06k7n43o27P68L04K39o84p68Q05Q01k83p34j48
2621d66M49N49m7p40m60O00Q64j31q65l09P21M52m37m36mK81K23j88K7n1J94J38
$$ plain form
2643 364 -3 -136 243 -311 -249 -398 144 151 -2 -188 -110 170 259 -115 -252 195 283 2 -199 -117 97 78 -314
2666 -314 -455 -48 225 -321 -33 -316 243 270 125 -532 -84 41 638 -126 -816 -91 485 906 -408 -404 -191
2687 -191 788 124 -217 -533 -108 278 -6 -445 -99 216 330 -95 -135 -28 324 214 158 -206 101 75 -174
2708 -174 148 -115 305 162 -266 -24 66 130 -179 -184 59 122 187 -273 -17 347 290 -278 -193 60 582 429 -394
2731 -394 -514 421 536 172 -423 -600 556 596 -2 -782 -121 515 655 154 -759 -431 765 264 -276 -360
2751 -360 103 562 162 45 -144 -55 351 31 -180 -359 87 98 -83 117 26 341 -389 -145 13 445 17
2772 17 -500 -2 360 83 130 -344 -190 456 440 -186 -392 -59 242 51 -245 -423 19 82 -289 -583 4
2793 4 151 -214 -253 -245 573 418 -257 -589 -73 455 657 52 -492 69 315 181 -159 -566 -194 325 543 -380
$$ packed form
2643C64l67j33L79n54O2j49N42Pj53j86P8K80Q9l74j37M47Q8k81k01Q2K14j9l92
2666c14j41M07K73n46K88k83N59K7j45o57M48J25N97p64o90P25N76M21j314MK13
2687a91R79o64l41l16M25L86k84m39L46L15J14m25m0J07L52j10n6l64L07k6k49
2708a74L22k63M20j43m28K42R0O4l09nK43O3O5m60K56L64n7n68Q5K53N22j53q23
2731c94j20R35J15l64n95j77J156M0n98p80O61O36J40n01r13L28J196n01n40q4
2751c60M63M59m00j17j89Q9M06l20k11j79M46J1j81K00r1L15p30K44J58M32m28
2772A7n17M98L62k77M7m74J54O46j6o26k06L33L01j91k96j78M42O3l71k94N87
2793DJ47l65l9QQ18j55o75l32N16N28K02o05n44N61K46j34l40m07L72N19K18r23
$$ plain form
2815 -380 -487 -94 298 174 -175 -120 -25 168 -123 -121 152 -126 26 -119 165 -21 160 -244 36 -62 382 -105
2837 -105 -397 122 -8 225 -188 -295 -98 -18 183 -333 -140 424 267 274 -123 110 265 109 -452 -214 108
2858 108 242 -11 -111 -120 -51 564 225 -609 -386 395 439 -321 -425 -220 563 578 -15 -203 -47 194 -46 -237
2880 -237 -178 -16 -145 163 17 62 202 -387 -79 125 135 109 -252 -279 126 381 14 -218 106 269 10 -107
2902 -107 -266 -11 496 177 55 -225 191 -35 -150 -175 -225 238 14 28 -224 5 487 100 -140 -207 344
2923 344 561 -144 -240 104 486 321 66 -188 78 176 467 -261 -437 -201 448 308 -79 -98 -3 412 -7
2944 -7 39 -306 -75 237 55 70 43 112 -356 6 288 215 -99 -344 15 329 336 -377 -406 -482 202 -89 -348 -403
2968 -403 33 512 412 -62 -229 356 410 -271 -302 142 126 272 -261 241 67 286 -134 -107 -223 408 183
$$ packed form
2815c80j07L93L92j24l49N5R5J93k91KK73k78J52j45K84j86J81m04K80r8M44m87
2837a05k92N19j30K33m13j07J97Q0K01n16J93N64j57Pl97K33J55j56n61K38L22
2858A08J34k53j00rO9O15l39q34K23P81M4p60j04K05P83J5n93j88J56K41k40j91
2880b37N9J62j29L08j46M5J40n89L08K04J0k6l61k7M05K55l67k32L24J63k59j17
2902a07j59K55N07l19j22k80M16k26j15k5n0M63k24J4k52K29M82l87k40o7N51
2923C44K17p05r6L44L82j65k55k54K66R8K91p28j76K36O49j40l87j9R5M15m19
2944gM6l45K31L12j82J5k7O9m68L62K82p3l14k45L59L14Pp13k9p6O84k91k59n5
2968d03M36M79j00m74j67N85N4o81l1M44j6J46n33N02j74K19m20K7j16O31k25
$$ plain form
2989 183 174 -355 139 353 248 110 -342 -70 67 261 -133 -49 44 161 -104 73 -283 38 68 -201 40 141
3011 141 52 134 -82 258 297 -166 -425 104 81 79 136 -136 -240 483 335 -63 -547 150 282 -109 -9 -234
3033 -234 98 106 13 -187 -79 210 161 -258 -320 -97 338 230 -6 -268 -82 512 277 -65 -13 429 567 25
3055 25 -303 -278 165 130 99 59 8 153 244 -191 -341 16 86 181 223 173 -12 -40 -230 -219 305 -367 -493 -128
3079 -128 128 337 -65 -462 -212 297 598 -43 -188 -106 325 133 66 -231 -136 8 399 -371 -388 53 296
3100 296 306 -246 97 -8 79 -270 -267 3 47 -67 -304 -22 61 -120 -122 -267 52 289 231 -88 -331 174 281
3123 281 100 -325 -269 169 457 -98 96 102 46 -3 -147 -150 43 2 -437 -14 90 110 -130 -289 104 -103 108
3146 108 -12 -207 106 266 247 -100 -223 247 95 125 -447 -407 50 21 26 -268 -283 355 102 -86 -356 202
$$ packed form
2989A83rn29M94K14j05j38m52K72J37J94l94Q4R3J17k65J77l56L21L0k69K41J01
3011A41q9Q2k16L40L9m63k59N29k3kN7k72j04P23j48l98m84O97J32l91J00k25
3033b34L32Qr3k00J08K89m9m19o2K23M35j08k36k62J86N94k35l42N2M42J38n42
3055B5l28K5M43l5l1m0n1J45R1m35j50L57P0R5M2n0j85k8j90J1N24o72j26L65
3079a28K56K09m02l97K50N09L01o41j45Q2M31j92o7k97R5J44L91p70j7M41K43
3100B96J0n52L43j05Q7l49LK70M4j14k37K82Q3j81kj45L19K37n8l19k43N05J07
3123B81j81m25N6M38K88n55J94On6m9j44lJ93m1m39M23J04K0k40j59L93k07K11
3146A08j20j95L13J60j9l47j23M70j52L0n72M0M57k9Nk94j5O38k53j88k70N58
$$ plain form
3168 202 25 198 -239 -181 35 263 26 -116 -78 249 292 22 -90 -80 225 176 206 -127 50 277 -137 -114
3190 -114 -28 147 73 -240 -214 -56 301 -106 -29 343 346 -44 240 177 343 -105 -27 -168 -538 68 430 -94 -383
3213 -383 -191 250 -86 -273 -64 68 362 72 -625 -75 129 16 -229 -91 -51 64 264 -165 14 -17 146
3234 146 -130 -277 -173 109 -116 -316 -196 -22 329 196 -377 -324 -97 -66 198 -79 -160 22 230 -154 97
3255 97 360 61 30 -36 -128 81 -133 -330 -279 109 246 -193 -238 -302 406 400 -319 -575 -291 186 -38 -169 -192
3278 -192 263 393 193 -118 -79 30 150 49 -150 -382 168 185 215 -195 150 54 -230 28 -89 17 232
3299 232 -251 -53 24 195 20 12 -15 -88 -108 323 17 91 213 172 -67 -172 186 14 13 -497 -229 355 66
3322 66 -75 -50 135 213 122 15 -403 222 325 -133 -29 -25 338 -119 -276 -192 -108 78 222 -37 12 -142 277
$$ packed form
3168B02j77J73m37N8K16K28k37j42L8L27M3k70j12J0L05m9L0l33J77K27m14K3
3190a14Q6J75p4l13K6J58L57m07P7L72Ll90K84o3J66m48P8j41l70O06L62n24k89
3213c83J92M41l36j87K09J32K94k90o97N50K04j13k45J38M0J15K00m29J79l1J63
3234A46k76j47J04K82k25k00J20J74L51j33n73N3K27L1K64k77q1J82K08l84K51
3255I7K63k99l1o6r2K09k14j97N1L88J37m39m5o4P08op19k56K84M77k24j31k3
3278a92M55J30k00l11L9J09J20j01j99k32N50J7L0m10L45r6k84K58j17J06K15
3299B32m83J98P7J71j75qk7p3k0M31l06P4J22m1k39j05L58j72jn10K68N84k89
3322F6j41K5J85P8r1j07m18O25J03m58J04ML63m57j57Q4Q4J86J44k59M9j54M19
$$ plain form
3345 277 147 94 16 -71 196 -19 -119 61 -220 2 1 -256 81 314 58 -476 315 114 146 -141 -273 159
3367 159 192 -129 -188 -79 -138 477 312 -97 -459 296 203 81 -341 95 66 -102 -258 17 34 206 -424 -216
3389 -216 76 357 -27 -16 143 146 253 323 -328 -302 424 219 -32 -303 289 518 63 99 -431 314 116 -353
3411 -353 -229 -29 172 -90 -149 109 -153 195 -149 -153 -44 -40 97 -32 -87 -68 136 -112 -231 88 22 289 -265
3434 -265 15 -79 -236 179 83 -181 266 54 181 -37 -70 -59 -129 -225 -294 -198 19 31 -127 10 220 167 -97
3457 -97 25 -335 496 161 -43 -123 143 200 -137 -16 7 108 261 51 16 -48 -141 188 204 6 219 23 -194
3480 -194 -151 -254 254 88 -292 -256 -159 157 113 -111 -202 241 149 -141 -115 -165 104 169 336 -63 -240 -3 -160
3503 -160 -194 -196 -121 -120 -73 -256 -259 144 192 -233 -363 439 246 266 -114 50 -110 -1 -256 -142 75 -24 45 -216
$$ packed form
3345B77j30n3p8q7K67k15j00J80k81K22jk57L37K33k56n34P91k01L2k87j32M32
3367A59L3l21n9J09n9O15j65m09l62P55r3j22m22M36k9j68j56K75J7J72o30K08
3389b16K92K81l84J1J59LJ07P0o51K6P26k05k51k71N92K29m55L6n30P45j98m69
3411c53J24K00K01k62n9K58k62L48l44mJ09MJ37j29n5J9K04k48j19L19o6K67n54
3434b65K80r4j57M15r6k64M47k12J27k18l3J1p0r6o9R6K17J2j58J37K10n3k64
3457i7J22l60Q31l35k04q0K66N7l37J21K3J01J53k10l5o4r3L29J6j98K13j96k17
3480a94M3j03N08j66l80L6R7L16m4k24r1M43r2k90K6n0K69O5J67l99j77K37j57
3503a60l4kP5JM7j83lM03M8m25j30Q02j93K0l80J64j60J09k55J14K17r9O9k61
$$ plain form
3527 -216 -13 229 -142 -150 -180 -131 139 -238 25 -186 -47 234 108 168 183 11 303 45 -33 -143 78 6 -244
3550 -244 -116 -190 -259 160 -49 -213 360 287 47 -125 -102 88 132 260 -296 -158 38 103 235 233 179 -105 194
3573 194 -3 194 108 -72 4 232 167 120 -152 76 -86 51 286 93 73 -53 197 -65 -16 12 46 259 -156
3596 -156 -124 -294 -99 146 -15 61 -154 326 42 1 101 283 65 -135 -1 194 100 134 -460 -221 -27 497
3618 497 -230 -192 171 -225 334 -203 -145 88 108 -126 -199 -250 -199 194 62 -35 -12 45 71 110 28 -172 152 44
3642 44 -421 17 -53 384 2 36 -130 -223 267 -219 -56 -17 13 -112 70 228 8 242 -264 -285 12 225
3664 225 -55 -381 -148 41 -67 143 96 -50 112 98 -78 -161 103 120 73 -109 -61 -150 180 -224 -232 500 22
3687 22 -67 -144 118 65 51 99 179 87 152 -202 -84 -188 -44 88 -244 -144 59 -60 37 -58 -237 195 202 265 -163
$$ packed form
3527b16K03K42l71ql0M9K70l77K63k11J39K81j26O0J5j72K92k58p8j10K21p2k50
3550b44J28p4o9M19k09j64N73p3k40j72K3J90M4J28n56J38J96O5J32kn4k84K99
3573A94j97J97q6j80P6K28o5m7k72K28j62J37K35j93k0j26K50k62M9K8L4K13m15
3596a56L2j70J95K45j61P6k15M80k84m1J00J82k18k00J34J95r4L4n94K39J94N24
3618D97p27L8L63l96N59n37N8K33K0k34p3n1N1L93j32r7K3N7K6L9q2k00L24j08
3642D4m65M38p0M37l82L4j66r3M90m86J63L9L0j25J82J58k20K34n06k1K97K13
3664B25k80l26K33J89j08K10m7j46J62j4j76q3K64J7m7j82M8q9L30m04qP32m78
3687B2q9p7K62n3j4M8Q0r2O5l54J18j04J44J32l32J00K03j19R7r5j79M32PO3m28
$$ plain form
3712 -163 -22 -117 390 269 -201 -166 360 67 38 123 341 131 197 -308 -139 -128 210 -369 -257 -87 115 49
3734 49 120 -156 -151 329 54 4 -276 78 245 105 -185 115 134 2 -12 -361 34 -114 33 241 -48 77
3756 77 -129 27 -177 -3 251 94 18 -62 277 122 -65 -176 -49 15 -77 -153 -123 20 401 -184 -178 -41 88
3779 88 -134 65 -271 -109 -380 -52 -276 -61 -185 103 -12 -108 46 -229 62 138 120 130 25 -166 -16 -17
3801 -17 -52 166 167 -157 -41 60 8 140 -117 3 324 163 -187 -173 28 114 -53 -19 -127 -107 -92 -120 -61 159
3825 159 -7 -121 -85 -23 315 5 -157 -71 -13 152 -145 136 230 175 66 16 -312 -122 108 97 357 -295 146
3848 146 200 121 -111 -105 28 -62 140 125 -45 321 -42 111 -78 -8 332 -126 -185 -1 -256 -112 -80 -255 338
3871 338 223 -121 88 103 265 314 -28 64 4 156 -358 -264 -93 30 -5 -71 -146 -304 -111 -178 52 -146 419
$$ packed form
3712a63J41r5N07j21m70L5N26k93k9Q5K18k10O6n05J69J1L38n79J12J70K02o6
3734D9P1k76NM80k75n0k80L54J67j40k90L00J9j32j4l49L95j48J47K08k89J25
3756G7k06J56k04J74K54j57p6q0L39j55j87j11J27O4r2p6L0J43L81n85OJ37J29
3779H8k22J99l36J62k71L28k24K15j24K88j15r6J54k75K91P6j8J0j05j91J50j
3801a7l5K18Jl24J16J01n2J32k57J20L21j61l50J4K01Q6j67L4j08K0J5k8N9K20
3825A59j66j14L6O2L38l10j62Q6N8J65k97K81R4n5j09n0l28J90K30j1K60o52M41
3848A46N4p9k32OJ33r0K02j5j70L66l63J53j89P0L40m58n9J84k55J44L2j75N93
3871C38j15l44K09J5J62M9l42R2o0J52n14R4J71J23l5o6p5j58J93o7K30j98N65
$$ plain form
3894 419 -66 151 -23 -38 74 316 88 -245 49 169 63 -140 -201 209 -43 -77 -42 -155 222 -354 21
3915 21 -16 92 -55 -162 -454 -115 185 232 -210 -288 229 -88 133 85 -375 32 -43 371 44 -5 -120 -254
3937 -254 154 105 -365 19 -8 264 145 42 20 -130 139 -159 81 -173 -418 -56 -251 79 -183 -105 13
3958 13 -74 187 -142 87 117 -323 -5 52 -29 93 327 7 -118 64 -39 35 -203 -99 -112 74 22 100 -34
3981 -34 -171 103 -210 -23 -269 0 217 69 -108 354 143 366 -137 -192 -83 137 455 93 33 462 172
4002 172 -151 145 -154 77 100 -101 186 23 -12 32 -22 -237 44 -94 -237 -239 20 -134 115 -331 97 -108
4024 -108 148 -108 33 -276 168 108 35 -139 -384 263 34 -156 -327 206 135 -162 -313 155 47 -73 -55
4045 -55 -144 234 132 -389 -132 -62 -79 -171 248 205 206 -175 -46 212 -104 -59 34 118 -80 -73 69 -140 -67 169 25
$$ packed form
3894D19m85K17j74j5J12K42k28l33K94J20j06k03o1M10k52l4L5j13L77n76L75
3915B1l7J08j47j07k92L39L00M7m42p8N17l17K21m8m60M07p5M14l27m9j15j34
3937b54M08m9m70L84k7K72j19j03k2j50K69k98K40k54k45L62j95L30k62P8J18
3958A3q7K61l29K29L0m40L18N7q1J22K34l20j25J82j03P4k38J04j3J86n2P8j34
3981c4j37K74l13J87k46K69K17j48j77M62k11K23n03n5J09K20L18l62o0M29k90
4002A72l23K96k99K31K3k01K87j63l5M4n4k15K81j38j43kK59j54K49m46M28k05
4024a08K56k56J41l09M44o0p3j74k45O47k29j90j71N33p1k97j51M68j08j20J8
4045e5q9L78j02n21K57P0j7r2M19m3Jl81J29K58l16M5R3Q4j98PJ42k09P3K36j44
$$ plain form
4070 25 -131 148 -200 39 58 46 128 51 -168 148 17 -300 -316 35 203 31 80 -95 112 229 -43 -74 -197
4093 -197 134 74 99 -294 -187 220 -83 -30 124 21 192 -307 -132 -230 373 301 -12 168 -118 2 -100 -101
4115 -101 -8 278 30 -145 -5 -13 55 3 -221 -271 32 -23 174 -287 -3 100 -29 -63 -16 -65 199 287 -185 168
4139 168 12 -354 -137 -24 254 182 -173 -119 20 18 286 -19 -181 107 -12 -80 -33 94 -26 -14 -210 -143 -54
4162 -54 246 -242 -102 -84 -42 22 -308 70 -121 -23 144 -203 -82 -72 67 293 173 28 268 240 20 44 -302
4185 -302 114 -50 -73 -47 -362 59 -30 -103 136 -90 66 -206 -137 164 -9 -62 -5 -86 252 282 -16 84 -76
4208 -76 25 -85 89 -236 80 113 250 -216 -162 13 203 98 -26 -211 215 -24 91 -143 -38 43 -131
4229 -131 -99 187 143 196 -235 68 294 156 -304 -392 39 84 -75 18 51 -590 -111 6 103 -20 97 -233 -254
$$ packed form
4070B5j56K79l48K39J9j2Q2p7k19L16j31l17j6L51J68j72M9j75K07J17k72l1j23
4093a97L31o0K5l93J07M07l03N3J54j03J71m99J75r8O03p2l13J80k86J20j02j
4115a01R3K86k48j75J40qO8n2k24n0L03n5J97m61K84J03j29l4M7m9K64Q8m72L53
4139A68j56l66K17J13K78p2l55N4J39kK68l05j62K88j19o8M7J27j20J2j96O7Q9
4162e4L00m88J40J8M2O4l30L78j91R8J67l47J21J0J39K26j20j45K40k8k20K4l46
4185c02M16j64k3K6l15M21q9p3K39k26J56k72O9L01j73n3N7q1L38L0k98J00j60
4208g6J01j10J74l25L16L3J37m66N4J75J90j05j24j85M26k39J15k34J05Q1j74
4229a31L2K86m4N3m31L03K26j38m60q8M31M5j59R3L3o41M79J17R7j23J17l30k1
$$ plain form
4252 -254 175 135 149 -28 -115 -3 -324 -235 238 144 -281 58 77 12 -169 200 28 84 20 158 -275 -122 -250
4275 -250 -23 91 130 164 -125 -15 153 135 -156 159 -123 53 103 -79 6 241 14 148 5 41 -96 130
4297 130 19 -94 -34 198 -31 68 -114 184 -149 298 301 61 -234 -1 254 -150 196 39 141 137 -149 -17
4319 -17 304 -214 -145 -30 -224 -174 15 -251 -56 4 222 463 -204 -290 -11 -96 -51 36 60 235 -22 142 -122
4342 -122 -49 -191 -167 158 -136 -122 3 -200 171 -172 186 -52 -19 -24 95 108 -75 -65 78 89 -66 -167 -295
4365 -295 208 103 -252 -294 10 80 202 78 -176 -458 33 -135 233 192 146 90 30 -52 -107 431 115 163 67
4388 67 -41 66 278 -79 -365 -89 268 -155 -8 -237 82 56 -71 225 -281 -299 -96 -60 -30 56 138 -115
4410 -115 63 188 -23 -196 135 180 -91 261 -211 -94 183 203 219 345 -175 -111 -161 216 130 -21 7 88 -39
$$ packed form
4252b54M29m0J4j77q7J12l21Q9M73r4m25L39J9o5j81L69j72N6o4J38m33J53j28
4275b50K27J14L9L4k89J10J68j8k91L15k82J76N0j82Q5K35k27J34j43L6j37K26
4297A30j11j13O0K32k29R9j82K98l33M47Lk40k95K33K55m04L46j57J02mk86J32
4319a7L21n18O9J15j94N0J89k66J95O0K18K41o67q6K79q5M5Q7K4J75k57J64k64
4342a22P3j42K4L25k94J4J25k03L71l43L58k38L3nJ19J3j83J0J43J1j55j01j28
4365b95N03j05l55m2L04P0J22j24k54k82M91j68L68m1m6n6o0q2n5N38l16M8r6
4388F7j08J07K12l57k86K76L57m23J47k29L19k6j27K96n06j8K03L6L0Q6Q2k53
4410a15J78J25k11j73L31M5k71L52m72J17K77K0J6J26n20O4n0L77q6j51K8Q1j27
$$ plain form
4433 -39 -278 286 78 279 0 83 -206 91 180 194 -166 -61 -130 -249 148 293 -113 -136 -325 -133 -146 177
4455 177 76 -14 115 112 316 -200 57 57 -208 -217 87 -2 -419 -17 182 108 121 -94 61 192 152 -253 155 -72
4479 -72 -153 99 -127 -75 -157 -180 387 143 80 -49 -131 183 92 58 148 216 20 85 -76 156 -1 -213 152 -59
4503 -59 83 233 203 30 -274 -373 68 -143 -349 211 233 22 153 -187 -138 -52 73 -118 73 -16 -48 -266 -64
4526 -64 -101 -36 76 -145 106 7 12 327 81 -64 -177 135 -31 149 511 197 198 -57 247 201 -139 86 144
4549 144 -10 15 233 63 -129 -176 30 -26 272 116 69 381 196 74 -70 177 125 61 -155 -292 47 148
4571 148 85 -135 -266 79 -255 -239 75 35 -101 -117 8 35 -55 151 45 75 49 -85 98 -153 213 148 -124
4594 -124 241 -51 -277 78 -126 137 -17 -93 13 -140 -8 -183 -121 214 123 -203 -333 124 -162 -342 -170
$$ packed form
4433c9k39N64k08K01k79Q3k89K97Q9J4l60J05o9j19L97J45m06k3j89J92j3L23
4455A77j01r0J29lK04n16K57%k65rL04q9m17M02J99p4J3k15J55J31m0m05M08k27
4479g2q1K52k26N2q2k3N67k44o3j29q2L14r1l4R0O8j96O5j61K32j57k12L65k11
4503e9J42J50l0j73l04r9M41k11k06N60K2k11J31l40M9Q6J25j91J91q9l2k18K02
4526f4l7O5J12k21K51r9NL15k46j45j13L12j66J80L62l14Jk55L04m6l40K25N8
4549A44j54K5K18j70j92m7K06n6K98j56m7L12j85j22j44K47n2o4k16j37L39J01
4571A48o3k20j31L45l34J6L14m0j36j6J25K7r0K06j06L0k6j34J83k51L66o5k72
4594a24L65k92k26L55k04K63j54p6J06j53J32j75O2L35r1l26j30M57k86j80J72
$$ plain form
4615 -170 -229 254 59 18 -56 -10 -10 -211 -71 193 -102 95 187 -304 -12 -151 -247 -112 -240 44 -212 -116 -220
4638 -220 -178 102 73 75 -14 -146 8 -109 96 82 -46 142 -100 131 175 249 -10 130 157 -177 -150 218 -103
4661 -103 71 -315 -127 -236 93 -74 83 1 -120 99 -77 -136 46 37 161 31 -61 -317 129 -248 -144 -169
4683 -169 -221 -122 -125 -171 44 8 5 -3 -83 -70 105 -121 -34 159 -108 159 52 -239 3 -58 -114 87 -28 -56 -199
4708 -199 -105 103 -19 -101 -253 61 189 161 -50 -25 -171 298 160 241 85 -99 -88 -185 203 -58 -175 -359
4730 -359 98 392 9 202 234 -136 50 13 -193 331 256 -91 -16 -240 333 3 47 -13 155 -3 -109 -32
4752 -32 -269 -239 -85 -101 -137 -59 28 -15 -36 -201 247 83 -4 -256 162 9 -72 -39 104 -18 188 135 -264 246
4776 246 -200 -188 41 -87 95 113 76 -73 415 -144 -62 -54 -93 -39 124 66 -107 -129 -139 107 -84 267 -180 -3
$$ packed form
4615a70n9M83j95m1p4M6%k01J40K64k95J97R2m91K92j39r6J35j28K84k56R6j04
4638b20M2K80k9Kq9j32J54j17K05j4j28J88k42K31M4P4k59J40K7l34K7L68l21
4661a03J74l86J88j09L29j67J57q2j21K19j76n9J82rJ24j30r2k56M46l77J04k5
4683a69n2R9lm6K15l6lqq0J3J75k26Q7J93k67K67j07k91K42o1n6K01j15k8j43
4708a99R4K08j22q2j52L14J28k8k11K5j46M69j38Q1j56j84J1r7L88k61j17j84
4730c59M57K94l83J93L2l70J86l7k06N24p5l47P5k24N73l30M4o0J68j58j06P7
4752c2k37L0J54j6l6P8Q7m3k1j65M48j64q7k52M18j53q1L3J43j22K06n3l99N10
4776B46m46J2K29j28J82J8l7j49M88n59Q2Ql9N4J63n8j73k2j0K46j91L51m47J77
$$ plain form
4800 -3 119 37 241 -119 118 133 -3 245 -187 130 11 25 -145 89 336 210 3 -2 -238 -333 -25 -4 -242
4823 -242 -180 139 154 7 -187 -52 82 -210 -92 193 -10 -133 -388 -176 103 -221 86 107 -119 -81 58
4844 58 -119 -163 257 238 -108 -4 37 144 51 -180 -87 -98 -1 -300 213 -73 -283 -2 62 170 -29 -48 70
4867 70 171 3 362 82 -87 52 -50 -7 140 118 -26 444 -333 15 33 -39 -28 182 -14 -49 -285 -118
4889 -118 50 -180 168 -1 73 86 -284 15 243 -135 -232 -286 142 -59 336 -179 143 -72 63 -239 -130
4910 -130 81 -8 -171 -32 -44 -42 33 272 157 -52 -170 -94 -47 46 285 147 -362 -212 -53 -15 -81 77 157 -19
4934 -19 26 -127 108 -88 180 -23 -48 25 -150 -44 140 68 -1 -166 -93 -198 -62 67 -119 -88 7 -202 -139
4957 -139 -218 64 205 145 -4 -139 96 -77 -229 240 -58 74 -332 -162 -272 -77 6 -259 23 287 271
$$ packed form
4800cJ22q2K04l60K37J5j36K48m32L17j19J4j70K34K47j26k07nk36r5L08K1k38
4823b42O2L19J5j47j94J35J34k92J18K85k03j23k55K12K79l24L07K1k26L8J39
4844E8j77m4M20j9l46J04M1J07r3k31R3j1R7k99N13k86k10K81O4J08j99j9J18
4867G0J01j68L59k80j69J39j02M3J47k2j44M70p77L48J8p2J1K10j96l5k36J67
4889a18J68k30L48j69P4J3l70K99K28l78r7n4M28k01L95n15L22k15J35l02J09
4910a30K11q9j63J39j2KP5K39j15k09j18P6M7R3K39j38n09J50J59L8o6J58Q0j76
4934a9M5j53K35j96K68k03k5P3j75J06J84p2o9j65P3j05J36J29j86L1R5k09O3
4957a39p9K82J41o0j49j35K35j73j52M69k98J32m06J70j10J95Q3k65K82K64j6
$$ plain form
4978 271 -33 -331 93 109 -162 -326 177 2 -98 -32 224 23 325 192 -196 -227 -117 -121 96 22 38 3 -240
5001 -240 20 -38 -50 26 90 -95 85 38 -65 101 -167 -87 -65 -31 125 259 -189 38 14 -124 283 -31 -14
5024 -14 -125 125 -4 -123 64 49 -26 19 -271 203 90 197 -45 -50 -382 -117 252 -69 70 74 212 -21 36
5047 36 -161 163 42 52 -128 -220 -145 -216 -23 -136 -59 -7 30 364 177 86 -56 167 -67 -256 -261 -17 78 -137
5071 -137 -103 49 -126 -127 66 -35 184 -15 -98 -17 93 -16 252 -265 79 -201 125 -136 -7 219 -189 50
5093 50 -42 -180 268 6 -52 -65 -179 -170 242 138 -236 -147 -132 351 77 -176 393 289 -58 63 -209 -65 59
5116 59 118 -125 -83 -167 135 -155 -84 94 202 -13 102 186 -276 209 130 -360 267 10 188 -162 -238 -187 -178 -76
5140 -76 64 -278 9 30 -17 -81 -115 110 299 118 -147 142 -364 170 112 49 327 -89 81 -193 -40 11 36
$$ packed form
4978B71l04k98M24J6k71j64N03j75j00O6K56k01L02j33l88l1J10mK17p4J6l5k43
5001b40K60n8j2P6O4j85J80m7j03J66k68Q0K2L4J56J34m48K27k4j38M07l14J7
5024a4j11K50j29j19J87j5p5M5k90M74j13J07k42nl32K65L69l21J39MJ38k33N7
5047C6j97L24j21J0j80r2P5p1J93j13P7N2L7L34j87r1j42K23k34j89nK44R5k15
5071a37L4J52j75jJ93j01K19j99q3Q1J10j09K68n17L44k80L26k61J29K26m08K39
5093E0r2j38M48k62n8j3j14RM12j04l74Q9J5M83k74k53N69j04l47J21k72J44J24
5116E9N9k43M2q4L02k90P1J78J08k15J15Q4m62M85p9m90O27k57J78l50p6N1RJ02
5140g6J40l42K87K1m7o4l4K25J89j81k65K89n06N34n8o3K78m16J70k74J53N1K5
$$ plain form
5163 36 19 279 -159 51 -47 160 101 311 22 -281 377 105 -6 -60 37 -48 -64 221 -155 160 30 11 -64
5186 -64 181 257 -13 -21 64 247 107 16 17 -168 36 -264 -133 -21 135 6 -379 100 -26 -4 185 -104 -362
5209 -362 -143 -109 29 -10 30 292 214 -175 -62 83 144 133 -68 -55 79 100 -72 63 -306 -225 257 307 101
5232 101 31 120 -150 -72 -157 362 -114 -154 37 64 101 107 68 105 37 268 -6 -222 -114 20 77 -123 34 -119
5256 -119 65 166 -338 102 -69 -167 140 207 285 -1 -64 102 -217 74 7 102 175 -174 146 -73 55 -174
5278 -174 -166 127 123 -223 -304 -103 194 -102 230 136 203 51 120 29 7 118 189 -99 14 373 -44 -248 -150 -97
5302 -97 89 106 -16 -152 379 -124 156 242 103 -135 -374 -46 -219 -92 -37 37 -149 -87 51 -5 171 -21
5324 -21 -103 -48 198 -81 -27 -211 100 149 -241 15 -44 316 318 -20 308 115 -267 291 -268 -226 89 89 -53 -92
$$ packed form
5163C6j7K60m38K10r8K07n9K10k89l03O58k72j11n4R7q5j6K85l76L15j30j9p5
5186f4K45P6k70qQ5J83j40r1Jj85K04l00J31J12J56j29l85M79j26K2J89k89k58
5209c62K19L4J38l9M0K62p8l89J13J45O1j1k01J3J34K1j72J35l69Q1M82N0k06
5232A01p0Q9k70P8q5N19m76m0J91K7L7Ol9L7o8K31k74k16J08J34N7k00J57j53
5256a19J84J01n04M40j71r8L07O7P8k86o3J66l19K91o7R5P3l49L20k19J28k29
5278a74QK93ml46q1K01K97k96L32r4O7j52O9r1k2J11P1k88J13L59m17k04R8N3
5302i7J86J7j22j36N31n03K80Q6j39k38k39L28j73J27N5P4j86O2J38n6J76j92
5324b1q2N5K46k79N4j84L11M9l90K56n9L60Kl38L28j93l82N58n59M2L15%j42l9
$$ plain form
5348 -92 -12 -124 231 276 37 53 177 40 3 129 302 63 -206 -68 -76 -21 -271 -65 226 -28 394 -92 10
5371 10 -325 -93 102 -51 -90 198 -49 -20 368 275 -50 -113 37 310 -32 106 384 128 220 -225 -95 -104 -5
5394 -5 261 86 -150 -40 -194 137 333 396 -206 -133 -57 -321 -149 -88 -110 53 327 -7 -449 288 247 -181 11
5417 11 -172 130 -47 82 -143 219 101 -32 148 -97 175 31 -119 162 171 -56 26 0 38 57 -333 45
5439 45 118 -55 -93 -30 254 83 176 -179 -138 97 -248 -284 -287 -132 61 2 -21 -98 -141 -226 -80 -137 28 321 119
5464 119 -50 -7 199 -156 -159 49 -3 115 190 73 -107 -135 23 -56 104 108 142 -38 -190 161 -171 -57 122
5487 122 -202 234 -14 54 -153 146 101 369 20 45 172 59 3 235 -286 390 -7 -67 -297 -31 68 -41
5509 -41 -46 -109 -212 -4 -37 -67 -90 -212 454 -1 90 50 68 129 -236 -285 -29 -84 -232 130 85 -243 79 30 -174
$$ packed form
5348i2Q0j12L55M5k39J6J24j37l7J26J73k39k69J38qN5k50K06K91k54M22m86J02
5371A0l35K32J95j53l9K88k47K9L88r3l25o3J50K73l42J38K78k56R2m45J30rR9
5394eK66j75k36J10j54L31J96O3o02P3P6k64J72O1k2J63K74l34m42P37m1m28J92
5417A1j83L02j77J29k25L62j18j33J80k45K72j44j50K81Rk27Q2k6L8J9l90L78
5439D5P3j73l8O3K84j71R3l55M1K35l45l6lJ55J93n9k3p7m3q5J46n7J65K93k02
5464A19j69M3K06l55lK08n2J18P5j17j80k8J58p9J60ML4j80j52L51l32J14J79
5487A22l24M36k48O8k07K99m5K68l49K5J27j13n6K32n21O76l97o0k30K66R9j09
5509d1no3j03K08l3l0k3j22O66m55R1m0J8O1l65m9K56n5j48L62m5l28L22m9k04
$$ plain form
5534 -174 251 -341 -238 318 -181 -236 53 -89 49 -76 43 135 70 -170 38 -29 -52 -164 173 58 -133 312
5556 312 -358 190 122 76 -328 -61 18 18 -158 44 267 416 -73 267 2 -171 -144 -164 120 280 99 -118
5578 -118 116 30 23 -63 -194 -103 -3 78 -279 -95 -124 -93 188 -222 9 399 -413 70 161 64 390 -21 10 -252
5602 -252 -237 38 -83 -251 -133 34 -148 -203 -301 -160 181 258 214 -40 128 112 186 455 66 234 31 -10 -49
5625 -49 6 132 388 31 46 -208 80 226 -194 -65 126 -189 62 109 0 205 -5 -276 97 -33 21 -172
5647 -172 -343 222 -88 -40 -77 36 192 147 -203 -148 -19 -6 -241 -33 -65 -160 -164 -117 -99 -34 -121 -61 -57 -490 153
5672 153 -232 101 -100 5 241 273 44 -43 105 81 -109 196 -312 -206 58 -144 -121 91 -18 -284 19
5693 19 69 13 -74 29 36 45 -104 120 99 -35 81 22 -305 333 68 -23 241 -240 8 -50 132 206 423 23
$$ packed form
5534a74M25n92J03N56m99n5K89j42J38j25J19R2o5k40K08o7k3j12L37j15j91M45
5556C12o70N48o8m6m04K67P9%j76K02K23J49m89L40k65j73K7k0K84J60j81k17
5578a18K34q6pq6j31R1J00Q1l57J84k9L1K81m10K31L90q12M83R1r7L26m11L1k62
5602b52J5K75j21j68J18J67j82n5r8J41L41P7m4k54J68j6P4K69l89J68k03m1l9
5625d9N5J26K56l57J5k54K88J46m20J29J91l15K51M7j09K05k10k71L73j30N4j93
5647a72j71N65l10M8l7J13J56m5l50N5J29J3k35K08l2r5mM7J8O5q7O0Mm33O43
5672A53l85L33k01J05K36L2k29q7J48k4j90L05n08J06K64k02K3K12j09k66L03
5693A9N0n6q7J03PRj49K24k1j34J16n9l27O38k65r1K64m81K48n8J82P4K17m00
$$ plain form
5717 23 214 352 209 -275 73 137 -36 -223 -265 157 -136 -99 -208 -47 91 173 79 -168 80 12 165 -32
5739 -32 -27 0 -78 -85 246 147 -108 -101 -193 -239 145 11 -141 -23 23 -88 152 -166 -95 -191 -91 44 45 -168 64 -135
5765 -135 -117 21 88 107 -61 -274 48 196 13 -3 -168 -176 126 333 -72 -57 -231 26 261 -294 -4 -199
5787 -199 185 76 -64 213 -39 -236 -193 -67 -162 -162 62 109 -341 208 -289 153 158 127 257 -40 -1 133 -236
5810 -236 88 -76 104 112 165 -11 166 343 -49 240 330 -307 232 369 -67 -1 49 48 -271 207 101 95 87 13
5834 13 -233 31 -56 113 0 87 222 -89 214 -199 173 83 -25 -240 -87 -146 -151 92 -17 321 -35 -60 -135
5857 -135 -342 173 -78 97 -123 171 -93 83 85 -333 205 14 265 -91 257 -64 19 -274 175 52 353
5878 353 189 -130 128 376 -128 -273 179 29 27 209 67 128 -67 381 -202 -2 -243 -158 -88 -15 -10 -216 354
$$ packed form
5717B3J91J38j43m84L48O4j73j87m2M22k93L7j09J61J38Q2r4k47K48o8J53j97
5739c2NK7p8pL31r9k55Pr2m6L84j34j52J18M6j11K40l18P1r6J00J35Jk13K32j99
5765a35J8J38O7J9j68k13L22J48j83j6j65qL02K07m05J5j74K57K35n55K90j95
5787a99L84j09j40K77k52j97M3J26r5%K24M7m50N49m97M42Nl1J30k97L9J34l69
5810b36L24j64J80QN3j76J77J77l92K89R0o37N39J37m36O6N0jl19M78j06oqp4
5834A3k46K64q7J69j13Q7J35l11L03m13L72r0j08k15J53n9nK43j09L38l56k5p5
5857a35k07N15k51J75k20K94k64J76Km18N38j91K51l56L48l21Q3k93M49j23L01
5878C53j64l19K58K48n04j45M52j50kJ82j42O1j95M48n83K00k41Q5P0P3Nk06N70
$$ plain form
5901 354 109 155 -74 -85 198 6 -15 85 179 35 235 45 -61 105 52 69 -237 298 85 -81 179 -250
5923 -250 -160 -44 -158 143 97 -244 -211 -49 43 112 -249 125 -35 -265 143 249 -2 251 200 138 1 75 276
5946 276 262 -353 100 98 -2 54 -64 -67 96 66 229 -69 -193 52 7 -350 153 54 299 67 43 32 68 244
5970 244 -179 -42 -135 -345 -78 -4 -39 -141 -22 195 -202 48 -1 131 -22 140 210 151 149 -75 -24 8 43 -406
5994 -406 197 -167 127 269 -34 -77 -234 -151 -112 81 39 -8 -298 -342 5 73 256 179 -13 63 124 -224 175
6017 175 149 121 -94 88 10 -172 267 -378 117 -203 -110 -391 -260 -6 -55 -210 -99 5 -149 -136 -168 142
6039 142 -119 -21 206 52 -32 -195 -268 -244 0 -20 -213 -227 85 114 105 -102 124 -121 -174 82 -422 -246 408
6062 408 126 66 -127 97 -168 76 217 175 -229 290 -54 -183 198 -24 97 302 104 -235 -72 372 58
$$ packed form
5901C54k45M6k29j1K83j92k1J00R4j44K00j90j06J66n3J7l06N35k13j66K60m29
5923b50R0J16j14L01m6l41L3J62R2O9l61L74j60k30M08J06k51K53n1o2j37P4K01
5946B76j4o15M53kj00N6j18lJ63l0J63k98j24K45m5l57N03r9K45k32k4j1L6J76
5970B44m23J37r3k10K67P4l5j02J19K17l97K50m9J32j53J62P0n9kk24N1L2L5m49
5994d06O03l64K94J42l03m3j57Q3L9J93m2m7k90m4L47O8J83p7j92P6O1l48L99
6017A75k6k8k15J82p8j82M39o45M95l20R3k81J31K54m9j55J11J04j54J3l2L10
6039A42k61R8K27j54q4j63p3K4K44k0j93j4L12K9rk07K26k45n3K56n04J76O54
6062D08k82o0j93K24k65K44J41m2m04N19l44j29L81k22J21K05j98l39J63M44l14
$$ plain form
6083 58 237 -108 -367 172 9 -42 -127 -69 23 105 -156 163 101 -26 360 -313 -23 -71 116 218 -205 -137 231
6106 231 -118 83 -54 204 239 -30 -142 19 25 -97 -12 272 31 -22 -97 47 -19 -108 -108 32 141 69 -307 81
6130 81 -195 -55 153 -105 159 164 82 -9 -46 -132 73 170 -100 305 -52 -25 183 121 -40 -64 36 33 117 175 105
6155 105 -239 214 176 -39 110 97 -172 -62 0 -187 98 12 -20 -82 89 -145 -214 -5 43 -329 118 305 -144
6178 -144 8 82 296 -99 -43 -155 -162 100 375 4 -143 132 148 -18 78 -138 -200 -31 103 115 -150 -25 144
6201 144 -104 -50 -192 -399 -55 215 148 -45 241 -155 -114 20 -154 39 -45 69 -232 -25 -113 -3 51 -21
6223 -21 26 128 159 -31 -16 -112 116 -85 49 -85 -41 -117 -134 -24 33 100 -53 33 7 0 270 -143 -67 223 113
6248 113 231 27 249 -231 221 -295 98 355 -197 -46 207 359 -119 -50 7 -139 35 320 59 190 -107
$$ packed form
6083E8J79l45k59N39j63n1q5N8R2Q2k61L19o2j27L86o73K90m8J87J02m23O8L68
6106B31l49K01j37K58L5k69j12J61Oj22Q5K84k41n3p5J44o6q9%J40J09p2l76L88
6130H1k76J40K08k58K64Nq2r1l7q6K05R7k70M05l57K7K08o2j61k4J00lQ4N8p0
6155A05l44M53l8k15J49j3k69J10O2j87K85q6l2o2J71k34o9K09M8l72M47J87m49
6178a44J52P4K14l95N6j12pK62K75l71j47K75J6j66R6k16o2J69J34J2k65J25J69
6201A44k48N4j42k07L44K70o7j93K86l96M1J34j74J93q4J14l01K07q8J10N4p2
6223b1M7J02L1j90J5r6K28k01J34j34M4p6j7J10N7O7j53Q6k6pK70m13P6K90j10
6248A13J18k04K22m80M52n16L93K57n52J51K53J52m78O9N7j46J74K85k61J31k97
$$ plain form
6269 -107 -83 -16 106 57 -20 54 -15 -207 -308 -221 226 48 41 -50 165 -18 -159 -69 -59 179 199 -3 -197 88
6293 88 -56 16 -91 52 -131 24 -139 -250 -23 100 239 141 -21 -174 -336 -139 -65 -42 -104 137 -501 -150
6315 -150 -31 120 331 -295 -155 -177 -99 -17 94 -77 194 114 -10 -134 9 159 325 3 -176 28 140
6336 140 -8 -132 -161 168 234 -250 -347 -236 -154 98 -128 -39 277 226 -49 274 -117 57 -15 -6 -64 -45 164 -67
6360 -67 -107 234 -70 7 -185 -176 -127 177 95 10 -231 32 173 140 -150 -45 -182 -273 -76 -106 -67 170 204 -315
6384 -315 96 -272 193 164 -61 195 141 231 -111 418 186 1 -252 387 49 29 280 -132 -372 -133 -43 -43
6406 -43 231 63 -72 28 73 90 266 236 -27 160 380 -123 215 -63 88 161 441 51 -93 72 -182 88
6428 88 -33 34 2 -79 17 -88 64 35 -287 125 191 13 130 -198 242 25 18 -196 133 225 -109 163 -45
$$ packed form
6269a07K4O7J22m9p7P4o9j92j01Q7M47j78pr1K15j83j41R0J0K38K0k02j94K85
6293H8j44P2j07J43j83J55j63j11K27J23J39r8j62j53j62J97P4K3o2K41o38L51
6315a50J19J51K11o26J40k2P8Q2J11j71K71q0j24j24J43J50J66l22j79K04J12
6336A40j48j24k9L29O6m84r7J11Q2K52k26Q9L16n1k75L23l91J74p2Rn8J9K09k31
6360f7m0L41l04P7j92RM9L04q2q5k41K63J41l3k90J05j37r1J97l0L9K37L4n19
6384c15M11l68M65k9k25K56n4R0l42N29k32j85k53O39l38k0K51m12k40K39R0%
6406d3K74j68j35J00M5J7J76l0k63J87K20n03L38k78J51P3K80l90j44J65k54K70
6428H8j21O7l2q1R6j05J52k9l22M12O6j78J17l28M40k17pk14L29R2l34K72k08
$$ plain form
6451 -45 -247 113 -143 175 -143 -59 300 -2 190 340 -146 102 215 156 229 332 -64 46 16 41 -209 45
6473 45 -58 76 -26 -291 -55 71 1 -30 116 -6 18 -139 347 204 36 -12 163 5 330 172 -101 24
6495 24 -122 -142 -259 2 -54 -116 322 -17 -28 -48 189 -70 87 -8 -48 214 192 -112 -86 -7 -9 -225 -102 110
6519 110 215 30 36 -105 153 162 -23 0 132 96 -94 -149 -42 -216 215 161 -126 -38 -232 52 93 -5 178 -15
6543 -15 176 -59 377 -274 43 -227 -92 245 -1 273 -87 -101 167 -39 -7 148 228 -138 111 -20 -285
6564 -285 57 -46 268 227 -261 -224 -115 99 -169 -20 -265 172 294 22 113 34 288 -90 0 -6 108 112 278
6587 278 318 155 -499 -216 280 153 -192 -204 -57 -112 119 36 -88 92 -263 -4 -147 -365 419 -149 -80 136
6609 136 20 8 145 140 -68 281 -124 98 23 -245 305 80 -65 62 -341 -8 -104 192 -277 -77 171 154
$$ packed form
6451d5k02L60k56L18l18Q4L59l02J92J50m86K48J13n9P3J03l96J10l0K5k50K54
6473D5j03J34j02k65K36J26p0l1J46j22K4j57M86j43j68m8J75j58L25j58k73J25
6495B4j46k0j17K61n6o2M38l39j1k0K37k59J57r5m0K62k2l04K6P9kk16J23K12
6519A10J05j85Oj41K58Rj85K3J32l6j90n5J07j74M31n4k87Q8j94K84M1r8J83j93
6543a5J91k35M36o51L17k70J35L37k46K74l60j4K68k06L2J55Q0l66K49j31k65
6564b85L42j03L14m1m88L7J09K14k68J49k45M37J22k72R1p9K54l78R0oJ14MJ66
6587B78M0j63o54K83M96j27l45j2J47n5K31q3j24J80l55K59j43k18P84n68O9K16
6609A36j16j2J37nk08L49m05K22p5k68N50k25j45J27m03L33r6K96m69K00K48j7
$$ plain form
6631 154 38 -196 292 -17 202 -289 -267 -28 -146 76 -190 -10 180 99 -214 -296 -46 23 -213 -201 129 6
6653 6 28 258 10 117 -35 -33 72 -204 81 -222 -351 -68 -101 351 -3 -1 -162 -96 0 220 79 1 165 -199
6677 -199 -95 10 -144 -109 106 -85 208 -28 -54 263 -269 -50 -115 29 147 -279 -35 -96 268 18 -222
6698 -222 -150 -202 -138 -9 -163 22 229 -42 -25 -30 -155 -119 160 85 -45 131 194 9 -250 -132 -11 -8 176 -174
6722 -174 346 -172 -138 -24 -61 -35 -140 -172 58 -133 312 359 20 228 221 -121 69 -72 -150 218 -224 -140 -266
6745 -266 14 -76 -219 -265 161 159 -21 -121 108 88 -36 -226 -325 144 -168 327 -32 -110 -80 -56 262 -23 122
6768 122 276 95 76 -188 117 -24 -75 -110 -55 322 -149 145 -90 -84 155 266 -130 -57 -153 37 113 -133 -32
6791 -32 156 -129 254 -360 -307 307 -134 -273 166 7 -189 -21 -118 124 66 -103 29 33 -40 -20 -103 76 -64
$$ packed form
6631A54j16k34M88l09K19m91K2K39j18K22k66J80J90q1l13q2K50O9k36J2L30j23
6653FK2K30k48J07j52KJ05k76K85l03j29K83l3M52l54Kj61O6R6K20j41p8J64l64
6677a99J04J05j54L5K15j91K93k36k6L17n32K19o5J44J18m26K44o1L64k50k40
6698b22P2n2O4J29j54J85K07k71J7nj25L6K79p5j30J76O3j85k59J18J21LJ84l50
6722a74N20n18L4J14l7K6j05l2K30j91M45M7l39K08pl42J90j41p8L68m42Q4j26
6745b66K80r0j43m6M26kj80j00K29k0j24j90r9M69l12M95l59p8L0K4L18k85J45
6768A22J54j81j9k64L05j41n1l5N5L77m71K94k35OK39J11l96P3r6J90P6k46J01
6791c2J88k85L83o14N3O14m41j39M39j59j96J68r7K42n8j69J32Mp3K0q3J79j40
$$ plain form
6814 -64 222 190 194 -221 142 -8 112 252 -155 61 192 215 25 -159 -11 102 314 -276 152 99 194 4
6836 4 162 294 -6 -85 -100 -185 151 -153 131 151 -31 -144 -382 183 406 274 -16 141 277 -263 142 279
6858 279 -13 132 6 -54 -99 165 -197 123 132 -12 -196 61 -282 -152 -56 -248 -162 -20 -206 31 -5 -57 -12
6881 -12 -71 -18 354 -137 -226 -76 -64 -21 39 49 -87 -302 -26 -109 -32 -161 231 -158 81 -138 380 48 34 95
6905 95 -262 -37 152 -233 -40 -110 -154 3 -105 127 96 271 6 237 139 -77 407 204 91 195 86 -136
6927 -136 -7 133 116 150 -69 93 115 1 79 -64 -148 160 87 26 -23 240 -50 -167 3 -116 -334 -108 -19
6950 -19 119 -326 184 6 81 246 -239 37 12 -21 -273 -342 -126 94 12 267 -322 -176 -187 -49 206 -8
6972 -8 401 -163 -121 -86 -19 38 -71 89 -144 93 204 189 84 -131 -36 88 42 -106 210 130 -151 251 90
$$ packed form
6814f4K86l2Mm15L63j50J20J40m07K16J31K3j90j84J48J13K12n90M28n3R5j90
6836DJ58J32l00p9j5q5L36l04K84K0j82j13k38N65K23j32k90J57J36n40M05J37
6858B79k92J45j26o0m5K64l62L20Rj44j84K57l43J30R6j92Q6J42j86K37l6n2M5
6881a2n9N3L72m91q9J50J2M3O0J0j36k15K76q3P7j29L92l89K39k19N18l32j4O1
6905I5l57K25J89l85J93p0m4J57j08K32l1J75k65K31r8k16M84k03j13J04j09k22
6927a36J29J40j7L4k19J62K2j14P8j43q4L08p3o1m9K63k90j17J70j19k18K26Q9
6950a9J38m45N10j78P5J65m85K76k5l3k52o9K16K20q2K55n89J46j1J38K55k14
6972hM09n64M2L5O7N7j09J60k33K37J11j5j05k15R5J24m6j48L16q0k81M02j61
$$ plain form
6995 90 -4 -111 130 74 50 78 195 -3 128 110 -68 317 121 -76 148 154 -76 -259 -177 -54 -32 47 -14 103
7019 103 -11 24 -252 159 256 52 7 88 -207 171 -160 30 -6 -54 438 118 -108 345 -86 191 32 -23
7041 -23 31 109 39 34 49 -161 -173 25 27 -37 -191 116 133 -195 4 192 64 285 75 -54 121 1 110 -69
7065 -69 -93 31 -163 173 -109 224 -64 -37 -180 1 -196 111 80 -30 -89 -19 -218 -10 -68 22 -87 261 -127
7088 -127 29 -90 -110 368 266 165 106 -237 75 188 -226 15 45 161 37 -110 -127 -99 32 -309 1 52
7110 52 3 3 11 151 -76 -223 73 -207 -29 -39 143 -52 72 -64 110 -4 277 232 -472 -147 48 74 75 -67
7134 -67 -93 248 -125 151 306 -44 195 -6 151 -79 -240 33 -88 -69 69 -199 -167 -194 -89 -221 -235 -100
7156 -100 -124 -50 -10 162 -114 214 112 97 63 -237 -145 7 -60 244 -94 -105 -421 100 -8 170 -101 -63 52
$$ packed form
6995I0r4j07K41n6k4K8J17j98J31j8j78L85j96j97K24Ok30j83Q2J23K2P9o1J17
7019A03j14L5k76M11R7k04m5Q1k95L78l31J90l6m8M92l20k26M53m31K77j59n5
7041b3N4P8p0nJ5k10j2J98Ko4j54L07J7l28J99J88j28K21k10j29J75j20J09j79
7065f9k4J24j94L36k82L33k88K7j43J81j97L07l1j10n9P0j99K08n8R0j09L48l88
7088a27J56j19k0M78j02j01n9l43L12J13m14K41L0J16j24j47j7K8J31l41L10N1
7110E2m9%QJ40k27j47K96k80J78j0J82j95J24j36J74j14K81m5p04L25J95K6Jj42
7134f7k6L41l73K76J55l50K39k01J57k30j61K73j21J9J38k68L2k7J05j32j4J35
7156a00k4P4M0J72k76L28j02j5l4l00R2J52o7L04l38j1l16N21j08J78k71L8J15
$$ plain form
7179 52 -161 -3 -131 5 122 311 -60 91 -19 -190 223 -102 -37 66 -115 -36 92 -39 244 2 140
7200 140 -50 20 41 -154 170 11 -60 157 91 65 227 146 -106 149 309 165 -14 -157 47 5 7 59 180
7223 180 -33 -59 -179 -76 -403 18 -42 124 -25 22 -120 107 -91 -179 -71 60 273 -23 -56 -153 -2 91
7245 91 114 -42 131 -145 78 158 92 161 -45 -122 -106 -233 281 -266 -313 -27 96 -152 -64 344 8 -24 -91 93
7269 93 77 23 51 329 55 -179 -39 103 -62 102 135 -131 58 43 -52 159 239 30 -69 -60 32 63 -147 338
7293 338 9 -117 87 -100 125 208 6 -94 207 45 -57 63 -122 12 135 64 109 67 -78 -240 127
7314 127 31 251 -222 163 -231 -42 -34 -103 -26 -57 -58 77 180 25 -95 -124 41 109 -117 -464 179 -43 217
7337 217 -234 173 -103 -176 -106 16 46 -189 -57 84 -5 -89 -90 0 389 -145 92 -133 5 107 -5 42 203
$$ packed form
7179E2k13J58j28J36J17J89l71J51j10j71M13l25O5J03j81P9J28j31K83k42J38
7200A40j90P0K1j95L24j59p1K17o6k6J62q1k52K55J60j44j79j43K04m2KN2J21
7223A80k13k6j20J03l27M21o0J66j49M7j42K27j98q8J08J31K13k96l3r7J51R3
7245I1K3j56J73k76K23Q0o6O9k06p7J6j27N14n47m7K86J23k48Q8M08l36l2o7J84
7269I3j6n4K8K78k74k34J40J42j65J64L3k66J89j5r5K11Q0k09r9RR2L1k10M85
7293C38l29j26K04j87K25Q3k02j00L01j62j02J20j85J34J23p1M5m2j45j62L67
7314A27r6K20m73L85l94J89Qo9P7l1jJ35J03j55j20k9J65O8k26l47O43k22K60
7337B17m51M07k76p3P0J22L0k35J32J41q9q4jR0L89n34K37k25J38J02j12M7J61
$$ plain form
7360 203 -124 66 -45 12 -229 89 -5 72 -48 14 26 56 80 -328 -204 -161 27 13 -191 -92 245 215 -21 8
7384 8 -181 126 -39 174 112 218 24 300 -378 179 136 -239 171 56 -44 112 53 -25 -45 -2 255 -118 7
7407 7 250 -33 238 -34 -73 194 -144 22 124 18 17 -219 -55 92 134 -168 -142 -366 57 77 -13 -139 344
7430 344 -116 77 154 -120 215 -151 -64 87 -90 -36 -35 -168 -231 313 -1 -62 138 109 -19 133 -110 -49 121
7453 121 -267 -151 197 -14 130 -154 -35 -301 302 -16 -7 106 205 50 -48 -135 2 338 -269 -25 -157 -115
7475 -115 -244 36 -240 181 164 209 148 124 -88 -17 141 157 -20 -336 -121 290 497 -177 53 248 -44 227
7497 227 -314 80 69 199 -73 2 -116 193 126 -123 -178 -127 135 166 -112 -140 131 -76 -65 -48 99 -239 -241 -125
7521 -125 -74 -94 -59 23 -151 -103 -16 -66 68 31 -283 -57 53 142 155 -83 -110 -135 69 -15 95 -263 -10 -62 -317
$$ packed form
7360B03l27J90j11N7k41L18r4P7j20O2J2L0K4m08J24M3J88j4k04R9L37l0k36K9
7384Hj89L07j65K13o2J06j94K76o78N57m3l75M10j15j00J56n9p8k0M3K57l73J25
7407GK43k83K71k72l9K67l38J66J02j06jk36J64J47M2l02K6k24M23K0r0j26M83
7430C44m60J93P7k74L35l66Q7J51j77N4Jj33o3N44l14o1K00k9j28J52k43O1J70
7453A21l88J16L48k11J44k84J19k66O03l18RJ13R9j55r8q7J37L36o07K44j32M2
7475a15j29K80k76M21j7M5o1k4k12P1J58J6j77l16K15M11K07o74K30J95k92K71
7497B27n41L94j1J30k72P5j18L09o7k49n5N1K62L1k78k8K71k07J1J7J47l38kJ16
7521a25N1k0L5Q2j74M8Q7n0J34l7l14K26J10Q9J3k38k7k5K04q4J10l58K53n2k55
$$ plain form
7546 -317 -237 -205 93 165 330 25 111 -167 21 -16 116 288 248 48 -28 -230 -568 11 -75 92 135 -120 85
7569 85 -167 -97 -59 -27 47 126 -105 -232 -58 -159 106 217 -63 -113 244 -22 122 -94 -381 -51 -29 -148 -133
7592 -133 63 -396 -176 12 -65 87 194 36 31 -356 -119 -28 218 -285 -238 -22 -75 -12 21 -176 -118 -42 48 180
7616 180 -46 246 -393 -3 -20 176 8 -146 -86 137 21 352 -125 -50 250 82 -141 156 -155 -203 50
7637 50 44 -149 -189 113 -109 -88 -68 -154 -236 -54 209 266 189 114 -9 -52 189 102 133 102 -154 123 -22 -174 -50
7662 -50 -93 74 -186 -40 241 98 146 33 -160 -248 102 -47 232 50 -57 262 -76 -78 128 34 39 114 101 -53
7686 -53 221 96 218 -75 234 -37 -61 84 -156 -103 -143 202 -60 122 -192 158 55 82 138 23 -94 -80
7708 -80 -31 -44 -4 154 -111 -139 111 -171 -174 -155 -58 259 -36 -180 29 151 96 -109 347 -91 34 -425 -60
$$ packed form
7546c17Q0L2K98P2J65l05Q6k78J88l7J32J72m0k00p6k02l38N79q6J67M3k55K05
7569H5k52P0L8L2P4P9k31j27J74j01K65J11k80n0L57k66J44k16k87L30K2j19J5
7592a33J96m59K20J88p7J52J07j58nl87K37R1K46n03M7K16n3O3L3j97N8P6R0J32
7616A80k26K92o39L90j7J96j68j54O0K23j16L31m77P5L00j68k23K97l11m8K53
7637E0oj93m0L02k22K1K0q6q2J82K63N7p7p5j23m3K41q7L1l1k56K77j45j52J24
7662e0m3J67k60J46K81j43M8j13j93q8L50j49K79j82j07L19l38kK06r4NP5j3j54
7686e3K74j25J22k93L09k71k4J45k40N3m0L45k62J82l14L50j03K7N6j15j17J4
7708h0M9j3M0J58k65k8K50k82lJ9R7L17k95j44K09J22n5k05M56m38J25m59L65
$$ plain form
7731 -60 -34 -92 83 -14 -18 153 103 11 -78 53 270 -17 55 -1 54 222 -203 -124 118 225 194 -18 345 -69 -221
7756 -221 -72 -103 -256 25 220 195 248 -70 -308 71 86 -211 -338 -233 -50 -356 -12 45 126 -33 137 133 -80
7779 -80 0 -366 129 -52 51 56 -38 -44 59 243 -21 -189 -43 -20 -84 -97 -138 45 -255 174 273 40 -3 -74 269
7804 269 -156 -346 63 -2 -143 -123 -131 60 3 27 -68 -402 294 -100 201 -40 -85 135 354 280 -16 183 -109
7827 -109 52 83 67 -161 13 -217 -51 77 -84 18 -111 -46 45 -76 101 -197 112 -130 -149 -105 -126 -197 25
7850 25 43 -140 -53 7 302 -266 -7 -103 -311 -22 -132 269 220 -235 81 139 -78 -148 -18 135 -156 -33 4
7873 4 -104 10 163 -199 -18 -61 -80 287 57 -98 78 219 352 -216 -143 -129 -2 49 -11 -91 17 -147 -217
7896 -217 -139 -4 -12 -307 -4 -10 78 -44 289 52 74 203 -92 152 -161 -137 -156 46 126 -112 -273 47 -74
$$ packed form
7731f0K6n8J75r7mJ71n0r2q9J31K17k87P2n6N5J68m25P9K42J07l1k12L63m14j52
7756b21J49l1j53K81J95k5N3l18k38L79J5k97j27J05J83l06L44N7Q1j59J70mk13
7779h0Q0l66M95j81J03Nr4oJ03J84k64j68J46K3o4j3m1J83l00M29R9k33m3p1L43
7804B69m25j90M09o5j41K0qJ91n7K4r5l34O96l94L01k41m5K20K19p4k96J99k92
7827a09J61L1j6k28J74k30J66J28j61J02j29O5R1j21J77k98L09k42j9M4k1p1K22
7850B5J8j83Q7O0K95n68K59r6k08K89j10M01m9m55L16N8k17p0J30J53k91J23L7
7873Dj08J14J53l62J81m3j9L67k30j55J76J41J33n68P3J4J27N1o0q0J08j64p0
7896b17P8J35qk95L03oQ8j22L33k37K2J29k95K44l13K4j9K02Q0k38j61L20j21
$$ plain form
7919 -74 220 -18 23 -80 41 -20 -1 -42 -63 116 -58 -15 77 78 -87 -45 177 -24 42 131 -43 -236 148 20
7943 20 -152 -204 105 -126 280 -111 -46 45 -121 287 175 16 -78 109 109 57 67 95 -369 -238 -196 402 -33 -129
7967 -129 138 52 106 229 -282 -135 52 13 204 78 -237 -83 -9 203 -45 164 -36 12 -53 186 -96 -35
7989 -35 -2 241 17 -181 78 -146 258 24 133 -24 -149 207 5 29 -79 338 62 -348 -160 140 -36
8010 -36 -28 -164 133 178 112 270 227 20 115 -40 36 101 -127 283 -32 -109 186 23 62 19 19 -63 -215 88 211
8035 211 -16 178 85 -370 219 66 -24 -69 309 253 -86 172 13 -75 -396 388 -38 -84 206 -29 -76 211
8057 211 -104 -242 120 117 -181 7 2 -183 117 -132 52 123 98 -67 -438 -188 55 -147 10 -233 -143 136
8079 136 -41 -128 -405 -145 -69 144 -155 54 -156 156 69 77 -9 -44 152 59 47 0 -91 183 -70 20 264 -28
$$ packed form
7919g4K94k38M1j03J21o1J9m1k1J79j74M3R2Jj65M2K22k01O6Q9j74j93L84j28
7943B0j72n2L09k31M06l91O5R1j66M08j12j59r4J87%n2J0K8m64J31M2N98m35r6
7967a29K67q6N4J23n11J47J87l9J91j26l15J54P4K12k48K09k00M8o5K39k82O1
7989c5L3K43k24j98K59k24M04k34J09j57j25L56k02K4j08M17k76m10J88L00j76
8010c6Qj36K97M5o6J58m3k07R5j55P6O5k28M10l15p7K95j63L9m3%q2j52L03J23
8035B11k27J94r3m55N89j53r0m5L78n6l39K58j59q8l21P84m26m6K90k35m7K87
8057B11l15j38L62lk98J88nj85L00k49J84P1k5j65l71K50K43k02J57k43R0K79
8079A36j77q7k77K60P6K13k99K09k10L12q7Qq6l5J96r3j2m7r1K74k53R0K44k92
$$ plain form
8103 -28 117 -10 -105 -106 -128 139 61 83 44 4 -53 202 59 64 -270 -183 177 162 -291 -33 77 -88 40 -2 -49
8128 -49 -102 -122 -117 -110 -39 182 -115 -213 58 8 -34 -38 209 -348 -25 7 -83 -136 -138 156 -23 -98 72 -12 463 -176 64
8155 64 206 168 -71 -81 -102 -21 134 -190 -254 143 -30 -51 154 7 227 -100 -25 -139 -238 -41 -20 164 -80
8178 -80 -16 -74 -62 49 -85 -13 169 109 227 124 -91 238 98
$$ packed form
8103b8J45j27r5jk2K67p8K2l9m0n7K55j43Nl34Q7L60j5m53K58J10j65J28m2m7
8128d9n3k0NPP1K21k97r8K71n0m2mK47n57L23L2r0n3kK94j79p5J70q4M75o39K40
8155F4J42l8k39j0k1Q1J55l24o4L97j73k1K05j47K20l27P5j14r9J97K1J84k44
8178h0O4n8J2J11j34P2J82o0J18j03k15L29j40
8191I8
$$ Imaginary data points
##PAGE= N=2
##DATA TABLE= (X++(I..I)), XYDATA
$$ plain form
0 0 0 0 0 8 -3 0 -8 8 -8 16 -16 22 -24 32 -40 48 -56 69 -80 94 -111 129 -148 172 -198 223 -256 292 -328
29 -328 369 -418 468 -524 586 -654 727 -809 897 -996 1102 -1221 1352 -1498 1656 -1838 2042
46 2042 -2270 2531 -2834 3185 -3605 4116 -4744 5551 -6619 8115 -10364 14121 -21566 42087
60 42087 -216766 -778755 -434139 154573 407173 99865 -258264 -313720 -95161 53066
70 53066 47028 -22003 -44669 -95210 -170221 -169558 -8031 144740 83493 -163369 -282751 -102668
82 -102668 186345 237694 9275 -216736 -182876 32335 173220 113670 -33934 -113271 -83670
93 -83670 -9021 57873 94284 79303 -2065 -99689 -116122 -14416 105898 107429 -22785 -143230
105 -143230 -120687 16919 117184 79063 -48601 -134394 -101548 6061 79184 49538 -46898
$$ packed form
0@%%%Qj1LqJ6j6K4l2L8m6N6p2Q8j04J25j49J74k05K40k77L20l70M21m79N48o20
29c28O97p87Q86r92J110j240J381j536J706j893K098k323K573k850L154l494L880
46B042m312M801n365O019o790P721q860J0295j2170J4734j8479K4485l5687O3653
60D2087k58853n61989L44616N88712K52600l07308l58129n5456K18559J48227
70E3066o038o9031k2666n0541p5011O63J61527J52771o1247k46862j19382J80083
82a02668K89013N1349k28419k26011L3860K15211J40885n9550j47604p9337K9601
93h3670P4649O6894L6411j4981q1368r7624j6433J01706J20314J531j30214j20445
105a43230K2543J37606J00265l8121j27664q5793L2846J07609P3123k9646r6436
$$ plain form
116 -46898 -111119 -84189 2244 67595 63853 5992 -58080 -82682 -45127 31261 82964 55266
128 55266 -34886 -101714 -70545 36396 113126 77057 -36666 -105622 -56315 51912 99668
139 99668 43361 -48331 -84382 -42992 29661 73928 57986 -10275 -78635 -82845 -9820 74958
151 74958 83712 2018 -90922 -100450 -17743 70572 76217 867 -74296 -81489 -24103 40505 61891
164 61891 23531 -46698 -89709 -57274 32331 89735 48516 -52309 -103261 -46706 53088 89680
176 89680 29989 -53374 -75763 -25630 36886 57449 32533 -7789 -37584 -43380 -14389 39077
188 39077 71326 37422 -41378 -83328 -33276 61290 98071 33739 -65060 -93937 -22649 72315
200 72315 92203 18036 -69067 -79172 -9043 61135 63332 6000 -46165 -48999 -12099 25205
$$ packed form
116d6898o4221K6930Q6433O5351l742n7861o4072k4602L7555P6388N1703k7698
128E5266r0152o6828L1169J06941P6730l6069j13723o8956M9307J08227M7756
139I9668n6307r1692l6051M1390P2653M4267j5942o8261o8360m210P3025Q4778
151G4958Q754q1694r2940r528Q2707Q8315N645p5350p5163p193N7386O4608K1386
164F1891l8360p0229m3011L2435Q9605N7404m1219j00825n0952N6555R9794L6592
176H9680n9691q3363k2389N0133O2516K0563k4916m0322k9795n796K8991N3466
188C9077L2249l3904p8800m1950N0052R4566L6781o4332r8799k8877P1288R4964
200G2315J9888p4167q7103j0105P0129P0178K197n7332n2165k834L6900L7304
$$ plain form
212 25205 36897 21142 -9114 -37035 -42564 -11103 39534 60255 16039 -55759 -74241 -8598
224 -8598 70067 70295 -6930 -72271 -53941 17726 60395 37922 -11034 -34717 -25209 -3938 15287
237 15287 30976 32873 1512 -45330 -52063 5924 71900 62053 -22285 -84025 -47406 44601 83812
250 83812 29127 -49651 -65083 -11459 42408 43403 4706 -24690 -24197 -9998 858 11146 22338
263 22338 17136 -13259 -41144 -28559 20652 52739 27956 -30939 -60285 -26536 36616 61880
275 61880 21151 -41760 -59353 -12938 44947 52581 7125 -37045 -37253 -2883 27138 29459 11169
288 11169 -9357 -21484 -19989 -2540 24411 37006 14552 -28809 -47081 -10562 44409 52542
300 52542 475 -51444 -43074 11941 48232 30026 -14837 -36554 -21296 6926 22358 17487
$$ packed form
212B5205J1692j5755l0256k7921n529L1461N0637K0721m4216p1798j8482O5643
224h598P8665K28p7225o5341J8330P1667M2669k2473m8956k3683R508K1271J9225
237A5287J5689J897l1361m6842o733N7987O5976r847q4338o1740L6619R2007L9211
250H3812n4685p8778j5432N3624N3867R95l8697k9396M93J4199J0856J0288J1192
263B2338n202l0395k7885J2585M9211L2087k4783n8895k9346L3749O3152K5264
275F1880m0729o2911j7593M6415N7885P634m5456m4170k08L4370L0021K321j8290
288A1169k0526j2127J495J7449K6951J2595k2454m3361j8272L6519N4971Q133
300E2542n2067n1919Q370N5015L6291j8206m4863k1717J5258K8222J5432m871
$$ plain form
312 17487 2227 -13828 -22835 -16094 6706 27287 21806 -10025 -36574 -25185 12594 35658 21571
325 21571 -12462 -32015 -21762 7563 31247 27943 -2160 -31237 -29416 4696 36925 32128 -3736
338 -3736 -33133 -25894 8379 33495 25013 -4476 -23888 -18271 2052 17852 20598 9505 -11532
351 -11532 -25932 -14780 16036 33740 14389 -21930 -33886 -9221 22025 26570 3944 -18095
363 -18095 -19691 -5994 7809 12028 8210 -1022 -13038 -19048 -8721 14838 26660 8817 -23825
376 -23825 -32721 -6343 26879 30997 3100 -25971 -27619 -1456 25945 28889 3832 -24323 -25499
389 -25499 1891 27901 24808 -2940 -22357 -14967 6933 18132 10399 -2682 -5102 -2117 -3142
402 -3142 -5846 2261 17204 14991 -10958 -30888 -13811 24200 34889 2473 -34169 -30825 6641
$$ packed form
312A7487j5260j6055r007O741K2800K0581n481l1831k6549J1389L7779K3064j4087
325B1571l4033j9553J0253K9325K3684l304l0103k9077J821L4112L2229m797l5864
338c736k9397P239L4273K5116q482k9489j9412N617K0323J5800K746j1093k1037
351a1532j4400J1152L0816J7704j9351l6319j1956K4665L1246M545k2626k2039
363a8095j596J3697J3803M219l818r232j2016o010J0327K3559J1822j7843l2642
376b3825q896K6378L3222M118k7897k9071j648K6163K7401K944k5057k8155j176
389b5499K7390K6010l093k7748j9417P390K1900J1199p733j3081k420K985j025
402c142k704Q107J4943k213k5949j9930J7077L8011J0689l2416l6642L344L7466
$$ plain form
415 6641 32098 18292 -13678 -26473 -10916 9324 12985 4462 -2812 -5244 -9020 -10956 138
428 138 16404 16590 -5702 -25423 -16091 12769 26787 10654 -14734 -22229 -6009 14237 18888
441 18888 5857 -9191 -13199 -4594 6905 12092 7960 -976 -8865 -8993 -131 9700 11370 3034
455 3034 -7399 -12343 -7100 6146 16117 10366 -9089 -22211 -11395 13638 23214 5205 -18984
468 -18984 -20800 -1031 15424 12034 -3069 -11331 -7347 -97 2219 2641 5153 3879 -6433 -15784
482 -15784 -6881 13725 20669 1503 -21622 -18455 6947 23498 12336 -10048 -16985 -4334 10198
495 10198 11372 2431 -3468 -2945 -602 -740 1002 6450 8198 572 -9235 -9416 1999 12301 9553
510 9553 -2263 -11813 -10508 314 11748 12875 -388 -16530 -16148 2112 18322 13068 -8262
$$ packed form
415F641K5457j3806l1970j2795J5557K0240L661q523p274k432l776j936J1094
428A38J6266J86k2292j9721R332K8860J4018j6133k5388p495J6220K0246M651
441A8888j3031j5048m008Q605J1499N187m132q936p889j28Q862R831J670q336
455C034j0433m944N243J3246R971n751j9455j3122J0816K5033R576j8009k4189
468a8984j816J9769J6455l390j5103q262L984P250K316M22K512j274j0312r351
482a5784Q903K0606O944j9166k3125L167K5402J6551j1162k2384o937J2651J4532
495A0198J174q941n899N23K343j38J742N448J748p626r807j81J1415J0302k748
510I553j1816r550J305J0822J1434J127j3263j6142L82J8260J6210n254k1330
$$ plain form
523 -8262 -20125 -10395 9413 15980 3948 -11443 -12285 -426 6828 4044 -909 -611 345 -3286 -5978
538 -5978 587 9265 8265 -3142 -10947 -5304 6380 10820 4550 -4098 -7099 -4004 2337 7426 7606
553 7606 1461 -7202 -9663 -1275 11133 12789 93 -13752 -11852 4247 14074 7502 -6004 -10917
567 -10917 -4959 2946 6088 4699 -295 -6353 -7815 -1768 6028 7984 125 -8329 -8237 483 6723
582 6723 4979 -2358 -4741 -1293 1092 -985 -511 4895 6576 -1662 -10679 -5571 9267 14875 1683
597 1683 -12924 -11333 4486 14894 8193 -5602 -10197 -2321 6522 7181 1520 -1936 -1979 -1848 -2000
612 -2000 1632 6257 5554 -2936 -8676 -3594 5417 7705 1696 -4947 -6157 -2610 1881 5233 3796
627 3796 -2259 -7535 -5603 1710 7712 4174 -4532 -8535 -3234 5145 5915 -729 -4620 -2004 2494
$$ packed form
523h262j1863R730J9808O567j2032j5391q42J1859P254k784m953K98R56l631k692
538e978O565Q678j000j1407p805N643J1684M440o270q648l001L095O341N089J80
553G606o145q663k461Q388J2408J656j2696j3845J900J6099R827o572j3506m913
567a0917N958P905L142j389m994o058j462O047P796J956p859q454R2Q720O240
582F723j744p337k383L448K385k077M74N406J681q238r017N108J4838N608j3192
597A683j4607J591J5819J0408o701j3795m595P876Q843O59n661l456m3J31j52
612b000L632M625p03q490n740N082R011K288o009o643j210L547M491L352j437
627C796o055n276J932P313O002l538q706m003N301Q379P70o644l891K616M498
$$ plain form
642 2494 646 -2940 744 6833 4028 -6346 -9289 1276 12693 9419 -5479 -12413 -3272 9799
656 9799 11633 582 -8716 -6012 2517 6827 3039 -1206 -1868 -1637 -2244 -387 4405 5209 -1338 -7818
672 -7818 -4620 4109 6929 78 -5529 -3862 1338 2265 -793 -1904 1054 1954 -1545 -4964 -2587 3995
688 3995 6187 -541 -7959 -5389 3046 7493 3022 -3634 -5113 -1999 1554 4653 4854 506 -5888
703 -5888 -6332 2308 9675 6247 -4524 -9326 -1843 8671 8140 -1230 -8046 -3246 5025 5718 -1570
718 -1570 -4768 458 5349 1017 -5697 -4096 4494 7154 -522 -7605 -5170 3345 6297 1719 -3764
733 -3764 -4746 -1458 1630 2864 2043 -660 -3355 -3980 -350 4774 4958 -1644 -7386 -4470 4559 7308
749 7308 667 -5855 -3953 2246 3812 435 -1817 862 1891 -1085 -2565 472 4642 3965 -1759
$$ packed form
642B494j848l586L684O089k805j0374k943J0565J1417l274j4898o934R141J3071
656I799J834j1051r298K704Q529M310l788m245o62K31o07J857M792Q04o547o480
672g818L198Q729K820o851n607J667N200R27l058j111K958R00l499l419K377O582
688C995K192o728p418K570Q435M447m471o656j479L114L553L099K01m348o394
703e888m44Q640P367l428j0771m802P483J0514n31r370o816M800Q271O93p288
718a570l198N226M891m332o714J601Q590K660p676p083K435Q515K952m578n483
733c764r82L288L088J234q21k703k695o25L630N124J84o602n742K916R029K749
749G308o641o522J902O199J566l377k252K679J029k976j480L037M170o77n724
$$ plain form
764 -1759 -5079 -1273 4510 4815 -968 -4489 -1901 2675 2074 -1096 -729 1531 587 -3297 -3336 2158 4985
781 4985 441 -5259 -4967 904 4676 1889 -3067 -3681 -785 1235 583 -15 510 118 -2073 -3416 223
798 223 4968 3647 -3444 -6625 -779 6233 5081 -2287 -5194 -1323 3375 3000 -348 -1436 26 806
814 806 -396 -651 1001 2378 544 -1945 -1832 968 2845 770 -1597 -996 1193 234 -2073 -609
830 -609 3229 2505 -3453 -6739 -890 6698 4886 -4344 -8639 -2394 6233 6321 -1405 -7262 -3797 3186
846 3186 5132 116 -3593 -2170 1191 1314 -138 35 936 244 -1157 -542 1628 1856 -980 -1335 1112
863 1112 1931 -353 -2498 -381 3762 3487 -1709 -4759 -1394 5042 5769 -1146 -6781 -3098 4902 6277
879 6277 -188 -5759 -2984 1837 3301 503 -1841 -1511 -608 -644 92 1404 990 -1788 -2894 -746 2034
$$ packed form
764a759l320L806N783L05n783l521K588M576o01l170L67K260r44l884l9N494K827
781D985m544n700K92N871L772k787m956o14K896K020o52n98N25l92k191j343L639
798B23M745j321p091l181N846P012j152p368k907L871M698l75l348j088J462P80
814H06j202k55J652J377j834k489J13K800J877k075k367O01K189r59k307J464
830f09L838p24n958l286N849P588j812r230m295O245Q627Q8p726n857L465O983
846C186J946n016l709J423L361J23j452J73R01o92j401O15K170K28k836l55K447
863A112Q19k284k145K117M143k75n196l050L365O436P27o915n635L683Q000J375
879F277o465n571K775M821J464k798k344L30R03l6P36J312m14k778j106K148K780
$$ plain form
896 2034 2165 -1373 -3116 -800 2297 1477 -1815 -2508 1478 3298 50 -3837 -1900 3919 4592 -819
912 -819 -4806 -1501 3722 4048 -453 -3030 -1256 1824 2036 97 -791 524 888 -682 -1362 1522 2836
929 2836 531 -3305 -2979 1709 4148 466 -3193 -2430 1267 2076 -476 -1717 -100 711 -831 -1926
945 -1926 -402 1866 1246 -1955 -3242 -671 2595 2082 -1790 -3279 159 2674 700 -2250 -1734 1572
961 1572 2470 -870 -2807 60 3687 1861 -1879 -2361 256 2892 1879 -586 -1830 -723 600 976
977 976 523 441 -359 -1856 -1653 1195 3540 1216 -3420 -3906 1262 4923 1702 -4137 -4458 1383 4435
994 4435 878 -3661 -2866 1470 3420 -220 -3559 -2007 2086 2783 -467 -3058 -1750 1348 2607 -25
1010 -25 -1669 -592 69 214 764 1565 487 -2141 -2299 1245 4528 1954 -3127 -3828 1106 5242 2716
$$ packed form
896B034J31l538j743K316L097q20l292o93L986J820l248l887J937N819O73n411
912h19l987L305N223L26m501k577J774L080K12j939q88J315L64j570o80K884J314
929B836k305l836L26M688K439l682l659P63L697Q09k552j241J617Q11j542j095
945a926J524K268o20l201j287K571L266n13l872j489L438K515j974k950N16L306
961A572Q98l340j937K867L627j826l740m82K617K636j013k465j244J107J323L76
977I76m53q2q00j497K03K848K345k324m636m86N168L661l221n839l21N841L052
994D435l557m539P95M336J950l640l339J552M093O97l250k591J308L098J259k632
1010b5j644J077O61J45N50Q01j078k628j58L544L283k574n081p01M934M136k526
$$ plain form
1027 2716 -2515 -3933 96 4143 2925 -2196 -3685 227 3129 1067 -2382 -1810 1023 1491 -429
1042 -429 -1671 -625 330 79 -634 7 254 -709 -1491 -44 2085 844 -2149 -3086 -57 3256 2219
1059 2219 -2065 -4131 -572 3663 2841 -2229 -4023 -154 3169 2057 -1712 -1832 948 1897 139 -1223
1075 -1223 -87 1630 776 -1336 -1144 1052 1775 183 -1403 -984 992 1297 -614 -1396 21 1504
1091 1504 281 -2033 -1599 1769 1803 -1038 -3013 -824 2083 1071 -1472 -2008 14 1278 -109 -1259
1107 -1259 -723 1089 768 -1296 -1884 327 2955 757 -2357 -2774 1165 3187 970 -2213 -2416 1073
1123 1073 2664 736 -1436 -494 652 696 -200 -178 651 244 -612 -764 993 1441 -266 -1826 -1015 1706
1141 1706 2042 -995 -2566 -688 2819 2250 -2645 -3544 234 3691 1826 -2820 -3528 457 3020 1652
$$ packed form
1027B716n231j418M029M047j218n121j489L912K902k062l449N72K833M68j920
1042d29j242J046R55k51p13O41K47r63p82J447K129j241k993r37L029L313j037
1059B219m284k066L559M235q22n070j794L869L323j112l769j20K780R49j758j362
1075a223J136J717q54k112J92K196P23j592j586M19J976L05j911p82J417J483
1091A504j223k314M34L368L4k841j975K189K907j012k543n36K022J264j387j150
1107a259N36J812l21k064n88K211K628k198l114m17L939K022k217l183k03L489
1123A073J591j928k172R42J146M4q96K2Q29m07q56j52J757M48j707j560Q11K721
1141A706L36l037j571J878L507n69m895q99L778L457j865m646p08L985K563j368
$$ plain form
1157 1652 -1815 -2738 -260 1768 1306 -487 -1259 -289 358 330 423 529 -27 -1459 -959 1381 2375 33
1175 33 -2765 -984 2729 3057 -715 -3292 -585 3207 2774 -1134 -3513 -706 3035 2665 -1186 -3291
1191 -3291 -954 2373 2186 -948 -2556 -808 1441 811 -370 -768 -461 -415 -269 655 1422 -341 -2300
1208 -2300 -1325 1113 2285 134 -2522 -1931 1329 2296 235 -2360 -1245 1773 2462 -202 -2333 -820
1224 -820 2082 1758 -1252 -1579 484 1856 978 -1218 -610 892 843 -517 -558 750 893 -522 -1513 -471
1242 -471 1682 1037 -713 -2082 -245 2032 1574 -1082 -2045 268 1956 342 -1904 -1298 1051 1274
1258 1274 -984 -1607 290 1625 312 -1911 -1309 640 1796 -103 -1971 -984 1148 1716 -654 -1828
1274 -1828 -353 1855 1502 -889 -1600 734 1585 391 -1226 -567 727 507 -303 -396 566 374 -396 -474
$$ packed form
1157A652l467r23K478K028m62j793p72R70O47k8R3J06n56j432N00K340R94k342
1175C3k798J781L713L28l772k577K707L792m33l908k379K807L741l70l851k105
1191c291K337L327j87l134j608J748K249o30j181l98L07M6J46R24P67j763j959
1208b300R75K438J172k151k656N91L260R67k061k595J115L018O89k664k131J513
1224h20K902l24l010l27K063J372q78k196O08J502m9j360m1J308J43j415r91J042
1242d71K153o45j750j369J837K277m58k656r63K313J688j614k246O06K349K23
1258A274k258o23J897J335j313k223O02J949J156j899j868R87K132N68k370j174
1274a828J475K208l53k391p11K334Q51j194j617O59J294k20q10r3R62j92p70p8
$$ plain form
1292 -474 475 1182 85 -1796 -1191 1392 2152 20 -2787 -1689 2147 3266 -378 -3250 -1827 2295
1308 2295 2798 -438 -2982 -940 1737 1582 -557 -1910 -582 1158 775 -336 -770 -285 115 -195 61
1325 61 405 411 -668 -1143 512 1572 726 -1856 -1869 1527 2932 496 -2797 -2200 1874 3018 361 -2535
1343 -2535 -1532 1083 2582 488 -1842 -1164 798 1562 178 -947 -593 388 -4 -292 129 557 -86
1360 -86 -1565 -372 1280 1195 -1331 -1885 -51 2438 1219 -2108 -2214 452 2685 931 -2304 -2696 312
1377 312 2606 911 -1686 -1618 1026 2102 372 -1424 -684 1065 989 -616 -647 414 829 -564 -652 357
1395 357 1162 524 -1407 -780 581 1542 -72 -1272 -689 1459 1291 -943 -1563 -293 1451 979 -1347
1412 -1347 -1659 737 1713 -83 -1845 -727 1367 1061 -1261 -1479 676 1381 141 -1634 -1266 1196
$$ packed form
1292d74R49P07j097j881O05K583P60k132k807J098L836J119l644k872J423M122
1308B295N03l236k544K042K677j55k139j353J328J740l83j111m34M85M00l10K56
1325F1L44Oj079m75J655J060q46k582j3L396J405k436l293N97M074J144k657k896
1343b535J003K615J499k094k330O78J962P64j384j125L54R81l92k88M21M28o43
1360h6j479J193J652q5k526n54J834K489j219l327j06K666K233j754l235l92L008
1377C12K294j695k597O8K644J076j730j796P40J749p6j605l1J061M15j393q8J009
1395C57Q05o38j931O27J361R61j614j200N83K148j68k234o20J270J744m72k326
1412a347l12K396R76j796j762J118K094l06k322k18K155P05j240j775L68K462
$$ plain form
1428 1196 1655 -113 -2045 -1028 1362 1866 -348 -1545 -649 1582 958 -905 -1219 288 890 20 -908
1445 -908 80 631 -45 -961 -182 960 1019 -598 -1362 -63 1883 1001 -1471 -1763 451 2188 991 -1657
1463 -1657 -1761 931 2192 413 -2107 -1604 745 1390 -146 -1026 -697 338 135 158 162 138 48 -640 -110
1482 -110 850 1041 -747 -1771 -467 1823 1621 -959 -2679 -363 2607 2107 -1378 -2863 198 2729
1498 2729 1338 -1542 -2107 27 2321 1142 -1153 -1761 360 1517 496 -609 -913 -113 232 -172
1514 -172 29 377 264 -1020 -792 946 1423 -247 -2117 -989 1799 1644 -755 -2253 -870 1737 1579
1531 1579 -660 -2074 -413 1898 942 -741 -1791 -179 1455 681 -1170 -722 693 1165 -365 -594
1547 -594 279 1041 -160 -950 -88 1099 844 -852 -1093 449 1524 355 -1107 -1487 677 1560 35
$$ packed form
1428A196M59j768j932J017K390N04k214j197Q96K231o24j863l14J507O02q70r28
1445i08R88N51o76r16P79J142N9j617p64J299J946q82k472k92K214J737j197k648
1463a657j04K692J261j779k520N03K349O45j536q80L29J035k03K3Mk4r0o88N30
1482a10R60J91j788j024J304K290k02k580j720K316K970n00l485j485L061K531
1498B729j391k880n65K134K294j179k295o08K121J157j021j105l04Q00L45m04
1514a72K01L48j13j284K28J738M77j670j870J128K788j55k399j498J383K607j58
1531A579k239j414J661K311r56j683j050J612J634p74j851M48J415M72j530k29
1547e94Q73P62j201p90Q62J187k55j696k41J542J075j169j462l80K164Q83j525
$$ plain form
1564 35 -1473 -1129 817 1349 -291 -1335 -624 917 625 -1120 -921 731 669 -352 -1493 -295 1063
1581 1063 1048 -731 -1151 -24 1028 559 -1004 -959 696 1423 8 -978 -816 748 675 -719 -890 427
1599 427 942 329 -424 61 964 172 -837 -800 609 1353 -258 -1461 -1038 1184 1402 -433 -2176 -683
1617 -683 1603 1402 -614 -2168 -334 1237 1172 -569 -1423 25 1088 531 -572 -528 -13 -84 27 26 245
1636 245 163 -714 -603 694 1097 15 -1451 -700 892 1507 283 -2128 -1247 1437 2101 -225 -2116
1653 -2116 -1204 1681 1396 -243 -1794 -637 943 747 44 -1316 -432 613 499 -379 -199 17 22 -422
1671 -422 -208 473 445 -466 -1338 296 1333 691 -1161 -1569 549 1733 628 -1173 -1475 895 1836 158
1689 158 -1546 -827 694 1401 209 -903 -475 645 723 -304 -354 -218 774 196 -519 26 572 171 -923
$$ packed form
1564C5j508L44J946N32j640j044P11J541k92j745J99J652o2j021j141J198J358
1581A063j5j779m20J127J052m69j563M5J655P27j415r86J62J564p3j394j71J317
1599D27N15o13p53M85R03p92j009L7J409P44j611j203M23K222K18j835j743J493
1617f83K286k01k016j554J834J571o5j741q54J448J063n57j103M4N15p1J11jK19
1636B45q2q77J11J297M03j082j466P51J592O15j224k411Q81K684O64k326j891
1653b116R12K885k85j639j551J157J580j96p03j360Q84J045j14q78J80K16Nm44
1671d22K14O81k8r11q72J634J037o42j852m08K118J184j105j801l02K370R41j678
1689A58j704P19J521P07j192j112M28J120P8j027n0J36R92n78p15N45N46m01j094
$$ plain form
1708 -923 -274 828 400 -475 -1449 44 1224 491 -640 -995 -210 1011 813 -1049 -823 633 1145 -119
1726 -119 -1056 -401 835 381 -584 -987 115 1048 58 -1116 -576 833 1092 -534 -944 -241 1079 798
1744 798 -574 -873 6 1036 257 -457 -760 -59 725 42 -757 -112 819 149 -683 -460 868 890 -491
1763 -491 -951 221 1327 344 -1170 -879 475 1394 287 -1243 -896 575 1201 71 -951 -727 859
1780 859 1406 -247 -932 -260 548 581 -237 -135 16 257 -307 -228 187 407 -173 -857 185 945 580 -920
1800 -920 -1326 262 1319 721 -1227 -1535 381 1891 748 -1356 -1203 447 1755 488 -988 -690
1816 -690 353 869 252 -517 -391 294 81 -224 -45 273 -112 -357 -313 486 634 -202 -1119 -751 1030 794
1836 794 -931 -1675 -183 1630 746 -890 -1325 -133 1463 458 -701 -859 256 906 178 -731 -578
$$ packed form
1708i23O49J102m28q75r74J493J180p33j131l55P85J221j98j862K26J456N12j264
1726a19r37O55J236m54r65m03J102R33r90j174N40J409K59j626m10P03J320k81
1744G98j372k99Q79J030p79p14l03P01P84o83p99O45R31o70q32K23J328K2j381
1763d91m60J172J106r83j514K91J354R19j107j530L47J471O26j130j022K24J586
1780H59N47j653o85O72Q08L3q18J02J51K41n64P9M15K20n80o84J042P60l65j500
1800i20m06J588J057n98j948l08J916J510j143k104J53J650J308j267j476K98
1816f90J043N16o17p69J26O85k13l05J79L18l85k45M4P99J48q36r17L68J781k36
1836G94j725p44J492J813q84j636m35J192J596j005j159j58J115O50p28r09J53
$$ plain form
1853 -578 388 601 43 -342 28 341 103 -315 -212 665 495 -359 -845 754 1075 65 -957 -457 565
1872 565 925 -56 -1028 -144 565 856 -299 -776 60 669 656 -253 -798 216 821 -172 -1054 -401 675
1891 675 399 -399 -696 417 625 -94 -786 -562 761 605 -188 -945 -90 686 384 -375 -616 244 218 22
1911 22 -456 -303 580 647 -432 -482 561 879 -138 -969 -518 1097 641 -622 -1204 37 1263 579 -975
1930 -975 -1106 116 1159 367 -798 -1040 278 629 326 -655 -261 393 298 -58 -348 133 297 -148 -307
1949 -307 450 865 -139 -1077 -320 866 1291 -553 -1263 -183 687 984 -284 -1169 -538 1010 1059 -369
1967 -369 -1298 -145 1075 520 -260 -732 197 683 130 -298 48 72 96 -101 -28 293 186 -224 -296 -26 713
1988 713 107 -1305 -924 438 1239 150 -1206 -778 699 1241 -148 -1081 -359 966 443 -250 -795 -177
$$ packed form
1853e78R66K13n58l85L70L13k38m18J03Q77j70q54m86J599L21j010j022N00J022
1872E65L60r81r72Q84P09K91j155m77Q36O09j3r09n45J014O05r93q82O53J076
1891F75k76p98k97J113K08p19o92K24J323j56p93p57Q55P76l02p59k41Q60k6j96
1911B2m78J53Q83O7j079n0J043L18j017q31M51J615m56j263n82J241J226o84j554
1930i75j31J222J043p92j165k42J318L51l03r81L94O54r5l56k90M81J64m45j59
1949c07P57M15j004r38P57J186M25j844p10J080Q70K97j268q85O31J548M9j428
1967c69r29J153J220n55p80m72R29M86n53m28L46K4K4j97P3L21j07m10p2K70P39
1988G13o06j412L81J362Q01j089j356M28J477N42j389r33P22J325n23o93n45O18
$$ plain form
2006 -177 680 206 -486 -484 199 251 -67 -277 164 -19 -481 -633 -246 529 446 -460 -882 89 1228 508 -619
2027 -619 -759 347 973 55 -1038 -640 596 972 35 -731 -273 599 571 -214 -640 307 799 74 -557
2046 -557 -189 44 472 -279 -354 -186 748 335 -582 -334 290 662 -24 -746 -238 563 285 -38 -208 61
2066 61 623 28 -535 -100 244 635 -119 -535 25 729 376 -776 -318 700 918 -119 -867 -560 773
2085 773 869 -112 -842 -173 620 631 -119 -363 -191 670 363 -3 -343 66 321 -225 -349 40 551 -79 -463
2106 -463 -473 382 217 -636 -469 272 1029 211 -886 -643 430 768 386 -907 -658 323 868 213 -1011
2125 -1011 -346 756 645 -250 -524 -162 404 -125 -37 131 227 208 -365 -76 596 611 -389 -531 8 874
2145 874 627 -448 -936 -324 924 545 -455 -954 -6 1023 596 -1069 -1045 558 996 151 -678 -727 63
$$ packed form
2006a77Q57m74o92KO83N2l18k10M41j83m62j52L87P75q3r06m22R71J139p20j127
2027f19j40J106O26r18j093L98J236L76r37p66M58Q72k8p85m26R47M92p25o31
2046e57L68K33M28p51p5J68R34m13r17K48O24L72o86p22N08Q01k78l23j70K69
2066F1N62n95n63M35L44L91p54m16N60P04l53j152M58J018K18j037p48L07J333
2085G73R6r81p30O69P93J1p50k44J72Q61l07l66l40M09K55n46j24L89N11o30l84
2106d63j0Q55j65q53J67P41P57q18j097K43J073L38l82j293K49R81N45o55j224
2125a011O65J102j11q95k74L62N66n29Q8J68R6j9n73K89O72J5j000j42N39Q66
2145H74k47j075m88O12J248l79j000m99R48J029m27j665K4J603M38q45q29m9P90
$$ plain form
2164 63 236 66 -219 270 130 24 -403 -20 100 -261 -253 -482 282 743 -272 -753 -460 477 558 -412 -750
2185 -750 -9 935 397 -446 -949 278 533 141 -386 -106 192 262 -309 -415 -329 482 782 -324 -352 335
2205 335 900 -62 -964 -264 639 707 -493 -688 143 568 487 -405 -565 -236 366 29 -358 -272 301 404 -76
2226 -76 -189 13 529 74 -394 -56 404 382 -389 -583 -82 545 417 -828 -262 85 659 -24 -838 -147
2246 -147 252 645 74 -577 -95 524 392 -185 -93 351 200 -88 -593 149 441 15 -562 -632 671 719 -331
2267 -331 -984 -184 1077 634 -265 -1251 -196 735 449 -255 -1066 255 696 452 -198 -406 -4 658 565
2286 565 -365 -255 -39 357 -212 -293 253 45 -392 111 423 754 -74 -618 -72 638 498 -263 -863 -181
2306 -181 753 693 -453 -944 48 945 536 -253 -910 220 662 97 -602 -199 194 387 -120 -221 64 299
$$ packed form
2164F3J73j70k85M89j40j06m27L83J20l61Qk29P64M61j015m81K93R37Q1r70l38
2185g50P41R44n38q43n03J227K55l92n27K80K98P0n71j06Q6Q11L00j106k8O87
2205C35N65r62r02P00R03O8j200j95Q31M25q1q92j60L29O02l37l87Q6N73J03m80
2226g6j13K02N16m55m68L38M60k2p71j94N01O27j28j245N66L47N74o83q14O91
2246a47L99L93n71o51M82O19j32n77R2M44j51k88n05P42K92m26n77p0J303M8j050
2267c31o53Q00J261m43q99r86J055R31k86p04q11J321M41k44o50k08M02O62r3
2286E65r30J10K16L96n69q1N46k08m37N03L12L31q28n44N46P10j40p61o00O82
2306a81R34o0j146m91R92Q97m09p89o57J130M42n65o99M03L93J93n07j01K85K35
$$ plain form
2326 299 113 -489 -289 243 436 -269 -833 -209 297 485 -535 -719 226 802 124 -618 -343 408 697 20
2346 20 -733 -243 194 469 75 -75 54 69 74 -15 -133 225 370 -179 -112 -51 477 -230 -335 -142 404 495 -363
2369 -363 -603 1 646 192 -382 -414 206 434 -34 -307 -190 555 383 -203 -515 -35 761 358 -172 -659
2389 -659 128 830 -35 -716 -141 111 713 -99 -628 -227 528 469 -120 -715 168 275 309 -193 -252 -211 308
2410 308 461 -351 -25 -178 86 -92 132 152 -26 -348 -496 450 482 -53 -685 -376 702 583 -582 -1047
2430 -1047 -197 800 244 -633 -764 -103 634 372 -391 -406 310 653 28 -288 -347 401 385 63 -82 197 238
2451 238 -92 -74 17 396 402 -367 -527 -106 307 377 -475 -341 217 633 186 -225 -565 305 284 239 -296 -93
2473 -93 54 234 -452 -124 -45 -369 -139 225 352 316 -359 -389 128 623 280 -188 -588 -5 650 314 -394
$$ packed form
2326B99j86o02K00N32J93p05n64O24N06J88j020j84R45N76o78p42K75P51K89o77
2346B0p53M90M37K75l94j50J29J5Nq9j18L58J45n49O7O1N28p07j05J93N46R1q58
2369c63k40O04O45m54n74l2O20K28m68k73J17P45j72n86l12M80P96m03n30m87
2389f59P87P02q65o81N75K52O02q12n29M01P55n9n89n95Q83J07L4n02n9M1N19
2410C08J53q12L26j53K64j78K24K0j78l22j48R46L2n35o32L09J078j19j165m65
2430a047Q50R97n56q77j31O61P37k62p63j5P16L43o25l16n9P48j6l22j45K79M1
2451B38l30J8R1L79Op69j60M21M13P0q52J34N58M16m47m11l40Q70k1m5n35K03
2473i3J47J80o86L28P9l24K30L64J27l6o75l0N17M95l43m68m00N83O55l36p08
$$ plain form
2494 -394 -763 53 591 138 -547 -772 115 672 200 -837 -409 502 585 -18 -589 -332 465 454 -360 -316 -109
2515 -109 75 205 -513 -136 281 320 -97 -367 -210 126 350 -410 -354 58 400 135 -83 -3 73 57 -131 6
2537 6 195 18 -447 -161 -170 340 12 -182 88 348 397 -322 -197 -195 508 519 -3 -608 -229 606 484 -553
2559 -553 -696 -115 392 404 -554 -159 -110 448 16 -502 -174 115 235 -216 -399 82 354 39 -551 -80 502
2580 502 -115 105 -495 -239 423 300 -170 -260 -268 368 107 -262 -265 -25 225 -184 207 31 -298 -285 -239 -13
2602 -13 282 -330 -474 -166 333 252 -43 -376 43 647 694 -257 -485 -102 584 484 -266 -823 -8 650 175
2623 175 -556 -969 -35 745 50 -431 -248 290 445 -175 140 -356 48 377 -57 -75 -221 188 140 -470 125
2644 125 580 174 -222 -250 228 459 102 -214 -97 332 223 -156 -172 26 590 -6 -400 -115 -30 -97 -211
$$ packed form
2494c94l69Q16N38m53o85k25Q87N57m72j037M28R11Q3o03n71K57P97j1q14M4K07
2515a09J84J30p18L77M17L9m17k70J57L36K24p60N6M12L42k65k18Q0P6j6j88J37
2537FJ89j77m65K86rN10l28j94K70K60M9p19J25KP03J1n22o05L79Q35j22j037
2559e53j43N81N07J2r58L95M9N58m32n18L28K89J20m51j83M81K72l15n90M71N82
2580E02o17K20o00K56O62j23m70r0qO36k61l69lK40K50m09L91j76l29J3M6K26
2602a3K95o12j44L08M99q1k95l33M19O04M7r51k28L83O86j00p50n57Q15O58m75
2623A75p31m13R34P80o95m81J83N38J55o20L15m96M04L29m34j8j46M09m8o10N95
2644A25M55m06l96k8M78K31l57l16J17M29j09l79j6J98N64n96l94K85Q5o7j14
$$ plain form
2665 -211 -394 480 377 180 -291 -14 653 360 -5 -398 -289 520 478 -141 -435 127 225 248 -351 -463 -104
2686 -104 403 208 -644 -606 143 285 -156 -342 -64 144 123 -37 -477 102 338 -22 -359 -199 106 95 91 -130
2708 -130 -38 204 259 -229 -97 -169 69 79 -251 125 248 3 -48 55 293 117 -424 -221 208 241 -103 -305
2730 -305 -199 92 480 301 -681 -92 227 766 -536 -687 -94 753 209 -291 -484 145 446 22 -209 -497
2750 -497 -211 246 408 -92 -451 -195 203 316 6 -400 -8 130 -35 -210 154 110 -70 -10 -2 180 -62
2771 -62 -486 80 107 399 30 -359 208 448 367 121 -199 -63 129 -342 -284 -132 -143 391 -206 -438 137 60
$$ packed form
2665b11j83Q74j03j97m71K77O67k93l65l93J09Q09m2o19k94N62R8K3n99j12L59
2686a04N07j95q52L8P49J42m41j86K78K08k1j60m40N79K36l60l37J60L05j1mk21
2708a30R2K42N5m88J32p2K38J0l30L76J23k45n1J03K38j76n41K03M29L3l44k02
2730c05J06K91L88j79r82N89L19N39j302j51N93Q47n44n00j93O29L01m24k31k88
2750d97K86M57J62n00l59K56L98J13l10m06L92J38j65j75L64m4j80O0QJ82k42
2771f2m24N66K7K92l69l89N67K40q1k46l20J36J92m71N8J52j1N34n97k32N75p7
$$ [...]
8191a94
##END NTUPLES=NMR FID
##END=
