##TITLE=1H_CA-8570-2
 DMSO, 8 sc, 
 6.3.2019
##JCAMPDX= 6.0         $$ Bruker NMR JCAMP-DX V2.0
##DATA TYPE= NMR FID
##DATA CLASS= NTUPLES
##ORIGIN= UXNMR, Bruker Analytische Messtechnik GmbH
##OWNER= root
$$ XWIN-NMR		Version 3.5
$$ Wed Mar  6 16:03:38 2019 Russian Standard Time (UT+4h)  she@DPX200
##.OBSERVE FREQUENCY= 200.1316
##.OBSERVE NUCLEUS= ^1H
##.DELAY= (6, 6)
##.ACQUISITION MODE= SIMULTANEOUS
##.ACQUISITION SCHEME= undefined
##.AVERAGES= 8
##.DIGITISER RES= 18
##SPECTROMETER/DATA SYSTEM= spect
##.PULSE SEQUENCE= zg30
##.SOLVENT NAME= DMSO
##.SHIFT REFERENCE= (INTERNAL, DMSO, 0, 15.7039)
##AUDIT TRAIL= $$ (NUMBER, WHEN, WHO, WHERE, WHAT)
$$ ##TITLE= Audit trail, XWIN-NMR		Version 3.5
$$ ##JCAMPDX= 5.01
$$ ##ORIGIN= Bruker BioSpin GmbH
$$ ##OWNER= she
$$ F:/spectra/data/she/nmr/H-F/1/audita.txt
$$ ##AUDIT TRAIL=  $$ (NUMBER, WHEN, WHO, WHERE, WHAT)
(   1,<2019-03-06 16:02:02.51 +0400>,<she>,<DPX200>,
      <created by zg, POWCHK disabled, PULCHK disabled
       configuration hash MD5:
       00 E9 B6 7A A2 85 ED C7 34 08 36 98 17 FE 4E 26
       data hash MD5: 16K
       A9 0B F3 C0 D5 CD 85 D2 E2 C2 7B EB 48 4F CE F3>)
$$ ##END=
$$ 
$$ hash MD5
$$ D9 16 31 70 D5 9A 9A 76 4C EC C2 08 B5 C2 7F E7
##$RELAX= 
##$RELAX= 
##$RELAX= 
##$RELAX= 
##$RELAX= 
##$RELAX= 
$$ Bruker specific parameters
$$ --------------------------
##$DU= <F:/spectra>
##$EXPNO= 1
##$NAME= <H-F>
##$PROCNO= 1
##$TYPE= <nmr>
##$USER= <she>
##$AMP= (0..31)
100 100 100 100 100 100 100 100 100 100 100 100 100 100 100 100 100 100 
100 100 100 100 100 100 100 100 100 100 100 100 100 100 
##$AQSEQ= 0
##$AQ_mod= 1
##$AUNM= <au_zg>
##$AUTOPOS= <>
##$BF1= 200.13
##$BF2= 200.13
##$BF3= 200.13
##$BF4= 200.13
##$BF5= 200.13
##$BF6= 200.13
##$BF7= 200.13
##$BF8= 200.13
##$BYTORDA= 1
##$CFDGTYP= 0
##$CFRGTYP= 5
##$CHEMSTR= <none>
##$CNST= (0..31)
1 1 145 1 1 1 1 1 1 1 1 1 1 1 1 1 1 1 1 1 1 1 1 1 1 1 1 1 1 1 1 1 
##$CPDPRG= <>
##$CPDPRG1= <>
##$CPDPRG2= <>
##$CPDPRG3= <>
##$CPDPRG4= <mlev>
##$CPDPRG5= <mlev>
##$CPDPRG6= <mlev>
##$CPDPRG7= <mlev>
##$CPDPRG8= <mlev>
##$CPDPRGB= <>
##$CPDPRGT= <>
##$D= (0..31)
0 1.2 0 0 0 0 0 0 0 0 0 0.03 0 0 0 0 0 0 0 0 0 0 0 0 0 0 0 0 0 0 0 0 
##$DATE= 1551873721
##$DBL= (0..7)
120 120 120 120 120 120 120 120 
##$DBP= (0..7)
150 150 150 150 150 150 150 150 
##$DBP07= 0
##$DBPNAM0= <>
##$DBPNAM1= <>
##$DBPNAM2= <>
##$DBPNAM3= <>
##$DBPNAM4= <>
##$DBPNAM5= <>
##$DBPNAM6= <>
##$DBPNAM7= <>
##$DBPOAL= (0..7)
0.5 0.5 0.5 0.5 0.5 0.5 0.5 0.5 
##$DBPOFFS= (0..7)
0 0 0 0 0 0 0 0 
##$DE= 6
##$DECBNUC= <off>
##$DECIM= 24
##$DECNUC= <off>
##$DECSTAT= 4
##$DIGMOD= 1
##$DIGTYP= 9
##$DL= (0..7)
0 120 120 120 120 120 120 120 
##$DP= (0..7)
150 150 150 150 150 150 150 150 
##$DP07= 0
##$DPNAME0= <>
##$DPNAME1= <>
##$DPNAME2= <>
##$DPNAME3= <>
##$DPNAME4= <>
##$DPNAME5= <>
##$DPNAME6= <>
##$DPNAME7= <>
##$DPOAL= (0..7)
0.5 0.5 0.5 0.5 0.5 0.5 0.5 0.5 
##$DPOFFS= (0..7)
0 0 0 0 0 0 0 0 
##$DQDMODE= 0
##$DR= 18
##$DS= 0
##$DSLIST= <SSSSSSSSSSSSSSS>
##$DSPFIRM= 0
$$ [...]
##$SUBNAM2= <"">
##$SUBNAM3= <"">
##$SUBNAM4= <"">
##$SUBNAM5= <"">
##$SUBNAM6= <"">
##$SUBNAM7= <"">
##$SUBNAM8= <"">
##$SUBNAM9= <"">
##$SW= 24.9336934301222
##$SWIBOX= (0..15)
0 0 2 0 0 0 0 0 0 0 0 0 0 0 0 0 
##$SW_h= 4990.01996007984
##$TD= 16384
##$TD0= 1
##$TE= 0
##$TE2= 300
##$TE3= 300
##$TEG= 300
##$TL= (0..7)
0 120 120 120 120 120 120 120 
##$TP= (0..7)
150 150 150 150 150 150 150 150 
##$TP07= 0
##$TPNAME0= <>
##$TPNAME1= <>
##$TPNAME2= <>
##$TPNAME3= <>
##$TPNAME4= <>
##$TPNAME5= <>
##$TPNAME6= <>
##$TPNAME7= <>
##$TPOAL= (0..7)
0.5 0.5 0.5 0.5 0.5 0.5 0.5 0.5 
##$TPOFFS= (0..7)
0 0 0 0 0 0 0 0 
##$TUNHIN= 0
##$TUNHOUT= 0
##$TUNXOUT= 0
##$USERA1= <user>
##$USERA2= <user>
##$USERA3= <user>
##$USERA4= <user>
##$USERA5= <user>
##$V9= 5
##$VALIST= <valist>
##$VCLIST= <CCCCCCCCCCCCCCC>
##$VD= 0
##$VDLIST= <DDDDDDDDDDDDDDD>
##$VPLIST= <PPPPPPPPPPPPPPP>
##$VTLIST= <TTTTTTTTTTTTTTT>
##$WBST= 1024
##$WBSW= 4
##$XGAIN= (0..3)
0 0 0 0 
##$XL= 0
##$YL= 0
##$YMAX_a= 201867
##$YMIN_a= -282560
##$ZGOPTNS= <>
##$ZL1= 120
##$ZL2= 120
##$ZL3= 120
##$ZL4= 120
##$ABSF1= 10
##$ABSF2= 0
##$ABSG= 5
##$ABSL= 3
##$ALPHA= 0
##$AQORDER= 0
##$ASSFAC= 0
##$ASSFACI= 0
##$ASSFACX= 0
##$ASSWID= 0
##$AUNMP= <proc_1d>
##$AZFE= 0.1
##$AZFW= 0.1
##$BCFW= 1
##$BC_mod= 2
##$BYTORDP= 1
##$COROFFS= 0
##$CY= 11.3945322036743
##$DATMOD= 1
##$DC= 2
##$DFILT= <>
##$DTYPP= 0
##$F1P= 18.9103706918063
##$F2P= -1.10871071338519
##$FCOR= 0.5
##$FTSIZE= 0
##$FT_mod= 4
##$GAMMA= 1
##$GB= 0.15
##$INTBC= 1
##$INTSCL= 1
##$ISEN= 128
##$LB= 0.24
##$LEV0= 0
##$LPBIN= 0
##$MAXI= 10000
##$MC2= 0
##$MEAN= 0
##$ME_mod= 0
##$MI= 1.114404
##$NCOEF= 0
##$NC_proc= 0
##$NLEV= 6
##$NOISF1= 3.799351
##$NOISF2= 2.8
##$NSP= 1
##$NTH_PI= 0
##$NZP= 0
##$OFFSET= 15.70392
##$PC= 1
##$PHC0= -8866.924
##$PHC1= 20.20014
##$PH_mod= 1
##$PKNL= yes
##$PPARMOD= 0
##$PSCAL= 0
##$PSIGN= 0
##$REVERSE= no
##$SF= 200.130013532006
##$SI= 16384
##$SIGF1= 3
##$SIGF2= 2
##$SINO= 400
##$SIOLD= 16384
##$SREGLST= <1H.CDCl3>
##$SSB= 0
##$STSI= 0
##$STSR= 0
##$SW_p= 3612.71676300578
##$SYMM= 0
##$S_DEV= 0
##$TDeff= 0
##$TDoff= 0
##$TI= <>
##$TILT= no
##$TM1= 0
##$TM2= 0
##$TOPLEV= 0
##$USERP1= <user>
##$USERP2= <user>
##$USERP3= <user>
##$USERP4= <user>
##$USERP5= <user>
##$WDW= 1
##$XDIM= 8192
##$YMAX_p= 0
##$YMIN_p= 0
$$ End of Bruker specific parameters
$$ ---------------------------------
##NTUPLES= NMR FID
##VAR_NAME=  TIME,          FID/REAL,        FID/IMAG
##SYMBOL=    X,             R,               I
##VAR_TYPE=  INDEPENDENT,   DEPENDENT,       DEPENDENT
##VAR_FORM=  AFFN,          ASDF,            ASDF
##VAR_DIM=   8192,          8192,            8192
##UNITS=     SECONDS,       ARBITRARY UNITS, ARBITRARY UNITS
##FACTOR=    0.0002004,     1,               1
##FIRST=     0,             0,               0
##LAST=      1.6414764,     0,               0
##MIN=       0,             -282560,         0
##MAX=       1.6414764,     201867,          0
$$ Real data points
##PAGE= N=1
##DATA TABLE= (X++(R..R)), XYDATA
0@%%%%%%%qJ6j6K4l2M0m8N6p2Q8j04J20j37J61j92K22k55K94l37L86m40M99n65
$$ 0 0 0 0 0 0 0 0 -8 8 -8 16 -16 24 -24 32 -40 48 -56 64 -73 88 -104 118 -137 157 -180 206 -234 265 -300
30c00O37p16Q05r02J009j127J256j397J548j716J904k108K333k582K861l173L519
$$ -300 337 -379 426 -476 533 -594 662 -735 813 -903 1001 -1107 1226 -1356 1505 -1668 1851
47A851l915M367m884N492o217P093q177R565j1414J4018j7987K4848m0016J34059
$$ 1851 -2064 2303 -2581 2911 -3306 3787 -4390 5175 -6239 7779 -10208 14640 -25376 108683
61A08683q4400k21575K10751J88408o2317j96162r98R4060L6955l6699m88k2511
$$ 108683 24283 -197292 13459 201867 139550 -56612 -57610 36450 73405 36706 36218 13707
73A3707m6289N828R1031J5553r4442n5048Q4132O3921n9655o6378N2482N7460
$$ 13707 -32582 -26754 64277 79830 -14612 -69660 14472 78393 18738 -47640 4842 62302
85F2302n2079o2609N8150P4462m9025r0079K8467Q8404l564o9441l369M2685j0193
$$ 62302 10223 -52386 5764 80226 31201 -58878 -30411 57993 54429 -15012 -18381 24304 14111
98A4111k8844M3507M2772o7714q0680O7777J26706l0428j52362k6332J43622Q3014
$$ 14111 -14733 28774 71546 3832 -76848 -9071 117635 87207 -65155 -91487 52135 135149
110A35149r5598j04752L6371Q9951J1828m2345k5491p477N171M2138L5517m4314
$$ 135149 39551 -65201 -28830 61121 72949 30604 5113 -2364 2807 44945 80462 36148
122C6148p3311K1969R3555N952r5794l0358Q5520L9551p9185m7219P2195N0118
$$ 36148 -37163 -15194 78361 84313 -11481 -41839 43681 83232 4047 -43172 29023 79141
134G9141p3496o4641O4165P5322n1204q5018K6004P6227r927o2331M1M1930p013
$$ 79141 5645 -58996 5169 80491 29287 -55731 -29727 46500 36573 -25758 -25717 16213 9200
147I200l3240J7468L4701k7113m7240K4526N7062j2156n8644k959M6991R425l0455
$$ 9200 -24040 -6572 28129 1016 -46224 -21698 35364 23208 -35436 -38395 8596 18021 -12434
160a2434k129J9873j3387k1357L1365L7125l7997n9000L1069P6874j0442q0766
$$ -12434 -14563 5310 -8077 -29434 1931 39056 1059 -57941 -26872 50002 39560 -41206
172d1206r593P3849K4831n9843k8315M8863K7077m3591k4684M5514K7973m5301
$$ -41206 -50799 23050 47881 -11962 -40277 8586 35663 -7928 -32612 12902 40875 -4426
184d426l5687L9627M3981k6842m5894J1922L8484j549k4343p11Q498q118M51J9896
$$ -4426 -40113 -486 43495 16653 -29241 -17319 21165 19616 -4727 -5438 3060 -5058 -4607 15289
198A5289k606l3715o014M1127J4404m5772k6292M3991L3689m4007m4832L8461
$$ 15289 12683 -21032 -27046 14081 28485 -17287 -43579 412 34101 -9906 -54738 -16277
210a6277N2617l1760o2624J8006O7214j645o5086j5885N2320K6213l4879k7953
$$ -16277 36340 4580 -58044 -40038 27176 25531 -39555 -55440 -3120 23093 -11786 -39739
222c9739J7808J8392p616l777P577q666j6288J4028K8861r245l7100k35L8464
$$ -39739 -21931 -3539 -11155 -14932 -7355 -16021 -32309 -18281 10580 1335 -35765 -36000 2464
235B464J0488l1408j4020K3432J1992j5634m211J7471k894k2894O720L3209k109
$$ 2464 12952 -18456 -32476 -9044 2948 -12686 -16897 574 -2320 -25214 -18494 14715 12606
248A2606m2106o130M6439J8897m4666l0638L7899M0393k7028m6245J4166M6832
$$ 12606 -29500 -35630 10809 29706 -14960 -45598 -7699 32694 5666 -40579 -26413 20419
260B0419m57m1999j2043L1060J9437j5712k0249K1J1454J1093L001j4033k0860
$$ 20419 19962 -22037 -34080 -3020 16417 705 -19544 -19523 -8069 3024 6025 -8008 -28868
273b8868O833L3548P732l8996k5427L3165L9077k1095m5956N653M3825O254l5287
$$ -28868 -22035 11513 19245 -19751 -45178 -12013 27064 5969 -39987 -34334 9491 15745 -19542
286a9542j2843K6081J2393j9234q344J7019M842j7565l137K0939N359k2266r458
$$ -19542 -32385 -6304 6089 -13145 -21489 -4470 372 -17193 -20330 609 5968 -16298 -25756
299b5756K1582J5128j7534j7683J2396J8615n670j5268P16J0546K628l780j497
$$ -25756 -4174 10954 -6580 -24263 -11867 6748 1078 -14190 -13474 -2928 -300 -4080 -5577
312e577k471k425Q892J0149r607j9803O668K9030K044l2959j3535L1938K5998
$$ -5577 -8048 -10473 -1581 8568 -1039 -20842 -14174 14856 16900 -16059 -29594 2344 28342
325B8342k4770l3840J2930L6851j15l2832q949K4645J4440j4843j4666P256J1122
$$ 28342 3572 -30268 -17338 19513 19398 -13434 -22383 2262 16702 1859 -12807 -5551 5571
338E571k524n087Q96Q97j562K931L258m358n292N138P143n274q573N859J0250
$$ 5571 3047 -2040 -1144 -247 -1809 1122 4380 22 -5270 -132 7011 1737 -6836 -977 9273
353I273n029j2119M386J4208l317j6188J475J7330J152j7249m695J7875Q236j7169
$$ 9273 4244 -7875 -3489 10719 7402 -8786 -7311 10019 11171 -6078 -10773 7102 15338 -1831
367a831j2129J5270J5496j1121j7490N261J8383Oj5531n484J0818Q075n987o744
$$ -1831 -13960 1310 16806 5685 -11805 -6544 11839 11845 -3686 -9170 1648 9723 3736 -3008
381c008j21M476L716J09m871m499L751Q375r80j0531k180J1675N842j1346q824
$$ -3008 -3129 1347 5063 5172 301 -4198 -447 7928 6948 -3583 -5763 5912 11754 408 -8416
396h416J0454J2550q941j3891N797J6505j970j6244k341J5825O656j3040r480
$$ -8416 2038 14588 5647 -8244 -2447 14058 12088 -4156 -6497 9328 15984 2944 -6536
409f536R562J1396m965j0522J173Q745K342n871m033L065L950M89l062l065R85
$$ -6536 3026 14422 9457 -1065 108 8853 11195 5324 1291 4356 8306 8795 5733 2668 3653
424C653M173K050o202m255M897O983l378j0081M27J0980K184j1236n715R104P822
$$ 3653 7826 9876 3674 -581 4316 11299 7921 -2160 -1733 9247 11431 195 -5520 3584 11406
439A1406p657r897M767R730k907r941j79R201J465q575l365O646M745m897n922
$$ 11406 3749 -6148 -1381 8349 5442 -4499 -4678 4523 5988 -2587 -5952 694 5439 542 -5380
454e380J739N701J204m641l440K632M788O29m321m251L825O265m55p580k440P622
$$ -5380 -3641 2060 3264 -1377 -4817 -2185 2603 3232 -1089 -5340 -1515 4750 4295 -3285 -5725 1897
470A897N778n274p986K998J0269M6r802k798R076N944o861p413M674Q277q66p591
$$ 1897 7675 2401 -5585 -2587 7682 7728 -2074 -4872 4204 10148 3287 -4126 548 8825 7959 368
486C68j901O208L445l986m472J600L926M0l576k192J895K722j421l379r77K850
$$ 368 -1533 4675 8120 4134 -338 1262 5188 5228 1652 -540 1355 4077 2656 -723 -1700 1150
502A150J722l617l061J628M142j487n607o68N373K375n978m781L870N886l024
$$ 1150 2872 -745 -3806 -2178 1964 477 -5130 -5798 -425 1950 -4028 -8809 -4939 947 -2077
517b077p109j82O632K188o103m194M184N394j873n457p46N525K714l707l764J738
$$ -2077 -9186 -9368 -2736 -548 -6651 -10845 -6661 -1267 -3140 -8597 -9343 -3818 -1104 -4811 -8575 -6837
533f837N387Q29m065k611L730M411q78m698n52M623K696k802l919J804M925J09
$$ -6837 -1450 -621 -4686 -7297 -3567 844 -34 -4732 -5284 -661 2035 -767 -4686 -2882 2043 2152
549B152m437j266M114K705k511l489K045L909q78m028m10L566J164l063k727K021
$$ 2152 -2285 -3551 563 3268 757 -2732 -687 3222 2344 -1684 -2094 1472 2636 -427 -3154 -1133
565a133K666p59l895q09K662J376k792l008O29L474l57l350k397K822K871k145
$$ -1133 1533 774 -3121 -3930 -1268 108 -2684 -5692 -5063 -1589 -1946 -5296 -7693 -4871 -2000 -4145
581d145l680O2L566R05l669k529K542L436j215m245J25L893J438k872k467K177
$$ -4145 -7825 -7763 -4197 -3292 -6961 -9490 -6948 -3512 -4727 -8972 -8847 -4954 -3516 -6388 -8855 -6678
597f678L175P7k990j161K954K607j743k145J509K977P15k357q63K548J982j187
$$ -6678 -3503 -3426 -6416 -7577 -4623 -2016 -3759 -5904 -4395 -1418 -703 -3060 -3923 -1375 607 -580
613e80k283M94L708M81k599j223K119K732j238k716R3K650J423k297k380J529
$$ -580 -2863 -2369 1339 1820 -779 -2002 117 2849 1611 -1105 -1012 1638 3061 764 -1616 -87
629h7K654q05k887p63K231J270k005k387J055J693n84k188q06J957N66j158j978
$$ -87 2567 1762 -1125 -1888 343 1613 -392 -2779 -1724 -31 -615 -2803 -3609 -1652 -1086 -2244 -4222
646d222J000J341k93j147j138J339Q69j067j556O44J741N60k133o63J660K017
$$ -4222 -3222 -1881 -2174 -3321 -4459 -3120 -2251 -3318 -4874 -4230 -2489 -1929 -4062 -4725 -3065 -1048
662a048j298k395Q16L167M74k762r13K416K749r33k688O30L048J121k093j392
$$ -1048 -2346 -4741 -3925 -758 -284 -3046 -3959 -1543 1206 273 -2415 -1785 1263 2384 291 -1101
678a101J491K482J58k307o86J655J514j14j821n06J372J596o38k050K0K032O91
$$ -1101 390 2872 3030 723 37 1692 3206 3092 1271 765 2137 3733 3095 1045 1065 3097 3788
695C788j113j402P61J349n96j195o20J017J93j092q5M61m14q60j30J053j60j904
$$ 3788 2675 1273 2034 3383 2787 1592 972 1989 2182 1090 1005 1466 1052 192 62 1115 955 -949
713i49m85J466J206j526j747P10J696M09j864j422J474J671P8j561r36M81K363
$$ -949 -1434 32 1238 -288 -2035 -1325 371 780 -1084 -2506 -1032 639 717 -844 -1780 -1299 1064
730A064K86k156j514J966K600n47k900o29L159K132j995k547J262L240M46l041
$$ 1064 1350 -806 -2320 -354 2246 1699 -1201 -1830 1329 3461 1466 -1081 181 3421 3867 826
746H26r42J782K516j017j379k16P77P30n7k85j122O7J143R42r05j575K95J831
$$ 826 -116 1666 4182 3165 1786 1570 2347 3077 3020 2735 1613 1680 2823 3765 2860 1285 1580 3411
764C411M18j544j181P27J589r90q29n4K07j1j8N04j351r60J173J940j138k355
$$ 3411 3829 2285 1104 1831 3420 2430 1601 1547 1754 1743 1725 2229 878 -82 1091 3031 1893 -462
782d62l88K851R42k736j893J742K376n77k404o82K031J014j209j212L68O74Q88
$$ -462 -850 2001 2943 207 -1686 56 2432 1855 -549 -1231 800 1814 605 -607 -239 435 1323
799A323l92n92o12O88J269J41j222j436J643J770r17k383J002K451k00j853m15
$$ 1323 931 339 -273 415 1684 1825 603 -833 810 2580 1663 -720 282 2733 2533 680 265
816B65J680P41j040m05O09O9n46N54L83N9j346J81J327L66j932n24J497R35j251
$$ 265 1945 2686 1646 1241 1850 1919 1373 1927 2310 2369 1023 1204 2531 2897 965 441 1938 2873 1622
835A622j218J092R28l32j195L77M70m60m12N37L11q10k65J053J74j227p69J473
$$ 1622 404 1496 2424 2092 897 1274 1744 1284 872 1409 1720 910 645 1698 1872 645 -124 1349
853A349P82j366j103J313J067j002j039M99J366o79j004M80J011P6j212n1J020
$$ 1349 2131 765 -338 975 2042 1040 1 500 1866 1187 183 663 1674 1750 538 487 1507
870A507J81j071r7J096L73j296J42P86l10m46K24R02n05j099K12J656l12j690
$$ 1507 1688 617 520 1616 1989 693 835 1621 1311 865 1089 1991 1486 387 599 2255 1943 253
888B53j73J657Q83j699o86J379O99r68q18M80P70n26j55N17J72j049L7J227L53
$$ 253 80 1737 2620 921 235 1614 2313 1345 527 1007 1777 1251 1096 1613 1785 736 773 2000 2353
907B353j321j101K191O34j074j841Q72K258p34j798O4J625Nr19j51L95J57l54
$$ 2353 1032 -69 2122 2756 1682 -159 713 2971 2237 439 503 2128 2133 1214 1063 1458 1615 1261
925A261P65K75j216n56J206J205j489j594J128K068m66j993l14J497J200j751
$$ 1261 2026 2301 1085 529 1735 2940 1451 -143 985 3053 2587 594 280 1777 2977 1226
941A226j196R60Q47K9p88r7J20OJ37N47r16p47K58K206o36k063k85J948J389j900
$$ 1226 30 990 1837 1866 1078 981 1101 1107 1244 1791 875 128 386 2592 1956 -107 -392 1556 2945 1045
961A045j465O73J875M5j633k69R53L49l53n6k38l75J24Q60K66j388p12J659J671
$$ 1045 -420 253 2128 2173 540 271 1224 1573 1220 1164 926 551 675 1535 1801 413 -299 1360 3031
980C031j571j975J069K464n82j993l91J134J204q86m25Q9M78k35L48j14n34l70
$$ 3031 1460 -515 554 3018 2436 443 52 1186 2390 1504 1079 1168 1646 1411 1759 1645 1111 741
998G41M88J280j091j755Q80J411J39j848q05J670P76j044j053J90R73j00p45O8
$$ 741 1229 2509 1418 -337 543 1954 2093 245 -560 1110 1886 842 -211 -21 952 852 107 175
1016A75n0R0J0K15R3j212j36J303M02j889n43J079J601j194j140K86J336k25r96
$$ 175 125 215 225 440 533 -679 -815 488 890 -999 -1542 -463 1138 -56 -1196 -910 426 201 -795
1035g95j56Q17L41n15J75J67k69k32L33N50m60q82L86J258n29j253K48J301L54
$$ -795 -951 -134 207 -308 -133 34 -235 -467 -134 416 -44 -926 -540 718 189 -1064 -816 485 839
1054H39j665l45J372L44r51l64L94M56m98p0L66j72o32p7P08P1j208o7R31J71
$$ 839 -826 -1171 201 545 -406 -770 -376 80 -418 -488 -122 -294 -926 -1003 -295 -224 -1432 -1499 -568 -397
1074c97r82m03Q36M64q51p48P61O96r39p19M11Q75m76m68M08N33o35n52J10P75
$$ -397 -1379 -1782 -946 -482 -1333 -2081 -1320 -624 -1563 -2282 -1871 -996 -1472 -1940 -1532 -999 -1634 -2186 -2076 -1301
1094a301l27m17j55P03k06r22O98P11J7j146N27O19J5j234K02R64j68n24k1P49
$$ -1301 -1628 -2045 -2200 -1497 -1703 -2625 -1927 -1216 -1199 -2345 -1818 -1199 -1184 -2418 -2216 -1252 -1420 -1944 -1965 -1216
1114a216l6p65J3N68K60q06j94O55k3n02j37Q14J04p05j8O16N03r98l83N26O64
$$ -1216 -1252 -2017 -2004 -1436 -1176 -1982 -2176 -1521 -1544 -2046 -2183 -1369 -1265 -1970 -1988 -1372 -869 -1867 -2250 -1724 -1060
1135a060q81k36K8O14j39o13L69L40p24J19N82r4l63m19M55Q36p29o26M17R70
$$ -1060 -1941 -2177 -2149 -1535 -1674 -2287 -1918 -1578 -2302 -2183 -1601 -1695 -2058 -2477 -2022 -1186 -1915 -2541 -2124 -1154
1155a154m76j162K89J139m75o99J81M61P4n77M99J77l77l55K39R39q36n58J93
$$ -1154 -1630 -2792 -2503 -1364 -1839 -2538 -2357 -1896 -1822 -2399 -1900 -1723 -2100 -2455 -2216 -1277 -2113 -2671 -2478
1174b478J596l35q40l37J136M37r71j83O78K85n00l50O93m2m73r8M57L54j134
$$ -2478 -882 -1217 -2057 -2394 -1258 -821 -1792 -1975 -1297 -1012 -1512 -1862 -1169 -1211 -1684 -1782 -1325 -971 -2105
1193b105L44J181K2j247r7J038N81j352n46R97R62q24p91N54O86J5r69K43M49
$$ -2105 -1761 -580 -558 -1805 -1902 -864 -283 -1635 -2181 -1184 -222 -1046 -1837 -1283 -597 -582 -1551 -1308 -859
1212h59k22k48J44M34O7r05M40J018p79l97J43J190m84j258P15R08j71j140L35
$$ -859 -1081 -1329 -1185 -751 -684 -1589 -1149 -131 -910 -1307 -1164 26 -458 -1716 -1001 -93 -264 -1404 -1069
1231a069O28K15j201N62N39K4j059L49J008k69r18p3J123M78j377j63J006O52
$$ -1069 -441 -226 -1427 -865 -326 -302 -1361 -1012 -4 -273 -1191 -1264 -141 337 -1040 -1203 -197 455
1249D55j211l57R30O65j290k76J016M70q39o63J206J04q68k42R34M94j073n35
$$ 455 -756 -1113 -183 482 -808 -1084 -68 402 -437 -1100 106 210 -658 -900 34 528 -545 -1080
1267a080J320R42j552q94J139J131q28r35P09J174n79j325N16J204m61r65N05
$$ -1080 240 1182 -370 -1264 -125 1006 178 -757 -48 1126 547 -778 -262 942 481 -484 21
1284B1R83k42j192L94R93l86q72J12J343m31j062J53J428n5j264j54J284k30j106
$$ 21 1004 762 -430 -36 957 571 -301 -189 1154 723 -339 -186 1242 1187 -77 -231 1053 823 -283
1303b83P3Q24L74j412J94J123k8j311j53J542N43j604m97J025R52j340p53R57
$$ -283 -210 614 988 -424 -230 893 865 -446 -599 943 1486 -118 -615 410 1362 22 -731 226
1321B26J081j129j098J297O04o78q15O59R38r82p71P82R63p91j116R08R79l87
$$ 226 1307 178 -920 377 981 303 -512 147 1085 103 -668 114 1077 286 -830 78 1057 670
1339F70j035P27O96m80j333J015J210n06j368N66J246j50j620Q3J543K60j532
$$ 670 -365 362 1058 578 -755 260 1470 964 -404 162 1408 1258 -362 -279 1264 1524 -8
1356hl78J738o4j399r1J167K17j014n59J632q3j612n8J745K85j923j21J430N37
$$ -8 -386 1352 1288 -111 -202 965 1182 168 -391 1241 1158 -454 -512 1233 1518 -405 -526 904 1441
1375A441j763n02J412P21j290q00J383M75j041q08J070P85j411p05J404Q89j232
$$ 1441 -322 -824 588 1309 19 -781 602 1077 36 -772 298 1083 -328 -1033 371 1260 28
1392B8j245J522J221j055j838P49K168r32j442m8K079n33j097q4J192l16p04L92
$$ 28 -1217 305 1526 471 -1367 -618 1550 618 -824 -872 1207 674 -423 -507 685 369 -335 57
1410E7P46l40j068L49J634m14k072P58J612J19k234j79J887O13j625o32J449L22
$$ 57 803 463 -605 -256 1378 964 -1108 -350 1262 1381 -853 -1032 855 1468 -157 -789 660 982
1428I82n03j249J357L02r55l26P34O79j569j31J097Q27j150j234J493J188j371
$$ 982 479 -770 587 889 -66 -392 342 1021 -548 -679 418 1245 95 -1139 354 1542 171
1445A71j149R07J254r48r13P19O31l55j025R14P03r41p77J030J146j465j205J141
$$ 171 -978 -71 1183 235 -678 41 672 317 -708 206 909 -32 -809 221 1367 -98 -1303 -162
1463a62J607p23k106R21J826l65j669l38J862P3j350l67J300J92j139K93Q71n1
$$ -162 1445 722 -1384 -463 1363 998 -671 -1009 853 926 -424 -791 509 701 -438 -145 726 675
1481F75j373M82J356k98j530J23J886j28j417o08J546P51j505n74J187M56j114
$$ 675 -698 -216 1140 842 -688 -565 1321 1193 -224 -832 714 1465 -40 -614 573 1029 -85
1498h5n85J272L45r72m05J180N50j421n78J448J144j142j635J279J521q46j570
$$ -85 -670 602 947 -25 -430 750 1300 -121 -699 749 1893 751 -884 395 1916 1070 -500
1515e00O97J216j31j451O22J009n15p61M32Q46q24p99J042Q96o15j589R25J279
$$ -500 197 1413 1282 -169 453 1462 947 186 618 1464 640 -159 883 1779 1164 -425 500 1779
1533A779m95j185p7J711M9j451n86J667N3j340j18R29L31r06k73R65K8q86m35
$$ 1779 1284 99 22 1733 1782 331 -255 1412 1465 125 7 936 1267 361 88 1053 1081 195 -240
1552b40J168J48q28l43O43J029j107p13J028P14j182m03Q47O30o84q47Q25J177
$$ -240 928 1076 248 -95 548 1577 470 -243 785 1499 317 -86 761 1391 707 -140 685 1862
1570A862j222n77O77R28p88p93J041R04r39q03L54R85j01r67K94J123k89j146
$$ 1862 640 63 740 1668 880 87 1128 2032 1093 290 644 1629 1528 561 855 1978 1689 543
1588E43K84J273k45j071j08R81m9o57M0Q21P6j159l2J001l61o41l8N29J86p89
$$ 543 827 2100 1855 784 676 1657 1608 951 991 1812 1888 729 697 1698 1337 696 658 1187 1373 584
1608E84m49Q25L85j285j25R81N69j118n95Q19O58o67o08N54O91p14q58P49L06
$$ 584 135 960 1345 60 -65 916 1485 367 -228 591 1249 582 -26 528 1219 505 -353 396 702
1627G02m77k80M43P24o66m80L62P86n66j021J097P17m28r23N20N96k24p56O3Q89
$$ 702 225 -55 388 1112 446 -34 328 1114 548 -473 624 1341 913 -10 510 1106 882 126 189 1078
1647A078l54l45J00P13l16p72M49O14j74n54k4R74j34j113R2Q42l6o60o01P75
$$ 1078 724 379 479 1192 876 104 553 1167 993 439 415 1389 1255 142 234 1076 1040 380 -221 554
1667E54M82q85j64M17R6l87k57N00j50l60j41P95j7j288j5P81M16o30p54M18O24
$$ 554 1036 151 -13 404 500 113 -144 356 206 -154 -295 500 483 -805 -820 -39 377 -253 -1007 -589 35
1688C5l18n77J44P88n25l32K61K59l35m12M46N10m50l42K71P48n63p00L40R34
$$ 35 -283 -860 -716 72 -453 -785 -524 -265 -600 -1012 -566 -56 -506 -848 -577 171 -392 -1092 -752 182
1708A82k24m80p2Q46k01m23P5M35j11l07L68L14o28j76j0M73K28r48M05P05Oj076
$$ 182 -42 -522 -594 252 51 -372 -297 138 27 -280 88 402 -226 -402 -412 61 289 -659 -254 451 457 -619
1730f19j66O22J01m83l04L95N33r01o3L30K82n39j0L26J67p27p0K73L52n31m31
$$ -619 -785 -163 -62 -545 -849 -454 79 -822 -885 -555 -273 -812 -822 -496 -329 -1056 -1126 -853 -501 -1032 -1463
1751a463M66K08q4p96M96K04r1l19j34M97Ko79N81L50l82l59M22l7J76l70K59
$$ -1463 -997 -789 -873 -1669 -1173 -969 -1060 -1379 -1513 -1016 -1014 -1693 -1112 -762 -1144 -1503 -1081 -1118 -942 -1312 -1053
1772a053L05J50k33j16O08k67k61j96N05J28l62n6K31J83m10J25K32N2j21n8J52
$$ -1053 -748 -598 -831 -947 -339 -606 -867 -1063 -558 -430 -792 -848 -617 -434 -844 -719 -487 -435 -556 -614 -462
1793d62L57l67o5K43J72l78l37M25q7j56m48M49L46o72J4J17J47l73J77J08J9
$$ -462 -105 -472 -537 -294 -122 -500 -837 -412 -499 -655 -1103 -654 -308 -980 -966 -849 -702 -1075 -898 -790 -771
1814g71k00l39N18j88j55N0j49L42k65j41mO79n17k47J14K78K01p79P43n9n8l37
$$ -771 -971 -1310 -792 -980 -1135 -1085 -1234 -892 -1157 -1298 -1302 -623 -1140 -1387 -1273 -995 -794 -1573 -830 -889 -947 -1284
1836a284M56J95o7K70m97L70L58l44j63K05J26k24K83K9L47o03P0O72j30l21M5
$$ -1284 -828 -633 -700 -430 -927 -557 -199 -543 -706 -501 -375 -599 -316 -287 60 -543 -473 199 69 -252 -207
1857b07L02r2k75J14J17M04j85l17m0L9r2m34N29R3n2O8p9J84m79l20L29N77j87
$$ -207 95 3 -272 -158 -41 363 178 -139 -179 -140 -232 -666 -137 -44 -96 -28 -107 77 -402 -722 -393 184 -3
1880cn23K53K68k48k48J65K90k88M8j94K72J03m54K71J16r7j57k20L40J28l14
$$ -3 -526 -273 -5 -253 -501 -336 -46 -334 -286 -480 -208 -105 -559 -288 -172 -269 -426 -646 -306 -178 -492
1901d92PM26J41k00J91P3J66j98k3J94k35J16l2L61k79m59L43N58j77j28l1P2
$$ -492 -485 -59 82 -118 73 146 312 114 91 285 50 166 134 495 216 -243 100 658 481 353 322 394
1923C94M41n80j61L56N9q3l97M16K16J5p12L78L48l33K2K70r1l82Q1J7Lk65k09
$$ 394 835 255 94 450 509 426 29 445 661 676 -36 342 690 357 379 649 558 176 257 274 277 12 -197
1946a97M79K62k30l59P8K65k5k23J16J47j32k18K94K0J8k50L31J22j43n25M23
$$ -197 282 544 314 -45 33 298 273 50 166 313 181 -37 257 277 295 45 376 498 355 -170 253
1967B53J94R8k53j83J36K29l40n5L51l6j93O7j50K4L15k75K83j00oK67j04J15
$$ 253 447 545 292 109 245 474 134 79 430 394 201 268 118 142 457 182 465 365 359 626 522 637
1989F37m06j20L27R1k70j51O2K54j10j98L78o9L20m19k2P5l04l37N18p7j58K43
$$ 637 231 111 438 529 259 108 170 424 314 116 494 425 745 326 304 379 75 -262 256 179 21 264
2011B64l9K90o78J82K11R6j26Q6j24J70J97l07k96L48r9l23N70J66j02m72o3N51
$$ 264 225 515 -163 19 230 326 200 286 162 332 529 222 -74 274 175 -148 422 588 486 14 -49 502
2033E02m08J93l93M51o2j77R3k06L18m65K6L45J96m86r1K66j17m6j36K49R1k02
$$ 502 94 287 -106 345 283 106 199 -7 311 -154 -128 217 413 -73 -164 102 -15 -61 -197 52 143 -59
2055e9K9o2J83l53p0L13J24k67j33M60j93l0m43M95M15l24n02J65O70l90o53J91
$$ -59 -30 -92 91 -262 -332 -19 105 -162 -295 165 -28 -58 -501 -6 409 85 -417 -252 418 28 -625 -434
2077d34M78J83k40l1O5J61j84j14J45J94n7k12O41l74j40O2rQ5n49J32N15j23
$$ -434 44 227 -13 -44 21 182 -2 -116 29 223 166 -46 595 221 81 143 134 219 -330 -198 317 194
2099A94k29k88J60R3jm5K16j1l09K6J89K05n50k34K36L71l82j22J23K74l64j70
$$ 194 -35 -323 -163 -70 -71 -116 100 89 -220 -194 -5 200 -350 -584 -348 23 -359 -481 -358 -84 -448 -618
2121f18QK06J26k54O1J69Q5j22K19k00N7o0j4L39k46k03M05J09l04l38K46O80
$$ -618 -610 -404 -278 -532 -471 -302 -217 -339 -120 -320 -263 -323 -337 2 -244 -447 -42 67 -237 -575 -329 351
2143C51%p64J17O25L4l86j73K81L76n83L62j94L57l07o0J56n6J10m46L37J25j32
$$ 351 351 -413 -296 329 363 -23 -196 85 461 -122 240 46 403 96 36 192 136 246 -200 137 262 130
2165A30k5j55L50n32j59M58m1k37O7J3m3L28o91L80N5n07O3L31K18l30l39K99
$$ 130 105 -50 300 -232 -391 67 26 -211 -144 -131 -174 154 -537 -157 -102 -609 -546 -215 3 -327 -666 -367
2187c67J25J60n85r4Q74k07m18j99M52M71n56k93P1K68Oj15J45o4J21j9N97k68
$$ -367 -242 -82 -667 -761 113 -94 -512 -711 -259 212 -344 -637 -566 -298 -292 -407 -262 -326 -205 -224 373 105
2209A05j9KR8J36l54j00M08L18m35K0J88P3m37J53J76L80m97ro7K95J67n40J65
$$ 105 86 88 186 322 -32 -132 276 594 159 179 367 440 3 156 332 712 215 206 139 434 601 61 226
2232B26L05j73j10j39L31j85k38k01L36J01l89k2N9Q7m34L49K27n19m6J31L92
$$ 226 531 358 248 109 440 255 17 -184 152 253 -136 -158 -99 -12 -446 -97 130 -389 -435 -304 88
2253H8p6p43N15L98l27m58K23N83p8p92N40J31L74m49k79M18o1J55k1L5J92j25
$$ 88 12 -731 -216 182 -145 -603 -380 203 125 -667 -127 4 378 -71 -350 68 7 162 141 176 368 243
2275B43j80J28J55j15L6O4K31k85J28K06J00j1o33M01L00l16n72P76m1k47j9K22
$$ 243 63 191 346 231 267 331 562 277 405 611 711 700 67 468 768 452 -120 656 615 368 349 571
2297E71J03m5n43M8N16p8p18O3O50m66l21L0L79j45R1J1J00j74j60j40L60J43
$$ 571 674 629 86 134 650 572 -146 -83 567 101 -220 -190 189 44 135 146 246 72 -88 -228 132 275
2319B75n65k7L75J18l27j20R3n9k22K77M83k53k67N6L16J22n98J26L01K29l60
$$ 275 -290 -317 58 176 -151 -271 -178 -237 -459 -182 301 48 -219 -163 153 275 -323 -197 104 333 -27
2340b7m27O14K84om58r6N05P2J73m61J20K7o0L03k04J38j68M66j71m86L86k72
$$ -27 -454 160 444 438 -20 -116 389 461 634 173 293 320 260 563 359 497 329 795 624 138 524 252
2362B52J86n1l88N61J78m69k49J04L94n8m41J24L84k26l58K34r8J28l48j54L49
$$ 252 438 387 -1 560 738 269 20 124 518 460 19 143 527 301 -57 177 79 207 -141 -295 54
2383E4K03j79o57M10L23r0m28J37N66j35j90P0k06K08PJ47m17j98L50r0K89m95
$$ 54 257 78 -579 -169 154 64 -364 -227 339 204 14 84 -122 86 93 240 -177 -375 -25 -115 174 -321
2405c21L17L52k08k71l0L75L70l36l91J61P68n04m23K80L45Q0m6l08k2L77k49
$$ -321 -4 348 140 -131 -161 214 584 248 -143 18 786 282 -141 139 484 564 518 210 188 565 316
2426C16K2q6k1ln7K87m86K8K94O7m97K80P3k12K45l06L73J82n58k17J61J47L31
$$ 316 338 252 231 228 171 458 -28 0 294 361 -136 144 217 5 250 -56 317 499 -59 -276 -115 32 363
2449C63o49k3L29j22k79p5O00j01L7l74n1M16J5k16r3L77o1M4l12pj39M04j01
$$ 363 -286 -309 20 -102 -381 -456 144 43 80 -294 -345 71 86 -130 -223 154 93 137 -175 -182 -321 83 -18
2472a8l32J34K73K72n59N3M6N34k45l27j49N03j48j13J4k15M72k01p9l05N58K30
$$ -18 -350 -216 57 329 -230 -177 -131 403 158 -169 -318 185 37 -76 -62 -277 195 -6 -85 -390 168 398
2494C98k73m25M33K05l78N8k65L64Pp3o1L6K18n4l54K69l28K12J05l19O3O5K56
$$ 398 125 -300 133 338 -40 18 -247 117 124 51 -10 26 244 190 -164 105 -223 -11 94 -225 -162 -97 159
2517A59j25k03k26M83q9n90K82M79j84k19l34M81K61k36j99m9N30m95Q1j21J87
$$ 159 34 -169 -395 88 -1 -591 -309 170 -14 -233 -567 -86 175 -61 -260 -309 221 -274 -193 -314 -127
2538a27M34k69j51l47M81j09K72l58j5J36Pj76n5R6J96J62j25j40k52N50j61j07
$$ -127 307 38 -113 -460 21 -88 184 -174 -189 -53 -46 -222 -277 -181 15 177 52 -88 -340 210 49 -58
2560e8j63n1J58k10J09J16J69J06q42O18L79k53o05L53rJ49J81m40L25k11J29
$$ -58 -221 -272 -114 -324 -215 -99 70 176 -666 -48 331 78 -527 -174 -183 -34 147 -293 32 -179 -50
2581e0n1j5K60n09l4Q5K61M7L1N9n66J16J71J62k89L3N7L73k81j18J14J58l19
$$ -50 -101 -116 144 -365 -399 -314 -53 -6 25 84 -482 -366 -195 -33 -322 -289 -232 141 -140 -258 -144 14 -305
2604c05k28Q2J64K71l16O4K13J99l47k80K60k6Q0k94qL19K17k22l44J84K34k39
$$ -305 -533 -451 -287 -16 -332 -268 -55 144 -203 -483 -223 -249 -169 -463 -471 -152 65 -157 -501 -317 -83 -322
2626c22L59l89l08P94l17j21o0J33j4K78l44j14M20J61k62k38Q9K58k43j9q6M51
$$ -322 37 -352 -660 134 -183 -304 -364 -231 -245 33 -311 -425 -5 156 -106 -344 -255 3 -240 -259 -345 106
2648A06k27j61l3J40M80k35l59M98Q7o26MK79NJ36k92J71o7j88K44P3m34L51j41
$$ 106 -121 -282 -315 -175 305 70 -289 209 296 -330 -326 -47 -42 94 -198 -27 -94 -282 -38 35 -399 -48 -189
2671a89L58m26j68M23J15Rl47j98K61k5m12k06O26J89m19j3J67J28k6J62j93q
$$ -189 169 -257 -425 -2 113 122 -225 -423 -162 -187 -599 -805 -179 10 -409 -422 -255 -127 -153 9 -184 -192
2693a92J48k16q0N4j13L18k59K94m30L06L06o97O44m69M68j44k17Q3P4J74j71
$$ -192 -44 -260 -340 -286 -399 -81 -340 -46 -476 -170 136 -561 83 -386 82 -62 -279 -196 -122 52 -119
2714a19j92L33O8p9j8j11M10j18l81j17L45K19q2k87J12J50l5j59J14O0rk2k74
$$ -119 -311 22 90 11 -7 -118 292 174 -207 -324 21 240 158 -129 -17 133 98 -61 53 113 104 82 -192
2737a92K91O3J18n25jl7N05n55J5L1J82J97N6m08K99L5j82o5J35R5j46m6n24N24
$$ -192 99 162 280 -245 -246 -283 222 -333 -318 -287 -105 92 148 -260 39 74 -108 -173 -38 57 -89 -135 -659 -135
2761a35M79k85Qk67J57K14l70r8K50j2R5k39J85l5L8j46L2M1J03L05j83P5Q3q4
$$ -135 344 59 67 -200 -43 171 -199 -297 -47 -59 36 -203 -18 -53 -15 -161 -129 -88 15 320 137 212 295 211
2785B11J19l69L29M3K41k10l26K94j44L17l03n6J42m0l03K8J29J42O4o0m62K83
$$ 211 330 -39 290 333 574 364 38 332 188 505 202 146 288 248 -55 -27 102 244 308 248 -214 69
2807F9J13l73pM27j77M7l24K80k35K01P9l53L27K0j91K55k92J27L8o1j97j58K42
$$ 69 182 -191 -198 229 52 99 -225 55 -180 21 100 -253 74 94 -97 158 -134 -7 31 -30 -227 -385 -143
2830a43K94j34j71K25j3Q8j48J45K1Q8k12J2R2J47j4q2p5LK68k03M3l62Q57n96
$$ -143 151 17 -154 71 58 146 -2 143 164 252 40 52 144 291 277 195 120 123 391 188 231 -131 726 130
2854A30M7M9j45K28K81n32j74M87J08l20J11J02j03K6k94J41pp1p8Np0N99m15
$$ 130 177 226 81 309 590 58 -116 371 479 159 270 372 269 295 1 142 135 64 -14 -9 -79 520 105
2877A05m9k25J03K88q03L63J07J86K01p00R15m98k56M73k79M0J15J20O2l27J81
$$ 105 56 -169 -66 222 -581 -218 -111 75 276 -424 491 -7 -263 210 -69 -29 86 206 268 -59 122
2898A22N0q3L45m53l3J56l37OK73L6J78j93k12L33Q0j01n1n9J06O5j2j70L46j54
$$ 122 172 89 434 -19 -52 104 -233 -227 46 82 260 67 -145 188 268 167 116 57 163 228 216 46 392 238
2922B38m3j73K23P6m0J07k30k45K29J2j45J71J5k20m7J05L3R4l57k11J78L36N4
$$ 238 195 22 245 321 281 388 158 -87 142 154 9 180 195 -25 -72 33 66 160 -197 -408 -230 106 160
2945A60j21l56K90K16k22j02O5J03P7j19k10M56j23n71M25k99K89R4J1rL2j78
$$ 160 39 -317 -27 189 -33 -135 -70 33 110 -9 -219 237 114 -457 -32 -331 -42 52 63 54 86 -92
2967i2R4K89l39Q7m1j3j34Q0O2R8j97J87K06k03K89m54L3l5K24l27J52J33P9J
$$ -92 2 291 -48 39 -2 -15 -149 -69 -7 91 -106 81 287 84 373 -81 -48 -83 141 -186 -34 99 178 179
2991A79k00J44m1k1M3j75jR5K58o5k59k3m0J42K51j22o8mnk29k6K84l1k98K5N40
$$ 179 -21 123 82 61 104 -71 -72 23 281 216 -43 -66 -106 36 287 165 97 93 88 -141 -167 117 86 -212 -187 353
3017C53Q7l35l03J17o8l1J4m64O00J5l29Q6L15L8k78N0p0L89k31Q2k8p4J33K2
$$ 353 440 105 -198 -81 -149 -180 -166 -630 -30 -15 -344 -258 57 95 -183 -133 -203 186 -45 37 9 -65 68 90
3041I0k40p3J25j1L72k30j24K6L97l82n1J4N13l36r7k2P0k3JO6P4j52l08J93J24
$$ 90 -150 -223 -98 -109 263 33 -91 -65 332 -50 -101 -87 426 90 -7 -29 41 18 19 85 159 7 -301 -108 16
3066A6p8j49L50l48J11J88qk60k11L38K47k33NJ25j72l33M46K3k59L02k20m5J3
$$ 16 -62 -211 139 -209 -98 90 82 -178 -389 -51 196 -37 -32 93 -79 -412 34 57 -202 100 -120 -165 -152
3089a52K36n4K73m83J53K27m30l01M25K5O5j29R7N1O4kl40O33l00P8l21l6l7p7
$$ -152 84 30 303 -180 -27 200 -230 -531 -106 -81 -16 -145 -48 3 67 65 -275 358 58 136 -185 -221 -258 -335
3113c35K51P0j79K64j3k2L2l26K10J97j89J28n92O72j45J77oj88O6q7M0M4R6j25
$$ -335 -84 -14 -193 71 58 36 68 -258 -48 149 -40 88 -504 168 23 200 194 6 72 -15 25 69 165 40
3137D0m2j1j53Q9Q0r5K4K35k94P3J83l06L01l32K45k66L36m7k09M1O8L06L9l97
$$ 40 -2 -13 -166 -77 3 -92 -68 167 -127 -54 129 -177 124 -208 37 -229 107 60 -149 -108 -40 266 305 -92
3161i2j32M01j34k9j26R0K28j14J19o60N90K01m11K49j12K07j60j14j04J35J50
$$ -92 -224 177 43 14 -112 -22 206 92 211 -449 141 342 -69 180 68 275 115 1 -103 32 182
3182A82k81J70L02m94K10j5R3j66k9j7k44L76l17M46O9l97K33O4k92M1N5j34K34
$$ 182 -99 71 373 -121 89 74 167 1 -28 -45 -289 87 -230 216 285 -112 121 185 -107 -66 -11 -145 89
3205H9pK21l76k30K74j50K81J85k98j63K01j15M0P5J10j65L31j44J7l4k50o4L03
$$ 89 82 303 -73 -303 -29 -179 102 287 -11 -174 27 -88 -48 27 137 -28 303 159 176 142 -108 -172 131
3228A31o5p0JN3J18j80j80K02q3M66o46Q5j42J51q8K7N15m14Q3P3O8j80p0K16
$$ 131 66 -4 -3 50 168 -12 -192 10 -73 393 -253 -168 -310 -159 -247 -220 295 -119 -36 37 105 -75 -145 71
3252G1J8j67J4N7J03k45K41k14r5J88j34K11j98J41k0k49O12m01L22j07L2k37
$$ 71 89 -78 -64 -7 96 -149 92 -122 -217 -29 -163 48 -150 -9 -29 -278 334 -67 255 148 180 -57
3274e7oOj36P5j00J67J57J30m8k74k0l6K51j03j95K31m8k0M8j56J26j6pk5O6J65
$$ -57 -63 -57 -193 -118 -218 -51 106 236 188 -86 -106 -142 109 6 -189 42 -6 -26 22 -134 -8 -24 -31 -56 10 175
3300A75l74n0M25k07j7k68J36J39J0R5k08R3p2O7K08k08n3j17K2K65j23j02P0
$$ 175 -199 -249 176 -31 -48 -316 -180 -41 -31 64 -144 -51 -123 -56 152 -56 -109 -226 -204 61 -62 -164 -94
3323i4r7K73l5L0k36pK35j8l79K99J86j86Pm13M27l31K80K37m13J99o3J26L6j69
$$ -94 -191 82 47 77 -159 -166 69 51 -328 -29 157 -29 -22 -435 -8 -339 -59 178 -235 -36 -99 27 63 -106
3347a06l4P3j6J09l45J37L69l40O5J84q0q4N7K87l40K72R9N9o24L39J4lk51J26
$$ -106 -140 -67 -83 26 -319 -182 187 -153 -88 96 16 -68 -11 276 -64 208 307 366 -258 81 95 92 -159 -33
3371c3J47l29L41j46N4J0k20J85M1l9j89M03k58pK6m7j21P6j71K62mJ30m10K09
$$ -33 114 -215 126 -20 34 44 -176 9 50 11 -178 225 -33 -40 -14 -61 -182 -106 -277 -15 -19 111 -299 -90
3395i0M08n54K45K2j12L29l83o1K32j26J39j47m2n9J60j44L25m34M06k41j34L37
$$ -90 318 -236 9 31 -81 248 -135 -196 36 -90 49 -98 -140 -199 -39 -183 142 -292 114 -127 -261 76
3417G6m3k23K70M0r6RNJ24m01K41l83L69k00J81j74K64j43j37K38r7J44m00P2
$$ 76 33 -190 80 120 24 33 38 162 -239 2 -381 -12 -212 -31 -205 59 -84 -221 17 -80 64 -336 -264
3440b64K17J82k59L45n0k43J18r7K16k41l7n1K35q9k10J76n3K04j18n3L33j29
$$ -264 -47 135 -124 221 171 -72 46 -51 165 -76 -113 -164 71 -18 -228 -52 -105 99 -19 -72 261 132
3462A32l15L5J4J68k08K7N4K79j64k10j74P51m37P8O5k68L34M5k56n3K58j92J02
$$ 132 -183 -148 -134 34 -174 -147 -93 186 22 -188 -362 389 -48 30 95 -173 161 206 -50 -103 155 -37 65
3485F5j33P8K5L3K36l89R5K72k60j04J81k29K07K9k24K8K71k2l65K50J19l68l2
$$ 65 -68 10 35 68 304 -85 10 282 22 -82 99 -130 77 106 -118 -90 181 159 -206 44 163 -205 -237
3508b37K31J2p6J9o1J34p4O1j05J74j90M2L91m07j47M36l14j25J52M9m1J52L50
$$ -237 -6 6 -70 -51 -112 22 -52 9 -96 78 -112 -70 321 -86 -233 203 -111 -236 -84 -35 -76 76 426
3531D26m07R4j43J0q0J5o9N08l37J21K04m90n9K41L09m81N0oK47j04q1J87j54
$$ 426 19 113 -30 -20 -100 -85 -154 354 17 138 342 -148 -207 34 343 -138 -88 -94 153 49 -32 155 1
3554AJ08j79j12M36l56j43J50oJ63k92K78J30j88N5j58L42m99K19J72k04K12P4
$$ 1 109 -70 -182 254 -102 -245 -95 -101 62 -230 48 178 -10 45 -113 229 -270 -51 121 -83 129 203
3576B03j36j76K28j44J39K22m18K97l23M59K7n66O2J22j05L20n12L07K04q3k7
$$ 203 67 -109 119 -25 114 336 -82 215 -108 351 378 -188 -126 -4 -109 211 -301 6 210 127 100
3597A00j58K3J30r6J01L01n83J92q5L58k21K6k22J48Q5k28pM31k06r3n2J37r8
$$ 100 -58 -35 95 -1 100 401 -182 10 -75 283 62 88 -134 14 99 -129 -136 295 89 -4 -56 81 -17
3620a7K81m34K42kj15M6K4Q2j23O3OL19k23J27m91K82lj63J4K2l0J07K11m06L13
$$ -17 264 -170 72 70 -45 1 25 107 -16 47 53 372 149 276 -215 67 64 -99 -85 -63 -93 14 225 -181 132
3645A32O5j52j23J67jr1r3R9N1n5K37k38k21K86J1j50K13Ok47O6nl76M38k35K79
$$ 132 197 45 -78 89 88 -3 -96 3 54 -1 236 -2 -223 63 74 -76 137 143 -104 -38 -43 -419 19 -216 63
3670F3J57l48J37J3j39J35J33k51K86M7M3k27j3K03o6J70l91K23q3J24j13j6k31
$$ 63 220 -128 9 22 -117 18 151 -100 186 233 276 49 36 239 173 343 -48 175 92 216 103 87 -144
3693a44J70j53j65M37j34r0j4J25l3j06K5J24l71M05k64K15j72O6L02j51J14k10
$$ -144 26 -127 -292 145 11 -79 -93 32 -1 -107 -82 42 -329 76 -188 27 -145 -79 223 72 186 -24
3715b4Kr0k24L30J72j66j33K43k56J82M1j99J39n3k56L09J47j77L2r5j7J60J20
$$ -24 -22 -112 -336 -6 166 0 -133 110 -146 36 77 -122 17 -36 -292 17 164 -13 19 -76 -93 67 187
3738A87k95j5J89l60K60K27k20L5j53n4K24K79m38K25J73k40l52l0L67L9m2o7
$$ 187 -108 -123 66 -294 -34 193 -27 8 -145 -199 25 304 -134 91 264 24 -328 -358 9 48 6 -61
3760f1K3L45l49O1K19l18J20k9k43P2m6J76L55j04k84Qj44K24j54L17k53K95O2
$$ -61 -38 307 -42 19 238 -80 40 11 -232 -160 -206 -30 325 221 -63 -55 -199 25 -129 188 -65 230 292
3783B92l5j42Rj91J80j74K4k10J85N0Q5L23m39m2j23J18lJ83l70M58j55O3j99
$$ 292 257 115 124 -67 113 -61 -37 -247 -62 -12 73 396 -43 -85 -208 -90 -93 90 -280 178 23 86 -113
3806a13K35k20j10J74M7r9R3J13j20k7r9k41M05j31J38n6j5l3j09m2k7K82k33
$$ -113 122 -98 -208 -34 13 -86 7 120 0 -27 -126 -367 38 -93 45 -11 -26 -59 -168 -210 -237 45 -188
3829a88K10M8J68n4m32J72L03p4k64mJ76q6J88L6k39l19L04J09J32r0l85K23J16
$$ -188 22 70 238 184 -248 -76 227 153 -111 -115 61 -25 163 199 -40 -359 -55 54 186 96 -289 -66 50
3852E0l7k02N3j32L26r0r6k65J20K92n1L3l7j61J98j63n6P7j3J86l20K47K22r4
$$ 50 13 -189 -136 -268 58 -32 -128 -393 -273 19 -32 1 -36 -197 1 -162 -218 -141 -154 32 -288 -41 181 87
3876H7k43NJ19K08K17l20K2q1r0M40k44j60J69M1l41J19k41M12j73L8j65K96l59
$$ 87 -156 -151 -32 176 393 73 95 14 -76 364 120 -40 129 170 -171 -52 -293 119 -54 -16 -181 115 -244
3899b44pK67K61m52J92j87M11l83K41r0j73M1K47n4m01J05J01K46n06J10N48j10
$$ -244 -251 16 277 -175 17 -170 241 -142 99 9 -164 -123 124 70 -331 -226 -125 121 -385 -275 273 163
3921A63k01K7O6j76K55k28K3j54P0R2o3j36O8K84O4M4j56m45P16k4l56J94n3L11
$$ 163 -38 -11 55 -121 134 -94 -71 -225 -155 -63 -126 -262 -194 90 154 198 42 -403 313 289 -67 127 74 385
3945C85l73k7j48K06j82K61l22M36o37P40l91Qj20K36R6j84k5J04J7r5Q3l21M61
$$ 385 12 -15 -163 43 -139 122 -200 236 -401 339 -52 -44 -164 72 168 -16 -41 63 80 -15 68 -253 208
3968B08j15qk57K32j22P8p1j29M05j42j00k09Q8J42j22j3P1r3J33n0P7k06M0J64
$$ 208 93 85 -172 60 -62 16 -55 -184 221 79 -21 -230 -142 0 -122 -135 -64 -157 -24 -74 3 -203 -163 1
3992AK80k30r7Q2j4K44l14L8L7L6j95J2K25n7m5r0L60k28O7j81j67J58J86J05
$$ 1 281 51 -46 36 22 266 -48 -10 27 63 -132 -120 105 48 3 -87 273 45 112 -69 -236 -78 108 213
4016B13k43j47J17j08K16j25K52j67p8N6K4J71k75Q2j99J7K91k03j64L04J14J92
$$ 213 -30 -177 -60 -168 48 -77 175 8 -70 -14 10 181 -94 -12 -211 -194 97 -106 -270 34 148 340
4038C40n22K91j37K14k03J15l1m26M07K2k03J75K92k37J88o40K62P3J09%j03R1
$$ 340 -182 109 -28 186 -17 98 67 -359 48 70 -133 42 334 97 285 -355 -93 -20 89 89 -14 77
4060G7q8P7J6J63l11q5K25J40k99P9m7K01j33L3o3J31j11k47K47q2j54R2m7J87
$$ 77 -11 66 82 245 -66 -151 74 214 -85 -6 -53 148 15 48 -15 116 5 -242 5 -77 -231 -139 -186 1
4084AJ45j63j03K87m52L63K7p6n0n7J83N2k0k9k57m9L05pk28j74K10nj76M17j67
$$ 1 146 -17 -120 167 -285 78 105 29 -21 -78 105 157 137 108 -149 -198 107 100 -128 -302 -92 -97 -273 144 -23
4109b3q4PM10n02L34n8N9J25n29N27m97R9K13j80Q9m59L54K31j13l8M1J2q0r8
$$ -23 -107 -100 310 -192 142 84 143 268 -261 266 -231 -132 81 -99 -10 -469 -115 116 3 -35 6 18 -62 -160
4133a60O1L53k11J40k7j54j5J54Q8k20J83k26RP1J1j75K50l13J98K13l43J65J19
$$ -160 -99 254 43 183 156 2 -13 141 229 9 192 -34 -25 46 57 -118 132 -181 17 230 -113 52 171
4156A71L2k18j74L23R9j47l12L45n4k39K34j37k23L14lk03M54k37J32J0k37m3
$$ 171 203 -15 -189 134 233 86 -226 119 65 -174 60 -77 -300 14 11 -192 262 25 157 167 -70 -113
4178a13K48K3k26J86K8j77j36J52j17j04L0J37j60J13J59J80k85J70l03M36P9
$$ -113 135 158 -68 118 146 -31 -167 -15 -132 -236 -206 -69 -229 -116 43 223 -62 108 -195 241 320
4199C20k50N0k8p4O8j35J48q7J12p1Q4j18j6l3K3J50j59k36J97N08m31J26k19
$$ 320 70 120 92 18 86 -49 99 12 124 53 137 19 3 -30 -7 143 -16 -252 -55 453 22 148 -71
4222g1J4p8R1L37n43K81nJ26j23l1j5k37L90j13k54L73m03L38O5o4J5k21K89k61
$$ -71 -57 -135 -44 293 -250 31 26 152 29 -2 -17 -254 136 23 -231 142 -261 77 142 78 93 -128 161 -100
4246a00K14k78J45j60J70Q3Q1m55K51J74J0O0j3j09j35O9J1r4O7J25k42K3j62
$$ -100 114 -164 -19 -179 -9 74 155 -300 -49 125 135 195 182 73 -62 7 18 -76 -9 116 -126 -103 -265
4269b65J70J30L09q5j56j88J27p6L38l21J81k03N1j44k8J89k39M53k83o2j00J55
$$ -265 -95 35 344 259 103 -85 42 -34 304 -17 164 -39 12 -132 -160 29 -210 243 -40 -102 -202 -47
4291d7o0l3J36Mn5L1j46L8J0J92q3J33q1q4Q1k34M20r7j85K99O5j97r0j56J68
$$ -47 -107 -140 -4 0 -55 -24 -170 -132 -122 70 -13 120 39 -45 36 -198 222 125 -60 239 304 107 17 -139 29
4316B9J0r8J45k13K02J82n51K33n0J92J9j14j4r8j3L34l40q3L29l56L22M6j28
$$ 29 39 -59 86 -127 75 257 -294 -61 -111 81 100 -14 -28 -126 -139 195 -145 -228 101 -255 67 113 -15
4339a5j59J32J17Q9K2n8r3k07L44k59K62l3k06R2k99L24j20K5jKN6L4j62j82M49
$$ -15 -174 -42 75 164 186 128 35 -172 172 -87 175 142 -64 28 -271 53 -67 -42 -43 -41 15 49 -113 -295 154
4364A54k2r2kk15L86l90L05QLk07P2J00J10j46q6n8N9L07n70K39K86n63J16M42
$$ 154 132 40 38 -177 209 -181 124 132 135 -72 0 100 210 64 -22 -80 -21 286 -284 -45 241 -322 -206 236
4388B36Pk35K4K42m51K81Q7j99p5J65l88L49l5p7J63k02O3l3J14j47K23j00j58
$$ 236 243 8 32 274 -177 104 191 -8 -83 82 -306 43 8 -69 94 -108 -45 -78 36 -111 112 12 -146
4411a46J59l0l1K47j28J22l8n0j30k89K45Q1M6J67n35M85J14k78J30j19k1j60
$$ -146 13 -17 -48 199 71 193 155 105 -25 -314 -69 12 58 225 -310 175 289 11 141 22 1 -159
4433a59M37m13l4L52j51j63j07K95Q1p4j91Jk9K14%P2nr3K28k65n4Q6q4K63k09
$$ -159 278 -135 -169 183 32 -131 -238 57 138 64 -127 -126 -155 59 59 131 126 33 261 -4 -58 28 -56 207 -2
4458bq8J15J46k32j81J50K92j71j14L3M29j32j19M5j59O3M4r1MQ0J15k0j65J25
$$ -2 -90 25 171 -61 -242 -92 200 29 -85 -52 377 245 126 171 12 75 119 28 32 112 227 207 42 167
4482A67k85J37O0j06q6K61k02K62k90J70K22l20o0k93K62j99L62O4l72N01l77
$$ 167 -118 19 79 -27 -113 148 -54 208 -82 88 310 -10 -70 -363 -101 -300 62 126 -246 255 -122
4503a22j21L74J69l59K7k34M64n1k11K81l36K39N9Q5k67L3m59M31K79j55l14L57
$$ -122 -243 131 300 -59 -32 -266 198 147 -64 217 -119 120 179 264 -3 30 -429 2 281 126 -188 169
4525A69j82J02J2j56J58k12J81L0j47j44L33J92k41l34L60j43m7K4J79q1k93J64
$$ 169 -13 89 101 -55 103 -109 72 102 -45 -189 144 336 95 -239 121 -22 -69 -45 134 53 -240 -76
4547g6Qj07J57O7q9o0l13m4M13R4l81M45j55o1l56L74K23K86j80m61J04N7M1p2
$$ -76 -68 -175 -18 49 -40 -100 -413 -457 -44 50 -331 114 -41 -102 -458 -84 139 425 245 -216 -112 -55 -14 -86
4571h6Kk39J78j60L1p2K57l8J50o5J04J21j69J64Nk8j01O6n4k09M1K79R4l12J20
$$ -86 -84 -323 -145 -305 -274 -346 -89 -127 23 -42 62 183 14 178 183 155 54 120 66 -143 -102 177 271 -41 79
4596G9j24k7J73J8K05n10KJ43m7o9K00J16n36M66m3m88L30j14J43jJ92l91K16
$$ 79 -45 -72 101 119 324 -186 -184 -41 -88 -157 43 159 -377 89 46 -442 -112 -226 -83 -84 108 -283 -67
4619f7K43m78M43j10K5k14J24k06N9M35q9k73K47j41k4J07k77J85l8J85j41J11
$$ -67 176 -302 141 31 56 -158 -34 -240 -181 254 165 -108 139 -2 -26 81 -196 -11 -49 136 -5 106
4641A06k98J64K4l5L8RJ27j17mm9j22J31Q3K23m92RL74m2j18J05o1M4J92k97q4
$$ 106 -192 -28 -4 -39 -1 8 135 18 14 -35 -157 -26 57 280 -212 -203 171 129 11 116 55 99 291 -6 -90
4666i0R4J55Po3JJ77l88K56q4l0l59M06j9R6m00J54L29n04K28j05P3l8J7K71P4
$$ -90 4 159 166 103 104 281 -107 149 65 35 -324 82 63 159 -241 -87 242 -262 -34 -139 -66 -104 -87 184 258
4691B58k97j06j81N40l34K63n85M01J00j90J42o7P4K55o8J5l30K73K12n41K56
$$ 258 -39 -145 -326 214 -120 143 -442 -41 59 -131 11 -56 18 273 205 220 -110 163 375 -166 90
4712I0j26M57m49k72J88Q8j12l2J11k0M4Q3j28K27k77K97k68L7L90l55l5N5J85
$$ 90 -36 421 -28 -300 -112 -24 -136 -168 -57 -77 -33 50 -78 149 -128 169 -99 -62 328 -27 -62 -7 178
4735A78p7M8l37K09P6J42k37k30J10K65q5k25j50N95l39J83j96j09L80j89k66
$$ 178 101 149 -188 21 97 239 2 -228 -118 147 62 -163 -313 282 -57 126 -70 -179 201 12 -254
4756b54N13k49pk6K23k8j06m9j33J12JJ16k60L1K1J60o7K61m01K85k35K92n24
$$ -254 259 10 3 -23 200 172 66 17 -116 -4 -3 113 -147 -116 -95 65 -2 259 -142 143 -92 200 -324
4779c24rL10R4o4j87q1J81K72O9l84K80J06l83j32L07K17n7m20M8J5j09J14J38
$$ -324 -333 -23 71 7 -180 -261 -80 192 261 -123 157 263 -120 -252 55 272 215 -205 -157 -142 -251 -137 1
4802AL7JQ8j11o6L82k35L0m52M16oK7L0J49k29k26M01j97o7M9j89j85L62K19k38
$$ 1 38 39 127 16 -50 332 97 127 -325 91 85 112 142 291 62 -164 237 40 -27 22 -167 -352 10 229 -9
4827ij09j3P6L9l3JJ6J2J32k3m7k68N45L0m46L27k78J2P5P3k99J80K16k50J15
$$ -9 -118 -131 -55 -16 -49 -48 -32 -20 112 89 42 -226 319 349 -97 230 -48 -36 39 112 -187 -7 209 -41 74
4852G4j62j50j59O66l15K1j49J49j97N2K93k44j22O7LM53l91J02Q1j00n0k64m2
$$ 74 -88 -238 -397 269 -46 -25 -174 -25 -222 -170 123 -121 -243 -176 -173 280 -111 -9 72 -28 -78 -342 -384
4875c84M39M8j40M8K8m33L40k22L19j74K20l1m67L90K7J5Q3j32K42j07K9R7r9
$$ -384 55 103 -37 11 39 -394 -54 -276 43 -131 89 58 -409 -19 8 23 106 -26 216 109 138 235 136
4898A36k05k34K79K75k43k04L73o07O41k28l4l9j2O1K1J04j46j83L51J51k17J89
$$ 136 -69 -303 -24 251 8 -196 177 -430 211 -17 -51 -90 -102 -41 -20 84 -62 -245 106 257 40 229
4920B29J52n70K38j61j9J58P8j85K13J3j99J21J6L7P8p3k84J08P2K09l25J73j41
$$ 229 381 -189 49 -112 -131 27 105 -80 133 146 -53 68 84 121 199 126 -158 -50 22 231 -94 79 -62
4943f2J9j77J29K63q5J23m36N55k61J29j75L2J41k65j34K77j00j25L40l38K63
$$ -62 -43 -220 -91 172 87 210 -226 329 68 197 22 54 195 -70 -204 73 -27 -152 188 -150 113
4964A13j40J29J50J61m32k3L49l12M6J92l12n9J84J86n38M41k09J09l9P4O3j57
$$ 113 -27 102 252 413 -19 -42 307 -5 41 233 -79 -138 46 232 -306 135 -74 35 -4 70 133 -24
4986b4K4K3k74L80k37J49j45j05L41k07Q5r3k10L81O4j09m9m4J02k30K52l26J52
$$ -24 0 23 -251 129 -108 41 -104 -209 132 -75 10 -83 -293 88 152 43 -6 -50 52 -178 74 -252 -100
5009a00l39N32n7J4Pk64P3L71m03L51k89P2k5q0J26M2l18P4L15j8l8k26J72j74
$$ -100 -439 93 36 50 57 -207 -134 237 -166 185 -104 -32 -57 -137 -11 31 -287 -213 102 84 46 -180 -8 -182
5033a82J62P8q5J76k75M8rNj10Q6K17j15j20K05k30K15o1q2k56M24%k04K80l23
$$ -182 -20 58 -27 149 -126 -78 -87 -82 -192 -106 111 -4 -124 81 -149 66 5 -77 -333 91 91 -113 167 -156
5057a56P3Q1j54p0K19R9q8j42K84l83M10m4J34q8j74J3j96K16j01K69k98N4R7
$$ -156 -83 -2 -156 -226 -7 92 4 -138 146 -237 173 129 263 175 1 14 -182 34 -67 202 -96 -42 55
5080E5r7R7K13l03k37m3K21N23o36L84l8l57M00M1N2p8m36L9l36P92j72l38L77
$$ 55 -42 55 268 -35 -272 -315 -94 429 -207 177 139 -218 182 223 275 197 -239 -200 -536 256 84 -254 123
5103A23NL2K4l22M70m55N30k78j45j2M15l89k9q4P2J72rm42L85L65m67q8K56r2
$$ 123 128 160 184 -138 332 -123 407 129 -16 -28 387 -2 -31 -115 -43 129 120 -322 63 428 -39 -127 129 37
5127C7J6nM6J93k29J03k28q7J39M5J82O0l65o9K54j70k54J88J20P4q9K52l9m1
$$ 37 53 48 94 287 58 161 -67 -154 -15 30 212 272 -93 -162 92 -78 -332 -144 -24 50 -39 213 174 133
5151A33l75J74K00k67L15l23l2J76j57M18m38kP8N8P7k16L00P3k42J4j20K15r2
$$ 133 -242 -68 132 -135 180 -143 -175 1 -156 262 -176 -178 -100 -42 35 -181 119 192 -50 -36 -156 59 -33
5174c3J8R4j27m1k39J46P7n5J70L04l25j09J82m16N57j10k45L11j72O5j13j08
$$ -33 -15 79 -48 -89 -328 -182 -105 -160 10 314 -11 -120 62 -354 203 93 -152 159 -13 52 -61 -169
5196a69P65o45q1J6k5L72k07J66k75K12k17j06K79m06K37N2n6k31K36J66l57L38
$$ -169 596 -49 -130 -114 -139 233 26 192 -83 129 -88 -194 85 -321 -84 -32 -88 -319 -83 83 -274 64
5218F4K9Nj09j1K43m01K34l47k0K44K82k80J6M8j91M18j20jr3l45K61K9J41j15
$$ 64 93 98 -11 -22 221 -180 54 -293 -313 -69 213 -67 -51 -3 -194 224 104 103 10 -335 -74 -45 96 -19
5242a9j08K23j41j45J91K3J6qp9j61L45k26k40M36J69k19l55kJ77M9k34L34Q5
$$ -19 -127 96 -45 -190 1 24 40 32 -47 -208 137 -89 -329 107 276 57 -298 -300 -123 -74 -308 26 111
5265A11j90J94k47J34j99Qk1J71j03p4j1J53j18K01on2J25j30L15j91O1j08j23
$$ 111 -79 115 -132 2 -197 -189 -210 -39 -142 -216 -227 -74 -192 9 3 -49 76 -54 261 70 131 23 -100
5288a00J56J16j46J88J3l75L53m2M4j76P9k4j53o1R2m7k1J26K52k5j54M3K76n69
$$ -100 56 172 26 214 227 -148 205 163 207 31 110 86 -67 -128 -36 -83 -104 22 274 249 95 138 414 -155
5312a55k3M45o15M86OO3k98L0j35P2K44n63M52N7k77R9J70m0j44J84k23J35Q0
$$ -155 -178 267 -348 138 144 207 -91 -61 -196 -124 120 -443 9 66 -211 -112 58 18 -126 58 -165 -30 50
5335E0K26k18r7J16j92K6j00K03J32q0J0k39J78J2k01L39p7k06L7R8Q3o8n82P97
$$ 50 276 58 -39 77 -115 -89 -189 14 146 66 76 -163 15 27 -174 165 88 -118 -81 17 100 32 -550 247
5359B47k89k8JK25Oj60j42J39m1p6K58k71K53j38J58l64L27k82K38n4J90n01q0
$$ 247 -42 -70 -69 156 162 2 -140 -1 -42 -118 140 -131 122 -16 142 -222 105 -177 61 7 197 -304 -384
5382c84L89M7p9m6j23J82r1R0k62L25K48p3m6k20J3j28J75j55K36m16L30J16m3
$$ -384 5 52 -27 -73 -196 -14 -105 -15 -277 48 296 223 177 -43 -30 -158 17 -138 98 -318 12 128 85
5405H5K22m71J47J53q3l24M78n7l70L91k69j83L97k15n3J44l7o0R3j26J93l22
$$ 85 307 -164 -17 136 53 -271 207 150 -220 171 -98 -281 116 -99 -152 -8 -45 -105 -12 -138 55 -267
5427b67K12j02K58k05M9J12J58l83J88n3q5K23j99J07J13k25Q8q6P9l65L23L17
$$ -267 -55 -157 101 -104 -55 57 215 -168 20 -33 -118 105 -94 13 126 -99 -11 -97 -18 -383 -60 257
5449B57k57j59J93L8j74O4K09o1N1k58L9K45l20J47j27j25K34K08k26J73J36k80
$$ 257 0 -159 34 72 -102 -38 171 110 161 -97 -58 187 -133 14 -113 -238 -4 204 -22 151 287 7
5471Gj9J77j89q8R5n6J40j34K04K74m09K13j41k84J04K49j97k7J61L9l35r2O11
$$ 7 -12 165 -24 -112 -17 -73 67 -67 137 411 2 215 74 -210 -106 143 -54 -81 80 119 -216 -308 303
5494C03l05J46k05K01J55o95M73m0K50j26j95k57M50J4k17J47J73l25K49k30K01
$$ 303 -2 144 -61 140 295 -400 73 33 283 157 -38 -295 155 169 -48 99 272 -53 196 -34 167
5515A67j59l7K59n47L49M4l49j15J77L73k68MJ01j71P4k28J97j0J60k33PO1K35
$$ 167 8 -29 230 -317 32 76 -273 -388 -211 162 -106 -102 -1 -172 -98 -326 -129 -139 21 -212 -205 -144 91
5538I1r4Q0j95k23J59J88j81J35j19J69K9k82K28J44j20j03J41l4P0j49K92p3
$$ 91 -3 77 -118 -341 -182 6 -175 -40 -159 10 39 -243 -15 129 9 -94 47 13 83 -66 226 153
5560A53j58j39J42J07qo0j74n6L90ok56J12O9j48K44l02j75L24k12j90L54j27
$$ 153 -5 -144 -2 105 97 37 -137 -193 197 191 -65 47 116 -32 212 -90 -265 59 -153 -343 11 -116
5582a16k5O2R3m1J34J00j07j53J77p3l2Rl47K06l3J32J85k47J65k32j4J97r6P3
$$ -116 -141 -79 14 -27 107 207 100 -53 124 51 19 28 -319 -113 -146 -14 171 -76 89 -143 -157 40 -56 17
5606A7k13K42k18N24n82N13j14j48lj20K6K17k49L54k72O9J5r8N2J64lP8k18l4
$$ 17 -196 46 -172 352 -230 283 169 21 18 -102 -76 141 -108 246 -26 43 58 -40 12 176 173 251 33 -1
5630am5k10J64L80l89j73K35j82J59R4j58J34J13q0k25J58n1J14j72M3q7K56n2
$$ -1 -46 -256 -92 288 -101 -274 -39 -221 -62 32 -126 8 121 41 -184 -26 -77 37 -135 -92 -179 77 25
5653B5p6j33J4K77p6P8R5l43Q5k24M39k35k11J49j15L02j04O5K09k21K3l73O76
$$ 25 -51 -184 -170 107 31 109 204 -139 -54 -278 161 -74 -285 -136 -251 51 -53 12 221 0 23 -350 326
5676C26k80j44j47J66K71j54pj9M0j48j8J64k58L32oK7Q9j97r6K92m68L43J6l38
$$ 326 46 -98 -245 -79 192 38 31 12 52 -96 -114 50 -208 124 118 145 234 37 -59 233 -235 108 124 -214
5700b14L78j14J23l86J5N3N6N5J9O8k19M70k61n3p4k29M47j30k52J05L33n21K34
$$ -214 164 50 173 -213 -198 -145 -89 -34 -15 53 -166 304 43 -10 -84 -313 134 4 -248 -143 190 -331 -97
5723i7L6N4j80J99j38K11k6Ko4p5J55l94L09k00J85l1q4K14n8k30K13pM60m55
$$ -97 -61 -7 -187 12 -126 85 59 61 -3 -78 77 -317 -8 -208 -23 -54 -138 76 18 -212 1 -6 454 -1
5747ak30L03j22Pj52O3J63M9k26K08jk58k21M54K26j99P6j16j66K70n46L02k2
$$ -1 -231 72 -50 -43 -195 -132 31 80 -146 62 61 -197 -418 36 262 63 139 23 -143 127 -419 -117 -139
5770a39J38J10j40o8K97r8Nm1k67J14J79L1k1l41j3L26n6L6N6J62j73j49R4j13
$$ -139 -1 109 -31 -99 198 100 105 64 -203 -89 90 121 100 -241 -254 72 16 52 108 270 97 -52 42 -71
5794g1K1N64n18n1j97J98qK4J37k47N1K78n3l09K27J06o6L36p19P8K41N6m53M82
$$ -71 -50 514 -4 -55 -252 -54 -62 -38 99 -148 -97 181 128 -181 46 152 86 422 -297 -219 22 78 -375 107
5818A07k85L09k77P6J85pK26l96L04m51q5K56K34k04K07l07j7O4q1J25m8J21r2
$$ 107 -178 131 -146 -70 115 108 334 -62 242 -209 -294 -38 196 -8 199 -108 -125 -61 -142 -17 -65 56 -36
5841c6L0J37k32j39L47J98l11J1J9k61J17K89k41m2Q5l7K34k04J3p0k50L62q5
$$ -36 -6 131 -101 -240 107 305 -6 5 24 -237 -120 169 -72 -114 -29 -66 168 -36 -23 -93 -343 19 -66
5864f6K59j69o7j14K10k3p2L07j79k08K70m19J41J78l32M10k27P3L7k0j64J69
$$ -66 193 24 -43 -157 53 30 -42 265 86 -122 148 -271 -130 48 -284 126 -101 -28 9 -11 -175 -6
5886fK6M5N5k90l7l1J53N7k92L46j13j42M30J32J74o05K33m01N95j80K52k73P4
$$ -6 20 65 120 -170 -207 -238 -85 -28 -320 26 -87 -229 201 333 507 -98 135 -266 329 149 401 128 202
5909B02p0j46o9J01r4L3Q4j54JM7m9K08k01J10nj75J82J17l00J8M03J0l41M77
$$ 202 132 -14 -83 18 -76 -43 41 -113 -112 -65 -114 94 -107 3 -2 -177 5 122 -178 -160 243 253 -88 389
5933C89l16J38k53j15K86Q2k35l5j0L77o4k65j18J37q2K4J9q5L94l73j5K8J78
$$ 389 73 211 -42 -157 129 211 -24 -59 -69 308 244 -21 -139 -2 -84 -60 -41 -126 268 -105 -120 -92 86
5956H6p8P1k25J15J52K20l53J34k01J75o8M8p5l37L40p6l7L0M5j74J53K57l72
$$ 86 8 79 -146 -31 121 341 -12 122 -79 96 28 76 1 -336 4 -72 -109 -79 -34 -208 -55 202 -170
5979a70L06Q0P4j20l33L74k60m6J08Rl18K32J4K38n0k09k26L07R6j94L37m01J84
$$ -170 136 216 290 170 -163 211 -49 -95 13 22 -296 -64 -50 188 138 -71 -297 10 106 -88 249 -152 32
6002C2j6P1r2j46L67m53L47l0J98k33j69j44M21k97O2J50J41n60L63m0j00j53
$$ 32 16 87 -5 -151 216 -237 110 80 278 45 -124 -268 153 -144 -82 68 209 -351 12 -28 -128 -281
6024b81K80J6n2J00J24j41J7k53J42j75J32j0QK9J42o9l09L43P8j08L4j95M43
$$ -281 -1 15 -37 63 187 46 63 -190 -48 -223 -91 -101 -93 -64 78 9 -300 43 121 13 47 -148 295
6047B95k74k3R0Om02L69j31K39Rl8j13m3K7j68L03k32Nk01M13Lj07j11J84l63
$$ 295 21 -2 88 94 -308 61 -70 169 178 140 27 -16 11 -157 146 -86 -81 -282 131 134 27 -84 100 -263
6071b63L42n1m7J15j34J70n2k3M3j02j65J87K9K41k25M6k5r5k93J45L33k44K1
$$ -263 79 28 -19 96 -38 132 80 57 100 -2 -167 20 49 290 65 111 86 -9 -302 -157 176 -68 -47
6094d7L9p4J94m4j9L6mJ8j60l50O14k45M2J66l63M83k94Q2n3N5K02j88q6kj10
$$ -47 -8 -82 112 68 49 85 81 99 -61 -411 203 -42 0 166 -197 286 -8 74 21 76 278 90 4 2 -108
6119a08k9L81m27L02m16N12n9k31k60K67M4J09O7q1p9K29l05O5P4k09M43n17J81
$$ -108 -137 244 -183 119 -297 215 156 -75 -335 -68 -24 85 152 71 -8 221 -84 -19 55 -154 289 -228 -47
6142d7j1J00k29r1K00J43J85o5k42K23j09j83M7J13k3N8k85K12o6K27k25J24k17
$$ -47 -58 42 -187 -278 -78 65 250 185 -57 166 57 -126 -79 34 11 69 -216 -4 -70 157 -68 56 -161
6165a61M2R8R1j29L6J68r3n1J69Ok24Rk4l10L26r6q0J92M2n6J16k17M9J2J52j38
$$ -161 -119 -21 70 -59 -23 145 52 1 170 176 -48 -39 -63 -373 -47 -143 -223 -31 11 -45 71 -146 -97 -85 67 -71
6191g1L03k17K76j9k99J40J37j93mk65L89l59L95l15K29K1l23K31j4J52k73M93
$$ -71 232 15 291 272 -27 113 250 57 53 -212 177 -182 213 -102 127 148 -175 56 42 194 -79 414
6213D14m90O1M7J21j25J08q6q3J99n4l46q2M25r0K99l83L75k95J83k34r9j72K13
$$ 414 -76 -15 32 153 28 136 50 -33 166 112 -234 -316 109 19 318 -65 310 15 198 -36 -135 -307 -94
6236i4J15J1q9J31O1l04K21J3k16P6k07M9L94k27l0K17j02j17M54j91m09K79K42
$$ -94 21 32 -57 74 135 -169 52 65 -151 -75 -282 -233 161 -66 -96 121 19 -98 356 165 -244 35 277
6259B77l12P0J26k23j63N8J6O1K66j10k16J25m6J40j40J95k19K56K15l88Q6o4
$$ 277 -35 35 161 -62 -225 -167 -151 -90 176 66 -150 -25 -71 69 -71 124 -95 161 376 -12 74 10
6281A0P6o0k0K57j9k87j06R3J75j23K20k29J67k81K1J51m96M49j94L14j61j20
$$ 10 86 26 6 263 244 -43 -149 -56 119 -4 216 -13 154 -127 -106 45 -451 -2 -196 118 -43 -163
6303a63K01j01L6r3j66J05J85j26j44L89j70J18J01j64n2R0j86L8j23L27k54K03
$$ -163 38 -63 -27 -120 -286 -181 4 -122 -266 123 -47 71 172 8 -44 46 -140 -102 -225 102 -152 51
6325E1j05n1K23m38M21M0k18m7L95m13K01j05m7J35j22k3J35l3J10l9J60O4n97
$$ 51 -54 -105 118 -320 101 141 -77 -124 271 -142 59 -46 -93 42 -80 -103 32 -1 109 70 230 294 -303
6348c03QL68n0K4o1Q9nO1p5j05J63k65J44M39n28mJ33j21K15j51J11J08j02j40
$$ -303 -295 73 23 47 -14 75 70 131 56 -49 114 -151 -7 432 -96 -100 33 -88 127 -24 87 195 93 -47
6372d7L2O6O9m40P81m75j2M05k30m04L37j51J74j65K18j50Q8j58J65L2k96J78
$$ -47 -15 51 120 -320 461 -14 -26 379 149 -255 82 -69 105 -60 158 8 96 -62 103 135 -161 17
6394A7R3N1lj56K92k08k5k2j95J30K6l8j37Q1M4Q0j31J84l41J86k65K87j28j80
$$ 17 110 161 158 2 294 86 61 39 -156 -26 0 -38 -175 -94 -50 30 -101 83 -258 -72 -337 -50 -178 -358
6418c58K39M81k14l55q7K72l4P1P8k60J63m5M6N8o7J10q1j48j07K27M0L5o9j5
$$ -358 -119 362 148 -207 -294 -22 -56 15 93 -167 -4 -49 -3 55 -12 98 17 -131 -238 -11 29 64 -5 -20
6442b0j46K71N8n4l09L77j05l13Q0J11J09M9M4j51J62j61o5m8J50J93j98j10K85
$$ -20 -166 105 163 109 -200 177 72 -241 -161 -50 59 108 152 1 163 2 -63 -111 39 232 34 -76 209
6465B09k88q1pJ73r6J67Qj80k51M35R1j32j29J57o4j13J17J37L0L7l9l92M04k41
$$ 209 -79 -160 -167 6 -90 77 85 -95 -346 89 180 48 -81 76 12 -101 16 153 183 220 181 -211 193 -48
6489d8J94k16J22j88J93pn6J33l4L6j79K11k34n2p0M05k48J5K91m5m88K24J89
$$ -48 146 -70 52 -136 57 50 -6 127 93 129 -50 161 -73 -125 -195 210 -38 -23 268 223 -265 -41 148
6512A48l37P4K78n6j47j96M02m4k00nJ19m9n45O78l17N27m30OK87l50J8N9K3j66
$$ 148 -189 -115 163 107 -40 -236 166 122 -78 -83 36 -13 -558 120 -197 330 -100 -94 193 -157 -139 -80 -57 -223
6536b23L62p9j74K18j80j58M02M6N5n33J61J71j2PR8j20r2p0p2J57Q6K6N7k54
$$ -223 139 60 -114 104 -76 -234 168 214 269 -264 -103 68 56 63 161 41 -51 -121 -193 -36 50 76 133 -121
6560a21K05n6k35K83j63J11J87n64K58J23m03M92j50K87l0P4m15Q1K71j76j80
$$ -121 84 28 -207 76 -87 24 211 -353 -95 28 -375 117 -33 254 224 298 -117 -36 235 59 -121
6581a21kO2K21m20L19q7K57l41L56k70o2o7j6J81r2l6k2J70K86n34J40J8K84m90
$$ -121 -123 -61 160 -260 59 -28 229 -112 244 -26 -88 -155 -171 10 -82 -118 -140 30 316 -218 -78 -60 224 -266
6605b66L1J66R9j97J31n7rk1K5J71K5j72k6O1j76J81p6O9k30K54j92L46m08L09
$$ -266 -235 -69 30 -167 -36 -93 -102 -123 -98 73 98 -74 -100 -39 -215 -34 -110 -41 -271 -17 -209 137 -271 38
6629C8n0M3K14k23M1O8J4q8j90J37k74M54k19K8k19M21k07K6J4J7JL1j70J58J74
$$ 38 -12 31 245 22 63 131 145 57 -133 4 -270 184 -35 -7 -226 195 -12 14 28 45 46 77 -93 65 239
6654B39j03n95L19J46j18L41m38K03j26M81l89N5k06M02l86J07R3k90M8K13J73
$$ 239 136 -459 -140 6 -112 229 -209 -6 -132 349 -40 15 -191 211 -175 -68 25 -265 -217 -4 169
6675A69j30rl5J10RJ26O0k09J9j46n1q2K01Q4q7J28j6N9m12q4N0J31R8j74JP8
$$ 169 39 30 -5 105 114 240 300 91 110 -36 -87 -169 32 116 29 157 141 200 -212 -296 -246 -115 -17 -191 -190 -112
6701a12J24J86l55m3L47r2p7K96l47P1k0Q5l04K74J23j55L5j45J26K75k72j0K55
$$ -112 12 198 -157 -200 147 55 -22 274 -73 -2 -22 63 -241 33 156 1 36 -109 17 292 20 10 265
6724B65m46N46n11j8K1J13k34L51k99J76p8O0k92N27l11J66M8o0k59O2J55j72
$$ 265 -181 365 -146 -164 -143 -30 -264 87 -212 -36 -114 -54 -346 181 -130 36 84 24 -235 -173 -18 -190
6746a90J08J17K9r8Q3J93k04k91J40J63k3J10j34K79m11J86K85n24L86j06m3k57
$$ -190 -82 35 64 -34 49 242 38 -253 -113 50 27 137 3 282 -129 57 342 -182 204 98 55 -202
6768b02K40k80K02k55O3Q6K03K0q3J46N0k85K09J93j28J11l65l0L69m96N6K25
$$ -202 38 -242 -40 -295 -232 -146 57 77 -6 140 190 -95 114 307 179 290 -75 -105 264 -232 -176 49
6790D9qk02Q0L05l61k0l10L16L39j96k03J70j12JN7j98K48M2N9j79K63l78N52
$$ 49 41 -161 -81 224 -137 -157 -467 -151 188 -8 -211 -41 -153 -152 -95 -293 -45 -3 56 -123 140 -238 314
6813C14m5k95J88j73j35J23j27L96Q5k31k00Q5L39l40J19J57l3j41j14P2N9O7
$$ 314 269 -26 162 -11 -146 -23 -150 246 331 100 -100 -15 324 -16 103 260 227 86 -28 44 103 170
6835A70q7n4j43p8J33J76j78M3L35j5k65J58k75K93L16o92M09l15L76k29l38K50
$$ 170 83 29 -114 -192 -59 117 -61 -18 317 302 37 195 -80 213 529 -163 246 -69 307 78 -260 -10
6857a0J76k33K50l04O0j09L82k51r5K88k75n6J17l9K11K12l24nK47k46j79L56
$$ -10 166 -67 183 -121 -61 -170 212 -39 -134 154 -121 -177 -60 -99 112 324 0 -5 242 -4 -183 173
6879A73k83J1J83j95J77m7K18k84m3k5P4L11k45L8N8J39k86j47K96k67L0O3K06
$$ 173 -110 -99 84 -111 66 19 237 -47 -90 -115 -41 270 25 63 121 260 -26 -173 123 -144 -114 -51 155
6902A55j30J00m1q0q6J38j02M1K99l26j52M5J0J04K36k00l0J3%J27k33K27j93
$$ 155 25 125 84 4 -82 56 -46 -5 294 -32 -184 -139 -129 -25 211 11 -19 -6 -6 121 -112 115 -78
6925g8J94J34m01Kp3J92M0J01L8j09l00M57j74K07m58K99M8j01Q6k76M3P4M3m1
$$ -78 116 250 -151 -149 -222 -30 10 111 149 40 -260 197 23 230 -228 71 119 18 104 -172 -129 -55 -12 -53
6949e3Q8k8K41m96J24J23k25M87l39p2j88Q7M05j33kj16j14R3J42j00K04J15j59
$$ -53 35 7 248 -248 -124 -1 -226 261 -78 -150 -338 -251 154 21 19 -97 -211 -118 24 -76 128 243 84
6972H4QM8k48K84k04J6j81R5J81l78K33J76j55j6J9K48k78J89j52k93K38j49M08
$$ 84 92 140 -108 176 -28 -12 -193 -98 83 -295 -62 114 -41 -57 -38 210 -68 121 -31 -324 -86 -235 173
6995A73o7j64j3K49k53N1j72L82m08L73m4j30J70k43L45k28k85L11j96J10K68
$$ 173 106 -58 -71 178 -75 -24 -196 186 -222 151 107 -23 147 -96 249 21 -264 47 -149 -39 229
7016B29l80j59K34J59j3j32n3ML36k22n7l2Q1Q6J48j75k4N7j2j60J01Q8k95o2
$$ 229 -151 -310 -76 83 70 -62 -115 -111 225 3 -54 -86 -5 81 229 54 30 87 75 -85 16 104 -191 -253
7040b53L67r5p8L43o7m61J69P2J39n6K2J51q4l79K64R9m27K63Q5L0k72R5K52j99
$$ -253 114 19 -59 284 217 -244 -75 -3 136 80 102 253 169 -210 54 153 -274 -11 74 104 -168 -73 179 -20
7064b0P7K1n2o5Q3N1J64m7L5k14j61M63j17l08L58j31K17L3m10j23K8Q4P6l1j02
$$ -20 57 78 26 -39 44 95 259 212 247 33 -128 335 218 -90 268 137 354 387 -23 -146 -118 -34 42 11 -91
7089i1R2J6q9J08J55j22k76K71j54L31n65M49j84O3j67J20L9K81l39k33J76l3
$$ -91 1 17 -72 36 191 69 -207 64 -90 241 -324 125 -59 4 -163 -43 -4 277 -62 -295 -119 -152
7111a52J71Q9J95J51l31r6j09K14l60J33L59n39L82j28Q5q1Jj34j5J8K01k2Rk56
$$ -152 19 108 303 454 123 27 -82 132 -228 -95 264 -275 107 -21 64 -17 -16 -150 -165 -147 54 32 41 -215
7135b15P6K44L7K83k24k95J94J46o3o5j49J26J9k43J79n7j26J29J62k74J14Rk08
$$ -215 -139 105 142 425 201 -94 100 246 183 118 -31 95 114 -129 50 -7 -133 -4 158 -116 -2 7 -201
7158b01L36kj01j96lk94M84j05LJ38p1K09k66j14J17K06o9K5q8j65K41R0J6l41
$$ -201 135 133 32 -164 -167 -461 23 -82 -79 59 -12 197 -69 -183 -66 140 71 96 8 -157 84 174 190 -151
7182a51K47j66K71k60J95o8k24J94j76j4L7p7q7N09l83o0K47k42K74O7J10j37
$$ -151 96 -70 201 -59 136 68 -156 38 -138 -152 -115 -192 -279 230 -153 -213 34 -208 66 133 243 106
7204A06j81J43k93L14q1J12M5O1j7l61K20K83k10Q4k02l10M08o5m8j38K11l89
$$ 106 -75 68 -225 89 8 120 165 226 209 -152 68 351 141 225 23 -287 121 56 8 -130 81 -308
7226c08L57j6Lp6Jj18j00L46m7K6O7m70J99P5j35J75J89k4j26l6K98j69j97J62
$$ -308 49 33 36 -40 -39 -157 -257 89 42 68 135 -335 -136 -61 -196 -21 168 144 18 -18 280 111 -86 76
7250G6L08l95JN6R7q1l4n3M6j53K43L3m10K0L36l09J22j03M86k64L40k59m5Q1
$$ 76 384 -11 -10 46 143 62 28 -25 21 -132 111 144 -266 -246 90 -219 -97 -200 286 22 362 103 58 139
7274A39J70l82K47l09J52r3p1Q8o9K0R0Q3k33J18j28Q4J65l30M40k81J03k21J13
$$ 139 309 -73 174 -135 17 -76 -147 -59 -128 -108 -18 65 -168 -50 -178 -94 71 -259 181 -100 3 -218 -105
7297a05J59k7k19K46J42k02R4q4J1L83m77lJ84j38J19J59j77j12l7o0L48j59r5
$$ -105 54 27 -192 54 196 -6 88 4 15 398 -79 -82 102 -36 83 242 65 -47 -84 -144 204 45 -50
7320e0J07Kj44K2L1k19J10L20j91Mj42J57m1L49m31J14N2j68L18p0j06L8J87j98
$$ -50 57 59 -85 -63 -32 -251 -141 179 -12 -8 -150 7 -34 315 -116 -2 50 -118 200 130 24 62 249 51
7344E1o5l95K00J78r3J22N4j76J70J64k8J48k68l33M05l59J49K48j51J71k37q8
$$ 51 -14 -409 -209 -31 -124 -2 52 -124 46 210 182 330 62 -271 134 -225 -76 172 21 192 -45 -133
7366a33O8j43j2L28m2j56k2k13N21j52o7k90L73j70P4p8J07J8l62L68o9J65j02
$$ -133 -65 -208 -220 108 66 -90 -112 -325 196 44 -23 -313 60 -110 -36 -114 -7 11 -351 17 -52 113 11
7389A1K96m98O4L24m10K64j39J44j32l7J25j86r7O78n12J31P3j81L73k75m8l21
$$ 11 307 -191 -127 197 -213 51 -88 56 -76 -113 12 -174 -271 407 -105 26 99 -82 291 16 -32 -353
7411c53K59M29l46p2j82K49N6j23J9L43l01K00j38rQ3k43J40O6k57j29J63K92
$$ -353 -94 335 -11 -83 -265 -16 40 -83 -64 279 -22 178 40 31 114 -129 11 77 -180 -309 -146 146
7433A46j12J04k57K80k27j98N63n80M17m06K22J18p6L14n78L4N33l92K78l91Q4
$$ 146 34 138 -119 161 -66 -264 299 -281 136 -270 -48 70 -6 308 -270 -236 297 -95 183 -208 -124
7454a24JK61k47K29l2Q3l45L68j63r6J66j76J00J91j85j41J9J09k61K89j59o1
$$ -124 -123 138 -109 120 88 171 -174 194 31 -65 101 -75 25 216 31 -110 -91 18 -243 46 -113 -174
7476a74J36p4j80K11J98j59O6n9j89L89j72l34O70k22p4nL1r7O9J74Ll07NK3J65
$$ -174 -38 -112 -292 -81 117 -42 24 -35 -224 165 -7 -341 329 107 33 28 59 -38 31 205 208 -99 -94 -71 94
7501I4l6J24k34R1J12q3k62L83j72j95J61K46m30Q0K77q3j91m3J02L12k38Q8j07
$$ 94 58 182 -52 39 151 68 -194 189 17 -178 -17 229 -201 -121 156 73 -118 -161 -59 253 15 103 -4
7524dR9n6P6j42j84n0K75R8l81n8K73K04j24k41K95k08R6K25p7j16j96J97J30
$$ -4 95 39 115 -27 -211 -261 14 112 -269 -327 -54 150 26 -215 80 -128 -32 193 116 0 -196 1 131
7547A31j7J1j66L80k46k8l70L46l6Q5k12L8j24k5K47n2K77m50M50k2m80Q0j9L82
$$ 131 114 125 -41 339 93 65 -305 41 5 90 -122 -84 -208 -233 14 -38 239 -211 239 217 -263 -183 -202 180
7571A80k86L0J65J50l5Nq8q1Lj43j7R9P2O9j0j78J8k13L21k4o2J24Q1j39j82O6
$$ 180 -106 -76 89 239 204 209 121 40 43 -100 -117 -18 54 123 113 -65 -47 -260 61 37 -25 99 180 41 -141 -75
7597g5pK8J64p5j47k9J56K23p9k85J24N7j30J63J71k90o7K43k01j22p2O16m56
$$ -75 -82 -54 110 35 -112 -141 15 238 159 -126 -2 55 -75 88 259 -31 -98 145 -56 -178 -250 366 -90
7620i0J78j00K03l33L96q7L7o70Q17l90N5l05J22O86n18r5j00L65m55L86k03K15
$$ -90 88 -12 191 -142 254 167 204 -466 351 -39 16 -289 -167 519 1 -94 -194 171 -284 102 -101 114
7642A14j3Lk56L81q5j40P6P5j73J2j37P8k5L7J15M7l70N40p1l06K2Q8j52j94J92
$$ 114 101 104 -152 229 144 4 80 155 -18 -6 -143 -65 -90 -53 62 109 -261 279 208 -98 -76 12 -140 -334 -142
7667a42L9K44k05J2L54j92m17M67j49J21k58L00M6m27QM3N9J34j94K64j37j78
$$ -142 -103 141 -64 -52 302 110 -307 160 11 132 -126 174 220 -207 -199 -156 -97 37 -157 107 -30 -208
7689b08M22k12P3J06M7k90P7n8J1J30j31K00k47K22j44oK5N1J67k49r5R8j13M2
$$ -208 214 2 75 181 228 -62 15 -43 -32 98 -33 167 -80 142 -2 -8 17 68 235 -14 -109 -11 -124 -82
7713h2J22l3k09O7J91J57j74m28L06PK08l7jj09q8N3M5K27k48O6k21K21rQ5o5
$$ -82 40 7 -202 -135 56 213 39 -389 -83 -76 132 95 94 -15 -103 -50 -5 222 -26 40 -181 40 31 116 51
7738E1j06o0J66N7j54j8k44K38l73L92R9K32l12N0J19N3k19J42l27J81J0Q8j32
$$ 51 -55 -115 51 108 -46 -64 -308 -70 -443 -51 48 280 -32 18 137 190 -29 113 -214 -33 -23 65 -67
7761f7j25J85J8K01j14k1j24j04R5K2K7J77k95J63j41J98J1mk37P7PP3Q3L9j30
$$ -67 -192 -7 11 212 98 77 -47 -151 -56 -34 -7 170 -125 38 -103 95 106 102 -135 -58 -51 22 105 144 14
7786A4L8l31N28k19O9j29J02l7k25K62J76q2j7m64M42n2j64N1O9J81k87L14k15
$$ 14 52 -279 249 30 99 -30 72 35 -190 72 248 166 149 -315 127 75 -89 -38 31 212 -75 239 24
7809B4K99m16m8K54N0j28j47P4J38J19l12J09r8j90L84j05J6j45K05m1j6K1Rj48
$$ 24 323 -93 -141 113 163 35 -112 -38 100 219 -93 16 -82 -272 112 7 23 -122 83 42 26 47 56 -92
7833i2K50n2J15J05n5m43K68l05M9K49J59j34k06K4PJ74%j16L9O0j77M2L17m55
$$ -92 158 106 221 326 271 -172 96 -209 -160 89 248 114 -92 -68 -61 113 113 -3 36 96 -81 -39 278 -177
7857a77J1K19j85P4J2j4O5j47q3K23Nm1k33K64RN1o2j20K24P2k59P4K41K0k33
$$ -177 -166 53 -132 -58 -46 -60 5 -142 -225 -2 3 -38 -271 -7 2 53 -9 -129 95 167 -92 -18 223 243 10
7882A0p1P7ll17K15PL13l44j77K84r7K40M3l20P8k37L57m2R7j33K77k67j77M90
$$ 10 -61 16 13 -304 -89 -82 231 -113 -290 -6 -103 137 180 -140 -62 -299 58 16 113 -20 257 -10 -187 303
7906C03l95j15K41pk44K75j11j2J85j18l5L07l84J52j53K69k97j31K2Q0j90M09
$$ 303 -92 -207 34 27 -217 58 -53 -65 120 2 -33 274 -110 42 -111 158 -139 -270 -248 -168 -358 51
7928E1n7K65j84J12j87k02M51j28J03j20k90p6K67m28O74l83j27L43k91J82K30
$$ 51 -6 259 75 187 0 -202 249 121 224 104 -186 -262 5 -423 251 -132 -259 84 -207 -25 205
7949B05l52L74m5n69N93R3l44L1kj00K3L10m59j14N88j45j31J53k2l3l4J20N7
$$ 205 -147 227 182 -387 206 299 -45 -14 -16 -116 -93 217 -242 -356 232 87 -44 109 87 54 20 140 197
7972A97j91Q7Ql08K47j68P7J55O9m27R1j81L81N3n11N06p3K43k06k97M31p8j34
$$ 197 6 93 101 -207 40 -128 -51 104 173 -254 -163 -344 37 90 -421 85 12 255 49 -248 183 105 -29
7995b9J6j61J31N9M0j85L40J48m15K23O1m04K31j73J53P4j53m4L25k09QR6K04
$$ -29 -13 -174 -43 16 56 -129 211 359 -56 167 228 -176 55 -118 35 109 -44 -88 237 28 36 132 336
8018C36k57k81K87k83o2L05L4n2K02k38J19K23m35J48O0L0J77j73l26K76Q5j21
$$ 336 79 -202 85 -198 -260 45 79 27 229 -9 110 333 -102 46 106 136 313 140 -186 90 175 54
8040E4Q8j90J22k98L67K9k65J19l69N04k44J51j46J26R8j79J60j68J27K7o7j20
$$ 54 142 -48 74 -224 143 172 -93 26 -343 161 -83 68 -78 48 146 -33 127 -41 86 113 46 -74
8062g4J28k6p3Q2J01k61MJ87J80k96J85k89L4O8n2J6J7K50K2Pk73K43k66j15N98
$$ -74 54 28 -45 37 138 -123 -119 68 248 -48 137 -152 -118 -50 -102 -86 -69 181 203 210 -63 180 -86 -201 397
8087C97m96Nk4j63J96r4J37j96K97j23J13N1nJ90k65j04K16J16j97qJK1k72K11
$$ 397 -99 -94 -118 -281 -85 -179 -42 -238 59 -64 49 100 95 285 20 -84 132 248 51 43 44 65 -207 4
8111DK55l1k93nR8L2j43J96pk00O3j09K6M65k18K1m95M28Kl22M42l50o4K72j06
$$ 4 259 228 -65 -70 28 60 -83 113 106 -94 -31 -140 -114 351 133 154 -341 87 89 -233 209 -141 -205 67 -39
8136c9m7J17j04K73l72L7R6K65l9k20mK96k37J00l5J40k57J0j67K41l8kJ07l3
$$ -39 -86 31 -73 200 -172 -135 -39 226 187 -33 -37 259 22 122 87 227 -30 -20 -187 54 16 14 121 88
8160H8M9k35N02k32k18k42M75m1m9Qk36R4r0J57n7J17J1j17j79oK08K8J44q8l59
$$ 88 137 -98 404 172 -46 -288 187 146 97 105 -131 -37 -127 30 -27 90 101 -16 -195 -201 7 35 179 91 -268
8185b68K71J83m1k82J12J65
$$ -268 3 186 145 -137 -25 140
8191A40
$$ Imaginary data points
##PAGE= N=2
##DATA TABLE= (X++(I..I)), XYDATA
0@%%%%%%%Qj6J6j6J6k4L2l3M1n4O2p2Q7j02J18j35J55j79K05k33K67l03L39l82
$$ 0 0 0 0 0 0 0 0 8 -8 8 -8 8 -16 16 -17 24 -30 32 -40 47 -55 63 -72 83 -96 109 -124 143 -160 179 -203
31b03M30m82N37o00O71p46Q27r17J019j129J249j381J529j696J881k090K328k600
$$ -203 227 -255 282 -318 353 -393 434 -483 536 -593 656 -725 804 -892 989 -1101 1227 -1373
49a373K916l291L740m289M984n891P130q933J1810j7136L0227j21734j80720K57048
$$ -1373 1543 -1748 1992 -2297 2687 -3204 3926 -5007 6803 -10333 19894 -101840 -282560 -25512
63b5512J87151j20618k12365L2850J40914L2804o7196j8181r56j8173J7909P6273
$$ -25512 161639 41021 -171344 -138494 2420 35224 -31972 -50153 -51109 -69282 -51373 24900
75B4900K070r2236l7176R4250O2156o8216o6363N6708O1647m9859n7866N7374
$$ 24900 26970 -65266 -102442 -8192 53964 -14252 -80615 -23907 37740 -12119 -69985 -12611
87a2611O7791n3888q3373M1356R2130j4340q0549j012N6700P26l2502K7365L2221
$$ -12611 55180 1292 -82081 -40725 51405 37065 -43484 -44496 12204 12930 -19572 7793 40014
100D0014n7393n8283P2046J05313n2861j42731L845J53389N6891j23067r8655
$$ 40014 -17379 -75662 -3616 101697 48836 -93895 -90050 63339 120230 -2837 -101492
111a01492O5568J01303r145o9022k3951J5991J8294K7494J3243m7343n7268L4158
$$ -101492 -35924 65379 56234 -12788 -36739 -20748 -2454 25040 38283 -9060 -66328 -32170
123c2170Q5180r401r7878k0238Q9800L5547q2699m4984P5161M8060p3759n6966
$$ -32170 53010 43609 -54269 -74507 15293 50840 -31859 -76843 -1682 46378 -27381 -84347
135h4347O9636P0124n8639q1093L9424Q3071j6297o9827L539N2761j793l5422
$$ -84347 -14711 55413 -3226 -84319 -44895 38176 21879 -47948 -44409 8352 6559 -28863
147b8863J3001L3848k2535l9287K7790N3569j7744n9246M715N5365Q464l7917
$$ -28863 -15862 17986 -4549 -43836 -16046 37523 19779 -39467 -34752 20613 29077 -8840
159h840o488K4708m285j7889K3764K7854l5793m7170L6673O8953k1215q0596K44
$$ -8840 -15328 9380 5095 -12794 10970 38824 3031 -44139 -7466 61487 40272 -40324 -40080
172d0080P8999J8360o6847k8277N3588K8371m5524k5756M3531K4943m6139l1600
$$ -40080 38919 57279 -9568 -37845 15743 44114 -1410 -27166 16365 41308 -4831 -36431
184c6431M3343L9595l4903m5998J8855M2466o903l2176j656J5099k951l566J3425
$$ -36431 6912 46507 11604 -34394 -15539 26927 20024 -12152 -13808 1291 -1660 -5226 8199
197H199l271k7693j098L8129R759m4458k0471M5268K9797m3817l9380M2360M8843
$$ 8199 4928 -22765 -23863 14266 24025 -20433 -40904 4364 34161 -9656 -49036 -6676 42167
210D2167l5161n7583K5763O6455j0084o6309p019N9999K3000m3500k7828K6294
$$ 42167 7006 -50577 -24814 41641 31557 -34752 -41771 18228 41228 -2272 -30100 -3806
222c806K4343j1262j1122P096k458j0854J2388K3165j1766l3544M730L9355O121
$$ -3806 20537 9275 -1847 5249 2791 -8063 4325 27490 15724 -17820 -13090 26265 32386
235C2386l5143j2923K7180J4166j8797q484J6056k66j9232N195K7953n301l8755
$$ 32386 -2757 -15680 11500 25666 6869 -1615 14441 14175 -5057 138 28091 22790 -15965
248a5965j865M4866J2347m6705k4898M1367L5916l3704m4088K0653M6906p365
$$ -15965 -17830 27036 39383 -7322 -32220 9147 45063 11359 -32729 -12076 34830 27465
260B7465m5300o382L6765J6788k3916k1075P601J6520N842m634j3777j1954J1229
$$ 27465 -17835 -24217 12548 29336 5420 -15655 -8054 8466 14308 9674 -4103 -16057 -4828
273d828K8245k69l7088j6940L7310L3524k7809m3327J3585M5638J310l9828r930
$$ -4828 23417 23148 -13940 -30880 6430 39954 12145 -31182 -17597 28041 29351 -10477 -20407
286b0407L0856J3489k1772j0208J7229O353j6179l331J9386L735k1482p124K2497
$$ -20407 10449 23938 2166 -8042 9187 15540 -639 -3970 15416 19151 -2331 -9455 13042
299A3042J2302j9825j6468J5266J9211r825j7094L024J3452J187o952k768O62
$$ 13042 25344 5519 -10949 4317 23528 13703 -3391 -367 13085 14272 7320 4552 5214
312E214o1O078O215r801j5154R087K4379k940l1854p476L3321K0099k8924l1077
$$ 5214 5153 11231 17446 7645 -7509 1578 25957 23017 -8837 -16313 17008 37107 8183 -22894
326b2894J9100L6189o747l5505m761K9024J2378k0381j4745J0976J2861m645q214
$$ -22894 -3794 32395 25648 -9857 -14618 14406 26784 6403 -8342 2634 15495 10850 2636
339B636J226L355j085Q52K503l821m287M770O476o024p750N591R423n165j1432
$$ 2636 3862 7217 6132 6984 9487 5666 1379 6149 12625 6601 -1149 4442 13865 8700 -2732
354b732M731J3380l942j4783K011J6363K2j7649l058J8455N838j7422j0146J6083
$$ -2732 1999 15379 11437 -3346 -1335 15028 15050 -2599 -5657 12798 18636 1214 -8932 7151
368G151J3947j3390j6779Q299J7917k381j7280k522J3427O916q006q087K777N902
$$ 7151 21098 7708 -9071 -772 17145 14764 -2516 -5038 8389 15305 7299 -788 1989 7891
382G891K375k169m359k164M444P067k608r267m83J1274L801j1160p527J1358J0214
$$ 7891 10266 8097 3738 1574 6018 13085 10477 1210 727 12001 15802 4642 -2885 8473 18687
397A8687r690j2887P396J5017l932j6528n9J6056M726j4678q583J1402J0631p428
$$ 18687 8997 -3890 3506 18523 14591 -1937 -1996 14060 18786 4108 -4475 6927 17558 10130
411A0130j1412K623J0087K95p577l096L902L628j218l947j756J768L514N2n628
$$ 10130 -1282 1341 11428 11723 4146 1050 4952 8580 7362 3415 1659 3427 6941 6993 1365
426A365l371N569N825n119q812K089J0407P55j1092m421J0152O870q783q611O281
$$ 1365 -2006 3563 9388 4269 -4543 -2454 7953 8708 -2384 -6805 3347 10217 1434 -7177 -896
441h96R621l461r761J231J0046N50q819k500P693M542n411n722L512O447j93n204
$$ -896 8725 5264 -4497 -3266 6780 7330 -1489 -3989 3704 8246 2835 -2887 625 7072 6879 1675
457A675k131L836M265l71n168k193L942N535k074p483n78Q210L947o925p143M754
$$ 1675 -456 3380 7645 7274 2106 -87 3855 9390 7316 -167 -745 7465 11412 4487 -2656 2098
473B098R081j917j0430j566R705L957q148p188N472P665k873q798n47O812K348
$$ 2098 11179 9262 -1168 -2734 6971 10928 2780 -4408 1064 8729 5856 -2942 -3489 3323 5671
488E671n626m391K119L660n86m154j944K650K478k099l348j09L059Q67l382k146
$$ 5671 45 -4346 -2227 1433 847 -3307 -5251 -2601 -123 -2222 -5570 -5679 -2620 -1753 -5135 -7281
504g281K232L291j497n031K17N446J783n759l456M807N623l757o578J681O997
$$ -7281 -5049 -1758 -3255 -8286 -8069 -2623 -840 -6599 -10055 -5248 375 -3382 -9960 -8279 -1282
519a282J231n661l243N339N286k901n276R77N834J970m277l644L139M567l30m791
$$ -1282 -51 -5712 -8955 -3616 1670 -1231 -6507 -5530 304 2274 -2003 -5647 -2508 2059 1729 -3062
535c062j788M261L282k453m575J17M136J988m129l933K915M131j361m827o41L638
$$ -3062 -4850 -589 2693 240 -4335 -4218 -82 1906 -2223 -6156 -3241 890 -471 -5298 -5939 -2301
551b301J676l817l064J968L512k203l931o14L518N17l491k567K113K755j583l994
$$ -2301 -625 -4442 -7506 -5538 -2026 -4229 -8160 -8774 -5256 -4739 -8230 -10797 -8684 -5929 -7512 -11506
567a1506q4L281J125k977k625J876L593m87l691j277L842K510k552k640R62M143
$$ -11506 -11590 -8309 -7184 -10161 -12786 -10910 -7317 -7804 -11495 -12772 -8930 -6420 -8972 -11612 -10650 -6507
583f507N45l765j489L243L524j573l464P95L927J537l045k381K947L255o02l098
$$ -6507 -5962 -9727 -11216 -7973 -4449 -6022 -9486 -8691 -4764 -3227 -6272 -8653 -5706 -2451 -3053 -6151
599f151k76L198J666j877k477J297L096j99k677j232K718J363j952k105N04K662
$$ -6151 -6427 -3229 -1563 -3440 -5917 -4620 -1524 -1723 -4400 -5632 -2914 -1551 -3503 -5608 -5104 -2442
615b442Q6k680j776K001K024j697k863j79K796O76k949j746J741K135j384k711
$$ -2442 -2356 -5036 -6812 -4811 -2787 -4484 -7347 -7526 -4730 -4054 -7003 -8749 -7008 -4873 -6257 -8968
631h968l01K507O07j969j615J432K016q01j974J03K044P28j152j442J393J696
$$ -8968 -9269 -6762 -6155 -8124 -9739 -8307 -6291 -7092 -9066 -8963 -6919 -6191 -7343 -8785 -7392 -5696
647e696o9j551K02J666R98j110r81J286K100p4j829o8K298J530j469j837J334
$$ -5696 -5765 -7316 -7114 -5448 -4450 -5560 -6541 -5255 -3155 -3229 -5058 -5126 -2828 -1298 -2767 -4604 -3270
664c270K980j0k459n73K801J934j826k382Q38K894P38k792j353J483K068m00k230
$$ -3270 -290 -300 -2759 -3332 -531 1403 -423 -2805 -1967 927 1665 -1127 -2480 -997 1071 671 -1559
681a559p99J783J388j089j963p9J535J270j464j917K89J840O44j686j515Q93J313
$$ -1559 -2358 -575 813 -276 -2239 -2318 -783 487 -977 -2894 -2605 -765 -121 -1807 -3322 -2429 -1116
698a116m86j311k37J182J56q65j96N27j13q42O00J046Q7j415J28J760J487j750
$$ -1116 -1602 -2913 -3150 -1968 -1812 -2677 -2873 -2346 -2459 -3301 -2701 -1655 -1568 -2983 -2855 -1095 392 -1358
716a358j500J518K026K28j937n61J713K030j68k019n36K259J156p2j927o70K154
$$ -1358 -2858 -1340 686 914 -1023 -1584 129 2159 1991 -28 -564 1695 2851 2779 852 182 2336
733B336K291j246k595J90L599J142k818k351J568L669o22l252q15K285J268j052
$$ 2336 4627 3381 786 976 4575 5717 2899 548 2116 5785 5163 1911 1096 3381 4649 3597
749C597j573o4R96M69l65q58l34L02Q28M06j062j485O16J636J69j988r96J527
$$ 3597 2024 1960 2956 3425 3060 2202 1868 2170 2998 3404 2342 857 1473 3109 3278 1290 294 1821
767A821J085p52r32m18P00J48O0R3o53q52J588J297j030k064L38K595J016k751
$$ 1821 2906 2154 1222 804 1504 1652 1712 1805 1152 300 1888 3185 2155 91 429 3024 4040 1289
785A289j485J931K601j292k202J81K274Q60j299j417R32J024J33j31q44l24N04
$$ 1289 -196 1735 4336 3044 842 1023 3297 4157 2858 1441 2373 3397 3530 3399 2555 2231 2735
802B735J547k1j747o45J915J364j323j986Q04K137l07k107k16J559M23j217n23
$$ 2735 4282 4261 2514 1869 3784 5148 3825 1839 2643 4780 4473 2366 2150 3709 4132 2915 2392
819B392O18L59j120K73L13j88r78L41J106j69j592m18J466O94j208j173Q97J023
$$ 2392 3010 3369 2249 2522 2835 2647 1669 2010 3116 2947 1355 937 2403 3097 1889 716 1613 2636
837B636p88j408Q50P87p16j84K90K53r97L5J267k30j166n58J518P10j682p50J443
$$ 2636 1848 440 1290 2077 1361 1177 1467 1720 723 758 2025 1795 629 71 1589 2299 617 -133 1310
856A310J140j422j007R78R67m68j535N69J378m45j052K05J111q0j290j79J212
$$ 1310 2450 1028 21 999 1966 1498 -37 532 1910 1465 413 618 1729 1649 359 180 1392
873A392j7p84j99Q63p3n85l37J138j91j622O22J121P4k022K11J584J09j427j089
$$ 1392 1375 591 392 1255 1182 597 260 1398 1207 -415 207 1328 1402 -620 -409 1175 1284 -143 -1232
892a232J561J361j343j327J063N34l07o35L27L81p34J53O91Kj156n02J865Q82
$$ -1232 329 1690 347 -980 83 617 310 -325 2 383 -351 -198 493 495 -661 -1163 702 1584
910A584j844j166J103J942j130k270Q25J550J20j089m90O90Nj06M45k52p29r7
$$ 1584 -260 -1426 -323 1619 489 -1781 -956 594 714 -375 -865 -175 -170 -276 169 -83 -812 -909
928i09R22Q89j152j634J139J546l29k412K3K278M07j535j048R93J136m82r99J55
$$ -909 13 902 -250 -1884 -745 801 472 -1940 -1917 361 768 -767 -1815 -822 314 -168 -1167 -1012
946a012P8Q0K43Q24j105o51O69K063n33k195l2K204J018k111j406J259J777k55
$$ -1012 -934 -854 -611 213 -892 -1543 -874 1189 656 -1539 -1571 633 1651 -460 -1866 -607 1170 915
964I15j839pJ171N37p61r5L67k54M3Q12l3j429l6J268J204j332j847J210K097
$$ 915 -924 -931 240 777 16 -79 288 34 77 889 856 -573 -609 659 1863 531 -1316 -106 1991
983A991q13k073J55J577P68j434o77L9Q94K0k92L16m64l95J043L66r09j390Q84
$$ 1991 1178 -895 -740 837 1605 171 -506 -467 427 447 155 471 7 -388 655 1021 112 -1278 -394
1002c94J771l28k029k15K057O65j338r08P85Q80M8j280N08L18r1r0O30n76n21
$$ -394 1377 1049 -980 -1195 862 1527 189 -719 66 946 994 -286 222 540 449 359 989 413 -108
1021a08M5J565lj387m74J495J150r63j064L90J454r4j224K79N96L66n51q2M31
$$ -108 -63 1502 1499 112 -362 1133 2283 1320 256 646 2100 2006 782 1061 1657 2023 1472 1390 1821
1040A821l68l18N73M37n75n95M90J050n53j355M26J488Q3j808j91J311K03p07
$$ 1821 1453 1135 1708 2145 1570 975 1465 2515 1962 607 1033 2521 2604 796 605 1916 2119 1412
1058A412o83P93L43m01l26K20O6r73L70L17J21o62J20R49r1o54m09Q82M79q85
$$ 1412 729 1522 1865 1464 1138 1358 1424 451 821 1138 1259 597 717 1666 1575 921 512 1394 1873 988
1078I88o93J024L87p61o33R18N12m36o17O49K02j98n48J65R40l58n65J96Q24n13
$$ 988 295 1319 1706 945 312 1230 1742 1306 689 1338 1540 1342 794 959 1899 1541 976 1172 1996 1483
1098A483p21L68R18m11p74L45R69l41q28J73R04j21o76j45O90L3n10n19L53L70
$$ 1483 762 1130 2048 1637 863 1208 2177 1836 1008 1181 2085 1964 1288 1143 1833 1866 1356 837 1190 1560
1118A560q38j18R62m30l67k12Q20K7p12j88M57K52o95o45Q53O24r12m28L92M31
$$ 1560 722 604 1566 1136 769 557 1377 1404 692 504 961 1213 518 -127 726 1350 438 10 402 833
1138H33m65p78O39L56m20j22J42N39q97o6O06M38p61q13J031M21m39j046O61R41
$$ 833 368 -410 229 585 165 43 185 724 -173 -239 367 805 44 -769 262 683 244 -802 -141 800
1158H00l06j100L52Q48j87n42l15Q57j43o31N2O54m35p29L55R59m03j129O42N77
$$ 800 494 -606 -254 594 407 -135 -450 407 264 -367 -315 339 -96 -825 -470 489 86 -1043 -401 176
1178A76K84j314R8R18K3p82j87K99M37q95Q3O09k62k48k08J177l19j268J56P94
$$ 176 460 -854 -756 162 185 -597 -784 -485 -48 -943 -860 -251 -513 -761 -969 208 -111 -1379 -1223 -429
1198d29O29j149p50J184N67q52j124Q09M92P1p65J68L15J75o40R7O51r63P0O64
$$ -429 200 -949 -1699 -515 52 -800 -1924 -1115 -623 -552 -1317 -1149 -834 -659 -1299 -1202 -551 -1514 -1444 -780
1218g80K31q44l15M21J131p56j233P07J341n30j541N16R38k56j045K09Q94j67
$$ -780 -549 -1393 -1708 -1287 -156 -912 -2145 -1438 -97 -627 -2168 -1652 -714 -970 -2015 -1806 -912 -1079
1236a079q64L15P08J9j338O17J294l30j339o1J122L04j216k74R14O64r08m41P88
$$ -1079 -1943 -1628 -920 -901 -2239 -1622 -328 -658 -1997 -2058 -936 -632 -1848 -2122 -1208 -544 -1452 -1893 -1105
1255a105L93p08k59P16L94q93o54J165M64q82q19J190R98j302p62P38J213q01
$$ -1105 -712 -1420 -1679 -963 -569 -1462 -2116 -951 -487 -1369 -2188 -998 0 -1302 -2064 -1326 -113 -914
1273i14j391O95J256l96j326M08J337q93o71O35Q40k70j010L05Q12k16j236L53
$$ -914 -2305 -1610 -354 -750 -2076 -1668 -331 -1224 -1895 -1260 -420 -690 -1700 -1395 -583 -799 -2035 -1682
1291a682J576n66j383L38J313l27j078K12J126k85j141LJ552P6j411J3Q89L97
$$ -1682 -106 -672 -2055 -1717 -404 -731 -1809 -1597 -471 -756 -1897 -1894 -342 -266 -1677 -1664 -775 -378
1309c78j202j27J297K56j323q46J799P79j476r14J585Q01j472o72J083P95o02
$$ -378 -1580 -1707 -410 -154 -1477 -2323 -524 255 -1221 -2135 -550 251 -1221 -1893 -810 -15 -617
1326f17j018J053Q83p96j200J209Q47r07o50Q55Q40r56r59J265P02q61q81P72
$$ -617 -1635 -582 301 -495 -1695 -486 361 -546 -1196 -341 499 -457 -1416 -151 551 -310 -1191 -419
1344d19J047l41j662Q49J438m72j887N94J397M6j510k90J683r3j156k68J489j42
$$ -419 628 287 -1375 -526 912 440 -1447 -853 544 590 -920 -1210 473 380 -776 -1044 445 303
1362C03q92l50J233K95j192l89J399J19j256m34J238N04j174n25J541M48j111
$$ 303 -589 -939 294 589 -603 -992 407 526 -730 -1164 74 578 -596 -1121 420 868 -243
1379b43q21R77Q24j078o94J065J186j696m66J179R54j457q71J156J437j222j252
$$ -243 -1064 -87 737 -341 -1035 30 1216 -480 -946 233 1187 -270 -1141 15 1452 230 -1022
1396a022M76J761m59j580O77J338j69j510K23J155o8j299L94J002k88j136O79
$$ -1022 -546 1215 756 -824 -147 1191 1022 -488 -265 890 822 -477 -83 919 631 -505 174
1413A74J000o36j508P81J633l01j818K35J979P8k012o19J511Q89j562j62O17P35
$$ 174 1174 538 -970 -189 1444 1143 -675 -440 1539 1617 -395 -1014 497 1386 -176 -338 279 1014
1431A014j253n17J241M74j326j93J322O08j354j355K026J093j493j346J121J190
$$ 1014 -239 -756 485 959 -367 -560 762 1370 16 -1339 687 1780 287 -1059 62 1252
1447A252q83j297Q29J156p95j294R88J137j248p39J494P69j477j363J452J714
$$ 1252 369 -928 -99 1057 262 -1032 -44 1093 -155 -894 600 1369 -108 -1471 -19 1695
1463A695r62k218P61J979k76j689r7J621K44j518l84J445J5r71L5J013m52r86
$$ 1695 733 -1485 -724 1255 979 -710 -807 814 1058 -460 -844 601 616 -355 -320 693 241 -745
1481g45O97J122n01j696M37J681K84j820j85J345P77j618q87J159Q11r56p84J428
$$ -745 -48 1074 573 -1123 -686 995 1279 -541 -726 619 1396 -222 -1109 50 861 -95 -879 549
1499E49M33j262k86J290J97j357o28J776M39j331q58J105J403j211j244P39J037
$$ 549 982 -280 -566 724 921 -436 -1064 712 1151 -180 -1038 67 1470 259 -985 -246 791
1516G91m06j043K8J027k66q82M08J041o03j031P48J241j174j139O41J419l89j618
$$ 791 385 -658 -630 397 131 -751 -343 698 95 -936 -188 1053 -121 -1260 -619 800 411 -1207
1534a207N15J146rj602K98J233J52j172m39J173K89j080k21J077K05j077o02J500
$$ -1207 -692 454 445 -1157 -859 374 526 -646 -1085 88 377 -703 -924 153 358 -719 -1321 179
1552A79L33j102k13J117M30j304l98J271M46r54o53J240M87q38n58R03M42p92
$$ 179 512 -590 -803 314 744 -560 -958 313 759 -195 -848 392 879 41 -517 386 828 36
1570C6n61Q37Q16j000r82J371O09j018r38Q54J211p89j119L62J127l22j229rJ315
$$ 36 -525 312 1128 128 -854 517 1126 108 -830 24 1235 446 -673 -311 816 494 -735 -744 571
1589E71l10p97R6P44J07j250p6J318n4p83j17M54M97q22l66R17K20q89m61R87
$$ 571 261 -536 -440 304 411 -839 -915 403 349 -434 -551 -97 400 -422 -788 129 349 -540 -1001 -14
1609a4M26j142n9R12M86j363l42J638N2r96l69Q77M64m24m33M23O58o26n32M86
$$ -14 412 -730 -789 123 609 -754 -1096 542 594 -402 -771 106 570 146 -287 136 794 168 -364 122
1629A22O92p46m65J004N16p80m94O02R21o76o93L17P26j81r35L28Q45n93k68k14
$$ 122 814 68 -397 607 1123 343 -151 451 1372 696 3 320 1046 865 -70 258 1103 510 242 28
1649B8P88j23p92J44J054m77q51K06P38j84r98K60P63m7n96j69M30L75q92n00
$$ 28 816 693 -99 45 1099 622 -229 -23 715 531 -467 -207 556 509 -87 -256 174 549 -343 -843
1669h43J142K11o77j63J85K64n57m7Q55j72n38l18P42P27r70o14P75P17j89r95
$$ -843 299 510 -167 -330 -145 119 -438 -485 370 198 -340 -658 84 811 -159 -773 2 719 530 -465
1689d65M38P40k14m16R1Q10p65K10P1M79o10k11P22l8P9o54K66O32J52p65j86
$$ -465 -27 713 499 83 174 984 219 429 500 979 369 158 880 842 921 267 533 1165 1317 552 366
1710C66O55J18o75K99L16k34m37K64J98M3l68k78O42m51o71M66L45J48q39k27
$$ 366 1021 1139 464 763 1079 845 408 672 870 913 545 267 909 458 -213 253 598 746 -93 -320
1730c20P60Rm52m37M43L11m85k76M23J26k44N8K25p5k4m19L71L52m91L9K53L65
$$ -320 440 449 -3 -440 3 314 -171 -447 -24 102 -142 -84 141 66 42 -377 -6 346 -145 -106 147 512
1752E12l27n94L69O35l67l74K28O83P1o08J6O62l84l87Q2M62j53j05L17J70j38
$$ 512 185 -409 -40 595 228 -146 82 765 836 228 244 906 522 135 217 679 526 421 738 908 770
1773G70j83m8O66m53l46k44M99j45n30M03K09K28l09q5j96K1j71N8J84O5m59J29
$$ 770 587 539 1205 752 406 162 661 516 -14 389 598 826 517 432 236 257 86 144 328 393 -66 63
1795F3L78j33n23L3L22J45o06J64o1K40k50J59k38L68k03l38J69K79k72j54q6
$$ 63 441 308 -215 -182 140 285 -321 -157 -218 22 -228 -69 -307 61 -142 -480 -311 -32 -304 -458 -544
1816e44R88o28j66K14J37K83j65k48N09j14l47L49j11L00j71q4L55k18q0n5K46
$$ -544 444 -184 -350 -136 1 284 119 -129 380 266 -81 268 157 457 286 202 557 339 259 204 450
1837D50J07N3m07L54J33j59k44L99m48J84J9J32O4n96K07KL19m94L74j54J46m16
$$ 450 557 610 203 557 690 531 287 686 238 422 441 573 637 41 248 250 569 75 449 295 441 25
1859B5k9O8k6k4j09M19k92j72P0j04L59n84j22N75l9j57j53J59K2p4m06K82K03
$$ 25 -4 64 38 14 -95 324 32 -140 -70 -174 185 -399 -521 54 15 -142 -295 -136 -114 -188 -594 -312 -109
1882a09K45m02p1K58L6Jj77J55J89k33N3M65k11j14O0M80o85m9K88J45K2j94J33
$$ -109 136 -266 -337 -79 -43 -42 -219 -64 125 -108 -55 410 199 85 145 625 -60 -109 179 324 346 152 285
1905B85J91K3l01p9M91j7k73j39k0L58m64q7nP28n76j44L15JK07n59K84L9k4k55
$$ 285 476 499 198 119 610 593 320 181 161 519 55 -32 -37 691 115 -29 286 287 494 -65 219 258 234 -21
1929b1nJ86k7k13K77l1m70K98j41L77l21k28L91o7k17k77L40O66n55l45J53K8
$$ -21 -26 160 133 -80 197 166 -304 -6 -147 230 -91 -319 72 5 -212 -489 -149 517 -38 -383 -230 -202
1951b02N6q4J03P8J11m19K41L68m33p2O1K56jk67J35M02k22q5l05N00j12p4j15
$$ -202 -146 -230 -127 -49 62 -357 -116 252 -181 -253 -192 64 63 -204 -69 333 111 26 -279 221 109 35 -80
1974h0J47M79n36j86J80N03l46j55K82m2k46j35k51L37k12j87N64k2j17n89N79
$$ -80 67 546 10 -176 4 507 161 6 288 246 0 -135 -386 -49 -261 -448 116 94 -23 -612 -33
1995c3J54J09l62j1J84j55j33K49J81j96j58j04N30l78l01K30J64j21l74Q6K91
$$ -33 121 230 -132 -143 41 -114 -247 2 183 -13 -171 -275 255 -123 -424 -194 -30 -151 -525 -439 -148
2016a48j08k44L28K38k64k17J17L02m0k91j59N76l76k31J24J28J26j81j33J84
$$ -148 -256 -500 -172 66 -198 -415 -298 4 -36 -327 -486 90 -286 -517 -393 -265 -139 -320 -453 -269
2036b69J18m47K22r1K94j28m07L19K6K6j51J04J20j30j41K95J27l65K7K48K04
$$ -269 -151 -598 -376 -467 -173 -301 -708 -389 -363 -337 -488 -384 -264 -394 -535 -240 -113 -478 -451 -203 1
2057Al88k42M38K03k16k35K19k0m7q1N3K16j85j42N9K18J74m83j19N74O5l32l06
$$ 1 -387 -629 -191 12 -204 -439 -220 -240 -287 -368 -315 -99 -284 -426 -367 -149 25 -458 -577 -3 62 -270 -576
2080e76J07N04nn71K82J22n28K41R4J07n27K67j03K87k51j65K65L39m26l35J44
$$ -576 -469 35 30 -541 -259 -137 -665 -424 -330 -223 -750 -483 -586 -299 -550 -715 -450 -111 -537 -872 -728
2101g28L69l03l48L30K36j43n81L23L38j89j91K40J79k9j70J63O6K12n90N18K6
$$ -728 -359 -662 -1010 -680 -444 -587 -1168 -845 -507 -696 -887 -647 -468 -497 -667 -504 -438 -226 -816 -298 -272
2122b72J34m59o1J60J49m2l03N41k31J45K04k61L5j14K00L00l03j85K57L78j70
$$ -272 -138 -597 -658 -498 -349 -391 -694 -153 -384 -239 -35 -296 -261 -375 -175 125 -178 -363 -106 272 102
2143A02n91M8O40k54k83m40O58L1j95r3N4J97j51N3k7J85l36l32N67j75k47j1
$$ 102 -489 -441 199 -55 -338 -778 -120 -89 -284 -377 -323 -126 -277 -224 -251 -66 -402 -734 -167 -342 -589 -600
2165f00K62J62k44l26K81Nj16j59M2L55m57k9M84q5k01j50K74M76j64k61K31M36
$$ -600 -338 -176 -420 -746 -465 -460 -576 -735 -693 -338 -795 -824 -340 -425 -626 -776 -502 -26 -190 -451 -220 216
2187B16m77n55R3J009k42l86K39K65J54o15J65K44n2L61on9j59O2J03O0k16O2
$$ 216 -261 -816 -723 286 44 -342 -103 162 316 -299 -134 110 58 419 413 354 195 257 360 420 204 266
2209B66j0L5j13j43K17J08L54o30j10K66K99o08J42J07J57m70q3J37M03m49l16
$$ 266 256 291 178 35 252 360 714 84 -26 240 539 -69 73 180 337 -133 -216 -79 324 -125 -441
2230d41L09M7j66j6K42p1K36j38l58N20o88NK58J63r5Q3J98j9n8k10J18J26k89
$$ -441 -132 -85 -251 -267 -25 -96 140 2 -356 164 -524 -519 -261 -98 -193 -110 88 69 11 -199 -81 45 -244
2253b44J77L78M23m36k18j51N84R1o93L31N03P9m37l64M87J81J0k79O4L77m3m49
$$ -244 -67 311 734 298 80 -71 513 604 -89 242 745 824 387 23 510 691 701 422 486 863 820 371
2275C71J19N12k57n1k67K89m44L38m2Pk74l5M70K0m94K14O9L66p05l19K57J17
$$ 371 490 1002 745 694 427 716 272 610 568 575 301 266 736 756 262 476 545 911 206 -113 144 261
2297B61K89n61M90k70K60l07m1J13K19l51k72M66K5n2l50M11l7n8m35N59J51l60
$$ 261 550 -11 479 209 469 162 121 234 453 102 -170 296 321 269 -81 330 293 235 -200 359 510 150
2319A50J8K67J0j93J03L56q15P25J73l8l64j29K95L11j78k44j91P41L3n73m8k8
$$ 150 168 435 445 252 355 711 -104 621 794 756 392 263 558 869 691 447 256 997 1030 457 409 381
2341C81O69l59m64L95M16j87m12N7M5k5o1j17O9r7L10j18m00K49m66N97n3m45
$$ 381 1050 691 227 622 1038 851 439 496 541 516 455 338 407 310 620 502 102 351 -115 482 429 -16
2363a6j90P85k92k27k95L88J75k40j33j13M44l76n6j44M09J5k30K69J24K6k10
$$ -16 -206 579 287 60 -235 153 328 88 -45 -158 286 -90 -146 -290 119 134 -96 173 297 323 113
2384A13j1K65J4n52M66j8j0q6l36K81l6q7K51K19k4l28L75J9j32j1l12M04N3l47
$$ 113 102 367 381 -171 295 277 267 181 -155 126 90 3 254 473 449 121 496 515 383 372 60 464 517 170
2408A70j49K73L80l98m65O11n2j5p53M22O10k79m15j16J63J35j13j79L65m86K37
$$ 170 21 294 674 276 -189 422 370 355 -398 24 634 355 -60 -176 -13 122 9 -170 195 -291 -54
2429e4j58L7K60n01M14M4l32K5J32N1j51qj32K62n3m07M43J12k35k62L60K74N8
$$ -54 -212 -175 85 -416 -2 42 -290 -265 -133 -82 -233 -241 -373 -111 -164 -571 -128 -16 -251 -513 -153 121 179
2452A79n27j2K96K33l08k98L12K21Q0o41K53L16P5l97j81J97K97j13l4j21N1J25
$$ 179 -348 -360 -64 169 -139 -437 -125 96 176 -465 -212 104 179 -218 -399 -202 95 -18 -52 -173 -122 3
2474CL5j12p3j46K10J78r7m74O85k8m15J44J60Ql95Q9j51K89J25j56j47M12k51
$$ 3 38 -74 -147 -293 -83 95 -2 -476 209 181 -234 -90 70 78 -317 -228 -379 -90 35 -121 -268 144 -107
2497a07J3l93j12O49J18m45K06j8k45K75k14NP7L0r5j93J80J32q7J51n36M32K43
$$ -107 -94 -487 -599 50 168 -277 -71 -89 -334 -59 -273 -268 -191 -161 -256 -449 -269 -137 -224 -73 -609 -177 66
2520F6k42q9k25K09M01j75l75J21M05o9n90L68M29n23J3q4J93J14k98L81k59L03
$$ 66 -176 -265 -490 -281 120 -55 -430 -309 96 27 -563 -195 234 -289 -276 -360 -167 -53 -351 30 -229 74
2542G4m21M6m9M32j4k68Kk72N06P0k92K26q8k06L23j01m56K9P00l76k02n7L53
$$ 74 -347 -301 -350 82 68 -200 -198 -470 36 106 -186 40 -48 -254 69 -32 -488 -459 241 -135 -337 -394 -41
2565d1J15m6l82L91K89k70l47K19J08j83O8l79M69K36p5j72j52K20j55N3k32J90
$$ -41 74 28 -354 37 326 56 -291 -72 36 -147 -79 -458 11 247 172 0 -152 68 -87 -34 -266 -76
2587g6l7Q0q4k37K15J76K8k29J77L45n72q7k06O31l2m2l57L24K02k46M2j3L10
$$ -76 -113 -33 -117 -354 -139 37 65 -164 13 358 -214 -301 -507 124 92 50 -307 17 219 -27 15 2 312
2610C12l32n1j72L20J83J94m02r7R0j93L16j66j18K92o8Q3j30o0J54J26Mk41L1
$$ 312 -20 -71 -243 77 260 454 52 -45 45 -148 168 2 -116 176 108 191 61 1 155 281 285 44 75
2633G5L50l02L1l3P7J24k2k97L84J71n83n7J81k8J34k95J33o4L29q1k65J68J63
$$ 75 425 123 154 121 198 322 300 3 387 558 -25 -82 99 71 205 -90 43 -21 308 227 -38 130 293
2656B93l37n2N4J04K09p6m52L20k57N92m28k03K64P6j41J24l49M32m6j36J34o2
$$ 293 -44 -96 -42 62 271 195 -257 63 -194 398 -30 -233 31 107 -34 90 -259 173 127 -9 125 63
2678F3K44j39p8k48M32j35k38N5P6K88qk63K02k5O6j16J5j19q0J21k21M17j49
$$ 63 307 168 90 -158 274 139 -99 -44 32 320 312 49 251 226 292 176 191 72 -8 113 -108 309 160
2701A60k7P6l00K87O0j2J1k49nL98k12k5l17O38l58O0m71M29K14k80k44J63J68
$$ 160 133 209 -91 196 256 244 255 6 1 399 187 162 -155 483 125 185 -286 143 357 77 -167 -4 164
2724A64k88L74p35M66J00j02l6p6p8P21o08j64J73J99p4j53k65K58J72m8j42l46
$$ 164 -124 250 -485 -19 81 -21 -57 -133 -211 510 -98 -262 -89 110 36 -117 -382 -124 48 0 -142 -488
2746d88L07J76J10m41P2L57k07j29K13K5K16Q2m92L59n3J02j9j21J80J26m46O0
$$ -488 -181 -5 105 -336 -264 93 -114 -243 -30 -5 211 293 -199 160 107 209 190 69 249 375 -71 -11
2768a1J94J12m7m9p9l02N06k42J49p8j82K62j71m34L21J3K46m24K53k28J60o8
$$ -11 183 295 248 199 120 -182 324 82 231 153 -29 233 62 -372 -51 -38 208 -216 37 -191 -31 -99
2790i9j50j0K79L3k85j50K41N84p12P7O2K6l74J32M77l45k9K28o9mk36O6J15l86
$$ -99 -249 -259 20 53 -232 -382 -141 443 -269 -192 -130 -104 -478 -346 131 -214 -243 -15 -84 -88 -324 -258 -143 -529
2814e29M76k38lK99k08j33N2K02q0K5l8K82l81j11O74j17j69j48J53j37O5J0r5
$$ -529 -53 -291 -294 5 -203 -336 -284 -82 -162 -137 -175 107 -274 -385 289 172 3 -145 8 -129 -64 -54 -149
2837a49P0K43l36L03l4j96J74j20lJ34qk78J43j35K66Qn6l59M85l87N6q0l0K52
$$ -149 -79 164 -172 131 97 -99 75 -45 -48 86 78 -200 -57 -192 74 82 26 -333 152 -235 -179 -259 -289 -37
2861c7P0m47K17K8M87m59k05L3K89K02m64J48K3J61l78K60rl1j01p9%N18l96k76
$$ -37 33 -414 -197 -169 318 -141 -346 -313 -24 178 -286 -138 -115 46 -332 -72 -81 -112 -213 -292 -292 226 -170 -446
2885d46L40R5p6J68j56j30L1J88k9k04J0J92r8J70j68q3M50k44K02k74J95K17
$$ -446 -106 -11 -87 81 -75 -205 -174 14 -15 -219 -209 -17 -115 55 -113 -196 254 10 212 -62 133 350
2907C50l42k20K12K05k69P5l33R7L47o0k4j45j2K88k15P4J99k90J0m71O36m07
$$ 350 8 -212 0 205 -64 11 -322 -225 122 62 38 -107 -119 169 -46 28 227 -63 -53 -524 112 -295
2929b95K64p6K5k28J62R5k0k04L2M24l52k49J84L99j98l40K54K72qk94j8K62M0
$$ -295 -31 -107 -82 -310 -148 -53 -73 -277 -245 179 -173 -422 -238 161 -37 -377 -123 149 141 -153 -171 91 131
2952A31o3l77O6M03k68L11l40J86j17J37n7l4j26K42J1k50J19m9p3J40n1L88l38
$$ 131 68 -309 -243 160 -108 203 -137 49 -68 69 12 -22 -148 94 105 -145 -26 -75 -148 -8 -59 329 -9
2975iK45l40J01N0O6j15r7j29M40J05n53M61l43J36l92L14j27J85q6nJ25M07m65
$$ -9 236 -104 -3 47 113 -2 -99 -228 212 317 -236 225 -118 18 -374 -60 -187 -2 -88 -93 32 439 -26
2998b6J94Pk88K34j46J18M1k73J57j92l69O64j8J49k7l14L95j44L6k15l6K6J35
$$ -26 168 175 -113 121 -25 93 134 -139 18 -174 -543 121 103 252 225 -89 306 162 198 -17 -53 -27 108
3021A08j69l5J17J74l0m20K48J90Kl19M2N37l82j33K19k77J00J23kj5j02P1n9
$$ 108 -61 -96 21 195 165 -255 -7 183 185 -134 -92 445 63 -70 149 -128 -28 95 93 78 -24 47 -12
3044a2J60k37L12P1l75R5j25J29K65l9k25j01k2M01n32M0M47Nk21l5J56k10R0
$$ -12 148 -89 223 294 -81 14 -111 18 283 244 19 -82 -104 297 -235 -195 252 257 36 1 157 -53 37
3067C7k11Q7qL21m51n6N93j30l18L95j56N0O7l08J58O6j49L9J19J21k04n3N16
$$ 37 -174 -87 -95 226 -225 -281 312 182 -136 259 103 153 220 -88 70 136 -13 26 145 266 62 9 525
3090E25p54O3K64j3Q1l37k5K89k44K92j15L73m53K18j73K15j26O5j44j72N36j78
$$ 525 -229 -166 98 85 166 -171 -196 93 -151 141 26 399 -54 164 -9 206 80 145 1 -171 365 187
3112A87k76J04K30k99J83k20K78j09M2j73K87j05l46O93k62j16l4m2l0L08j48
$$ 187 -89 15 245 -54 129 -91 187 78 120 -53 234 129 -217 476 214 98 64 22 -8 300 152
3133A52Q5j13m2j86J29K94k74k97L0K72j24J38O8jk24J07J70k87M18l67P1r5K18
$$ 152 237 124 82 -104 25 319 45 -252 -222 50 -74 64 132 131 -93 14 184 -103 315 -52 19 -76 142
3156A42r2j24K70l96L32j32K4PO0m9j11K11k00J4J95k28M9l27M19m1n6K4K4J02
$$ 142 50 -74 196 -200 132 0 24 31 91 42 -69 142 -58 -44 151 -77 -28 -355 64 23 -33 -9 15 117
3180A17k68%J56O6l2j77K58jl59O2J65M7k04N40l09k14J11O4j77O4K66k31j3J63
$$ 117 -151 -151 5 71 39 -138 120 119 -240 -178 -13 34 -170 370 61 -153 -42 22 -155 -91 175 -56 -69 94
3204I4j07K29k8L0m60K35MQ1j06K39J16p9K62o06K59L6k8l1J61k68J6lk04K39
$$ 94 -13 216 188 218 -242 -7 -3 78 -28 211 327 248 510 -96 163 199 171 140 301 33 49 46 -158 81
3228H1K31J03m86N60j31l23Q2l98L61n2K60j16q2j54J9K8J89J21k82j02L10k74
$$ 81 312 415 -71 489 358 35 117 -281 80 28 288 172 90 -64 -45 -17 172 293 11 -91 219 -55
3250e5J12j46K17j50Q1m8QR3j3O7j80J14k16L01J06k13q9J88k15J00k1L7m6j76
$$ -55 57 -89 128 -22 59 11 19 112 99 166 -14 100 -116 185 291 78 -11 177 -38 62 41 78 32 -144
3274a44K67P6l11K23J06k54Mr3K07l26J10K45l15K66K62j68L4k50j80K47%l7K14
$$ -144 123 199 -112 111 217 -37 -33 -126 81 -245 -135 110 -205 61 323 155 189 -61 -241 6 6 -31 183
3297A83l34j00K17j56P1j90L44j03L70l92J60J13j03n7P6j82J11j70K84k74K10
$$ 183 -151 -251 -34 -190 -119 -309 35 -68 302 -90 70 183 80 23 99 -83 28 -142 142 -132 78
3318G8P2r6k11J39N5r5jjJ38j35J14j41J66j2m07K18K02M3p0j27K40m46N92l27
$$ 78 150 54 -157 -18 37 -58 -59 -60 78 -57 57 -84 82 70 -337 -119 83 126 56 -71 169 -277 315 -12
$$ [...]
8191i
##END NTUPLES=NMR FID
##END=
