##TITLE=1H_CA-8570-1
 DMSO, 8 sc, 
 6.3.2019
##JCAMPDX= 6.0         $$ Bruker NMR JCAMP-DX V2.0
##DATA TYPE= NMR FID
##DATA CLASS= NTUPLES
##ORIGIN= UXNMR, Bruker Analytische Messtechnik GmbH
##OWNER= root
$$ XWIN-NMR		Version 3.5
$$ Wed Mar  6 16:10:16 2019 Russian Standard Time (UT+4h)  she@DPX200
##.OBSERVE FREQUENCY= 200.1316
##.OBSERVE NUCLEUS= ^1H
##.DELAY= (6, 6)
##.ACQUISITION MODE= SIMULTANEOUS
##.ACQUISITION SCHEME= undefined
##.AVERAGES= 8
##.DIGITISER RES= 18
##SPECTROMETER/DATA SYSTEM= spect
##.PULSE SEQUENCE= zg30
##.SOLVENT NAME= DMSO
##.SHIFT REFERENCE= (INTERNAL, DMSO, 0, 15.7039)
##AUDIT TRAIL= $$ (NUMBER, WHEN, WHO, WHERE, WHAT)
$$ ##TITLE= Audit trail, XWIN-NMR		Version 3.5
$$ ##JCAMPDX= 5.01
$$ ##ORIGIN= Bruker BioSpin GmbH
$$ ##OWNER= she
$$ F:/spectra/data/she/nmr/H-F/1/audita.txt
$$ ##AUDIT TRAIL=  $$ (NUMBER, WHEN, WHO, WHERE, WHAT)
(   1,<2019-03-06 16:08:46.70 +0400>,<she>,<DPX200>,
      <created by zg, POWCHK disabled, PULCHK disabled
       configuration hash MD5:
       00 E9 B6 7A A2 85 ED C7 34 08 36 98 17 FE 4E 26
       data hash MD5: 16K
       25 2C 48 7A DD CB BD 17 83 22 E4 EA 89 0D 58 BF>)
$$ ##END=
$$ 
$$ hash MD5
$$ 02 AA EF 57 FE BE 2C 14 DE 97 C9 9C 8F 1E 30 CF
##$RELAX= 
##$RELAX= 
##$RELAX= 
##$RELAX= 
##$RELAX= 
##$RELAX= 
$$ Bruker specific parameters
$$ --------------------------
##$DU= <F:/spectra>
##$EXPNO= 1
##$NAME= <H-F>
##$PROCNO= 1
##$TYPE= <nmr>
##$USER= <she>
##$AMP= (0..31)
100 100 100 100 100 100 100 100 100 100 100 100 100 100 100 100 100 100 
100 100 100 100 100 100 100 100 100 100 100 100 100 100 
##$AQSEQ= 0
##$AQ_mod= 1
##$AUNM= <au_zg>
##$AUTOPOS= <>
##$BF1= 200.13
##$BF2= 200.13
##$BF3= 200.13
##$BF4= 200.13
##$BF5= 200.13
##$BF6= 200.13
##$BF7= 200.13
##$BF8= 200.13
##$BYTORDA= 1
##$CFDGTYP= 0
##$CFRGTYP= 5
##$CHEMSTR= <none>
##$CNST= (0..31)
1 1 145 1 1 1 1 1 1 1 1 1 1 1 1 1 1 1 1 1 1 1 1 1 1 1 1 1 1 1 1 1 
##$CPDPRG= <>
##$CPDPRG1= <>
##$CPDPRG2= <>
##$CPDPRG3= <>
##$CPDPRG4= <mlev>
##$CPDPRG5= <mlev>
##$CPDPRG6= <mlev>
##$CPDPRG7= <mlev>
##$CPDPRG8= <mlev>
##$CPDPRGB= <>
##$CPDPRGT= <>
##$D= (0..31)
0 1.2 0 0 0 0 0 0 0 0 0 0.03 0 0 0 0 0 0 0 0 0 0 0 0 0 0 0 0 0 0 0 0 
##$DATE= 1551874125
##$DBL= (0..7)
120 120 120 120 120 120 120 120 
##$DBP= (0..7)
150 150 150 150 150 150 150 150 
##$DBP07= 0
##$DBPNAM0= <>
##$DBPNAM1= <>
##$DBPNAM2= <>
##$DBPNAM3= <>
##$DBPNAM4= <>
##$DBPNAM5= <>
##$DBPNAM6= <>
##$DBPNAM7= <>
##$DBPOAL= (0..7)
0.5 0.5 0.5 0.5 0.5 0.5 0.5 0.5 
##$DBPOFFS= (0..7)
0 0 0 0 0 0 0 0 
##$DE= 6
##$DECBNUC= <off>
##$DECIM= 24
##$DECNUC= <off>
##$DECSTAT= 4
##$DIGMOD= 1
##$DIGTYP= 9
##$DL= (0..7)
0 120 120 120 120 120 120 120 
##$DP= (0..7)
150 150 150 150 150 150 150 150 
##$DP07= 0
##$DPNAME0= <>
##$DPNAME1= <>
##$DPNAME2= <>
##$DPNAME3= <>
##$DPNAME4= <>
##$DPNAME5= <>
##$DPNAME6= <>
##$DPNAME7= <>
##$DPOAL= (0..7)
0.5 0.5 0.5 0.5 0.5 0.5 0.5 0.5 
##$DPOFFS= (0..7)
0 0 0 0 0 0 0 0 
##$DQDMODE= 0
##$DR= 18
##$DS= 0
##$DSLIST= <SSSSSSSSSSSSSSS>
##$DSPFIRM= 0
$$ [...]
##$SUBNAM2= <"">
##$SUBNAM3= <"">
##$SUBNAM4= <"">
##$SUBNAM5= <"">
##$SUBNAM6= <"">
##$SUBNAM7= <"">
##$SUBNAM8= <"">
##$SUBNAM9= <"">
##$SW= 24.9336934301222
##$SWIBOX= (0..15)
0 0 2 0 0 0 0 0 0 0 0 0 0 0 0 0 
##$SW_h= 4990.01996007984
##$TD= 16384
##$TD0= 1
##$TE= 0
##$TE2= 300
##$TE3= 300
##$TEG= 300
##$TL= (0..7)
0 120 120 120 120 120 120 120 
##$TP= (0..7)
150 150 150 150 150 150 150 150 
##$TP07= 0
##$TPNAME0= <>
##$TPNAME1= <>
##$TPNAME2= <>
##$TPNAME3= <>
##$TPNAME4= <>
##$TPNAME5= <>
##$TPNAME6= <>
##$TPNAME7= <>
##$TPOAL= (0..7)
0.5 0.5 0.5 0.5 0.5 0.5 0.5 0.5 
##$TPOFFS= (0..7)
0 0 0 0 0 0 0 0 
##$TUNHIN= 0
##$TUNHOUT= 0
##$TUNXOUT= 0
##$USERA1= <user>
##$USERA2= <user>
##$USERA3= <user>
##$USERA4= <user>
##$USERA5= <user>
##$V9= 5
##$VALIST= <valist>
##$VCLIST= <CCCCCCCCCCCCCCC>
##$VD= 0
##$VDLIST= <DDDDDDDDDDDDDDD>
##$VPLIST= <PPPPPPPPPPPPPPP>
##$VTLIST= <TTTTTTTTTTTTTTT>
##$WBST= 1024
##$WBSW= 4
##$XGAIN= (0..3)
0 0 0 0 
##$XL= 0
##$YL= 0
##$YMAX_a= 309440
##$YMIN_a= -398740
##$ZGOPTNS= <>
##$ZL1= 120
##$ZL2= 120
##$ZL3= 120
##$ZL4= 120
##$ABSF1= 10
##$ABSF2= 0
##$ABSG= 5
##$ABSL= 3
##$ALPHA= 0
##$AQORDER= 0
##$ASSFAC= 0
##$ASSFACI= 0
##$ASSFACX= 0
##$ASSWID= 0
##$AUNMP= <proc_1d>
##$AZFE= 0.1
##$AZFW= 0.1
##$BCFW= 1
##$BC_mod= 2
##$BYTORDP= 1
##$COROFFS= 0
##$CY= 11.3945322036743
##$DATMOD= 1
##$DC= 2
##$DFILT= <>
##$DTYPP= 0
##$F1P= 18.9103706918063
##$F2P= -1.10871071338519
##$FCOR= 0.5
##$FTSIZE= 0
##$FT_mod= 4
##$GAMMA= 1
##$GB= 0.15
##$INTBC= 1
##$INTSCL= 1
##$ISEN= 128
##$LB= 0.24
##$LEV0= 0
##$LPBIN= 0
##$MAXI= 10000
##$MC2= 0
##$MEAN= 0
##$ME_mod= 0
##$MI= 1.114404
##$NCOEF= 0
##$NC_proc= 0
##$NLEV= 6
##$NOISF1= 3.799351
##$NOISF2= 2.8
##$NSP= 1
##$NTH_PI= 0
##$NZP= 0
##$OFFSET= 15.70392
##$PC= 1
##$PHC0= -8864.623
##$PHC1= 16.40014
##$PH_mod= 1
##$PKNL= yes
##$PPARMOD= 0
##$PSCAL= 0
##$PSIGN= 0
##$REVERSE= no
##$SF= 200.130013532006
##$SI= 16384
##$SIGF1= 3
##$SIGF2= 2
##$SINO= 400
##$SIOLD= 16384
##$SREGLST= <1H.CDCl3>
##$SSB= 0
##$STSI= 0
##$STSR= 0
##$SW_p= 3612.71676300578
##$SYMM= 0
##$S_DEV= 0
##$TDeff= 0
##$TDoff= 0
##$TI= <>
##$TILT= no
##$TM1= 0
##$TM2= 0
##$TOPLEV= 0
##$USERP1= <user>
##$USERP2= <user>
##$USERP3= <user>
##$USERP4= <user>
##$USERP5= <user>
##$WDW= 1
##$XDIM= 8192
##$YMAX_p= 0
##$YMIN_p= 0
$$ End of Bruker specific parameters
$$ ---------------------------------
##NTUPLES= NMR FID
##VAR_NAME=  TIME,          FID/REAL,        FID/IMAG
##SYMBOL=    X,             R,               I
##VAR_TYPE=  INDEPENDENT,   DEPENDENT,       DEPENDENT
##VAR_FORM=  AFFN,          ASDF,            ASDF
##VAR_DIM=   8192,          8192,            8192
##UNITS=     SECONDS,       ARBITRARY UNITS, ARBITRARY UNITS
##FACTOR=    0.0002004,     1,               1
##FIRST=     0,             0,               0
##LAST=      1.6414764,     0,               0
##MIN=       0,             -398740,         0
##MAX=       1.6414764,     309440,          0
$$ Real data points
##PAGE= N=1
##DATA TABLE= (X++(R..R)), XYDATA
0@%%%%Qj6J6j6K4l2L2m0N5o3P3r0J13j37J61j92K25k63L03l50M06m65N31o06O89
29C66p80Q79r90J114j247J392j553J730j922K135k368K623k905L217l561L943
45B073m372M854n397O019o738P575q573R782j1278J3196j5756J9357k4846L4351
59B0247n5384J82750r6977l04602K90149K73257p6418k86197k1186J36841P6303
70A38783m0003j6882o1602p5568M0315J64834M917j98256r9511J74900J39786
81A71713j22063j62017P3645J30717n5480j16114O1028J04363p1418j24585O2832
92d7379J35557l6033j32663J0431J02521p828o8557M2500O1698q7795r5422J21243
104a727J68990r7372k36730K4813K65752Q3213k18857j59781J23516J77010r892
$$ plain form
0 0 0 0 0 0 8 -8 8 -8 16 -16 16 -24 31 -32 41 -49 64 -73 88 -104 121 -142 161 -189 217 -248 283 -323 366
29 366 -414 465 -525 589 -658 734 -819 911 -1011 1124 -1244 1379 -1526 1691 -1870 2073
45 2073 -2299 2555 -2842 3177 -3561 4014 -4559 5223 -6055 7141 -8615 10742 -14104 20247
59 20247 -35137 147613 50636 -253966 36183 309440 233022 -53175 -74361 62480 138783
70 138783 98780 81898 20296 -55272 -14957 149877 154794 -43462 -142973 31927 171713
81 171713 49650 -112367 -38722 91995 36515 -79599 -18571 85792 14374 -110211 -47379
92 -47379 88178 52145 -80518 -70087 32434 24606 -43951 -1451 60247 -27548 -122970 -1727
104 -1727 167263 69891 -166839 -142026 123726 206939 -11918 -171699 -48183 128827 118935
115A18935j12298n4239P379M6971R3258L6176j30894j42132R5525K22651n024
126A76308k37999q8430J91183J41727j16533j39431N5712R3861m2355n1263O4774
137D7554L4635j04930o2267J17638J01125r9999j34737N0590J26099j1531r3697
148b9520l948M6934k2702l0285O0580M4634q9962q9481P9828J24949m1677j34726
160h5376p726J03879K9766n7317j3836K2103l4635k8666Q0923P4352r4788j35691
172a47012O1385J77591L469j73790o7143J28231R5649o5569p8779K3106L2184
183a0678k1322R531N4876j9138r7193j0304J13719N6962r3209q9929M2716Q2191
195A8222J966l7801j5176j8942k0955N0064Q1938l6627j39024k1656J55050R1356
$$ plain form
115 118935 6637 -47602 -40223 6748 100006 136182 5288 -136844 -41319 181332 176308
126 176308 -61691 -150121 41062 182789 66256 -73175 -17463 76398 34043 -17220 47554
137 47554 82189 -22741 -85008 32630 133755 33756 -100981 -50391 75708 64177 -29520
148 -29520 -33468 13466 -9236 -39521 21059 65693 -24269 -113750 -33922 91027 49350 -85376
160 -85376 -93102 10777 40543 -16774 -30610 -8507 -43142 -71808 9115 83467 -11321 -147012
172 -147012 -85627 91964 95433 -78357 -145500 -17269 78380 12811 -65968 -42862 -10678
183 -10678 -32000 -22469 32407 13269 -83924 -94228 19491 76453 -16756 -106685 -63969 18222
195 18222 20188 -17613 -32789 -51731 -72686 -22622 59316 22689 -116335 -137991 17059 108415
207A08415j24052j41402N9588J43576J332j06696l1228N3813J9457j8432J6051
218a9578J7352m8882m4370N5984P7937l3251r1010n0P7544K3076m5014j6425K0808
231b5879q570j8143L8581M4019m3778p5149K6023R4861J2115q1089l7495M9832
243b4672L8681j3523o781Q115l1737l3753N4710Q5709l4897j26873j7564J35486
255C2901Q3470r5700j23735K8069J19679L6907o8765o5703J514M7115N0051O596
267E2399n9824o5012K8371R6226K2872r0078o4452N5314P5869j8384n9756p20
279b7175L1780p013j6082K7933K2299m3678m5978L8337O6865j4228o9951j3493
291e0384N0239K5835k1557j4424L695j1339r905L3506L7431l2221o6613N317P6725
$$ plain form
207 108415 -15637 -157039 -97451 46125 47457 -59239 -90467 -36654 -17197 -35629 -19578
218 -19578 -2226 -51108 -95478 -39494 38443 5192 -85818 -85868 -8324 14752 -30262 -46687 -25879
231 -25879 -34449 -52592 -14011 30008 -13770 -88919 -62896 31965 44080 -37009 -74504 -24672
243 -24672 14009 486 -6295 1820 -29917 -63670 -8960 76749 41852 -85021 -102585 32901
255 32901 116371 20671 -103064 -74995 44684 81591 12826 -52877 -51363 -4248 45803 52399
267 52399 -7425 -72437 -44066 52160 75032 -15046 -79498 -24184 51685 33301 -26455 -27175
279 -27175 4605 -2408 -18490 9443 31742 -11936 -57914 -19577 47288 33060 -36891 -50384
291 -50384 -145 25690 4133 -10291 -6596 -17935 -27840 5666 43097 10876 -55737 -50420 26305
304B6305L4357n5396n9237J2724N4318K8661j5733m1820l4259J8730O9719L3917
316G2286o7774q4373K9104J09475K7577r4441p1124N0461Q3921j935o1218k4923
328c2964K2276K1416Q145N539j3137l2332o058M1412L2674k6130m6818l34L6978
341A0667K0597j0765j8459j4579n307K1526L5068m536n1531k6911M3450N2166
353E1386j6036n6115j3465L6359K5613p657j3867j0397j3483M186L7038K3120
365D6682l8838n5364J4087P0463K4247n7348n4538K0644N8716J8576l4478l9886
377b7037m780L1240L5248Pm1517l4654K1354N1267R828m2496l2505J6088L1836
390A3879Q199j1905j3584j3851l744K4867L1640j2771n2296j7349M9018M7224
$$ plain form
304 26305 60662 5266 -53971 -41247 13071 41732 25999 -15821 -50080 -31350 38369 72286
316 72286 4512 -79861 -50757 58718 86295 -8146 -79270 -28809 55112 53177 -8041 -32964
328 -32964 -10688 10728 18873 24412 11275 -21057 -27115 14297 46971 20841 -25977 -26311 10667
341 10667 31264 20499 2040 -12539 -17846 3680 38748 34212 -17319 -44230 -780 51386
353 51386 35350 -20765 -34230 2129 27742 20085 6218 -4179 -17662 -13476 23562 46682
365 46682 7844 -47520 -33433 37030 61277 3929 -50609 -29965 28751 47327 12849 -27037
377 -27037 -31817 -577 34671 34678 -6839 -41493 -20139 31128 40956 -1540 -34045 -17957 13879
390 13879 22078 10173 -3411 -17262 -21006 3861 35501 22730 -29566 -46915 2103 49327
402D9327k3366n9069j2204M5352L5400j3702l5943j6158J3524K6908J5980j5081
414A0968l2614j1399K7928L2319n444l4575j8587J6711K6793J0073j4166k5459
426a7452j3565K0143L7325N295m1849l5249K3521N1756Q336m5206l3092K0362
438a9675L7825Q678k2042k1488m058J3882K1213R800j8933l0418j602L4147K7172
451C4501j6937l8953j1959K8885L3683q96l4340k8124J2517M1206J9703l0687
463H599m2799K468M4612K6451k5433l9508k512L0605K1624p957k1465j2914L418
476a4811J7555J7971m729k7322j8564J7663L3723O235l2048k8350J1256L4891
488A3470J5351k1772l1502m348K7595K6567o464l2231j8007J7872L1188N404k3931
$$ plain form
402 49327 25961 -33108 -45312 40 35440 21738 -14205 -30363 -16839 10069 26049 10968
414 10968 -21646 -33045 -5117 27202 21758 -12817 -31404 -14693 12100 22173 8007 -17452
426 -17452 -31017 -10874 26451 31746 -10103 -45352 -21831 29925 38261 -6945 -40037 -19675
438 -19675 18150 26828 4786 -16702 -20760 -6878 14335 24135 5202 -25216 -26818 7329 34501
451 34501 17564 -21389 -33348 -4463 29220 28324 -6016 -34140 -21623 19583 39286 8599
463 8599 -34200 -31732 12880 39331 13898 -25610 -28122 2483 24107 16150 -5315 -18229 -14811
476 -14811 2744 20715 15986 -11336 -29900 -12237 21486 27721 -4327 -32677 -21421 13470
488 13470 28821 7049 -24453 -28801 -1206 25361 18897 -13334 -31341 -13469 17719 23123 -808
501h08k3398L878K2215J7521m642k3133j7814R900L0960J4877k3430l5016K63
514b8627L8572K6499k0565l9833p554L2778L0180r105l3615j6326J8431K9055
526A9890O535k2412k3480K159K3720J7230p612k3031j2646J1082K3289R473j6463
539G734k4992m380K4769K4183p341l2209j7201K1670L1759J206k9920k3026J1996
552a5752K9127J0476j8004k3856l343J9576J9730j239k1575j8249P260K5042J4139
565B3332j4844k7409o787K3634K6100m103l0564j9187J7607L2989O629k7553k6353
578b6509P711L1125J4991j7281k6416l615K1029J9829l051k0852j4994O821K1049
591I837J1538j0966k3023q569J7768K3319l30k5123j9906R931K7920J0872k0920
$$ plain form
501 -808 -24206 -20328 1887 19408 14766 -8367 -26181 -16281 14679 29556 6126 -28890 -28627
514 -28627 9945 36444 15879 -23954 -31508 1270 31450 22345 -11270 -27596 -9165 19890
526 19890 26425 4013 -19467 -17308 6412 23642 16030 -7001 -19647 -8565 14724 24197 7734
539 7734 -17258 -21638 3131 27314 19973 -12236 -29437 -7767 23992 25198 -4722 -27748 -15752
552 -15752 13375 23851 5847 -18009 -21352 -1776 17954 16715 -4860 -23109 -15849 9193 23332
565 23332 8488 -18921 -25708 -2074 24026 19923 -10641 -29828 -12221 20768 27397 -156 -26509
578 -26509 -18798 12327 27318 10037 -16379 -19994 1035 20864 17813 -3039 -18033 -11212 9837
591 9837 21375 10409 -12614 -21183 -3415 19904 19574 -5549 -25455 -15524 12396 23268 2348
604B348k7092m01K6407J8971j1679k7559r972J7510K2267M95k0225j8181M769
617b2342K0365J2674q993k1721r881J4514K3213L876k1376k1554O690K7485J4510
630A7460j6509k5937k319K4240K1251o214k4452j1589J4853K4120N571j7393j8277
643a5195K984K1009J5924n824k0633r223J2695K2767O228j6434k0683J745K5031
656B0391J8615j0951k7429q425K2207K5281l646k7142j4835J3427K3939N620j8779
669A8273j9759Q87J9358J3999p415k1167j1008J1465J9158K876j7295j7638J001
682g265J6666J2638p334k0455j1076J1310J9759K979j9268j9264L724K2201J0984
695A5599j3204k0459m555J5345J6377m07j6359j5297L931K0792J4495j2089k4594
$$ plain form
604 2348 -24744 -25145 1262 20233 8554 -19005 -28977 -11467 10800 11295 -8930 -27111 -22342
617 -22342 -1977 10697 1704 -20017 -29898 -15384 7829 11705 -9671 -31225 -24535 2950 17460
630 17460 951 -24986 -27305 -3065 18186 11972 -12480 -24069 -9216 14904 20475 3082 -15195
643 -15195 -12211 8798 24722 18898 -1735 -10958 1737 24504 30732 14298 -6385 -4640 20391
656 20391 39006 28055 626 -7799 14408 39689 36043 8901 -5934 7493 31432 37052 18273
669 18273 -1486 -599 18759 32758 25343 4176 -6832 4633 23791 26667 9372 -8266 -7265
682 -7265 9401 22039 14705 -5750 -16826 -5516 14243 17222 -2046 -21310 -17586 4615 15599
695 15599 2395 -18064 -22619 -7274 9103 8696 -7663 -22960 -19029 1763 16258 4169 -20425
708b0425m803K2150K2630n160k5584j2971J6262K5249N346k0460j9579N474K5662
721A3791J5135j3612k3974k968K2200J9665o547k1075q314J3077J6922K778j0870
734A6208j2713j188J1746J3855r65j5887j2295P034J8391N526j3370j5518k10
747F14J3178J1447k463j5033j2421M603J8251Q948j3893k1893j780K0427J5643
760B5628r216k2643q870J3418J9373K363j8738j9015L071K3269J5237j5222k7684
773a9029l244K5267J9637j1472k5519o780J7856J7862j906j6777j2143M283J6586
786D621R986q377j7499m990J4283J4911l012j5357q225O594J1583N002n010j1008
800f498p164P011J5581M009j4686j6456M590J8672Q460j2128j6579j955J2592
$$ plain form
708 -20425 -25228 -3078 19552 14392 -11192 -24163 -7901 17348 22694 2234 -17345 -11871 13791
721 13791 28926 15314 -8660 -11628 10572 30237 23690 2615 -5699 7378 24300 27078 16208
734 16208 3495 2307 14053 27908 26943 11056 -1239 5795 24186 29712 16342 824 614
747 614 13792 25239 22776 7743 -4678 -75 18176 27124 13231 -8662 -10442 9985 25628
760 25628 16412 -6231 -15101 -1683 17690 20053 1315 -17700 -14629 8640 23877 8655 -19029
773 -19029 -22273 2994 22631 11159 -14360 -21140 -3284 14578 12672 -4105 -16248 -11965 4621
786 4621 14607 6230 -11269 -16259 -1976 12935 9923 -5434 -13659 -7065 4518 9520 4510 -6498
800 -6498 -13662 -6651 8930 12939 -1747 -18203 -13613 5059 13519 1391 -15188 -17143 -4551
813d551J2604o82j4384j4279L676J9605J1091j4088k3057p71K2645J5395j1656
826A548k1861n269J6018J5702p29j5750j3858M667J8570J0955j1211k0666k354
839b4238J9545J5190p713j7953m938J1249J2622J909q457j0391k136J0694J4302
852I685j039j7011j0211J0866J7862K410j4980j1934M582J3504P979m826j2518
865e631q209Q265J6933M507j6248j6065N606J9779P292j3483j5258M11J2884R469
879A0252k446j1834j0028L331J5581Q671j1304j8392q35J7722J1667q742j5822
892a2179m295R974J0892J951r009j2119j739J3208J3222m579j9209q048J4630
905g300J7299j924j7369r392P336J4119N978q061j4026m097J2545J6331j642j8988
$$ plain form
813 -4551 8053 7371 -7013 -21292 -17616 1989 13080 -1008 -24065 -24836 -2191 13204 1548
826 1548 -20313 -25582 -9564 6138 5409 -10341 -24199 -19532 -962 9993 -1218 -21884 -24238
839 -24238 -4693 10497 2784 -15169 -20107 -8858 3764 5673 -2784 -13175 -15311 -4617 9685
852 9685 8646 -8365 -18576 -7710 10152 12562 -2418 -14352 -9770 3734 11713 6887 -5631
865 -5631 -13840 -5575 11358 15865 -383 -16448 -10842 8937 16229 2746 -12512 -12101 783 10252
879 10252 7806 -4028 -14056 -10725 4856 13527 2223 -16169 -17004 718 12385 3643 -12179
892 -12179 -16474 -6500 4392 6343 -2666 -14785 -16524 -3316 9906 5327 -13882 -21930 -7300
905 -7300 9999 8075 -9294 -18686 -11350 2769 8747 686 -13340 -17437 -4892 11439 9797 -9191
919i191j1405J2622J9360N56j6816j1072P100J3566N182o860j0224m525P385J2910
933H588K877j3032j1588M725J5029N520r477j0998K42Q540P173L92o876r337m97
948h719J1952J0564n656j6547m951J3446J3874l132j4738q027O809J2957O098
961A3930q465j4881l220J4523J5088m663k0021q728J4645J8228k009j7963j0058
974a3594Q674J4810L557r430j2099j764J1810J1711k777j5885p986J0368J4404
987A1799l68j2845p832M500R216L576l619o772n423K790R988N178q211j1620k71
1002i914J2005P926n155j1184m367O171R853L239p501j2158j659J3261J2020o290
1016F247j7637n432J3883J4650l431j6032p591P942J3257L359r356j2586j049
$$ plain form
919 -9191 -20596 -7974 11386 11942 -4874 -15946 -8846 4720 9902 3042 -7182 -11707 -4322 8588
933 8588 11465 -1567 -13155 -8430 6599 12119 2642 -8356 -8114 426 7599 7991 1115 -8222 -8719
948 -8719 3233 13797 8141 -8406 -13357 89 13963 10831 -3907 -11934 -5125 7832 13930
961 13930 5465 -9416 -12636 1887 16975 12312 -7709 -16437 -1792 16436 14427 -3536 -13594
974 -13594 -4920 9890 13447 4017 -8082 -9846 1964 13675 10898 -4987 -12973 -2605 11799
987 11799 11431 -1414 -9246 -4746 4470 8046 4427 -2345 -7768 -4978 5010 10188 1977 -9643 -9914
1002 -9914 2091 10017 4862 -6322 -10689 -4518 5335 8574 1073 -11085 -12744 517 12537 6247
1016 6247 -11390 -16822 -2939 11711 8280 -7752 -15343 -7401 5856 9215 -141 -12727 -13776
1029a3776J3244J1871n456j6297o374J2536J3968k200j4435o693O771R978L545
1042F682o546q622k919P055J0233N53j1347q527N081J2195L254q515q970K29P735
1057b429O800m19p722q261K186J1420P076q034j3438p95J3502Q855n520j2309
1071i088m130P733J0296J862q747j0181P53J1988R411o414j4215l522J1962J1360
1085I068l134j2417n242O357R630L122o114r354j896Q846J0399j906j2702o844
1099a2187Q375J1998R48j0016p543K567Q382N822k681q958n999N741J1967K612
1113A1028j1074j0636L927J3310M707q823r641k87Q210P272j030q430p692L256
1127e903J1345N415q480j1732M82J1986O801n695r834k831O474O728J991n604
$$ plain form
1029 -13776 -532 11339 5883 -10414 -16788 -4252 9716 7516 -6919 -13612 -6841 3137 6682
1042 6682 136 -8486 -11405 -4350 5883 6436 -4911 -13438 -8357 3838 7092 -1423 -10393 -10164 -2429
1057 -2429 4371 3952 -3770 -12031 -9845 1575 8651 617 -12821 -13616 -114 8741 3221 -9088
1071 -9088 -13218 -5485 4811 6673 -2074 -12255 -11502 486 9897 3483 -10732 -14254 -2292 9068
1085 9068 5934 -6483 -11725 -5368 4262 7384 1270 -8084 -9980 -1134 9265 7359 -5343 -12187
1099 -12187 -3812 8186 9134 -882 -8425 -5858 2524 8346 5665 -3293 -9292 -3551 8416 11028
1113 11028 -46 -10682 -6755 6555 11262 2439 -7202 -7489 721 7993 6963 -1467 -9159 -5903
1127 -5903 5442 10857 2377 -9355 -8873 3113 9914 4219 -5615 -8446 -1972 4756 6747 1143
1141A143q231r02Q907Q578l613j2144m132Q816R861j426r262n396L110P733M834
1156G876l147r076m786P285J1492N44j2582q250P219J2514K346j0218q125K205
1170d703Q366O283k384q865o303N483J2298K547j1046r888M812J2800L063q650
1184C813p764J451O735M513l92n139o705O17R176O644o471j1099m02J0173O615
1199A1765m604p891k356L301N484L608k895r005l737Q057J0075k102j3254n407
1213h961Q927J0113j564r482n239K500O655M922k023q999o413O451J2683M32j3491
1228c489q807Q443J2537m62j0075n678K879O331L536q68o171n984K821J0933L787
1243I733r945r458M096J1400K688p207n514J164L162L299K845k298p836k720R526
$$ plain form
1141 1143 -7088 -7990 917 9495 5882 -6262 -10394 -1578 8283 6857 -2405 -7801 -4691 3042 7876
1156 7876 4729 -4347 -9133 -1848 9644 10188 -2394 -10644 -3425 9089 11435 1217 -6908 -4703
1170 -4703 3663 9946 7562 -1303 -7606 -2123 10175 12722 1676 -8212 -3400 9400 12463 3813
1184 3813 -3951 -2500 4235 8748 8356 3217 -3488 -2871 6305 12949 6478 -4621 -5023 5150 11765
1199 11765 7161 -730 -3086 215 5699 9307 6412 -2593 -6330 1727 11802 9700 -3554 -8961
1213 -8961 -34 10079 8515 -967 -6206 -3706 2949 7871 5848 -3151 -9564 -3113 9570 10002 -3489
1228 -3489 -12296 -3853 8684 8222 -1853 -7531 -4652 1679 5215 4347 -1824 -7808 -4987 5946 9733
1243 9733 -212 -9670 -5574 5826 8514 1307 -4207 -3043 119 3418 6263 3965 -3871 -6591 2935
1258B935R574n154j2733j739J1349O942m691p555j118K342M153M070r46q848n620
1273g039P485J2242j589j4181n692J0156J0133l464r117l118L249L885L686m21
1287F215p263p306M635J2473J477j3280q455Q175J1342k145r107k815K997K086
1301i71K037J887k657q303j250J0859P204q863j1365K593J1869K962p531m762
1315f291R83K421K544M125j245r072m170J0019J1134n609j4154l85J2063O585
1329H948o685o566R50K717J613L702J671o904p477O206J3199p88j3997n867J0733
1344A455R083m188p764p47L031J114K393L024m466r672K321J2854L913j2240r735
1359i624P219J1105j348q302k258J864R35K237M539k638j0720k045J2380R141
$$ plain form
1258 2935 12509 7355 -5378 -7117 4232 11174 6483 -1072 -2190 152 4305 8375 7429 -1419 -7039
1273 -7039 446 12688 11099 -3082 -8774 1382 11515 8051 -1066 -4184 -935 2950 6636 6215
1287 6215 -1048 -8354 -3719 8754 10231 -3049 -11504 -3329 8013 5868 -3239 -6054 -3057 -971
1301 -971 1066 2953 296 -8007 -9257 1602 8806 -57 -11422 -8829 3040 6002 -1529 -6291
1315 -6291 -5308 -2887 -343 3782 2537 -6535 -10705 -686 10448 4839 -9315 -9700 2363 8948
1329 8948 2263 -4303 -3353 -636 977 4679 6350 -554 -8031 -1825 11374 10586 -3411 -9278 1455
1344 1455 10538 6350 -1414 -2161 870 1984 4377 7401 2935 -6737 -4416 8438 12351 111 -9624
1359 -9624 -2405 8700 7352 -950 -3208 -1344 -409 1828 6367 3729 -6991 -9036 3344 12485
1373A2485j0276j3935M205J3803J312r300m194L558J865L25K966P17p295n591
1387i355Q361J0470m930j3099N2J1195M177o413m520K678M94j546M391M887o527
1402C15r808M364J3838J127j3928o603R831Q923l647p094J50J501n37L181N716
1417G329m607j1457M99J4787N520j2945j1757P317J3044j248r120k839L552J323
1431f02J143L486k167r131j687J1628P365j0294j1526N202J2307l85r516j462
1445e639N214r0k975M082L975o249q189O184J1541j685j2386k558J0033M734n001
1460I91l504J927q71j983N492N839o482j1491L922J5211K238j4371p998R609J0180
1475H709l217p324n27J357J42L639M636n474j0385J443J4555M710j3970j0143
$$ plain form
1373 12485 2209 -11726 -7521 6282 7594 -1706 -5900 -2342 -477 -152 2814 3531 -3764 -9355
1387 -9355 -994 9476 4546 -8553 -8501 2694 6871 458 -4062 -1384 -890 -2436 1955 6842 315
1402 315 -9493 -5129 8709 9836 -4092 -10695 -864 8059 4412 -2682 -2532 -1031 -1568 1613 7329
1417 7329 2722 -8735 -8236 6551 12071 -874 -12631 -5314 7730 6482 -2638 -5477 -1925 -602
1431 -602 541 4027 1860 -7271 -8958 2670 10035 -259 -11785 -6583 5724 5339 -4177 -5639
1445 -5639 -425 -515 -3490 592 4567 -1682 -9871 -3687 7854 6169 -6217 -8775 1258 5992 991
1460 991 -2513 -586 -1457 -3440 2052 7891 1409 -10082 -6160 9051 11289 -3082 -11080 -1471 8709
1475 8709 5492 -1832 -2359 -1002 -860 2779 7415 1941 -8444 -7001 7554 12264 -1706 -11849
1489a1849Q729J2496l466r832p07N264j68j237L189O31p190l442Q592P424o869
1504A565j0138L255R537n26o277j12L152k307k538O067M825p710r261N861J3159
1519H552j539j2953l951R738O166m426m355J166m88j257N478M848o610j0491M281
1534e841J3610K105j3829o907R626Q963l650p161O7K249O4J737M237l500q588
1549f818Q10J1187M228j0333q461O941R368l019o610L45L417j643j363N605J728
1564E382q526m974Q272Q893n154j0599Q97R177K058n197k063J804j381l45N427
1579C671K672p566p289O418J0816j639j2008k745R257N286m842l879J267r5r17
1594a593L491M072m776q473K501J1462J943j0814n926O986P223k753n212M42J092
$$ plain form
1489 -11849 -3120 9376 5910 -3922 -4629 635 467 -770 2419 3050 -4140 -7582 1010 8434 1565
1504 1565 -8573 -5318 4219 3693 -2584 -2696 456 -1851 -4389 1678 6503 -1207 -10468 -4607 8552
1519 8552 7013 -5940 -9891 -153 6013 1587 -2768 -1602 -2090 -3347 2131 6979 369 -10122 -5841
1534 -5841 7769 9874 -3955 -10862 -1236 7727 4077 -3084 -3017 -768 -704 1033 5270 1770 -6818
1549 -6818 -6008 5179 9407 -926 -9387 -2446 6922 3903 -2707 -2362 1055 -588 -1951 3654 5382
1564 5382 -3144 -8118 154 9047 3893 -6706 -5809 3368 5426 229 -1834 -30 -1411 -1756 3671
1579 3671 6343 -1223 -8512 -2094 8722 7083 -4925 -7670 1587 6873 2031 -1848 -581 -676 -1593
1594 -1593 1898 5970 1194 -7279 -4778 6684 8627 -2187 -8113 -1127 6096 3343 -1869 -1427 -335
1609c35j510J883M660k000q352j460J0105N617p931q666L514Q346M76n443j516
1624b612J309j109J544M373Jp727l521Q144Q006o047r291Q87Q575J985m915k398
1640b796J964n15o69M029K203n411n789M532Q489j050q712k083O066L799k405
1655A652k467M35j087j085L795M996m437q259J290R582L290r008n549M069O627
1670C844k31m086j209o72P6L228M162l319p772m06R327M714p485p600L148P375
1686C094J058m734k246Q79M73J243L133j041n523k320O409N508m083p063J000
1701d213N916J361k957j526J091j157m29L567K388m448n446L300P482O2o722l446
1717e177M355M218n81k437j176j252M7M312L280m575o912J803Q542K711p471n930
$$ plain form
1609 -335 -1845 38 4698 2698 -5654 -7114 2991 8608 677 -7989 -4475 3871 4347 -1096 -2612
1624 -2612 -1303 -2412 -868 3505 3506 -4221 -7742 402 8408 2361 -6930 -6043 2532 4517 -398 -2796
1640 -2796 -832 -1347 -2016 2013 4216 -1195 -6984 -2452 6037 4987 -3725 -5808 258 4057 1652
1655 1652 -815 -380 -1467 -2552 1243 6239 1802 -6457 -5167 4415 7705 -1303 -6852 -2783 3844
1670 3844 3613 -473 -1682 -2354 -2278 950 5112 1793 -5979 -6385 2942 7656 171 -7429 -4281 3094
1686 3094 4152 -582 -2828 -1949 -1476 -233 2900 1859 -3664 -5984 425 5933 1850 -5213 -4213
1701 -4213 1703 3064 107 -1419 -328 -1485 -1914 1653 4041 -407 -5853 -2553 4929 4991 -1731 -5177
1717 -5177 -822 3396 2815 378 -798 -2050 -2003 2309 5589 1014 -5898 -4095 4447 7158 -313 -6243
1733f243L874N814M52l100k653n29R70L184K556l048n968M32P021L528n895n435
1749e040K157N093J086l138j753J40j4R75L299k0n116k445M085M852j481n747
1765c067q32L736K285q63j575j010j219J022L813J594m774m723K826O956O62o326
1781a495l409L125M473Kk434k091q95J428L562J947m047n280J807O472K042n635
1797d28m566K796M344O14k210j865r72R42K494K118k276m674k33N373L206l594
1813A069m607L05M178J570j475j627j243m49K178K952l59m852k225L762M943r39
1829C181n670j485L369L040m75j908j751r91J834L499M95m236l892K700O074L56
1845D140n607k496K525L563J06j826j915o29J018K690J894l210m607Q65N762J564
$$ plain form
1733 -6243 -2369 3445 3897 797 -1856 -2385 -1415 1769 4325 1277 -4691 -4259 2762 6290 395 -5040
1749 -5040 -2883 2210 3296 158 -1595 -1455 -1469 -494 2805 2785 -2331 -4776 -691 4161 2680 -3067
1765 -3067 -3899 -163 2122 1259 -316 -1326 -2545 -1523 2290 3884 -890 -5613 -2787 4169 4831 -1495
1781 -1495 -4904 -1779 2694 2696 262 -1829 -2724 -1296 2266 4213 166 -5114 -3307 3165 5207 -428
1797 -428 -4994 -2198 2146 2760 550 -1315 -2287 -1345 1149 3267 991 -3683 -3916 1457 4663 1069
1813 1069 -3538 -3233 945 2515 1040 -587 -1830 -2279 -101 2851 2492 -2360 -4585 -823 4120 3181
1829 3181 -2489 -3974 -605 2435 1960 52 -1699 -2690 -856 2643 3138 -1098 -4990 -2290 3784 4140
1845 4140 -1467 -3963 -1438 2125 2231 405 -1510 -2139 -1121 1569 3463 253 -4354 -3489 2273 3837
1861C837m150l687J097L946J110j247j868j687k80K920L103j645n018q93N067
1876F05L341k627m922J48L344K178r81j665j613j02K089L153q25m581k110M097
1892d71M513j573m828j131L270K600o98j253j302j005J517K583J320l658l365
1907c481J971M959P80m492j909J223K913O35j082j349j431L36K757K376k105m886
1923b785K25N266K639l812l778M49L177J697r08k023j845K45K535L021j774n085
1939b756r57M977L461k946m619pL543J618p17k128r80m92K011K146k57l392k426
1956c921K989L842j146l705j073K165K114n12m37j196j271N61L075J446k873m048
1972c990J486M878J280l986k824J607K931N84o73j505j760K87K956K522k362m222
$$ plain form
1861 3837 -313 -4000 -2903 1043 2153 906 -962 -2649 -2929 -9 3094 1449 -3569 -4462 605
1876 605 3946 1319 -3603 -3455 -111 2067 1086 -579 -2192 -2294 -205 2948 2123 -2458 -4568 -471
1892 -471 4042 2469 -2359 -3490 -220 2380 1682 429 -873 -1878 -361 2222 3542 -116 -3481
1907 -3481 -1510 3449 4229 -263 -2172 -949 1964 2599 1517 168 -1263 -927 1830 4206 2101 -2785
1923 -2785 -2560 2706 5345 1533 -2245 -1796 1381 3078 2170 147 -1698 -1453 1082 4103 2329 -2756
1939 -2756 -3713 1264 4725 1779 -2840 -2847 696 2314 1597 -531 -1511 -2003 8 2154 1897 -1495 -3921
1956 -3921 -932 2910 1764 -1941 -3014 -849 1265 753 316 -880 -2151 -1590 1485 2931 58 -3990
1972 -3990 -2504 2374 3654 -332 -3156 -1549 1382 1966 1293 -212 -1972 -1685 1271 3793 1431 -2791
1988b791n1N298K075l375l209L20L232J091l79j341j760l96K561K525j143m761
2004b104q28M223L174k316l704l48L227J114r68p67j149o04M64K974N95l561k848
2021c426K468M158k40l891j840K468J802K24q05j533j482N26L109J787l522l570
2037c767J669M550O46l904k169J785K046L00q64o26j409o55K552K746j718m439
2053c257k49M524K343k841l549Q38K713Q96j009n83r12j350J807K953k49m397
2069b322j970M093L412k161l516m63K669J045j23l97j399j254O18L676J121m273
2085a244l266K664M691m64m714j329L447J554p25j029l2q45k16K332J770k614
2101b0l159J016M049M82k591k113J237J952k49j6J32j695j648K417L501r55m461
$$ plain form
1988 -2791 -2842 2456 4531 1156 -2053 -1733 1499 2590 2211 870 -890 -1286 1275 3800 2657 -2104
2004 -2104 -2932 1291 4465 2149 -1555 -1903 1324 2438 1470 703 -446 -1050 -586 2388 2983 -578 -3426
2021 -3426 -958 3200 2960 -931 -2771 -303 1499 1723 918 -615 -2097 -1571 1538 3325 -197 -3767
2037 -3767 -2098 2452 3098 -806 -2975 -1190 856 1156 292 -334 -1743 -2398 154 2900 1182 -3257
2053 -3257 -3506 1018 3361 520 -3029 -2191 522 1418 409 -174 -1086 -2436 -629 2324 2075 -2322
2069 -2322 -4292 -199 3213 1052 -2464 -2927 -258 787 664 267 -1132 -2386 -1768 1908 3029 -1244
2085 -1244 -4510 -1846 2845 2381 -2333 -3662 -215 1339 614 -415 -447 -1292 -1508 824 2594 -20
2101 -20 -3179 -2163 1886 2368 -223 -2336 -1099 853 604 588 720 -975 -2623 -206 3295 2340 -2121
2118b121p82L828L294l074l405N12K622N33l64j14j414j395J115L620n1m177k432
2135c805L527M198j508m235q81K725J634j37j225r19j198J015K988L50l628k773
2151c872L267L859j511m153J04K971O06j625l12J184q91j908J548L391j723l991
2167c056j06M225J434k600k629R66J968J13j38L03j632j888K380L536j358m757
2183c239p30M198K784k375l597Q04K030N16k21P1j364j893J197M222L10n316k226
2200d829M507M182k778m324J08L687P97j840n08M73n49j60K024J336k496k280
2216b650J234L366l61k825l56J546L47o98J510jj931k090L155L569k191m980M5
2233c311M838J991l619k898K099K173k45r67M43r11j537J298L578o96l677j999
$$ plain form
2118 -2121 -2903 925 4219 1145 -2260 -1748 874 1407 1043 929 -485 -1880 -765 2855 2804 -1373 -3805
2135 -3805 -278 3920 2412 -1823 -2704 21 1655 1518 293 -626 -1824 -809 2179 2529 -1099 -3872
2151 -3872 -605 3254 1743 -2410 -2306 665 1271 -354 -666 518 -373 -2281 -733 2658 935 -3056
2167 -3056 -3162 1063 2497 -103 -2732 -1766 202 315 177 480 -1152 -3040 -660 2876 1518 -3239
2183 -3239 -3969 229 3013 638 -2959 -2155 -125 391 170 241 -1123 -3016 -1819 2403 2713 -2603 -4829
2200 -4829 -322 3860 1082 -3242 -3134 553 1350 -490 -998 -525 -1074 -1234 790 2126 -370 -2650
2216 -2650 -1416 1950 1589 -1236 -1592 -46 301 -397 1113 1112 -819 -2909 246 3815 1624 -3356 -3311
2233 -3311 1527 3518 -101 -2999 -900 1273 1028 61 504 -407 -1944 -646 2932 2236 -1441 -3440
2249c440M001L236k639l187L70K307R38p68l29q63j767J604L338l34l826j564
2265b923L518K909k105l633J024K794l27j658R81J021j851j805L119K466k084
2280A446l873O94L952J338l114k478J401J938m1O6j009r51m85J913K255j729l738
2297b415M99M017N30k797j546J738J038j168K15J128q98k622Q29L946L11m880
2313b075j619L485L389k065l537L98K614M54r04j85q0q76J04K112J003k568j971
2330b321K205K158k72k008n13J505N40k37J296l84k683j40L485K439l181l722
2346a833K033M613j40l749j454K978J739j333p49O53K52j156L74J578P06k713
2362A799j009K149J486r33j742p6L24M92Q43J15k162j525J822K998n87m536j325
$$ plain form
2249 -3440 561 3797 1158 -2029 -1659 648 1586 818 489 -374 -2141 -537 2801 2467 -1359 -2923
2265 -2923 595 3504 1399 -2234 -1210 1584 1257 -401 580 1601 -250 -2055 1064 3530 1446
2280 1446 -2427 -1733 2219 3557 443 -2035 -634 1304 1263 1329 320 -631 -1116 797 3052 1323 -2415
2297 -2415 -1916 2101 2631 -166 -1712 26 1064 -104 111 1239 341 -2281 -1452 2494 2805 -2075
2313 -2075 -3694 -209 3180 1115 -2422 -2024 590 1044 140 -45 -125 -1001 -897 1215 2218 -350 -2321
2330 -2321 -116 2042 1770 -238 -751 754 1294 1057 2353 1969 -714 -854 2631 5070 1889 -1833
2346 -1833 200 4813 4673 924 -530 2448 4187 2854 2105 2758 3010 1854 2228 3806 4512 1799
2362 1799 790 2939 4425 3492 1750 1674 1998 2490 3333 3448 1286 -239 1583 4581 3994 -542 -1867
2379a867L882K238k783k567O59J652j65j028O15k77j740m21K192J993k872l344
2395c833J393L439M55l174j493J040J903j5p81j217n24J250J943k28k323j039
2411c204J590J957k34j870J50J674p07r28J285J373j220k652J938L265k01l731
2427a515j405L083K922j294l044l19K474J202o15p00q66o0J089J219j08k341o71
2444i49J896J133n80j313n41J01O54P93L89j555k082R76K575J012l654k445K651
2461i39K770n36l256p53J985J351j492r53M51O9o44J22J087K33j708o92Q30J792
2479b83l95j612o95M98J261J381j342k491j53K734K106k146k994N91L139J039
2495F38k208j703P52J913k57q76L51L15j172qJ788Q63j893j594Q14K543P62k167
$$ plain form
2379 -1867 2015 4253 1470 -1097 -438 1214 1049 21 636 359 -1381 -1802 390 2383 -489 -3833
2395 -3833 -2440 999 1454 -1720 -3213 -2173 -270 -285 -1066 -2283 -2807 -1557 386 158 -2165 -3204
2411 -3204 -1614 343 109 -1761 -1611 63 -644 -1572 -287 1086 -134 -2786 -848 2417 2216 -1515
2427 -1515 -2920 163 3085 1791 -1253 -1572 902 2104 1489 789 -77 -137 952 2171 2063 -278 -949
2444 -949 947 2080 1500 187 -354 -253 401 1194 1583 28 -2054 -1078 1497 2509 -1145 -3590 -939
2461 -939 1831 1295 -1961 -2714 -729 622 -870 -1823 -1372 -1303 -1947 -1825 -738 -505 -2213 -2905 -2075 -283
2479 -283 -678 -2290 -2985 -2487 -1226 155 -1187 -3678 -3831 -1097 1009 -1137 -4131 -3540 -401 638
2495 638 -1570 -3273 -2521 -608 -865 -1741 -1390 -1075 -2247 -2255 -467 396 -1497 -3091 -2277 266 1028 -1139
2513a139j786O71J907R52j119j967K98J264J394n34j839n45J683J216q29j177
2529a550N03K48l43k3J049M44j724j378J728K401m88l087j071L136K083j739k732
2546b543J44K265J469j222j797J59P33R45Q2p64m46j42R84K11l18j4m88m31O46
2565e27J014Q56j905j780J100K891L59k947j849K240K876o97l177k75J979Q65
2581A023o08r30J21K99k4L81M08j14r78p68J309J361n50j042j209R52J923O85
2599B239j991j815M08K877Q32k312k120J218K820j52k387n84J617O40r63k23O72
2616G76j70q30j07J234J229j437j779P58J990N96j618j868R89J723O94q55k120
2633g95j13J921J302r10k351P3J995O09j068q72N78N90l69m02J368j98j800n61
$$ plain form
2513 -1139 -2925 -2254 -347 605 -514 -2481 -2183 -919 475 -59 -1898 -2443 -760 456 -373 -1550
2529 -1550 -1047 -799 -1142 -1165 -116 328 -1396 -2774 -1046 1355 867 -2220 -3291 -155 1928 189 -2543
2546 -2543 -2399 -134 1335 113 -1684 -1525 -792 153 235 -529 -975 -1117 -133 78 -240 -254 -742 -1173 -527
2565 -527 487 1343 -562 -2342 -1242 1649 2008 -939 -2788 -548 2328 1631 -1546 -1821 158 1023
2581 1023 415 -515 -394 -95 -119 262 670 556 -422 -1190 119 1480 930 -112 -1321 -369 1554 2239
2599 2239 248 -1567 -1159 1718 2550 238 -1882 -664 2156 2004 -383 -967 650 1290 327 104 776
2616 776 606 -224 -331 903 2132 695 -1084 -326 1664 2260 642 -1226 -237 1486 2180 1325 -795
2633 -795 -908 1013 2315 1405 -946 -873 1122 1731 663 -209 369 959 590 188 1556 1358 -442 -1003
2651a003J630K299j673k866N25K766J034k175j806P64J926K20p21j246j11Q29
2667C92J321o19r67o77R97M97p69k14Q10l60r17k01J472J159j710k401J716K850
2685B379N1l538j620K747K597j392k661J23J900J36n31l22K80p61J20R49L1l56
2703A32j000N28P86M49k34j006n94N80J164Q48j193k127O38K818P58k990j774
2720b217K186K330r46k350K51J816J65j481J3J328j73j581R6J949O59k184j397
2737a536J003J984l0j184o94k75R83J480q38k110m14J665K162j268k531M63K424
2754A284k11j387p52J406K08j293k00J916j08j982q24K180K207k030k838J206
2770a218K293K0j452j300Q09J094J68o48n18o05Q61J061Qj339p42J092P89q71
$$ plain form
2651 -1003 627 2926 1253 -1613 -1088 1678 2712 537 -1269 -505 1421 1641 920 -326 -437 392
2667 392 1713 1094 127 -550 447 944 175 -39 771 411 -506 -707 765 1924 214 -2187 -471 2379
2685 2379 2430 -1108 -2728 19 2616 1224 -1437 -1314 586 722 191 -131 149 -612 -492 457 488 132
2703 132 -868 -340 446 895 661 -345 -939 -359 805 1653 460 -1667 -1029 1789 2547 -443 -2217
2720 -2217 -31 2299 1353 -997 -746 1070 1235 -246 -233 1095 922 -659 -563 1386 2045 -139 -1536
2737 -1536 -533 1451 1421 237 -457 -732 251 1731 893 -1217 -1631 34 2196 928 -1603 -1140 1284
2754 1284 1073 -314 -1066 340 548 -745 -945 971 863 -1119 -1943 237 2444 414 -2424 -1218
2770 -1218 1075 1095 -357 -1657 -848 246 414 -234 -752 -1357 -496 565 573 -766 -1508 -416 373 -498
2788d98k07M09M12j031q40J971R47j844k299K237L028j473l167j62K883J092j781
2805c23j965J292J217Pq70p3J92n45J83Q43L98j067n66P27M92k80M51M8r16n79
2825a334J307J432r00l066R94L076P92k713j990K395K082j035k007O3J744K76
2841A116j404N46N69n81j119J125J198j90j900l52J322Q86o80p40M8l29J061N03
2859A079n02j587l64K064J360j875k197J212K135m20k270M16J556j44k109L77
2875a269K255m32j892n86K560J132j911k013Q91K104N2j639n10O19L42O36K31
2892E70j089p39O74J408N0j577p79J426J316j430r09J151J72q34k80J163R15k090
2910h82j375K365J859j573k575N52K835L72k491q49J371P82m35r81R34k49n79
$$ plain form
2788 -498 -705 -296 116 -915 -1755 216 1163 -681 -2980 -743 2285 812 -2355 -2517 366 1458 -323
2805 -323 -2288 -996 221 228 -642 -715 -523 -1068 -885 -42 356 -711 -1277 -550 -58 -338 113 161 -755 -1334
2825 -1334 -27 1405 505 -2561 -1567 1509 2301 -412 -2402 -7 2075 1040 -967 -904 840 1116
2841 1116 -288 258 827 246 -873 252 1450 1260 -640 -992 330 1216 536 -204 -156 -485 576 1079
2859 1079 577 -1010 -1374 690 2050 175 -2022 -810 1325 905 -1365 -949 607 463 -1646 -1269
2875 -1269 986 554 -1338 -1924 636 1768 -143 -2156 -1265 839 891 -748 -1258 -639 -297 339 570
2892 570 -519 -1258 -584 824 874 -703 -1482 -56 1260 -170 -1079 72 244 -590 -870 293 1208 -882
2910 -882 -2257 108 1967 394 -2181 -1629 1206 1578 -913 -1762 -391 391 -44 -1025 -91 -340 -919
2927i19K12J020j85j095K51K8L41j07L18Mq44m67J480J268j019k586J113L024
2945A837N86l250j426K853J908j408j372O20J196m14m70P08Q42p82p97J094J395
2962C120r78j129K88J246K90o53m63K35k76N98J062o56j775MK097Q79j957k166
2980b34J510J568l78j705n0J742q97j534P95R35m92j992j10K213J33j960j239
2997a695J244R37q76p69j88QM59j61M60j097n94N43J379m96j491k07J589M31j214
3016a738k07J258rj241J55J559N41k015p08K399J394r64k247O86K329M79j413
3033B58o12P98N29J44M01L08r31m83J432R85q52j109L11J257J91n87R1L09n03
3052A937p12J219Q33j565j522J299J909o66k225r21K409N76j736o72P64L45p19
$$ plain form
2927 -919 -707 313 128 -967 -716 -688 -347 -454 -136 -132 -976 -1443 37 1305 286 -2300 -1187 1837
2945 1837 2423 -827 -2253 600 2508 1100 -272 348 1544 1130 660 1368 2210 1428 631 1725 3120
2962 3120 2142 1013 1301 2547 2837 2184 1721 1956 1680 2278 3340 2684 909 913 3010 3889 1932 -234
2980 -234 1276 2844 2466 761 711 2453 1556 22 817 1752 1260 -732 -842 1371 1504 -456 -1695
2997 -1695 -451 486 -390 -1159 -1347 -1339 -880 -1041 -581 -1678 -2272 -1729 -350 -846 -2337 -2544 -955 -524 -1738
3016 -1738 -1945 -687 -696 -1937 -1782 -223 318 -1697 -2405 -6 1388 424 -1823 -1137 1192 1671 258
3033 258 -354 444 973 1117 1518 1826 895 412 1844 2829 1977 868 1179 2436 2627 2040 2131 2440 1937
3052 1937 1225 2444 3277 1712 190 1489 3398 2732 507 -414 1995 2571 835 163 927 1272 553
3069E53o37Q87K88j263o31O71O66p02j073L59N00L97n29n6r49L6P37Q50q94j711
3089b501J24K177N58j857j182R25J805m80j370P28O91m11n83N84P07q32r48J075
3107g90J187j89j814p0J663M53o63o82L87J15P5K77R4o02q76R85J134o07r59k80
3127a162J017R0q49J11O52l25j053L21J349l4j615l85J807P23j539j115N85J374
3145d8j68j054n2J71M99L05k4Q9j067J39R75M12p76p64P42O49j27l40J1J00j06
3166d34j63Q92M16j017j110J185J636r49j491O01R69M05q77n22O11J07k20k08
3184a69O60m28l22k47J003Q9q55p54O46N10n9l16j60o77K93O04O84j029j059K49
3204a337J506J03j535l82N92J244r16m42j37R08m81m50N71N01r90o11P46J019
$$ plain form
3069 553 -84 803 1091 -172 -803 -132 534 -168 -1241 -882 -382 15 -514 -570 -1519 -1483 -746 104 -790 -2501
3089 -2501 -2377 -200 358 -1499 -2681 -1756 49 -431 -1801 -1073 -382 -793 -1376 -792 -85 -917 -1865 -790
3107 -790 397 208 -1606 -1676 -13 440 -223 -905 -518 -403 -328 -51 43 -559 -1435 -450 684 77 -882 -1162
3127 -1162 -145 -55 -904 -793 -141 -466 -1519 -1198 151 117 -1498 -1883 -76 647 -892 -2007 -1422 -48
3145 -48 -216 -1270 -1322 -1151 -652 -347 -371 -282 -1349 -1210 -235 177 -599 -1363 -621 28 -99 -439 -428 -328 -434
3166 -434 -597 295 711 -306 -1416 -231 1405 456 -1035 -434 535 940 63 -459 152 259 39 -169
3184 -169 491 63 -259 -506 497 586 -269 -1023 -377 133 74 -242 -402 -1079 -786 -182 502 -527 -1586 -1337
3204 -1337 169 272 -1263 -1645 -1053 191 -725 -1167 -1304 -396 -877 -1327 -756 -255 -1245 -1856 -1110 -91
3222i1K6r82j14N31N20J43n47l20j31O32L08J79j178J24Q71J052n71j087M15K77
3242E7N75p81K89J38j71r3N40N78n72j022K68J255L53j054o45N51R08l16o65n30
3262c37P52r7O12k24k01p00K64Q94j75m77m65O09k3l05K99k26J37p30N11O80k86
3283E12r66j99J020O98r62j028M42Q32L11o67l42lM01k80K39J27k79n61O63O78
3303F36k28o90m7L23J09k10L33m04N9J7O04J56o29q60P75P24K7j071m4N36N34
3324F50n10m37N88j61j85K04L93r4l46l56O59N73o71n17K16M73L80o19P6l38m10
3345d32Q18L79jj410L65N45P37p80o72L72L64L05n62K16J82m93Q6M50J72l31j077
3366g67M36R64j83n48n47O76L40N2k45k85j28K7M7P42o90o09P22N79j27o53k35
$$ plain form
3222 -91 -65 -1047 -1161 -630 -110 33 -514 -834 -965 -333 -25 154 -1024 -900 -29 1023 452 -635 -220 57
3242 57 632 -149 140 278 107 14 554 1132 560 -462 -194 1061 1414 360 -285 266 1174 858 193 -337
3262 -337 415 318 930 706 505 -195 69 963 788 311 -154 455 432 127 426 200 337 -393 118 798 512
3283 512 -454 -653 367 1065 103 -925 -483 349 660 -7 -349 -352 49 -231 8 135 -144 -705 -42 636
3303 636 408 -282 -329 -6 103 -107 226 -178 -119 -102 502 658 29 -831 -56 668 695 -376 -420 116 650
3324 650 140 -297 291 130 -55 149 542 448 102 -254 405 978 307 -210 6 479 859 240 316 -22 -432
3345 -432 386 765 764 -646 -281 264 1001 221 -451 -79 285 590 28 244 426 -67 19 469 641 310 -767
3366 -767 -331 633 450 -98 -645 31 371 423 178 -107 -235 -208 -161 581 -109 -718 4 583 456 -197 -432
3387d32N74j60Mk6M56p40J20L01R6Q8q92K58L19Q36o94p92L00P94r5l68j97J55
3409i5k4k0P52l27l09m51O96L92k99o12K26L69J87k44j62k75J3%M23M15o69q46
3431h60P67R38n09p54o7N65M63l77N9J1J4p57Q09M78o82p02L03R81m7o53j65K92
3453A07M39O8k59k38p5K7J60P00l52j035J53P04M65r84j02K96K89J65p91M36J02
3474B75o83k29R15M74r98m20O82P63n05p02k35O16L58m98J8P5l34l50J001j68
3494E5m17n56N95P69k01r07O4P50J62m65J50l0l99o8L92N50n42o84L85J040m9
3515E94j144j46R47J29m93k83M76j22l37J10P80j63j008K38O39q0k93m49L42M00
3535A37k14m33P71l56o11j25J064J72r71m60P02J113o69p86P4O74J78n17nJ79
$$ plain form
3387 -432 142 -18 -14 -40 416 -324 -204 97 193 281 -611 -353 -34 802 108 -684 -384 410 315 -53 -250 -95
3409 -95 -119 -139 613 286 -23 -474 222 614 315 -297 -71 298 485 241 79 -196 -183 -183 240 655 -14 -860
3431 -860 -93 845 336 -418 -485 80 543 166 225 236 250 -507 302 780 98 -604 -301 680 633 -20 -185 107
3453 107 546 614 355 117 42 69 229 929 577 -458 -305 399 864 -120 -222 74 363 528 -263 173 275
3474 275 -408 -637 278 752 -246 -666 16 779 274 -428 -663 -47 311 -187 -169 -94 -428 -778 223 55
3494 55 -362 -918 -323 446 245 -662 -598 152 314 -151 -1 -31 -430 -498 -106 444 -98 -782 -397 643 594
3515 594 -550 -696 251 380 -113 -396 80 -42 -379 -269 511 348 -660 -422 217 137 -156 -605 -263 137
3535 137 -77 -510 261 -95 -706 -831 233 405 -566 -1026 -324 789 120 -666 -592 82 260 -257 -262 -83
3555h3l09k18R65L48p51p16Q54R49m21n65l62Q64n8j63J72J68j91n59Q96N44m44
3576I20p74L14J062m06p29J05P74k94j89l8J79Kp09K44P52j17q70l79R39N04r42
3597C48n66M65K9j12k87M47l54o16M7N23L6q10o45N02J059p82q02L28N81k79k34
3618a122j1K89o75J21O46K62o68m94M92P99j07p88J53R45j04l96J51K86j59m01
3638g81P41P85m11n99O4J087L97p83k78P57p4j49R4L68j26m53L75O56K25r89k71
3659F35O96P54r02l26L38L73m09l96K16J94m17l22Q66k5r14o58J070N73j006m64
3679a24K23M57m71k34L61K7j067J27N06L83l21j387P35P28l38o07k65P49O3m36
3699h91J03K61l60J3j46J124l95j099O52N49L79p97l29M69P07k06o16N71Ql78
$$ plain form
3555 -83 -392 -610 355 703 -48 -764 90 1039 618 53 -309 555 497 334 506 674 483 -76 820 1364 920
3576 920 146 460 1522 1116 387 492 1266 972 783 745 924 926 217 461 1213 1096 226 -153 786 1290 348
3597 348 -218 247 276 164 -123 324 -30 -646 -599 -76 -40 -850 -1495 -993 66 -716 -1518 -1190 -609 -888 -1122
3618 -1122 -1133 -844 -1519 -1398 -752 -490 -1158 -1652 -1160 -361 -468 -1256 -1103 -158 -262 -658 -507 -221 -380 -781
3638 -781 -40 745 334 -265 -201 886 1283 500 222 979 905 756 850 1218 1092 639 1014 1670 1895 906 635
3659 635 1331 2085 1183 857 1195 1568 1159 763 979 1173 756 434 1300 1275 361 -297 773 1346 340 -124
3679 -124 99 556 85 -149 212 239 -828 -701 -195 188 -133 -1520 -785 -57 -395 -1002 -1267 -518 -455 -891
3699 -891 -788 -527 -887 -874 -1020 104 -291 -1390 -738 -189 190 -607 -936 -467 240 34 -582 -11 -3 -381
3719c81Q1O92N8j034L58Q00J90o79l62J88O48m70n5L37K63n72K0M10K54q41l53
3740d48L43Q24l17p25K76K10k78j76N79j56l13l48L39O84o64p92M56R00p61j86
3760e53J04K07L55k60j41L77j9l57K87K77l5o04J32N11L40q28J58K93L49m95J24
3781B22M80k74m13K6R00j32q74l00Q53L67l97l56J48K97o1r8J98k08m06L4L50
3802C56M27n78m65N01P2k17m65O1L58j54n40N61m3n89l22O73J21j84r98O18O00
3823b07j6o02n3N19k05k88k45R21n19m21K36N29J38o40q1O78N25q60j07L92N28
3844B22l46j57J95j49m3K51N99J0p39k72N59L03P3r38O61K73k08O2o0N1J0l98
3866d1R14j32n40k97J65N43L8p91K92M4L22q24N58J52l77m71P77J07n80l57k9
$$ plain form
3719 -381 -300 392 450 -584 -226 574 764 85 -277 -89 559 89 34 371 634 62 82 492 746 -95 -448
3740 -448 -105 719 402 -323 -47 163 -115 -291 288 132 -181 -529 -190 494 -170 -962 -506 394 -367 -553
3760 -553 -449 -242 113 -147 -288 89 70 -287 0 277 242 -362 -230 281 621 -207 -49 244 593 98 222
3781 222 702 428 15 41 941 809 -65 -365 488 855 458 102 250 547 486 388 586 378 -28 6 356
3802 356 783 205 -260 241 313 96 -369 -308 50 -104 -644 -83 -126 -715 -1037 -364 -243 -427 -1425 -807 -207
3823 -207 -223 -825 -878 -359 -564 -852 -1097 -176 -695 -1116 -880 -351 -213 -853 -934 -256 269 -591 -698 -306 222
3844 222 -124 -281 -86 -235 -278 -27 572 582 -157 -429 130 433 506 -432 229 502 294 356 296 347 357 -41
3866 -41 873 741 201 -96 69 612 650 -141 151 195 517 -307 251 403 26 -445 332 439 -141 -498 -527
3887e27M79J65rr32Q09j52K3j50P4O2k90J54L19j94m40j74L08P85m66jj55J67
3909a45l09K07J76j65J02n90Q18Mk38o62P34L40j51k41j54N13k30j91M28k04j3
3930B9j30n7L76K6o62M78L19q3n14J90k00K93j3Q4N39p13k60K83O43n75k79j14
3952c40M90k1m95L20M7j18J92j22L48m36j84K30L04K30n56l59K81L91j0n31j11
3973d50P99l77Q3o5k65L38k03K97K53k67n40L40M36k70k06J63L89l51l0K63l26
3994A1j1k11N12j55l67j20L73K93m8m24m7K12L63l10J12j10j06k64K20N45m39
4015B9J19n4j09K35l4k54J16J34K03j76K3K49o64K53K78l70J12l35O02q0j91o9
4037A7j84N79n47M7L26k69J03k35M81j9l44j96q5N71n9k95K2J00P6j79L28m1k86
$$ plain form
3887 -527 -48 117 108 -824 -15 -167 -144 -294 -220 -158 -448 -294 25 -169 -609 -783 -475 310 -156 -157 -312 -145
3909 -145 -454 -247 -71 -236 -134 -724 94 98 -140 -802 -68 272 121 -120 -274 239 9 -182 246 42 29
3930 29 -101 -158 218 244 -418 60 379 296 -218 -28 -228 65 52 136 675 -38 -298 -15 628 53 -226 -340
3952 -340 150 129 -366 -46 1 -117 75 -47 301 -135 -319 -89 215 445 -111 -470 -189 202 192 -339 -450
3973 -450 349 -28 55 -10 -275 63 -140 157 410 143 -397 -57 379 109 -97 66 455 104 74 337 11
3994 11 0 -211 301 146 -221 -341 32 325 277 -147 -194 18 381 71 183 73 -33 -297 -77 468 29
4015 29 148 94 -15 220 186 -68 48 182 385 209 232 481 -183 70 348 -22 90 -245 357 277 86 17
4037 17 -167 412 -135 -88 238 -31 72 -163 318 299 -45 -241 -326 245 186 -109 -87 13 89 -90 238 197 -89
4060h9j42M58J03o35J74J75K45L3m34j3J6J10k14J44L67m73j97N65k97M48m71
4081a27J67J22K81n32j11M9K27j26M0J92k7n04L48L84nm49k93M30L58j40k32q3
4103c1J86k25L01r4K89k94m12M34P5P0p25M79K01j43lj91L98M9o12K71l9m31L60
4126h7J51L36l93l48O5K95l8l3j26M75l85K41j74J85k74m93N33J82j98l51J59
4147b78J91J19j88k31K23L56k26k25M04l21j66o5L95M00q84K54J27K67l1n80L79
4168h0J12J04m12M17j95k24K73Q3J45m46N4L85O5m70p9N40j29J41l01L85j73M7
4190B42k01J76L48j86m06l48O95k63p5L8J26k22K46j64J95j22j80NK57q8l88j96
4212e11M82P0n07L01KR5l49J70L91n68L53l78L18K06n96J41K24R5j4m24K52m4
$$ plain form
4060 -89 -231 227 330 -305 -131 44 289 322 -112 -125 -109 1 -213 -69 298 -175 -372 193 -104 344 -127
4081 -127 40 162 443 -89 -200 -151 76 -50 -10 182 155 -349 -1 383 378 -71 -364 66 424 284 52 -31
4103 -31 155 -70 231 137 426 132 -280 154 229 299 -426 53 254 111 108 -83 315 364 -248 23 -16 -447 -87
4126 -87 64 400 7 -341 -276 19 -19 -52 -178 297 -88 153 -21 164 -110 -603 -70 112 -86 -437 -278
4147 -278 -87 32 -156 -387 -164 192 -34 -259 145 -176 -342 -407 -12 388 -496 -242 -115 152 121 -459 -80
4168 -80 32 136 -276 141 -54 -278 -5 78 223 -223 -169 216 281 -189 -268 272 143 284 -17 368 195 242
4190 242 41 217 565 379 -27 -375 320 57 -18 20 146 -76 170 6 201 79 -101 -96 161 73 -315 -511
4212 -511 -29 41 -466 -165 -163 -68 -417 -247 144 -424 -71 -449 -131 75 -521 -380 -156 -61 -75 -499 -247 -291
4234b91k06L14k70K11m1m13O69j20j34l29O59m2K70l01J42l44K16k57N02P8l90
4255g7K03k08M59l48O2J09L12J40n90n9N59K7m3Jj31j53k8Q5M10j70n54K2K51
4278B79M11n67l19M59J14j89j8K44j90n55K22L0K39k73m83O65k0k92l26N56j24
4299a37l1j98N7L06o54qL85L97l36l31K69L26l69k41L98j42j76L10P1J99k27k86
4321d18N12L16k99n83N88N56k19n25K15J80k26j84K07N5j20j72J87L47q8k65P5
4342A39J25J09j14k89K78J32m14k33M39k13J32j18J76J60n36pJ65K49k21qL4l8
4364e3N7k49M48k22k99k81N27K41l80N2k3N85k7p07M87K44m76k43J07J40l2j87
4386b91L70L68l53m20M35J91J57n15K79K19j96rn0M30k52l81L57J49kk99k24K80
$$ plain form
4234 -291 -497 -183 -453 -242 -283 -696 -27 -147 -281 -610 49 7 277 -24 118 -226 -10 -267 235 313 -77
4255 -77 126 -82 377 29 91 200 512 652 62 3 562 589 546 547 416 263 235 320 730 560 6 28 279
4278 279 690 123 -196 263 377 188 170 414 224 -331 -109 -79 160 -113 -596 69 49 -243 -569 -13 -137
4299 -137 -168 -366 -309 -3 -657 -665 -280 117 -219 -550 -281 45 -324 -565 -167 -309 -485 -175 -104 95 -132 -418
4321 -418 94 410 111 -472 116 672 453 -72 143 323 97 -87 120 175 55 -117 70 417 329 64 139
4342 139 264 373 259 -30 248 380 -34 -267 172 -41 91 -27 149 309 -227 -234 -69 180 -41 -49 -15 -53
4364 -53 4 -245 203 -19 -318 -599 -72 169 -211 -159 -182 403 376 -331 156 400 -76 -319 -212 -72 -104 -291
4386 -291 79 447 94 -326 109 300 457 -58 221 440 244 235 185 615 363 -18 339 488 486 187 -37 243
4408B43K30l70O3QK16l99m8K94o4l37L48K1K4m81j9J61R2o4j33k07J52J12P3j91
4432b76M77o74J52M28j25p6l91K19K86m45K86l13J38R6j04L67J65j90n41P34k18
4453ek49k12N16J67m53Q2J41K60J13l48L00O2n44J76L21J00J03o09J36K20P6m55
4475a02N10k62K24m16mO49l33k84N8J98J02j35k22L37L3l47j31j2K80m69M2O4
4497b20L64j74m03O66q4m62J04M4N77l60m59J57K78j73k00J74J83l70l4M80J51
4518B39k89k61L37r1K83l22Q3j20L62l08k00R29n23m69K11L25J42o01j24M33j25
4539h9j8j35P6J11l35M04K96k66j52m2K51L9j95j08L3K23J12m70OJ37pK95L5k86
4563h5n5RR2M6j89k97K47L95j71k87J68J31q7l5N7M13m12j83L19L53j21o85L64
$$ plain form
4408 243 473 103 166 174 390 -9 -57 237 173 -164 184 205 229 -252 -271 -110 -18 -82 -215 -422 -270 -158 -85 -276
4432 -276 201 -473 -321 107 -18 -94 -485 -266 20 -425 -139 -452 -314 -218 -322 45 210 20 -521 213 -5
4453 -5 -254 -466 50 217 -236 -154 -13 247 360 12 312 374 -170 6 327 427 530 -79 57 277 353 -102
4475 -102 408 146 370 -46 -50 599 266 -18 40 238 340 205 -17 320 353 6 -125 -137 143 -326 -284 -220
4497 -220 144 -30 -433 233 149 -313 -209 -165 412 52 -407 -250 28 -145 -345 -171 12 -358 -392 88 239
4518 239 -50 -311 26 -65 218 -104 -21 -141 221 -87 -287 642 119 -350 -139 186 328 -273 -397 36 -89
4539 -89 -107 -242 -166 -55 -390 14 310 44 -108 -150 101 140 -55 -163 -130 93 205 -265 -259 -122 -129 166 201 -85
4563 -85 -140 -131 -39 7 -182 -479 -232 163 -8 -295 -127 4 -83 -118 -61 352 -60 -243 76 429 308 -377 -13
4586a3K96m6m37J5J03j14MK79N8K54l59l20N24p1k83J08O5M12n67L18r5J7l43
4609a95K44L55l47Kl28K89L49r7l88L89j24m07L12p7K72m35l7K65J80k90m12O86
4631B06m52J97p7j32M18N7o46L58j8K37N0j41K35k60m04L51K22J12m13j22Q58
4652F36m34k65J03Pp3K03k82M72k90n9K40j86Qj03J40K32J7m42j21N39m75J08
4674b5r2J57Q9k05N6J77k89J96k84N2K50q2l2J56P1j49M0K27J11n28mK63J82K6
4698C63l61M9m9J21j71K07J26m90J60L09KJ86j99j32p3J60l85K90K61L30m28k31
4720D5N9Nl39L13Q7l20k2L09j96L94l64j20M65n47K97J06n9Q8l86L91K21l24N0
4743A53l56J16K39j50k98K27M3j52K58k7j2J62k29J69k89o5L48K3j5J05l60l76
$$ plain form
4586 -13 283 237 -200 -185 -82 -196 -192 87 145 399 40 -280 244 173 -110 -2 63 475 -92 226 131 148 -195
4609 -195 49 404 57 59 -269 20 369 272 -116 273 149 -258 54 -23 249 -186 -223 42 222 -68 -480 206
4631 206 -246 -49 -126 -258 160 217 -429 -71 -89 148 198 57 292 32 -372 -21 201 313 -100 -222 636
4652 636 202 -63 40 47 -26 177 -105 367 77 18 258 72 80 -23 117 349 366 -76 -197 342 -133 -25
4674 -25 -117 40 129 -76 -20 157 -132 64 -220 -168 82 0 -32 124 195 46 86 313 424 -104 -108 155 337 363
4698 363 2 51 2 123 -48 159 285 -205 -45 264 266 452 253 121 48 208 -177 113 374 704 276 45
4720 45 104 109 -230 83 170 -150 -172 137 -59 335 -29 -149 316 -231 66 172 113 201 -185 206 427 103 153
4743 153 -203 -87 152 2 -296 -69 -26 -178 80 53 41 203 -26 143 -146 -211 137 160 145 250 -110 -486
4765d86N35l86L98J89l63k28J86K39k15n5J55J72o2J37l97J08K36k69m3J78P3
4786A02k3lk10J14l9l48K22J40jl3l39K63k9K46j94J3J91J43k88p2J60k42k0K46
4810al02L41m52L13K26l17J04J82k70j14J90M3O9j34j29J76K32n0j29j43M4J91
4832G0l34K91m70K95j56J59K20l12M0J52J9M6L2j79O3K9l2j84r1J32K59m65K24
4855a92J42m19L47M3K05j05j87K11O1Pn80L75J20l78K26K92r1j99j56L10k81N05
4877B56n62J49N6P7Nl04L63Mk55J5J17K09m43L00K15r1j40j7J90l30L9K92O0k90
4901h5l70J84P50o04P7J31K07o44L36k96l3K97J6M5P3Rk24M8k9K79l13R5J25J50
4925B24n18J82K96k38l15J90M54m56Q6M1K59N0j99k28L43K14l81j09R2j5o1J93
$$ plain form
4765 -486 49 -337 61 250 -113 -341 -155 84 -131 -186 -31 141 79 216 -181 -73 163 -106 -149 29 102
4786 102 79 76 -134 -20 -59 -407 -185 -45 -46 -79 -418 -155 -184 62 -132 -119 72 215 -73 -145 15 -227 -247 -1
4810 -1 -303 38 -414 -101 125 -192 -88 94 -176 -290 -100 -57 12 -122 -251 -75 157 107 -22 -165 -121 70
4832 70 -264 27 -443 -148 -304 -145 75 -237 -197 -45 -26 20 52 -127 -64 -35 -67 -251 -342 -210 49 -416 -192
4855 -192 -50 -469 -122 -79 126 21 -166 45 106 113 -467 -92 28 -350 -124 168 77 -122 -278 32 -249 256
4877 256 -306 -157 -101 -24 -19 -323 40 44 -211 -196 -79 130 -313 -13 202 111 -29 -46 144 -186 -147 145 205 -85
4901 -85 -455 -271 479 -125 -48 83 290 -354 -18 -314 -347 -50 -34 11 84 93 -131 -83 -112 167 -146 -51 74 224
4925 224 -294 -112 184 -54 -369 -179 275 -181 -95 -54 205 255 56 -172 171 385 4 -105 -13 -28 -89 104
4947A04P4pk23J39K60k85m4J88m43J74J23j53o1L69j33J8L70k33k26j17m2M76
4969C28k89j43O8l3J76m20K35K29J61k83j74R4L07m58N1L93q9k74l0K4K14N0j55
4992a8k29K34O8J76p7l31K19RN81p36n5k1L80M4j37n93Q26L5j50m0j21J3Nk85
5016b03J69K04J0K7k51L99j25j15r8j11R5k5k9K26k41r1K13P4m03L08M28j30m17
5039h6J73j61K19k12J9O5M3J50m79J96K14J34l83l08J90M71m53MJ95k07KN2n3
5062b15K43p3J2O7r8j29K00J17j63j26p9J94MK1l6p4J46K52k20Q9J27l37P4M0
5086C6J71l10N6l4N81q36K51J27r9K67j31p2O6j2J11m66K98J45k21K15J07k70
5108b0J04o6j27jJ26J36r0J38o09J30M59k12J26l61M82k33k03j34K81q5N5q4J03
$$ plain form
4947 104 178 171 -52 87 347 62 18 206 -237 -63 60 -93 -154 215 82 100 470 237 11 -106 -148 328
4969 328 39 -104 -36 -69 107 -313 -78 151 312 29 -145 -51 256 -202 -151 242 153 -121 -151 -127 87 137 -18
4992 -18 -247 -13 55 231 154 -177 42 51 632 -104 -159 -180 200 244 107 -486 340 375 225 185 64 77 82 -203
5016 -203 -34 170 180 207 -44 355 230 115 17 -94 1 -24 -53 173 -68 -159 54 128 -275 33 461 331 -86
5039 -86 87 -74 145 -67 -48 17 60 210 -269 -73 141 275 -108 -416 -226 245 -208 -204 -9 -216 -214 -162 -215
5062 -215 28 -45 -33 34 -64 -193 7 124 -39 -165 -244 -50 -46 -25 -61 -135 11 263 43 132 259 -78 -4 36
5086 36 207 -103 -47 -81 500 -336 -85 42 -57 210 79 7 73 61 172 -294 4 149 -72 143 250 -20
5108 -20 84 18 -109 -110 16 152 62 200 -409 -279 180 -32 94 -267 215 -18 -221 -355 -74 -159 -104 -188 -85
5131h5J93J80o03L25P2J82j23k94M7J57N8k63P7J43k0J86j79N2m6k93J94q8o9
5154a97J99P1j46o1J45k6q2l69K56M26q7l97K00J50K82p41J79J49L35m06J57n6
5176a9J06j94J81r1Kk19J41L11m31L0j66M82l99J23J56m7N9j43K75N7j74J61n51
5199c50M11L0K85m81j51M35j18l62L27M5K36L5l5k2m66R3J98N3j94Q5j08Q6l49
5222c17K06K43l33j11Q3J87L5K1j23K6QK23l84J56N0L0j12j88M77rl94J28j4M87
5246C75n62Q3p4J17K96l73R7j82K31R4k23K78n06L35j94K24j0J86l47K93n51P55
5268C42k03j04j85p1L04J42k69k94L96J32j54J06k95M74K4m17j10M2M5J85k03
5289a13P3L27k56K78k73k50J09p2K93j27j37L85k65j40k06J36L07J35m56J88K59
$$ plain form
5131 -85 108 288 -315 10 82 264 141 -153 -106 51 109 -154 -77 66 46 232 53 105 59 -234 -40 -128 -197
5154 -197 2 73 -73 -134 11 -15 -97 -466 -210 216 129 -268 -68 82 364 -377 -198 -49 286 -120 37 -19
5176 -19 87 -107 74 -17 -15 -234 -93 218 -213 -183 -349 133 -266 -143 13 -34 25 -118 157 214 40 201 -350
5199 -350 61 91 376 -105 -256 179 61 -301 26 71 307 342 307 285 -181 -88 110 163 -31 54 -54 32 -317
5222 -317 -111 132 -201 -312 -229 -42 -7 14 -109 -83 -75 148 -236 -80 -30 0 -112 -300 177 168 -226 -98 -112 375
5246 375 -187 -104 -178 -61 235 -138 -41 -223 8 102 -121 157 -349 -14 -208 16 6 192 -155 138 -413 342
5268 342 139 35 -150 -221 83 225 -44 -338 58 190 36 142 -153 321 345 -72 -182 -140 -95 90 -113
5289 -113 -40 287 31 309 36 -214 -105 -177 116 -11 -148 237 -28 -168 -374 -238 69 204 -252 -64 195
5310A95m14lN4L62k4m55K13J57J47k09l50J94K17q0j58L6j4k6L23j23j86K31J36
5333B23k04J56k49J55M4p7k52o2L93K17n40l6K76K33k75J40k24J75K48l69P8J22
5355A72k4R5l78M75j53J23l44K47j25m5J02j42J86j03j01K60k08J03L6N0r1j81
5377d6M32J62l04k58j50K85j36R4L4K9K8k4j95N8oN2P0k6J34M5m81O3K25K78k04
5402A59j93K49j67O2l1m37L00K0J83O7l51J30R8j14R2j82O7M04k98o5K11r2L4
5425A46j30j66K88R3k48J82j70K10j83k37K53k9L4k36N05l26J4p1K71k07k6q7
5447a20P5J7jm2M96l60k24R4n9K81l90%M69l62k5K56q1J0j37N9K85J4k97l91L27
5472a06J32j90L18n63L48m9K39L1l02j04J20J89J94k21l33P7K05k15J0K61k15
$$ plain form
5310 195 -219 -222 -168 194 170 -285 -72 85 232 23 -327 -133 84 4 -154 -118 -132 -158 165 42 -144 87 223
5333 223 19 175 -74 81 125 48 -204 -266 127 344 -196 -232 44 277 2 142 -82 93 341 -28 50 172
5355 172 148 243 -135 340 187 310 -34 213 88 43 145 3 189 86 -15 245 37 140 176 226 135 -46
5377 -46 386 548 244 -14 -164 121 -15 79 113 142 170 146 -49 9 3 55 125 99 233 278 -203 -140 85 363 159
5402 159 -34 215 48 110 79 -358 -58 -38 145 212 -139 -9 89 -25 67 -115 -48 356 58 -7 204 112 146
5425 146 16 -150 138 231 -17 165 -5 205 22 -215 38 9 43 -193 312 -14 0 -71 200 -7 -33 -120
5447 -120 -45 -28 -29 -71 425 65 -159 -65 -124 157 -233 -233 236 -126 -151 105 24 34 -103 -44 241 255 -42 -433 -106
5472 -106 26 -164 154 -409 -61 -110 129 160 -142 -246 -126 63 257 36 -297 -220 -15 -230 -220 41 -174
5493a74J28r4K2R3J70q3j82M08k27q9m37L30K29k36l06N10l02J27j54J16k28M33
5515E4J33m46J17J75K39o18J6J17O7j7K3k00J64j02L80j12K17m05M60l19l02O46
5537B87m85Q0O3l66M61J16j53k61j78M55k42L23kM8j94l5j35P2L7J21l1M4k31
5560b06oN9J18L6k55M22l29j98K78K49K4l73J88j91M8K77k68n0L15n4l83J84R0
5583b5k57R0k7K96k09m3j4J98J87l39J26M6J39j63J46j07j94R6M3L77l16j49n2
5606a51K45Q6k60R0j2M2q1O4P1k17R0J83j10k60K75J3l19L22j23J35k38j32O53
5629C66l6n66K48K24J4l05J94k2l9l6j82J92k2K33j67l28L98m3j50j41P8J29J72
5652B11j34k47P5J61o0q0P4k99M72j09o0k01K86j10K61j37P0j0o8M1j13J41J09
$$ plain form
5493 -174 -46 -140 -118 -25 145 62 -120 288 61 -28 -465 -135 94 -142 -448 62 -240 -113 -267 -151 -379 54
5515 54 187 -259 -142 33 272 -346 -330 -213 -146 -163 -140 -340 -176 -278 102 -10 207 -198 262 -57 -359 287
5537 287 -198 -118 -55 -421 40 156 3 -258 -436 19 -223 100 98 146 -48 -83 -218 -146 -109 12 -19 25 -206
5560 -206 -212 -153 -35 1 -254 168 -161 -359 -81 168 192 -181 7 -184 -136 141 -127 -177 138 84 -299 -115 -25
5583 -25 -282 -192 -219 77 -132 -175 -189 9 196 -143 -17 29 168 5 151 44 -150 -54 -11 366 50 -99 -151
5606 -151 94 180 -80 10 -2 40 -41 23 94 -123 -33 150 40 -220 55 68 -251 71 -52 83 -155 -287 366
5629 366 330 -236 12 236 250 -55 139 117 78 42 -140 52 30 263 96 -232 166 123 -27 -168 -90 39 211
5652 211 77 -170 -95 66 6 -74 0 -299 173 64 4 -197 89 -21 240 103 173 163 95 136 23 164 273
5675B73l36j16J93J08K98l79j45J50K39j07k50kJ74M2r7K7k12K33J6M7m80K72
5697e2O1K3j19K47p2J61Q1l79J5J0k20L14q4J96o4k5j96N6K52k04J39m03K46N42
5721E25m59j75J52N0qj45J79L7k0m06L87k58K11j12o4J85J75j97k7J64k91R2n2
5744e7q3J05J97j50M4Q5j52J47j32q4j86m4L77J38l3p6J26l30r4j81L15j53L02
5767H1k21J36L9k45J53p5J40j64M4L08j53o0J1O6l1j38J92J8j82qm5J99j26L18
5791B57k91m4r9J03j37K8M17o5k17J81K1p1j34K37j83Qj9M1J17k20r3J98j98L46
5815A83k31j88L44k24K54l85K34n6R2q5J46l08J68k7j16N50k11r4j35P3o2J9L84
5838C25k91j18p6J64m8J85j37mK4j87m6K09J85m10K64j86J39R9o4j78J54m0q9
$$ plain form
5675 273 -63 -179 14 122 420 41 -104 46 285 178 -72 -74 100 142 45 72 -140 93 109 156 -324 -52
5697 -52 9 32 -87 160 88 249 330 -49 -34 -24 -244 70 -14 182 118 93 -103 -47 205 1 140 -263 -17 525
5721 525 66 -109 43 93 85 -60 119 156 136 -270 117 -141 70 -42 -106 79 254 57 30 194 -97 -5 -57
5744 -57 -140 -35 162 12 56 141 -11 136 4 -80 -266 -310 67 205 172 96 222 -108 -202 -383 -68 -221 81
5767 81 -140 -4 35 -210 -57 -132 8 -156 -112 196 43 -17 -6 60 29 -109 83 101 -81 -89 -134 65 -61 257
5791 257 -34 -78 -177 -74 -211 -183 234 169 -48 133 154 83 -51 186 3 11 -8 33 150 -70 -163 35 -163 183
5815 183 -48 -236 108 -116 138 -247 -13 -69 23 -62 84 -224 -56 -83 -199 351 140 46 -89 -16 -78 -59 325
5838 325 34 -84 -160 4 -44 141 4 0 24 -163 -209 0 185 -225 39 -147 -8 91 27 -151 3 -37 -126
5861a26LK58M8m14P6K45j8l36J67J12K02m65M6J43M43l11l83K69O8J6j14l70M94
5884E3r4J0KL8J02J52n50O51n89J25L25k12j83J10k7J22j00R0j45J35p6P3J24
5907A36l0k68r3K72p6O4l40L74l14K43m34J84j28J82J56p8K16k43Q0o3J32q6K1
5930i3k01L59j52J7O7j74j14J30J76r5r6l9m9K10j28P1j79K30r4Q4o9L13m8l12
5954a86M9Q1K40r5J11k61L2l46M47jm9pJ81j05Ok08J31K46j99j59p7J18J71J49
5978B69j39J4j88l2N2K07r1l6q6J97j95Q1N8j02M5Qn7k21N0L42j83l26L01o8M6
6003e4o1K75Kl6Jj80n9k32K20k5M8j24L02N5P5k06K37M4l13K12j64J54m08J47
6027i0J50j43j00N06j13j11k05R2M5N05k82J52j31l20K54K6Q9l87j23M18R0k62
$$ plain form
5861 -126 -123 135 183 -231 -155 90 72 -264 -97 15 217 -248 -202 -59 384 73 -310 -41 27 43 -71 -441 53
5884 53 -41 -31 -29 9 111 263 -287 364 -225 -100 225 13 -170 -60 -87 35 -65 25 -120 15 -61 12 136
5907 136 106 -162 -255 17 -59 5 -335 39 -275 -32 -466 -282 -410 -228 -72 -150 66 -177 -97 -160 -28 -114 -93
5930 -93 -294 65 -87 -70 -3 -177 -291 -161 15 -80 -176 -215 -264 -54 -182 -111 -290 -60 -154 -70 -139 174 126 -186
5954 -186 -137 -56 184 89 200 -61 -29 -375 72 71 22 15 196 91 97 -111 20 266 67 -92 -169 -51 120 269
5978 269 130 144 -44 -76 -24 183 92 56 -30 167 -28 53 111 9 54 62 5 -216 -166 176 -7 -333 -32 -100 -54
6003 -54 -115 160 162 126 127 -53 -112 -344 -124 -149 -101 -225 77 132 207 1 238 282 -31 181 17 171 -237 -90
6027 -90 60 -83 -183 323 210 99 -106 -14 31 536 254 406 275 -45 209 235 324 -63 -186 232 322 60
6049F0L58m43J62O2M9J06k00P0j59o5J35k3n7L8K33J45m08p2P4N8P7l75K49K33
6073C07o1o5kj56K82o1q0O6KQj64m5K61k96K13k89K21J9J27k19K13j10l5j98J25
6098F3K02k01r5Q7K35l04Q6n7J49J69l73o5O6Q1J26J5Q3m55J59J05MM68m55M6
6122A39m49M70k28L60j17j6k79J32j47L54k39MJ00j86Q3J39j36J14o2q5q8M9j59
6145b47J3M65L1k27J03Rm11L97oj15j61K36k6p4p2K98j19q7J48l36J08j12K26
6168D1j47J86j4j93L0q3N00l91P5j32L08M6k80J56l71K94j26K48j87K2J46l15
6190a87K28j65j21K64J0k30j35K36R0j34L6K50l95L66k05L67m73J76j3L0j12m4
6212a61K15k00P9k02P0k3NL7j65K40K93m60M31m46K04J54k17J98l07L77p3k87
$$ plain form
6049 60 418 -25 137 199 248 354 154 224 65 0 135 112 55 93 326 471 63 -9 65 123 200 -175 74 307
6073 307 246 181 179 23 305 244 164 230 232 240 76 31 292 -4 209 -80 141 160 287 68 281 171 136 -62 63
6098 63 265 64 -31 56 291 -13 73 16 165 334 -39 -104 -38 43 169 184 267 -188 -29 76 80 548 93 139
6122 139 -310 160 -68 292 175 159 -120 12 -135 219 -20 -16 84 -102 -19 120 -16 98 36 -49 -137 -88 -247
6145 -247 -234 231 262 35 138 147 -264 133 127 12 -149 87 61 -13 -85 213 94 7 155 -181 -73 -185 41
6168 41 -106 80 66 -127 -97 -180 320 -71 4 -128 180 226 -54 102 -269 25 -101 147 -40 -18 128 -187
6190 -187 41 -124 -245 19 29 -201 -336 -100 -10 -144 -108 142 -253 113 -92 275 -198 -22 -35 -5 -117 -161
6212 -161 54 -146 -67 -269 -199 -222 -217 -180 -345 -105 188 -272 159 -287 -83 71 -146 52 -255 122 49 -238
6234b38O9n1J79L4j36J42K9qq1q2J39p6j05J43k08L7J04j9jK85j46J7P4j8kj4
6260F7j73L42n4n47L92p4M4L4j29p5L7N24l45j26J03%k16J97j26L09l33J79K36
6283B66m56K39K80o13J88P1J06j66o5L75j33K63o06K5K55J08l5Q9j82j14O9k32
6305b68K56j51m07P49j66j34o3K38P5j39Nk93K00l1O8K33N0j70o6k14N44k55j52
6328i1J75k63L44l1q0P7n5k9Q2l44J5L92j19j38k9K27l4j46R1o3N2o9l42N34k67
6353a11K11j16j5J80j33k0J93n79M14J70k35J00q7N7J66j69K01k00k82J12m0J89
6375FK51l18KK46J60l24q2J61j36J28j02m4M4m07M45m3k51M79p5j86j39J14K94
6398B23l41J29n2K14P5L74n18r0J10j79K44q3K1k67J09K3k9O1k43L44j97M41j19
$$ plain form
6234 -238 -169 -220 -41 -7 -143 -1 28 20 -61 -143 -4 -80 -185 -42 -250 -213 -109 -128 -129 156 10 27 101 83 81 67
6260 67 -106 236 182 -365 27 -47 -3 31 -98 -173 -136 388 43 -83 20 20 -196 1 -125 184 -149 30 266
6283 266 -190 49 329 -284 -96 -25 81 -85 -150 225 92 355 -251 -226 29 137 102 191 9 -105 -36 -268
6305 -268 -12 -163 -570 179 13 -121 -184 54 129 -10 -5 -298 -98 -129 -61 172 222 52 -14 -228 316 61 -91
6328 -91 84 -179 165 134 54 131 76 47 129 -215 -200 192 73 -65 -94 133 99 -47 44 -19 33 -36 -378 156 -111
6353 -111 100 -16 -31 149 16 -4 189 -390 24 194 -41 59 -28 29 195 26 227 27 -255 -143 -183 6
6375 6 257 -61 -59 187 347 23 -59 102 -34 94 -8 -52 -8 -415 30 -13 -264 215 140 -46 -185 -71 223
6398 223 -118 11 -41 173 248 622 104 14 124 -55 189 106 127 -140 -31 -8 -37 24 -219 125 -72 369 250
6421B50k59p9k46K34J28j81K58j12J17j42P7K28l91K0n3J80j62P4J75l19R0R4
6443a9lm7K13k93L94p5j8j52NN6j11J67k66L72r5j26L81m45J74j65l0j51L42j53
6467d5j59M08l22K18N4k2l5o4j13K00n2j7J26k22O5k40K08O5k99K69j95J26Q2
6490C6k50K15J50j67j71J08J07j53J18O7l34M11m7Q0j57N2j94J29K09Q4l08oM4
6513B3K81k67j1k36J8J64j44J34J04j85m2J27j33j87L18M2Q8l36L22L9m13K68
6535b6J69j50k26L43l14J88r1O9m2k12Q7J0k6K75j72O8L63l39j06L22k06Q8k65
6558a93j8K69j90J27j90J30J70J32k00j19Q3k47N18k84j65L02l76M22l11J37R3
6579I0J43m89N37k5p0j46m1o0Q7N1J54k77J13k08L09q6n6j76R1J3J15J27j38k33
$$ plain form
6421 250 -9 -88 -334 -100 28 -153 105 -7 110 -32 45 273 -118 -98 -151 29 -133 -59 116 -203 -113 -19
6443 -19 -22 -69 144 -149 245 170 152 0 5 61 -50 117 -149 223 128 2 383 -62 112 -53 -83 -234 108 -45
6467 -45 -204 204 -118 100 154 132 97 33 -80 120 68 51 177 -45 20 -220 -12 53 -246 23 -172 -46 36
6490 36 -214 1 151 -16 -187 -79 28 -125 -7 60 -274 137 90 170 13 65 -129 0 209 293 -15 -21 23
6513 23 304 37 26 -210 -192 -28 -172 -38 66 -119 -161 -34 -167 -354 -36 6 94 -242 80 119 -294 -26
6535 -26 143 -7 -233 110 -204 -16 -107 -38 -80 -292 -205 -195 -221 54 -118 -50 313 -26 -132 190 -16 72 -193
6558 -193 -211 58 -132 -5 -195 -65 105 237 37 -82 1 -246 272 -12 -177 125 -251 171 -140 -3 90
6579 90 233 -256 281 256 186 40 -1 -61 26 77 231 -46 67 -141 168 82 26 -150 -59 -46 69 196 58 -175
6603a75qq5K75k81j29M72p6j90k2j0j8L96l19N5K53m43m4M20l11p7J58K68m00
6626b91M60j81j14k15P66n82K26k18m0O6J97j87J8K60j11q5N0K34n40J55J73n7
6648a6Q8L3l57K2J45M07l40p8J63K02o7Q3r5j1o8K06l57N02l58j86L45k70J65
6671A58n3K98j20m26L68kj11p7k2K01%j41L1J64l59J10J86m8j25k30N19n9k35
6694B7K9jk34L25l9J68m18K69L7q2J76k04P4J06k4r5J64n9k39j00J14K16l10M53
6718C53k77j37J4J25J00J65l08K34k65m2J15j50K49k01Q0j42J11J69k19K7K7j68
6740a40N12l50m8J02Q9j87J58K3j36P9k44K34P4k11r9K17k19K84q9K02m50M6J67
6763A4L26k48P1r7n6K7K22k93J69m8j54J90k08L88j34j43J49k16K98l83J38K20
$$ plain form
6603 -175 -183 -268 7 -274 -403 69 -7 -197 -219 -229 -247 149 -170 -115 138 -305 -349 71 -240 -317 -159 109 -291
6626 -291 169 -12 -126 -341 425 -157 69 -149 -189 -123 74 -113 -95 165 54 -31 19 253 -287 -132 41 -16
6648 -16 72 105 -252 -230 -85 322 -18 -96 67 269 202 285 190 179 111 317 -40 462 104 -82 263 -7 158
6671 158 105 403 283 -143 225 223 112 35 13 214 214 73 104 268 -91 19 205 157 32 -198 321 262 27
6694 27 56 55 -179 146 107 275 -143 126 163 81 257 53 127 233 209 114 278 219 -20 -120 -6 210 -100 353
6718 353 76 -61 -47 78 178 343 35 269 4 -38 77 -73 176 -25 55 -87 24 193 -26 1 28 -140
6740 -140 372 22 -26 76 165 -22 136 159 23 102 -142 92 166 -45 -144 73 -146 138 49 251 -199 -153 14
6763 14 340 92 163 66 10 37 259 -34 135 87 -67 123 -85 303 169 26 175 -41 257 -126 12 232
6785B32l83M44l16L36l19P6j52K33k47j78L85j31m6O1k46K79j47K83l53k8K21
6806Dj29K37j93k0K53n2j76qM87n97o5L85j85j18r0L19r3q1j36O4M92k63J08k24
6830h1j77K58k62K47N8K21j81k61K13l1K01k21r6jOM9k9K6Q2J46p2j83J18r3j55
6855b18J01r9J8K03r2j82K56j97J93N7k88J60j05K56l32J59O6k18J19k1J09j28
6877a83L13l58K13m11N74j82j46Q9K26l86M8K31j23N8k31R0K7K4J39J2K45m84
6899b15M31m36K80k45K30j90n8L33J84l03K11k28O8k0j93K91n5l08L17J52l08
6920f2J31m13M48K55m63m1M85l82N5O1k4j71M8q8K90J4k15o9J53L19k88L5j95
6943a17J87R7k50K00j44O7mj0K43k39K7l7Q3k86M81k22j20j42K50k87J27L9j9
$$ plain form
6785 232 -151 293 -23 313 -6 70 -82 151 -96 -274 111 -20 -66 -5 -251 28 -119 164 -189 -217 4
6806 4 -125 112 -81 -101 152 100 -76 -84 403 -194 -259 126 -59 -177 -267 52 -41 -122 -258 -194 298 35 143 -81
6830 -81 -258 0 -262 -15 43 264 83 -178 35 4 205 -16 -112 -113 -107 -58 -87 -61 21 167 95 -88 30 -63 -218
6855 -218 -117 -216 -198 5 -87 -269 -13 -210 -17 40 -248 -88 -193 63 -269 -110 -44 -262 -143 -164 -55 -183
6877 -183 130 -228 -15 -426 148 -34 -180 -91 135 -251 -203 28 -95 -37 -268 -178 -151 -127 12 24 269 -215
6899 -215 216 -220 60 -185 45 -145 -203 130 314 11 222 -6 62 42 -151 140 85 -223 94 246 -62
6920 -62 69 -344 104 359 -104 -145 340 -42 13 74 50 -121 -73 -161 129 143 -72 -141 12 331 43 78 -117
6943 -117 70 167 -83 117 -27 40 36 26 269 30 57 20 103 -183 298 76 -44 -186 64 -223 -96 -57 -76
6966g6k51M24k08J33o1q5J91R8j32k21M01l00L56m84L29j45r5L3j18K73n04M64
6988B2l4q3k63N14k74J34o6l22M67l1j56M3r8K34J6j09L19k71k45K71J10j62J99
7011B15k20J34j33pl9J15r3m12N60k6j6o6k09J48k41K35K95k32m2J29qJ46l93
7034a60R7k3L06q6j48K13j69j6l6j46P9q9p7K89j52K45j63L03k81j83J77M8j86
7057a58J63R6j22j31L54k71p3KK59K6j99l1M26o89L76J6m2K31q5l67L46k60OM2
7081h5K0K39k10k54J93K96k71R0j32J71Kk33K01m7J11j02r3R1K2rq5L23k25l4
7105b1k8m6O3k83L17j63M6m1N31m53j90Q0L69Rk68L48m20m5N6L61N6j85j59K18
7129A52q4l2l2R3l26L15m4k12L31l40J28j7K99nl99J98M1opl11K99l17M39lk52
$$ plain form
6966 -76 -327 97 -111 22 -39 -124 67 165 33 -188 213 -87 269 -215 114 -31 -126 -93 -211 62 -442 22
6988 22 -12 -95 -358 156 -118 16 -50 -372 95 64 -92 -49 -147 87 103 -6 313 42 -203 68 178 16 215
7011 215 -5 129 -4 -11 -50 65 -28 -440 120 94 78 12 -197 -49 -290 -55 240 8 -34 95 87 233 -160
7034 -160 -63 -86 220 134 -14 199 30 14 -22 -168 -89 -178 -255 34 -118 127 -36 267 -14 -197 -20 28 -158
7057 -158 5 101 -21 -152 202 -69 -142 -140 119 145 -54 -85 341 -348 28 44 2 233 148 -219 127 -133 -127 -85
7081 -85 -65 174 -36 -290 -97 199 -72 18 -114 57 59 -174 27 -20 91 -11 -104 -13 9 0 -85 238 13 -21
7105 -21 -49 -95 -32 -315 2 -161 -115 -156 375 -78 -268 -188 181 190 -78 270 -150 -195 -139 222 278 93 -66 152
7129 152 68 36 4 97 -229 86 42 -170 161 -179 -51 -68 231 226 -173 25 66 60 53 -258 41 -276 163 160 -92
7154i2L49l12j63Q6k4J70p0M4O5K55k1l99J77q5n2q8J67J55j20O0j89K17k4k29
7178a23J13J18j55N2J31n1j07r5L67k69j95K03J06n2k08K85k55O8k4J71j65M31
7200C46l85O5O2k56J81m8K54j60J6k18K61q5K3k60J4L95l96J97j76J97K8m99M22
7223b2n8J71l2j26J40J26j93k81m6J20M8K74K40n19K89q7o9j75qQ5J72j6j01p3
7247a41R8K92l36J34Q8P3p7np2P6J58n19L54J08J10k72R6j51Rm4r9K22k5l7Mp1
7273b7K22P5l81K28j75P2j02K05n5m2j05J67j4rk07K7M0J53j28L87k98k21P5k0
7297a33J42l80J62L69l16Q3N4L15k22m1j5K79q9l68J52P8r4J25N7j00K4n1j35
7320a04K06R3l72K72K15j89n0k65O9J99r1O9l9j29M18l08p8K27J49k10o6j20K01
$$ plain form
7154 -92 257 -55 -218 -132 -156 14 -56 -12 53 308 287 -112 65 -20 -72 -160 7 162 42 102 -87 130 106 -123
7178 -123 -10 108 -47 5 136 85 -22 -117 250 -19 -214 -11 95 43 -165 120 -135 -67 -91 80 -85 346
7200 346 -39 26 88 -168 13 -35 219 59 75 -143 118 33 56 -204 -190 205 -191 6 -170 27 55 -444 -22
7223 -22 -80 91 59 -67 73 199 6 -275 -321 -201 -153 121 361 -158 131 44 -25 -200 -208 -123 49 33 -68 -141
7247 -141 -43 249 -87 47 135 208 131 126 54 130 288 -231 123 231 341 69 165 14 23 -21 -120 102 77 40 44 -27
7273 -27 195 270 -111 117 -58 14 -88 117 62 20 -85 82 68 59 -148 -121 -81 72 -56 331 33 -188 -113 -133
7297 -133 9 -371 -209 160 -156 -73 -19 296 74 33 18 297 208 -160 -8 70 -24 101 158 58 82 31 -104
7320 -104 102 195 -177 95 310 121 71 -194 -125 74 -17 52 13 -116 302 -6 -84 143 292 82 16 -104 97
7343I7J50j55r6k07M28k13P4p1j63L45M4l00O7J0j04k7K68n6j26mJ02O1J7j94
7367e3N5l7L05k03j7p5k76K41K7L9L6O8k41R4K18p7q1N5j44J52Q2Qp3j4k14M03
7393B78k46J67j68j36l2K64o4L84l71k12Q4M17l65j5k07J88k84K76L68l20K21
7414B27j99p7N9j80J52k2O0R6j55J40O2o7j1o7K60m63J13P4r2K21k30J64l37K87
7438A5J73j30k48R2N4M2pR3r9lj1lk6L75l02J42j99K88n25K12L1J05J4n1oj73
7464a47L30l51j34K27J09k51Q1K1K36l05Q3N1MN3K25P3l88j40K47n7l7j80JJ51
7488i8q2L53l05K02J40n04K34j21J9J11k57K40K27k62M6J41l01K30K15j70o2j17
7510a21N0N2K01k36K48r0l45L49k39J84k27K93p9k90M39O4l10J62L9P1J43Qk69
$$ plain form
7343 97 247 92 -4 -211 217 4 78 7 -156 189 233 -67 0 10 -94 -121 147 91 -35 -39 63 124 141 -53
7367 -53 2 -35 270 67 50 -25 -301 -60 -33 6 42 110 -131 -37 181 104 23 78 -66 86 168 176 103 89 -125 278
7393 278 32 199 31 -105 -137 127 63 447 76 -136 -52 365 0 -15 -222 -34 -318 -42 326 6 227
7414 227 28 -49 10 -170 -18 -40 20 116 -39 101 163 96 85 18 278 -185 -72 2 -90 131 -99 65 -272 15
7438 15 188 58 -190 -98 -44 -2 -9 84 -15 -18 -29 -32 -58 317 15 157 -42 246 -279 -67 -36 69 83 32 26 -147
7464 -147 183 -168 -302 -75 34 -217 -136 -115 121 -184 -101 -50 -46 7 232 305 -83 -223 24 -33 -70 -250 -249 -98
7488 -98 -180 173 -132 70 210 -294 -60 -181 -162 -51 -308 -68 159 -103 -57 84 -217 13 228 58 -4 -121
7510 -121 -71 -19 182 -54 194 104 -241 108 -131 53 -174 119 40 -250 189 253 -57 105 144 215 358 366 97
7533I7m0l1k32J07q4Nk9P2kJ5K26k57K5R1L0j41J2K21n9P2J30j39J05r7L8k28
7559i3M1J69j62K11j10k4k07m0K45N2J89l00J08k42M3L16j46l28J45J0K74O3k66
7582e2J30p8J0L37m10N8Kl3l3r0M4O4j20K50n8oj8J3J92Mn65L91J1k40L56l81
7608b22J34o3J68l56L67J04k96K22M6q6J3k45K02K52j93k46L07j20j92O9L28k91
7630i8J7J76r9k28j28L63J28k71J0R5M3j34J63j15q7M26k93K3J49j74Q0j19J83
7653A10p4k72J56l3j05k2K95N2k5j21J65k50ok5L49j91q7LJ73P6j30q0mr6M3J53
7679E4J02Q2k64q8L04k38%K7K37j30k90Q5P9p3j0J45K44l42MK27j72J65q3j04
7703c9M4k92Q0L42j68J90r3J30m8l04j40L40j52J10O3K96l84J58K16l85l12L81
$$ plain form
7533 97 57 26 -206 -99 -183 -178 -207 -135 -137 -122 104 -153 -128 -37 -7 -148 -136 85 26 98 228 89 194 97 135 -93
7559 -93 -52 117 -45 166 56 32 -175 -215 30 82 271 -29 79 -163 -120 196 50 -278 -133 -123 151 214 -52
7582 -52 78 0 10 347 -63 -5 -3 -36 -69 -159 -115 -51 -171 79 21 15 -3 10 202 206 -359 32 43 -197 159 -222
7608 -222 -88 -151 17 -339 28 132 -164 58 104 18 31 -214 -12 240 47 -199 108 -12 -204 -135 193 -98
7630 -98 -81 95 -4 -232 -360 3 131 -140 -130 -35 8 -126 37 -78 -165 261 -32 -9 140 -34 46 -73 110
7653 110 36 -236 -80 -113 -218 -240 55 107 82 -39 126 -124 -130 -155 194 3 -84 -81 92 168 38 -42 -46 -142 -99 54
7679 54 156 238 -26 -114 190 -48 -48 -21 216 86 -204 -119 -40 -113 -123 22 266 -76 -72 155 -17 148 65 -39
7703 -39 5 -287 -207 135 -33 157 64 194 146 -158 -298 42 -110 0 63 359 -25 133 349 -36 -348 33
7725C3J9Q3j88J47k14M26nm27L22j71j30J93k63K41N6J9k27p7N88j72m31J80o9
7748f7K33l33J25J7M1j18J66LK20j21k19J64o5o3N07n74MK0J12M4k40J31l57K71
7772i9j85M81k02r6J49l37L80p7m62O00l25J76qp3J76L57m40m8j23L2M1M15l50
7795a8rJ28r9r1K01l63L44lp7P2J8j22m23M00j02J49oj27k9K47m8P2k7j98q4L96
7821B01j77l09M84l00p4K96j05j82j16J63K59l04K57J07k73N5K87k08K7j04R5
7842G9l57K45K14k22O2Qp6p7O6o6l3o2L7L8k5L48j24L6r8R3j53m8K25K05l82J35
7868F8K8l56M38k60J97k79L42j74j83J53j31L49l5o04L04K20p4K66k25k05M70
7889C09p7k94j24M41m3n33K40q3L66k21O3k43L56j19n1N7O1p9j34R0L39l83P5
$$ plain form
7725 33 52 135 -53 94 -120 306 301 -126 196 25 -105 88 -175 66 122 141 -86 -163 425 253 -178 2 -67
7748 -67 166 -167 -42 -25 16 -102 64 67 287 166 -53 111 46 -17 490 -84 -80 -60 52 96 -144 -13 -370 -99
7772 -99 -284 197 -5 -101 48 -289 91 14 -448 152 -173 3 -5 -78 98 455 15 -33 -156 -124 -83 332 -18
7795 -18 -27 101 2 -89 112 -251 93 90 13 85 103 -19 -442 -42 -144 5 -1 -128 -157 90 42 114 87 -111 -195 201
7821 201 24 -285 199 -101 -175 121 16 -166 -282 -119 140 -164 93 200 -73 -18 269 61 88 -16 79
7842 79 -278 -33 181 -41 21 29 -47 -124 -58 -124 -157 -219 -182 -144 -169 179 55 91 -7 86 -67 -115 110 315 -67 68
7868 68 96 -260 178 -82 115 -164 178 4 -179 -26 -157 192 157 -447 -143 77 3 269 44 -161 309
7889 309 232 -62 -186 255 212 -321 -81 -164 202 -19 44 -199 157 38 -13 44 105 26 -108 -18 321 -62 13
7912A3k0R6K55l66J05mj26J89k01L4M1J9O9k85K19O5mo1j40J82k72J19K79l46
7936a40L25j78L41l47k04L95l23L27L4l98K39J21j77R4J83k67j02j2J88N8k82
7957a25q6Q0J81j71J83L1K07j75n60M06J87J31k67J56N0m24N0K70j35K91j93j7
7979G0j33J83k34J59p7J18r3j24m5M73l07J04j91K35k27J03K8l31K97J46k50J51
8001E5o1k56N06m69K08J9J32jj27j06K37k68O7R2k49K62R8n24K61P5K75j35k48
8024a57R4L7N1q2P7j27J29K20j84l74M05N8m4j58J50N2k34N6Q6J92l47J04lJ65
8048A66k83J31k04J03L7M64m50J6k86K22J04j59J67L84m47J61j27J8l46K78k56
8069c07M53j37O9J84M6j86K41m70K83L0Kj02l49J66lJ18Q7j0m5Rl26L60N2j34
$$ plain form
7912 13 -7 89 344 -22 83 79 -47 142 -59 -25 16 35 104 -181 38 103 99 38 -102 80 -192 -73 206 -140
7936 -140 185 7 348 1 -203 192 -131 196 230 -168 71 192 15 109 292 25 -77 -89 99 157 -125
7957 -125 -211 -131 50 -121 62 93 300 125 -435 -29 158 289 22 178 228 -196 -146 124 -11 280 87 70
7979 70 -63 120 -114 45 -32 86 -7 -131 -176 297 -10 94 -97 138 -89 14 42 -289 8 154 -96 55
8001 55 -6 -262 244 -225 -17 2 134 133 6 -100 137 -131 -64 28 -221 41 139 -385 -124 -49 226 91 -157
8024 -157 -63 -26 25 -57 20 -107 22 242 58 -316 89 147 103 -55 95 147 -87 -31 55 247 -100 4 1 166
8048 166 -117 14 -190 -87 -50 414 -36 -20 -306 -84 20 -139 28 412 -35 126 -1 17 -329 -51 -307
8069 -307 146 9 78 262 308 122 363 -107 176 206 208 106 -243 -77 -80 38 125 115 70 79 -247 113 165 31
8093C1j9J74j16m4m9J52p6j77P6KJ50J68m38q1L26n3l2N0J48n4j67J64k49P7k3
8118f0L4j96K22j30j8J28J33j43j81K54M9j66L2L5K29j8k61L09j42l66K40k94
8140c10J88L0j12M36l68K58j25j30k9J32J44k64j05L15J4m4m04L06L10p29L65
8161a22N9K51r5k62L9J00K10k10O6m3q0J30J30J42j64j50M9j14K19n2j10K67m33
8184a73Q4J99j15K49l04m3L90
$$ plain form
8093 31 12 186 70 26 -23 129 53 -124 -48 -46 104 272 -166 -247 79 26 -6 44 192 138 -29 135 -114 -37 -60
8118 -60 -26 -222 0 -130 -148 -20 113 -30 -211 43 92 -74 -42 -7 222 204 -57 252 110 -256 -16 -310
8140 -310 -122 -92 -204 232 -136 122 -3 -133 -162 -30 114 -150 -255 60 74 30 -374 -68 242 -487 -122
8161 -122 -63 188 93 -169 -130 -30 180 -30 36 -7 -87 43 173 315 151 1 50 -64 155 103 -7 260 -173
8184 -173 -89 110 -5 244 -60 -103 287
8191B87
$$ Imaginary data points
##PAGE= N=2
##DATA TABLE= (X++(I..I)), XYDATA
0@%%%%%%qJ6j6J6k4L2l2M0m8N6p2Q7j02J19j39J59j83K14k47K80l20L67m16M68
30B47n25N91o64P42q30R26j027J140j267J405j554J719j904K109k336K590k878
47a516L207l584M020m536N157n915O872q124R831j2314J6286k3639M1700j65492
61a38047k60693L51955K64105j64082l09199K9572K06812O7958r2759n0594k5102
72a20074k2043N7487J29818k4924j85423n3795J96695J24372j45738j54937R8647
83i9915J49927n6357j20455O0822J10006o3719j10516P3970J34510m7136j34522
94a03385K5838J22785j500q1468K4392O3279o1670p0847J11260J31736j14310
105D6110k04373O8236K60813L0222k50627j26734J76461J78406o3970j53179l0380
$$ plain form
0 0 0 0 0 0 0 0 -8 8 -8 8 -16 16 -16 24 -24 32 -40 47 -55 64 -75 84 -99 115 -132 148 -172 195 -221 247
30 247 -278 313 -351 391 -439 487 -540 600 -667 738 -816 903 -1001 1108 -1228 1362 -1516
47 -1516 1691 -1893 2127 -2409 2748 -3167 3705 -4419 5412 -6902 9384 -14255 27445 -138047
61 -138047 -398740 -46785 217320 53238 -255961 -226389 -19577 48381 -44378 -94972 -120074
72 -120074 -142117 -84630 45188 20264 -165159 -218954 -22259 102113 -43625 -198562 -99915
83 -99915 50012 -6345 -126800 -65978 44028 -19691 -130207 -56237 78273 31137 -103385
94 -103385 -77547 45238 43738 -37730 -13338 49941 -11729 -82576 28684 160420 46110
105 46110 -158263 -90027 170786 201008 -49619 -176353 108 178514 114544 -38635 -69015
116f9015O2223N9894M7379j2570j22482r0006J20689J88062n5216k40474m5971
127a57487K19963J20495j56200j48765Q0145J17998m3907p2108M8885L6423q6775
138d1333m4845J14679Q0718j14012j22023P6179J34824k8990j12200j757O9590
149A0830n287l4400M1534L3330p8256o5078Q9711J10255o3212j34406J6301J24458
161D5780K3641q0478k6528L6129p435j9204O0594M7747r2935j04985Q3756J61484
173A27566l1421j81793l7671J55360Q6712r6716r2730L9357N6614j7047r095L4396
185C3532j9921p7654P975J09164L3135j08468p8021O9299R1187j8265o3894j4139
197c6070Q358J565L9399M9913m9861j13841J1677J53448N6748j44650j20755R3810
$$ plain form
116 -69015 -6792 53102 100481 87911 -34571 -124577 -3888 184174 128958 -111516 -157487
127 -157487 62476 182971 26771 -121994 -41849 76149 32242 -39866 9019 45442 -41333
138 -41333 -86178 28501 109219 -4793 -126816 -50637 84187 55197 -57003 -58760 10830
149 10830 5543 -28857 12677 46007 -32249 -97327 -7616 102639 39427 -94979 -78678 45780
161 45780 69421 -11057 -37585 -1456 -8891 -28095 32499 80246 -12689 -117674 -33918 127566
173 127566 96145 -85648 -123319 32041 118753 22037 -70693 -31336 25278 8231 -864 33532
185 33532 13611 -64043 -56068 53096 86231 -22237 -100258 -30959 60228 41963 -21931 -36070
197 -36070 -27712 -26147 13252 63165 13304 -100537 -88860 64588 121336 -23314 -144069 -50259
209e0259J48985k6052j28422k1449Q0690L0295l2008k542J4406l3994k7920N7041
221H771O2879m6876q7394J7334Q7905J4888o0943k2399L0766O711j6008K5374
233B1008K8875m4141n9979L8678Q8195p838r1461k7391O6675M2400l0051k5825
245h55O291j3641j7151M6549N8171n0396j09805J1287J36327N0576j21315j09273
257a13235O2992J27089O492r8881n7746L4562O1369K8036k3093o1285l8551M8351
269b3900Q4529l640r8013m6864P4338P4573l5508p0967N453M5692o71k1141J7233
282A114J6662l7647l2885M3886N8280k7578p0657k80O2184K3376l5716k2796J1017
295a1040K843l444K4634K2474l5833n2831K1800P5636J4646o9541m9383L6344
$$ plain form
209 -50259 98726 72674 -55748 -77197 3493 33788 1780 -762 13644 -20350 -48270 8771
221 8771 71650 24774 -62620 -45286 42619 57507 -3436 -25835 4931 11642 -4366 21008
233 21008 49883 5742 -54237 -15559 72636 64798 -26663 -54054 12621 55021 24970 -855
245 -855 5436 -8205 -25356 21193 79364 28968 -80837 -69550 66777 117353 -3962 -113235
257 -113235 -50243 76846 83338 -15543 -73289 -38727 22642 50678 27585 -33700 -72251 -23900
269 -23900 60629 56989 -41024 -87888 -13550 61023 25515 -45452 -39999 5693 5022 -16119 1114
282 1114 17776 -19871 -52756 -8870 49410 21832 -48825 -49105 13079 36455 739 -22057 -11040
295 -11040 -8197 -11641 12993 35467 -366 -53197 -31397 44239 58885 -10656 -60039 -23695
307b3695O1263R643l7794l9586q949L4705N5812N810p3680o0972N2201J01761
319G6519j410j06754n2316P4759Q1787k5234p5601j5342M1979K6867m666j0076
331A0512j4052k0186N560M0113J9687l6816m2537J3323M4519J2593k5446k2328
343a5058m008Q644K1275K0081j5704m5796j1277N0599M1561l1708n7451M67M8656
356A0281K2014k1671k3113m094R02J0148K7410P702m1489m0546K8939O6044M634
369D7161o7549m2348M0681O0741p7m9945l3035J5511L8628K1989j6782m2234j9042
382d6301L4195M5536n776n0081k3485L0122L5296k389k4021j4125j652P344K1585
395F248J8033k1987m4306j441N4305L3160l8098n6367N379N5217K6340l0568l9052
$$ plain form
307 -23695 37568 47211 9417 -30169 -39118 -4413 51399 57209 -16471 -77443 -25242 76519
319 76519 75109 -31645 -83961 -9202 72585 47351 -28250 -43592 -1613 25254 20588 10512
331 10512 -3540 -23726 -18166 21947 41634 4818 -37719 -24396 20123 32716 7270 -15058
343 -15058 -19066 -10422 10853 30934 15230 -30566 -41843 8756 50317 18609 -38842 -38375 10281
356 10281 32295 10624 -12489 -16583 -15681 -5533 21877 29579 -11910 -52456 -23517 42527 47161
369 47161 -20388 -62736 -22055 38686 38609 -11336 -44371 -28860 9768 31757 14975 -27259 -46301
382 -46301 -12106 33430 27654 -22427 -45912 -15790 19506 17117 -6904 -21029 -22681 -15337 6248
395 6248 24281 2294 -42012 -43453 10852 44012 5914 -50453 -45074 10143 36483 5915 -33137
408c3137k716K6751K4503J561k3155k6892K096L3943K3728j8173l6370p873K8309
421g425K5066l152k3051j9805J093K6187K6934r011m2583k0609L5071M6381q245
434B6851n1143k2240L4187L8587n119l1796j7686Q761K0509J5119l417k2788k1790
447c1965J1028L5153J4598k7462l5355L140L6493K4776j6278l7160j4270K5988
459a1314L7531L673l8969l3398J8103M7034J3318l7329l5391J1650L7470J4237
471B6615j9783k4110l400J3730J8363Q231j3197k4525o888K5490K8645o601l5249
484a2679j7903K3655L4544K870l0495k5193R494L3019J7569j8378l1483n833K7516
497F703K6975o279k9239j5549J5018K5908Q471j5281k2156o474J9380K7227J610
$$ plain form
408 -33137 -35853 -9102 15401 16962 -6193 -33085 -30989 2954 26682 8509 -27861 -35734 -7425
421 -7425 17641 14489 -8562 -28367 -27274 -1087 25847 16836 -25747 -46356 -11285 35096 26851
434 26851 -24292 -46532 -12345 26242 21123 -10673 -28359 -19598 911 16030 12613 -10175 -31965
447 -31965 -20937 14216 28814 1352 -34003 -30863 5630 30406 14128 -23032 -37302 -11314
459 -11314 26217 29890 -9079 -42477 -24374 22660 35978 -1351 -36742 -25092 12378 26615
471 26615 6832 -17278 -20678 -6948 11415 19646 6449 -18076 -24964 526 29171 22570 -12679
484 -12679 -30582 -6927 27617 30487 -8 -25201 -15707 17312 34881 16503 -14980 -20813 6703
497 6703 33678 27399 -1840 -17389 -2371 23537 32008 16727 -5429 -11903 7477 34704 36314
510C6314k9312k6545J3799L9465J4095l1100l5691P144L9199K0490k2022l4352
522h516m347K8128K4888o131k7840j5940J2824K5847Q685j7284k2254k735J9063
535A4388J9484j154k1466j9323P170K7095J5480j7517l1215m621K9510K5965j0957
548C2839l3445j3047K2456K8388j33k5757j8881P910K3513J3037j1005k3066r200
561f391J6131K3350L983k1863k2940M690K7658J8057j5856l0378p950K5397K8096
574D1984n802l3064j7785J8297L1307L563k6521k3632O891K5642J2928j3637k2588
587b417p241J4286J9532K446j8678j9541J375K1507J6950j0400k6933j1479J9009
600a584K5622M5k6576k0842J0908K8648R923k0642k5295P64K4181J7958r420k3603
$$ plain form
510 36314 7002 -19543 -5744 33721 47816 16716 -18975 -11831 27368 47858 25836 -8516
522 -8516 -12863 15265 40153 34022 6182 -9758 3066 28913 37598 20314 -1940 -4675 14388
535 14388 33872 32718 11252 -8071 -901 26194 41674 24157 -7058 -11679 17831 43796 32839
548 32839 -606 -13653 8803 37191 37058 11301 -7580 330 23843 36880 25875 2809 -6391
561 -6391 9740 33090 37073 15210 -7730 -3040 24618 42675 26819 -3559 -11509 13888 41984
574 41984 36182 3118 -14667 3630 34937 38500 11979 -11653 -4762 20880 33808 20171 -2417
587 -2417 -9658 4628 24160 26606 7928 -11613 -10238 11269 28219 17819 -9114 -20593 -1584
600 -1584 24038 24083 -2493 -23335 -12427 16221 26144 5502 -19793 -19029 5152 23110 13690 -9913
614i913r836J3854K1559M987j6751j8963N23K0098J8427n674k4388j2805J6024
627b858K6712M137k3411k1549P714K7765J3092j6472k4889k688K0952J9861m837
640B3529k3060j3116J0906K1178O957j5535k0523j790J7512J6541l905k2183j5894
653a9383R567K3599P947k0083k6441Q02K5689J6583j5153k8935p503K0890K0041
666G620n564k4059j4731R437K0177O180j4704k0345k247J6921J5608n073j9994
679c0774j1999R584J8696O442j3439j8217j779J8032J6914l849k1231j1808J3574
692b9854K3220M307j7730j6916N501K0741J2659p508j7583o832J1868K0854O334
705I061j6966k0031M477K6247J5646j4081k5203l787K3348K1313n784k4074j3097
$$ plain form
614 -9913 -19749 -5895 15664 20651 3900 -15063 -14540 5558 23985 18311 -6077 -18882 -2858
627 -2858 23854 27991 4580 -16969 -9255 18510 31602 15130 -9759 -12447 8505 28366 23529
640 23529 469 -12647 -1741 19437 26394 10859 -9664 -11454 6058 22599 18694 -3489 -19383
653 -19383 -9816 13783 21730 1647 -24794 -23992 1697 18280 3127 -25808 -33311 -12421 7620
666 7620 2056 -22003 -36734 -27297 -7120 -940 -15644 -35989 -38236 -21315 -5707 -10780 -30774
679 -30774 -42773 -33189 -14493 -8051 -21490 -39707 -41486 -23454 -6540 -10389 -31620 -43428 -29854
692 -29854 -6634 -2327 -20057 -36973 -31472 -10731 1928 -5580 -23163 -29995 -18127 2727 9061
705 9061 -7905 -27936 -23459 2788 18434 4353 -20850 -24637 -1289 20024 14240 -9834 -22931
718b2931J4404K4751N481k1150k1132N446K5083J2043j5321k2186j396J7577J3570
731A4239n466j5325r320M797J2934P971p663j6734o691J2256J6079j616j7335
744a1874j2338P086J5365O340q965j4654n765J1328J6289J930j7847j6217O428
757b2894K3318R072j5823k0498N03J9957J5755n990k0283j1209J2523K3576O467
770A4474k0891k2288P149K8468J3191j9084k4254K700K3497J4084r702j8685n592
783a6933J1596J6219L396j3685j5187K502J7588J0980r397j6467k574J1438J0737
796A0213J39r564r429p29J0020J2332j949j6673j0541J0096J8883K728j7096j3890
810a5460N121J6301Q520p431j4709p310J0514J8220M058j8226j8076P235K5175
$$ plain form
718 -22931 -8527 16224 21705 555 -20577 -15131 9952 21995 6674 -15512 -16908 669 14239
731 14239 8773 -6552 -15872 -11075 1859 9830 2167 -14567 -21258 -9002 7077 5461 -11874
744 -11874 -24212 -17126 -1761 4579 -4386 -19040 -24805 -13477 2812 4742 -13105 -29322 -22894
757 -22894 424 9496 -6327 -26825 -26322 -6365 9390 3400 -16883 -28092 -15569 8007 14474
770 14474 -6417 -28705 -21556 6912 20103 1019 -23235 -20535 2962 17046 7344 -11341 -16933
783 -16933 -5337 10882 14278 593 -14594 -12092 5496 16476 7079 -9388 -11962 -524 10213
796 10213 10352 788 -8641 -9370 650 12982 11033 -5640 -16181 -6085 12798 15526 -1570 -15460
810 -15460 -10339 5962 14482 7051 -7658 -14968 -4454 13766 17824 -402 -18478 -11243 13932
823A3932Q751j7573k0061L431K0368J2006q148j7176o832J1181J7856L708j6037
836E406j6837N667K1440R947j4458j8005J588J5639J0100m808j1658o731L617
849I07J1716Q633o939j7326m791J5094J5376n165j8119q073J0381J3371J902j0192
863F775j2128j999J1093J3233k848j7881j1489J1403J9221K6j7539j3089P415
876g807J4863M754q163j2305m110Q164J4224K023j4847j4069N546J9037P050j4324
890C6j4800K067J4164Q362l848j1341p617M768J4035P694r610j7377j389J8419
904C563J3744q575j8625l747J2914J3454j09j2623j0868K336J4818J1084p903
917I463j9359m347J6917J6028n852j9098o710J2489J3442k59j1230q826R78J0064
$$ plain form
823 13932 22683 5110 -14951 -11520 8848 20854 12706 -4470 -11302 -121 17735 21443 5406
836 5406 -11431 -5764 15676 25623 11165 -6840 -5252 10387 20487 15679 4021 -2710 907
849 907 12623 21256 14317 -3009 -7800 7294 22670 17505 -614 -8687 1694 15065 16967 6775
863 6775 -5353 -7352 3741 16974 14126 -3755 -15244 -3841 15380 15406 -2133 -15222 -7807
876 -7807 7056 11810 3647 -8658 -12768 -4604 9620 11643 -3204 -17273 -11727 7310 14360 36
890 36 -14764 -12697 1467 9829 5981 -5360 -12977 -8209 5826 13520 3910 -13467 -14856 3563
904 3563 17307 8732 -9893 -13640 -726 12728 12619 -4 -10872 -8536 6282 17366 9463
917 9463 -9896 -14243 2674 18702 12850 -6248 -12958 -469 12973 12714 1484 -7342 -6364 3700
931C700R566l019j4228p340R587J4193Q5j3326q755M865J0524M455m690q181n094
946g658L301J1636O120j0095j4314N66J5841R992q927j5687k895J1827J1929n96
960A1040j2004j1278L098J6088R296j0206j9174k335J8809J4343q879j9581m127
973a4910J3767J3378k332j3526r305M770J3007P404q173j4963k926J3759J1869
986A1819n480j4738m594R143R379Mp362n961q87N878P620J256j0092q784M339
1001h460J2696M084r020j0340L01R442Q051j683j0058q175L779J3722O753j0216
1015H76j5658J19J7228J0718r369j6245k819J3151J1626k643j2168r048M840J4367
1029D975O427r939j5081m6J5123J0631p935j4835k905J0856R788j568r143p020
$$ plain form
931 3700 13266 10247 -3981 -11321 -1734 12459 12544 -782 -9537 -4672 5852 10307 5617 -2564 -7658
946 -7658 -4357 7279 13399 3304 -11010 -10444 5397 15389 6462 -9225 -12120 -293 11636 11040
960 11040 -964 -12242 -9144 6944 16240 6034 -13140 -15475 3334 17677 8798 -10783 -14910
973 -14910 -1143 12235 9903 -3623 -12928 -8158 4849 12253 4080 -10883 -13809 -50 11819
986 11819 6339 -8399 -12993 -3850 5529 5533 -1829 -7790 -8677 -2799 4821 6077 -4015 -12799 -8460
1001 -8460 4236 8320 -700 -11040 -10739 -1297 6754 5071 -4987 -13162 -9383 4339 11092 876
1015 876 -14782 -14663 2565 13283 3914 -12331 -15150 -1999 9627 6984 -5184 -14232 -9392 4975
1029 4975 11402 1463 -13618 -13664 1459 12090 4155 -10680 -13585 -2729 7059 5491 -3652 -10672
1043a0672K092Q844P273m170j1486m660Q450J1199r56j0608o617L936R178L999
1057E802m473q422l896N928J0493K719j0999j1200M699J4421N054r813j1585N88
1071a0684J0749Q095l099j0297o423N363J2131M409r441j3001J703J4576Q005
1084A2086q323j2794j082R774Q594j665q543p088K465J0292O352o058j2132k347
1098a0469J0746J0125l889j1674m824O768Q817J908o151q520j583Q211R527j830
1112G162j2351p213P967J3019N58j1583q609M351J0388M420n166r037l092O256
1126b930J0522J007j0484r374N113J2818L866r474r242J733Q682N950k343p297
1140a453n154L081R120N772p066j0991N2J1654P790n786j0421k119P204P805O19
$$ plain form
1043 -10672 -8580 264 7537 3367 -8119 -12779 -4329 6870 5914 -4694 -11311 -7375 1803 5802
1057 5802 1329 -7093 -10989 -5061 5432 8151 -2848 -14048 -9349 5072 10126 313 -11272 -10684
1071 -10684 65 8160 5061 -5236 -11659 -6296 5835 10244 803 -12198 -10495 4081 12086
1084 12086 3763 -9031 -10113 -339 8255 6590 -1953 -9041 -6576 3716 10068 4010 -8122 -10469
1098 -10469 277 10402 6513 -5161 -9985 -3217 5600 7508 1357 -7163 -8746 -535 8992 7162
1112 7162 -5189 -12402 -4435 8584 9142 -2441 -11050 -6699 3689 8109 2943 -6094 -9186 -2930
1126 -2930 7592 8599 -1885 -11259 -6146 6672 10538 1064 -8178 -6445 2237 8187 5844 -1453
1140 -1453 -6607 -3526 5594 11366 4300 -6691 -6639 5015 12805 7019 -3402 -5521 1683 9488 10107
1155A0107n945p183o84R009Q903l381j3023m899J0637J1843k460j2472n503O440
1169A389R238K285n918p863k143P797R947j906j2273o908Q468J2264r38j1456
1183A983n668M761Q296J734l825n832l818L729Q149K986q428r171K818J1500L681
1198A2895p512q571J057O063M574m10m893o421l68Q908P405n546j2639j710J1728
1213D560Q689n691j0736k137O397O848J350n060p493k310Q670J0210l103j3964
1227c770n166J1571J1361m298j1876l177O994O667R29m267n272k679N267Q982
1241A1266L90j0964p287P499J1018l05r983m185L814M958J482n54l859n842M46
1256b106R302O163p984j2153J873J2354M514q455q029J336N372L572k24l087p199
$$ plain form
1155 10107 4162 -3021 -3705 5304 14207 10826 -2197 -7096 3541 15384 12924 452 -5051 1389
1169 1389 10627 12912 6994 -869 -3012 4785 14732 12826 553 -6355 2113 14377 13439 1983
1183 1983 -3685 1076 9372 11106 7281 1449 -2369 1360 9509 12495 4067 -5104 -2286 9214 12895
1198 12895 5383 -3188 -2131 3932 8506 8096 3203 -3218 -3586 5322 12727 7181 -5458 -7168 4560
1213 4560 13249 7558 -3178 -5315 1082 7930 9280 4220 -3273 -5583 3087 13297 10194 -3770
1227 -3770 -8936 2635 13996 9698 -2178 -5355 1639 8306 9235 4968 -304 -2983 2284 11266
1241 11266 11656 692 -6595 904 11922 11617 1634 -2551 1263 6221 7703 7149 3290 -2552 -2106
1256 -2106 7196 13359 5375 -6778 -4905 7449 11963 3508 -4521 -3185 2187 5759 5535 2448 -4751
1271d751k484Q727Q992n533j3986k454J2654Q586p492j0530l54O135M052L21k680
1286g97o242l308O084J0127j858j3531n442J1381J0418n373j0232r35N982L158
1300e68j12j00l347n016J466J0280M687j0931r776O415J2323M64r981m316L987
1315d525M301J917P66k515p065r01J0510P675q754j2919L137J3509L899r829o859
1330g653L567N074L64Q77n54o281m162P160J0419m100j4338k724J2830P782p205
1345A056r772J639N359R26N91J61m406n940L584J1040J223j3494p133R812J1166
1360E812l867j0470j083N224K090L14J854k986q075Q18J2514N282j1944j1271
1374a5788P400J4235q06j1770l500O542L787j065M10p3n533k566Q791P905p030
$$ plain form
1271 -4751 -7235 1492 10484 4951 -9035 -11489 1165 9751 2259 -8271 -8625 -2490 1562 1883 -797
1286 -797 -7039 -10347 -4263 5864 4006 -9525 -14967 -3586 6832 1459 -8773 -9708 -3726 -568
1300 -568 -680 -780 -4127 -9143 -7677 2603 7290 -3641 -13417 -7002 5321 5785 -4196 -8512 -4525
1315 -4525 -224 1693 2459 -56 -7121 -8022 2488 10163 1409 -11510 -8373 5136 9035 -794 -7653
1330 -7653 -4086 988 1352 2229 1675 -4606 -8768 -1608 8811 4711 -9627 -12351 479 8261 1056
1345 1056 -8716 -7077 -1718 -792 -201 -40 -4446 -10386 -6802 4238 5461 -8033 -15166 -5354 5812
1360 5812 1945 -8525 -9608 -4384 -2294 -1980 -126 -3112 -11187 -10369 2145 7427 -4517 -15788
1374 -15788 -8388 5847 5041 -6729 -10229 -3687 100 -965 -555 -628 -6161 -8727 64 7969 939
1389I39j2197K432J2976K872r187n029M371L103j393K025K589n526p293N671J2255
1404H608j643j4310m576J2326Q275o524q515J514M243L59R81K935m899q312L164
1419f374J3616K612j4843q921J0836J2809m343j1668j353P084K200l83Q01k238
1433a65o342O19J0946M503j1491r791Q237J2608k900j1172m29P645O23l324K067
1448A634L023n384n566O635R959m140j2608j96J1587L935p187m803K939J872j385
1463C15L449L030o324q795N857J3449q81j5391n247J2071R692o392r125K86M402
1478C96J209J248J811m522q302L809J2938J389j4309q038J1522J1699n938j1649
1492f737J115P652M54l309K134K60n598j712Q361N646q189r144N323J0339j637
$$ plain form
1389 939 -11258 -8826 4150 7022 -2165 -7194 -2823 280 -1113 912 3501 -2025 -9318 -3647 8608
1404 8608 6965 -7345 -11921 405 8680 2156 -6359 -4845 -602 -243 738 3673 -1226 -9538 -6374
1419 -6374 7242 9854 -4989 -13910 -3074 9735 5392 -6276 -7629 -545 1655 1272 2073 -165
1433 -165 -6507 -5888 5058 9561 -1930 -11721 -3484 9124 6224 -4948 -5377 2268 2891 -433 1634
1448 1634 4657 -727 -6293 342 10301 6161 -6447 -6643 4944 8879 1692 -3111 -172 1700 315
1463 315 3764 6794 470 -8325 -2468 10981 10100 -5291 -10538 1533 11225 4833 -4292 -4006 396
1478 396 1605 2853 4664 142 -8160 -4351 8587 9976 -4333 -12371 -849 10850 4912 -6737
1492 -6737 -5622 2030 2484 -825 1309 1569 -4029 -5741 2620 8266 77 -9067 -3744 6595 4958
1507D958q321qM492p70k507M351L441o979o929P065J1732l919j3792j071J1843
1522C586N268p285n218J847K570p29L187K328o289p603N817J2838j514j4414m922
1537a0533J2301Q819o845q763J601N005K31K2J791k902o757K211J0719J438j1391
1552c053o521R073Q901m586q137J211N070q55k070L573J311p200l181Q522P346
1567I404p098j0253L194J0078Q10p236k353L217Q01j055L062J829p176m788P077
1582d87R781m372j2178j59J0768L903o583n003K552J869n76K069K146m598o297
1597g165L720J0154m5j1735m117R007P229n044o221J095K916k84J095K573k739
1612D39o707L20J0145L102r080p384O225Q935j694p073r03K977N75K02L001j135
$$ plain form
1507 4958 -3363 -3371 1121 351 -2156 2195 5636 -1343 -8272 -1207 10525 6606 -7186 -8257 3586
1522 3586 8854 1569 -3649 -1802 768 39 3226 5554 -735 -8338 -2521 10317 8803 -5611 -10533
1537 -10533 1768 10587 3742 -5021 -3420 1585 1816 1838 3629 727 -6030 -3819 6900 8338 -3053
1552 -3053 -9574 -501 8400 3814 -4323 -3112 1958 1103 -967 2606 3917 -3283 -6464 2058 9404
1567 9404 2306 -7947 -4753 5325 6135 -1101 -3454 -237 564 -491 2571 4400 -2776 -7564 -487
1582 -487 9294 4922 -7256 -7415 3353 7256 673 -4330 -1778 91 -485 1584 3730 -868 -7165
1597 -7165 -3445 6709 6664 -5071 -9188 -181 7048 2004 -4217 -3122 -206 -490 605 3178 439
1612 439 -6268 -5948 4197 7299 -1781 -9165 -2940 5995 4301 -2772 -3675 -698 -123 79 3080 1945
1628A945o676j457Q727N948p294r002L311R873J08o823k307K909J567o07J641
1643A863J152m726l895N083P300k749q987n41P310L560m409l386J078O14p5K642
1659A834K294m613o206L140R537M87r565m808O705O517k400m991j244J593J172
1674e48K502J354l111o355J508Q960K779q687o561N465P876r87o113j847K647
1689a118J943M31J161j465m285o27O243L885n304o438K475O883N00m638j378J483
1705b49M83l94K675J246m647l883M181O508j443p519j831N737L915k203l364q10
1721a598J60J475L165J104n214m894L457Q297m1q177m355N352O623j741m896j868
1737c151J419K026K344M69l399m286J826O830J492o486n008M027O052o31m545
$$ plain form
1628 1945 -4731 -6188 2539 8487 1193 -7809 -4498 5375 5483 -1340 -3647 -738 829 222 1863
1643 1863 3015 -1711 -5606 -523 6777 4028 -4959 -5500 1810 5370 961 -2425 -1347 -733 -808 1834
1659 1834 4128 -485 -6691 -3551 5986 6473 -3092 -7900 -1195 5322 2922 -2069 -3313 -1720 -548
1674 -548 1954 3308 197 -6158 -4650 4310 7089 -1598 -8159 -2694 5182 4195 -1918 -3765 -1118
1689 -1118 825 1256 2417 952 -3333 -3960 2283 6168 864 -5574 -3099 3784 4284 -354 -1732 -249
1705 -249 234 -160 2515 3761 -886 -4769 -588 5920 4477 -3042 -4873 864 4779 2576 -788 -1598
1721 -1598 -1438 37 3202 4306 -908 -5802 -2345 5952 5911 -2266 -6621 -1269 5354 3613 -1283 -3151
1737 -3151 -1732 294 2638 3107 -292 -4578 -2752 4078 5570 -916 -5924 -1897 4155 3524 -1021
1752a021j255J625R85Q38J117o13m200q99M894M030l042o134O45M925J845k402
1768A338k478J7O05J123K605L46n030k944M127O408j771o753k256N131M215j431
1784C252l331k088Q26K118K591J11m289l966L497O288k9o463l475M368M705l65
1800C750m211j501O97J618J807P31k558l695Q80N148K249n057l760J430N186L10
1816C024k628j837j16O02J899J983j689m238r92N120L411k607n576l47M709K556
1832C274j978k531j231Q95J948K113n98m393k079L537N710k341n457j501M031
1847f01L564j480k794j612O17J704K292k3l056l487K391N493j3m864l120K714
1863b275L983Lk551j721k1R86K346J761k753m164O18N267K246m003m162J182M573
$$ plain form
1752 -1021 -2276 -651 334 1172 2289 1676 -2524 -3423 1471 5501 2459 -3675 -3030 1895 3740 1338
1768 1338 -1140 -1123 -518 605 3210 3556 -1474 -4418 -291 6117 4346 -2407 -4663 468 4683 3252
1784 3252 -79 -2167 -1341 777 3368 3479 -810 -4776 -1279 5009 4980 -1483 -4958 -590 4115 3750
1800 3750 -461 -1962 -1265 353 2160 2891 333 -3362 -2482 2666 4915 -142 -3902 -2472 2714 3024
1816 3024 396 -1441 -1557 -955 944 2927 1238 -3000 -3992 1128 4539 1932 -3644 -3991 718 3274
1832 3274 1296 -1235 -2466 -1571 377 2490 1892 -2501 -4580 -1043 4667 2326 -3131 -4632 -601
1847 -601 2963 1483 -1311 -2923 -2306 -602 1690 1667 -1389 -4876 -2485 3008 2995 -1869 -4989 -2275
1863 -2275 1708 1711 -840 -2561 -2582 -1596 750 2511 -242 -4406 -3788 1479 3725 -278 -4440 -3258 1315
1880A315J459k836j958n91J038K315J724j518m382j70M082L628k725n147L50M228
1896H12K025j829k441n10K72J740K109m86l621k133L196M283p11m702k047L192
$$ plain form
1880 1315 2774 -62 -2020 -2611 -1573 742 2466 948 -3434 -3604 478 4106 1381 -3766 -3416 812
1896 812 2837 1008 -1433 -1943 -1671 69 2178 1692 -1929 -4062 -866 3417 2706 -1996 -4043 -851
$$ [...]
8191A71
##END NTUPLES=NMR FID
##END=
