##TITLE=1H_CA-8570-06
 CDCl3, 48 sc, 
 7.3.2019
##JCAMPDX= 6.0         $$ Bruker NMR JCAMP-DX V2.0
##DATA TYPE= NMR FID
##DATA CLASS= NTUPLES
##ORIGIN= UXNMR, Bruker Analytische Messtechnik GmbH
##OWNER= root
$$ XWIN-NMR		Version 3.5
$$ Thu Mar  7 11:58:24 2019 Russian Standard Time (UT+4h)  she@DPX200
##.OBSERVE FREQUENCY= 200.1316
##.OBSERVE NUCLEUS= ^1H
##.DELAY= (6, 6)
##.ACQUISITION MODE= SIMULTANEOUS
##.ACQUISITION SCHEME= undefined
##.AVERAGES= 48
##.DIGITISER RES= 18
##SPECTROMETER/DATA SYSTEM= spect
##.PULSE SEQUENCE= zg30
##.SOLVENT NAME= CDCl3
##.SHIFT REFERENCE= (INTERNAL, CDCl3, 0, 15.7039)
##AUDIT TRAIL= $$ (NUMBER, WHEN, WHO, WHERE, WHAT)
$$ ##TITLE= Audit trail, XWIN-NMR		Version 3.5
$$ ##JCAMPDX= 5.01
$$ ##ORIGIN= Bruker BioSpin GmbH
$$ ##OWNER= she
$$ F:/spectra/data/she/nmr/H-F/1/audita.txt
$$ ##AUDIT TRAIL=  $$ (NUMBER, WHEN, WHO, WHERE, WHAT)
(   1,<2019-03-07 11:57:06.40 +0400>,<she>,<DPX200>,
      <continue with go, POWCHK disabled, PULCHK disabled
       configuration hash MD5:
       00 E9 B6 7A A2 85 ED C7 34 08 36 98 17 FE 4E 26
       data hash MD5: 16K
       FF 84 47 3A DC 1A 9E 9E CA 76 CE 15 CB D6 CA 2E>)
$$ ##END=
$$ 
$$ hash MD5
$$ 04 96 3E C0 29 BB 42 FB 88 4B 4F DA FE B3 7F E9
##$RELAX= 
##$RELAX= 
##$RELAX= 
##$RELAX= 
##$RELAX= 
##$RELAX= 
$$ Bruker specific parameters
$$ --------------------------
##$DU= <F:/spectra>
##$EXPNO= 1
##$NAME= <H-F>
##$PROCNO= 1
##$TYPE= <nmr>
##$USER= <she>
##$AMP= (0..31)
100 100 100 100 100 100 100 100 100 100 100 100 100 100 100 100 100 100 
100 100 100 100 100 100 100 100 100 100 100 100 100 100 
##$AQSEQ= 0
##$AQ_mod= 1
##$AUNM= <au_zg>
##$AUTOPOS= <>
##$BF1= 200.13
##$BF2= 200.13
##$BF3= 200.13
##$BF4= 200.13
##$BF5= 200.13
##$BF6= 200.13
##$BF7= 200.13
##$BF8= 200.13
##$BYTORDA= 1
##$CFDGTYP= 0
##$CFRGTYP= 5
##$CHEMSTR= <none>
##$CNST= (0..31)
1 1 145 1 1 1 1 1 1 1 1 1 1 1 1 1 1 1 1 1 1 1 1 1 1 1 1 1 1 1 1 1 
##$CPDPRG= <>
##$CPDPRG1= <>
##$CPDPRG2= <>
##$CPDPRG3= <>
##$CPDPRG4= <mlev>
##$CPDPRG5= <mlev>
##$CPDPRG6= <mlev>
##$CPDPRG7= <mlev>
##$CPDPRG8= <mlev>
##$CPDPRGB= <>
##$CPDPRGT= <>
##$D= (0..31)
0 1.2 0 0 0 0 0 0 0 0 0 0.03 0 0 0 0 0 0 0 0 0 0 0 0 0 0 0 0 0 0 0 0 
##$DATE= 1551945265
##$DBL= (0..7)
120 120 120 120 120 120 120 120 
##$DBP= (0..7)
150 150 150 150 150 150 150 150 
##$DBP07= 0
##$DBPNAM0= <>
##$DBPNAM1= <>
##$DBPNAM2= <>
##$DBPNAM3= <>
##$DBPNAM4= <>
##$DBPNAM5= <>
##$DBPNAM6= <>
##$DBPNAM7= <>
##$DBPOAL= (0..7)
0.5 0.5 0.5 0.5 0.5 0.5 0.5 0.5 
##$DBPOFFS= (0..7)
0 0 0 0 0 0 0 0 
##$DE= 6
##$DECBNUC= <off>
##$DECIM= 24
##$DECNUC= <off>
##$DECSTAT= 4
##$DIGMOD= 1
##$DIGTYP= 9
##$DL= (0..7)
0 120 120 120 120 120 120 120 
##$DP= (0..7)
150 150 150 150 150 150 150 150 
##$DP07= 0
##$DPNAME0= <>
##$DPNAME1= <>
##$DPNAME2= <>
##$DPNAME3= <>
##$DPNAME4= <>
##$DPNAME5= <>
##$DPNAME6= <>
##$DPNAME7= <>
##$DPOAL= (0..7)
0.5 0.5 0.5 0.5 0.5 0.5 0.5 0.5 
##$DPOFFS= (0..7)
0 0 0 0 0 0 0 0 
##$DQDMODE= 0
##$DR= 18
##$DS= 0
##$DSLIST= <SSSSSSSSSSSSSSS>
$$ [...]
##$SUBNAM2= <"">
##$SUBNAM3= <"">
##$SUBNAM4= <"">
##$SUBNAM5= <"">
##$SUBNAM6= <"">
##$SUBNAM7= <"">
##$SUBNAM8= <"">
##$SUBNAM9= <"">
##$SW= 24.9336934301222
##$SWIBOX= (0..15)
0 0 2 0 0 0 0 0 0 0 0 0 0 0 0 0 
##$SW_h= 4990.01996007984
##$TD= 16384
##$TD0= 1
##$TE= 0
##$TE2= 300
##$TE3= 300
##$TEG= 300
##$TL= (0..7)
0 120 120 120 120 120 120 120 
##$TP= (0..7)
150 150 150 150 150 150 150 150 
##$TP07= 0
##$TPNAME0= <>
##$TPNAME1= <>
##$TPNAME2= <>
##$TPNAME3= <>
##$TPNAME4= <>
##$TPNAME5= <>
##$TPNAME6= <>
##$TPNAME7= <>
##$TPOAL= (0..7)
0.5 0.5 0.5 0.5 0.5 0.5 0.5 0.5 
##$TPOFFS= (0..7)
0 0 0 0 0 0 0 0 
##$TUNHIN= 0
##$TUNHOUT= 0
##$TUNXOUT= 0
##$USERA1= <user>
##$USERA2= <user>
##$USERA3= <user>
##$USERA4= <user>
##$USERA5= <user>
##$V9= 5
##$VALIST= <valist>
##$VCLIST= <CCCCCCCCCCCCCCC>
##$VD= 0
##$VDLIST= <DDDDDDDDDDDDDDD>
##$VPLIST= <PPPPPPPPPPPPPPP>
##$VTLIST= <TTTTTTTTTTTTTTT>
##$WBST= 1024
##$WBSW= 4
##$XGAIN= (0..3)
0 0 0 0 
##$XL= 0
##$YL= 0
##$YMAX_a= 196646
##$YMIN_a= -286141
##$ZGOPTNS= <>
##$ZL1= 120
##$ZL2= 120
##$ZL3= 120
##$ZL4= 120
##$ABSF1= 10
##$ABSF2= 0
##$ABSG= 5
##$ABSL= 3
##$ALPHA= 0
##$AQORDER= 0
##$ASSFAC= 0
##$ASSFACI= 0
##$ASSFACX= 0
##$ASSWID= 0
##$AUNMP= <proc_1d>
##$AZFE= 0.1
##$AZFW= 0.1
##$BCFW= 1
##$BC_mod= 2
##$BYTORDP= 1
##$COROFFS= 0
##$CY= 11.3945322036743
##$DATMOD= 1
##$DC= 2
##$DFILT= <>
##$DTYPP= 0
##$F1P= 18.9103706918063
##$F2P= -1.10871071338519
##$FCOR= 0.5
##$FTSIZE= 0
##$FT_mod= 4
##$GAMMA= 1
##$GB= 0.15
##$INTBC= 1
##$INTSCL= 1
##$ISEN= 128
##$LB= 0.24
##$LEV0= 0
##$LPBIN= 0
##$MAXI= 10000
##$MC2= 0
##$MEAN= 0
##$ME_mod= 0
##$MI= 1.114404
##$NCOEF= 0
##$NC_proc= 0
##$NLEV= 6
##$NOISF1= 3.799351
##$NOISF2= 2.8
##$NSP= 1
##$NTH_PI= 0
##$NZP= 0
##$OFFSET= 15.70392
##$PC= 1
##$PHC0= -8861.793
##$PHC1= 19.60014
##$PH_mod= 1
##$PKNL= yes
##$PPARMOD= 0
##$PSCAL= 0
##$PSIGN= 0
##$REVERSE= no
##$SF= 200.130013532006
##$SI= 16384
##$SIGF1= 3
##$SIGF2= 2
##$SINO= 400
##$SIOLD= 16384
##$SREGLST= <1H.CDCl3>
##$SSB= 0
##$STSI= 0
##$STSR= 0
##$SW_p= 3612.71676300578
##$SYMM= 0
##$S_DEV= 0
##$TDeff= 0
##$TDoff= 0
##$TI= <>
##$TILT= no
##$TM1= 0
##$TM2= 0
##$TOPLEV= 0
##$USERP1= <user>
##$USERP2= <user>
##$USERP3= <user>
##$USERP4= <user>
##$USERP5= <user>
##$WDW= 1
##$XDIM= 8192
##$YMAX_p= 0
##$YMIN_p= 0
$$ End of Bruker specific parameters
$$ ---------------------------------
##NTUPLES= NMR FID
##VAR_NAME=  TIME,          FID/REAL,        FID/IMAG
##SYMBOL=    X,             R,               I
##VAR_TYPE=  INDEPENDENT,   DEPENDENT,       DEPENDENT
##VAR_FORM=  AFFN,          ASDF,            ASDF
##VAR_DIM=   8192,          8192,            8192
##UNITS=     SECONDS,       ARBITRARY UNITS, ARBITRARY UNITS
##FACTOR=    0.0002004,     1,               1
##FIRST=     0,             0,               0
##LAST=      1.6414764,     0,               0
##MIN=       0,             -286141,         0
##MAX=       1.6414764,     196646,          0
$$ Real data points
##PAGE= N=1
##DATA TABLE= (X++(R..R)), XYDATA
$$ [...]
3702e873M554R570j5209K951J1439j2234j775J2847q898n791J4370p225o457J2116
$$ -5873 -1319 8251 -6958 -4007 7432 -4802 -6577 6270 -2628 -8419 5951 -1274 -7731 4385
3716D385j769j1547J2402J323j2896J0116N200j3799P655P653j3503L001J0837
$$ 4385 2616 -8931 3471 4794 -8102 2014 7214 -6585 1070 8723 -4780 -1779 9058
3729I058j1577K06J2009j0838m361J4322q066q199J3924m718j0887J2202Q5j2828
$$ 9058 -2519 -2313 9696 -1142 -5503 8819 753 -7446 6478 1760 -9127 3075 3160 -9668
3743i668J0678K619j2822Q161O630j3916N490R767j3689J960J2319j0797k082
$$ -9668 1010 3629 -9193 -1032 5598 -8318 -2828 6939 -6750 -4790 7529 -3268 -5350
3756e350J3571q271n729J3683n405r376J3988k067j1515J2027J067j2651R022
$$ -5350 8221 -50 -5779 7904 2499 -6877 7111 5044 -6471 5556 6623 -6028 2994
3769B994M814j3959O691P041j3029K665R513j1651j259J2554j0249l902J3156
$$ 2994 7808 -6151 540 7581 -5448 -2783 6730 -4921 -6180 6374 -3875 -7777 5379
3782E379p049p499J2792k808r871J2029R21j2860J0376M208j2950Q240P081j2625
$$ 5379 -1670 -9169 3623 815 -9056 2973 3894 -8966 1410 5618 -7332 908 7989 -4636
3796d636M161J0118j2129J137J1328j0987l506J4133q949o204J2472m192r275
$$ -4636 -475 9643 -2486 -1349 9979 -1008 -4514 9619 670 -5534 6938 2746 -6529
3809f529J1820j097j2642J0624J789j1893O791O431j3432N096R681j3459J974
$$ -6529 5291 4194 -8448 2176 3965 -7928 -1137 5294 -8138 -3042 6639 -6820 -4846
3822d846J0681j0261j480J3142r168n191J3249m567q656J3269k206r996J0599
$$ -4846 5835 -4426 -5906 7236 -1932 -7123 6126 1559 -7097 6172 3966 -6030 4569
3835D569J492j1818R049M266j2506O036P418j2971K854J0310j2831n35J2455j0820
$$ 4569 6061 -5757 3292 7558 -4948 1088 8506 -4465 -1611 8699 -4132 -4667 7788 -3032
3849c032l919J3402q342o782J3405m527r411J3013j809j0719J0657L120j2153
$$ -3032 -6951 6451 -1891 -8673 4732 205 -9206 3807 1998 -8721 1936 5056 -7097
3862g097P562O208j1515L656Q939j1125P44J1309j0989j203J2654q460n697J2631
$$ -7097 465 6673 -4842 -1186 7753 -3372 -2628 8681 -2308 -3511 9143 683 -5014 7617
3876G617m933r582J2640j776j0840J0684Q90j2667Q629M389j2698N592P463j2481
$$ 7617 2684 -6898 5742 3966 -6874 3810 4700 -7967 662 5051 -7647 -2055 5408 -7073
3890g073L059J0182j1887o24J2818r177m603J2940o129o236J2756l014r749J1572
$$ -7073 -4014 6168 -5719 -6343 6475 -2702 -7305 5635 -494 -6730 6026 3012 -6737 4835
3904D835L53j1985J1160K274j2488P880N898j2891M270Q653j1382m01J0669r017
$$ 4835 5188 -6797 4363 6637 -5851 2029 7927 -4964 -694 7959 -3423 -3824 6845 -2172
3918b172l347J2755q402o761J2059l782q818J1779j525j1622J1540K226j2164
$$ -2172 -5519 7236 -1166 -7927 4132 350 -8468 3311 1786 -9836 1704 3930 -8234
3931h234Q247N393j2305O009P224j1639K986J0865j0439q91J1561q809l492J1559
$$ -8234 13 5406 -6899 -890 6334 -5305 -2319 8546 -1893 -2784 8777 -32 -3524 8035
3945H035n815q136J2601k352j0759J1183P1j1469P919M076j2652O466O365j1968
$$ 8035 2220 -5916 6685 4333 -6426 4757 4828 -6641 1278 5354 -7298 -832 5533 -6435
3959f435K461J0015j1489n30J1348q767l316J2980p287o463J2028k770r757J1866
$$ -6435 -3974 6041 -5448 -5978 5370 -3397 -6713 6267 -1020 -7483 4545 1775 -7982 3884
3973C884L00j0325R518L022j2566P939N810j1458L097Q670j1192R75J0467r865
$$ 3884 4184 -6141 3377 6399 -6167 1772 7582 -3876 -779 7891 -3301 -2326 8141 -1724
3987a724k013J1174p525o552J2864n977p774J1457k757j0107J0988J222j1173
$$ -1724 -3737 7437 -88 -6640 6224 247 -7527 3930 1173 -8934 2054 3276 -7897
4000g897Q221M130j2236O292P188j1218K326J0405j0794n75J2280r060l889J2450
$$ -7897 324 4454 -7782 -1490 5698 -5520 -3194 7211 -3583 -4158 8122 -938 -4827 7623
4014G623o411o355J2411l478r074J0819o70j1094R033L419j2294O270N542j2066
$$ 7623 1212 -5143 7268 3790 -5284 5535 4865 -6229 2804 6223 -6071 199 5741 -6325
4028f325L568Q069j1212J128J0135q782l119J1657p056n639J2069m986p185J2234
$$ -6325 -2757 5312 -5900 -4772 5363 -3419 -6538 5119 -1937 -7576 4493 -493 -7678 4556
4042D556j786j0028J0626J749j1410Q232N696j2202M610Q024j0954K115R141r827
$$ 4556 2770 -7258 3368 5117 -6293 1939 7635 -4567 43 8067 -2887 -772 8369 -1458
4056a458r24J0430q099n182J1833o010p120J1024k838r355J0426o9j1638R895
$$ -1458 -2382 8048 -51 -5233 6600 590 -6530 4494 1656 -7699 2727 2658 -8980 915
4070I15K835j1148O332O132j1581K838R896j1014O04J0754r189k191J1834n883
$$ 915 3750 -7398 -1066 5066 -6515 -3677 6219 -4795 -4191 6563 -2626 -4817 7017 1134
4084A134o317J1962l593q474J0926j023j0907J0127K446j1931P179O577j2748
$$ 1134 -5183 6779 3186 -5288 5638 4615 -6292 3835 6281 -5650 1529 8106 -4642
4097d642K751Q579j1435J365Q996j0139p56J1254q899m584J1944m666p732J1365
$$ -4642 -1891 6688 -4747 -3382 5614 -4525 -5281 5973 -2926 -7510 4434 -232 -7964 3401
4111C401j916r215J0861P68j2011R473M634j1399N877P645j2824L434R741j1053
$$ 3401 1485 -7730 3131 3899 -8112 1361 5995 -5404 473 8118 -4706 -1272 8469 -2584
4125b584L84J0983q671n246J2248o993n876J1200l727q620J0863r32j0829R441
$$ -2584 -2200 8783 112 -5134 7114 121 -5755 5445 1718 -6902 3961 3029 -7800 1641
4139A641K657j1937O648O268j2109L772Q253j0641J678R876r582k433J2537o702
$$ 1641 4298 -7639 -991 5277 -6832 -3060 5193 -5448 -3770 6106 -3476 -5909 6628 -74
4153g4n951J1804m417p897J2356r24j0286J0353N48j0021O838M706j1910N044
$$ -74 -6025 5779 1362 -6535 5821 4897 -5389 4964 5512 -4509 2329 7035 -4875 169
4167A69O890j1184J616R577j0638j011J0943r040m206J1918o113p080J1717k086
$$ 169 7059 -4125 -2509 7068 -3570 -4581 6362 -2678 -6884 5034 -1079 -8159 3558 1472
4181A472r478J0290Q26j0906Q790L794j1433P294O047j1408L760Q474j0535M67
$$ 1472 -8006 2284 3110 -7796 994 4788 -6645 649 6696 -4712 -952 7522 -3013 -2546
4195b546J0896q677l323J1720o714p588J2096l673q422J0778j032j0522R208K108
$$ -2546 8350 -327 -3650 8070 1356 -6232 5864 2191 -6231 4547 3515 -7007 2201 4309
4209D309j1505P063M964j2000M770P878j1434N80J1185r151k799J1713o777m948
$$ 4309 -7196 -133 4831 -7169 -2399 5479 -5955 -5375 5810 -3341 -6140 5573 -1204 -6152
4223f152J1751m283q362J2006j693q889J0697P5j0732Q817L364j1273N199P065
$$ -6152 5599 1316 -7046 4960 3267 -5622 5075 5150 -5582 3235 6599 -4674 525 7590
4237G590j2123L326Q500j0104j197J0559q310m523J0893n465o942J2041m429p745
$$ 7590 -4533 -1207 7293 -2811 -4008 6551 -1759 -6282 4611 -854 -7796 4245 -184 -7929
4251g929J0813n7j0645Q777L209j1875P210O408j0908L445Q051j0092R20J0364
$$ -7929 2884 2827 -7818 959 4168 -7707 -497 5911 -4997 -1552 6499 -3593 -2673 7691
4265G691r528k171J1702o714m807J0405m867p292J1560k711r732R502J836j1611
$$ 7691 -1837 -4008 7694 980 -3827 6578 1711 -5581 5979 3268 -6464 3038 4874 -6737
4279f737Q121L492j1539M481P380j0982K275Q642r371p98J0675p691l029J0155
$$ -6737 1384 4876 -6663 -2182 5198 -5784 -3509 5133 -4238 -5036 5639 -2052 -5081 5074
4293E074n257n891R980j013r215R972M33j0677R293L885j1643O318O809j1147
$$ 5074 -183 -6074 3906 2893 -6322 3650 4083 -6594 2699 6584 -5059 1259 8068 -3079
4307c079J665R121j0722N07R643q795k740J0153n984o841J2010l999q420J0088
$$ -3079 -1414 7707 -3015 -2508 7135 -1660 -4400 5753 -231 -7072 4938 939 -7481 2607
4321B607j006j0455J0427J483j0419P037N523j1695N187P405j0790J537R507q096
$$ 2607 1601 -8854 1573 3056 -7363 -326 5197 -6498 -1311 6094 -4696 -3159 6348 -1748
4335a748j821J0247p023m045J2067n616p082J1438k846r616J0077Q43j0780P593
$$ -1748 -3569 6678 -345 -4390 7677 2061 -5021 6417 3571 -6045 4032 4875 -5905 1688
4349A688L998j2295O217N883j1131L546Q587j1207J12R384q128k437J0343n613
$$ 1688 5686 -6609 -392 5491 -5640 -2094 6493 -4714 -4602 4782 -3346 -5783 4560 -1053
4363a053n476J1091l798o743R872q53r282R470K870j0842O250N748j1285L593
$$ -1053 -6529 4562 764 -5979 3893 3040 -6242 3228 6098 -4744 1506 7254 -4031 -438
4377d38P754j0487N52J0262r127k044J0565p022n613J0851m943o969J0518j673
$$ -438 7316 -3171 -2619 7643 -1484 -3528 7037 15 -5598 5253 310 -6659 3859 2186
4391B186j0083R522J968j1086P404M552j0709M273P002j0293J890R139r265n94
$$ 2186 -7897 1625 3593 -7493 -89 4463 -6246 -1973 5029 -5264 -3374 5765 -3500 -4094
4405d094J0560p521l534J0962n583n605J0509l173q171J0044J45r750P714K644
$$ -4094 6466 -1055 -4589 6373 790 -4815 5694 2521 -5650 4394 4539 -5211 2503 5147
4419E147j0599N743N305j0695K749Q267r994n04R957q715k704J0263n857n785
$$ 5147 -5452 291 5596 -5099 -2350 5917 -4077 -4581 5376 -3339 -6043 4220 -1637 -7422
4433g422J1031l413o859J0346r08j0183R881L058j1843P857M687j0429M438O952
$$ -7422 3609 196 -6663 3683 2775 -7408 2473 5531 -6312 1545 6232 -4197 241 7193
4447G193j0245J346R076r341n14R341o060n465J0265m996n921Q968j504q448R102
$$ 7193 -3052 -1706 7370 -1971 -2485 6856 796 -4669 5596 600 -5321 3647 2143 -6305 2797
4462B797O00j1167Q299L325j0783N255P011j1335L237Q241r593k74J0324p583
$$ 2797 3397 -7770 529 3854 -6929 -1674 5337 -5998 -2761 5480 -4113 -4387 5937 -1646
4476a646l387J0973n229n790J1197k954q895J0015N71r697P779K839j0716O076
$$ -1646 -5033 5940 711 -5079 6118 3164 -5731 4284 4855 -4842 2937 5776 -4940 1136
4490A136N792j1269L289Q063j0884O30Q300q526k041R740n839n100J0156l467
$$ 1136 6928 -4341 -1052 7011 -3873 -3243 5057 -3469 -5510 4230 -1609 -6709 3447 -20
4504b0p186R809p68r097R192J335r489O670M611j0357M776P632j0967K653Q912
$$ -20 -7206 2603 1835 -7262 1930 3265 -6224 446 5057 -5300 -524 7108 -3859 -1206 7706
4519G706r160j018R369p087m057J0778n451o176J0258k948q030Q689N89j0374
$$ 7706 -1454 -2472 6897 -190 -4247 6531 1080 -5096 5162 2214 -5816 2873 3462 -6912
4533f912P901K457r825N323N877j0493K790Q239r972J304Q414p956k285J0375
$$ -6912 989 3446 -6379 -1056 4821 -5672 -2882 5357 -4615 -3311 5103 -2853 -5138 5237
4547E237n125n190J0870l027p758R146K53r673Q355K141r996O000M640j0104L720
$$ 5237 112 -5078 5792 2765 -4993 4153 4406 -5267 3088 5229 -4767 1233 5873 -4231 -511
4562e11O689r387N19R358r213k035J0224p207l957R826m959n646R148j702q685
$$ -511 6178 -3209 -2690 6668 -2545 -4580 5644 -1563 -5520 4306 -653 -6299 2849 1147 -7538
4577g538Q911K121r916P478L437j0413N820N642r192K585P944q722K0Q370o719
$$ -7538 1373 3494 -6422 1056 4493 -5920 -100 5542 -3650 -1065 6879 -1843 -1823 6547 -172
4592a72l711J0358n680n001R680l163p528Q939k84r512Q529K341j1337O278N003
$$ -172 -3883 6475 795 -4206 5474 2311 -5217 3722 3438 -6074 2455 4796 -6541 -263 4740
4607D740j0492L682O911r344l68R715q340j524R959n840m377R748l249p459J0347
$$ 4740 -5752 -2070 4841 -4503 -4871 4844 -3496 -5020 4939 -901 -5278 4470 1221 -6238 4109
4622D109j029q103R066K95r277O983M405j0857M992O528r706L85Q487q920p08
$$ 4109 3080 -5023 4043 4338 -4939 2044 6449 -4408 584 7112 -2594 -2209 6278 -2642 -3350
4637c350R108o771l678Q385m538n901R524j530q367R279K2r415P560L626j0090
$$ -3350 5758 -1013 -4691 3694 -844 -6745 2779 1249 -7118 2161 2183 -7232 328 3954 -6136
4652f136N388O327j0480L114P528q825k04J0189q214k113J0183o076m584R923
$$ -6136 -748 5579 -4901 -1787 5741 -3084 -3288 6901 -1313 -3426 6757 681 -3903 6020
4666F020l406o933Q909m87r683P751J526q650N358L779r222L975O008r766J228
$$ 6020 2614 -4319 4590 4103 -5580 2171 3697 -4953 405 4184 -5038 -1063 4945 -4821 -3593
4681c593Q562q553p60Q583n959l367R075l354o829R748q34q767Q247J833q894
$$ -3593 4969 -3584 -4344 4239 -1720 -5087 3988 634 -6195 3553 2719 -6048 2199 4032 -4862
4696d862O524M281r551M621N449r318K055P748r021r31R024o613l215Q140m096
$$ -4862 1662 5943 -3608 1013 6462 -2856 -801 6947 -2074 -3005 6019 -594 -3809 4331 235
4711B35n361Q761k968o657P571N39q978P378L126r646O268M102r572L845O746
$$ 235 -5126 3635 667 -5990 1581 2120 -6858 520 3646 -6000 268 4370 -5202 -1357 5389
4726E389r090J251Q212p194j738R447o117m077R317l493p000R572l30q505P894
$$ 5389 -3701 -2450 5762 -1432 -3170 6277 160 -3917 5400 1907 -5093 4479 4149 -4356 3538
4741C538Q75r502O892K144q653L989N889r547J766P638q041j737Q929n767m012
$$ 3538 4413 -5089 1803 3947 -4706 -717 5172 -4375 -2609 5029 -3012 -4749 4180 -1587 -5599
4756e599Q923l675n580R310k062o765P550R01q829P477L185r253M718N273q731
$$ -5599 3324 -351 -5931 3379 1317 -5448 2102 3003 -5826 1651 4836 -4417 301 5574 -3157
4771c157L573O299r252R06P608o929j906Q655o004m682R686l999o587Q893j69
$$ -3157 416 6715 -2537 -1631 5977 -952 -2858 5797 -207 -4889 4797 798 -5789 3104 2935
4786B935q810P206J177p881M900L717q308M108N334p938P25Q200p884j319Q753
$$ 2935 -5875 1331 2508 -5373 -473 3244 -5064 -956 4378 -3560 -2835 5365 -2519 -3838 4915
4801D915n770l110R707m337n893Q556j140p483Q017P15q670O572K688q422L621
$$ 4915 -855 -3965 5742 1405 -4488 4068 2928 -4555 3462 4177 -4493 2079 4767 -3655 -34
4816c4M766q261J554O995q462O2Q031o804l159Q856m130n530R508k629o647P583
$$ -34 4732 -3529 -1975 5020 -3442 -3380 4651 -2153 -5312 3544 -586 -6116 3392 763 -5884 1699
4832A699J027q494P211J988p720L999O044r391K891O052p084K16P154n833k168
$$ 1699 2726 -5768 1443 3431 -4289 -290 5754 -3637 -746 5306 -1778 -1562 5592 -241 -2409
4847b409Q553n435m600Q787l883o284Q520j453o711O986N3q121O068L384r123
$$ -2409 6144 709 -3891 4896 1013 -5271 3249 1796 -4915 2071 2124 -5997 71 3455 -5668
4862e668M154N721q964J135P594o642q68Q738o015k907Q617m181n078R186k102
$$ -5668 -1514 4207 -4757 -3622 3972 -2670 -3538 5200 -815 -3722 4895 714 -4364 4822 2720
4877B720o645P911j81p327N548L060q415M820L665q586K421N962p479o3P578o411
$$ 2720 -3925 3986 3805 -3522 2026 5086 -3329 1491 5156 -3430 -1009 4953 -2526 -2589 4989 -1422
4893a422k379P474m684m684P965j993n447P297m33o757O483J056p706M819M423
$$ -1422 -3801 3673 -1011 -5695 2270 277 -5170 2127 1694 -5063 1420 2476 -5230 -411 4012
4908D012p856L451O174q173J692P078q020m88P718n350l305Q087l247o536R060
$$ 4012 -3844 -393 5781 -2392 -700 6378 -1642 -2130 5588 238 -3067 5020 1773 -4763 4297
4923D297j875o736O832K29p571N738K703q933M280N153r020K392O380p192n02
$$ 4297 2422 -4314 2518 2747 -4824 914 3617 -5316 -1036 4117 -4903 -2511 3869 -3323 -3825
4938c825P955n935k344Q435m682m206P930j469o336P482J78o969N664K986q657
$$ -3825 4130 -1805 -4149 4286 -396 -4602 3328 1859 -4477 3005 3183 -3786 1878 4864 -3793
4953c793N358L500q220K714N979p696O44O053o434j394O873m038l996Q046l897
$$ -3793 1565 5065 -3155 -441 5538 -2158 -1514 4539 -1895 -3289 3584 -454 -4450 3596 -301
4968c01n395P378o99o927O783J786q068O502J690p155M100M813p274J302O320
$$ -301 -5696 1682 983 -5944 839 2625 -5443 1059 2749 -4406 -306 4507 -2767 -1465 4855
4983D855o690n48P936n415l674R020l860m738P110j875o726P028P13p771O019
$$ 4855 -1835 -2383 5553 138 -3536 5484 1624 -3114 3996 2121 -4605 2423 3136 -4635 1384
4998A384J583o683L192M098p881J936N981o980k72P034o307j262P948m473l384
$$ 1384 2967 -3716 -524 3574 -4307 -2371 3610 -3370 -3642 3392 -2915 -4177 3771 -702 -4086
5013d086P320k937n843Q066J95o659O153J409p511N202M016q371K693O146q155
$$ -4086 3234 297 -5546 2520 2715 -3944 2209 3618 -3893 1309 5325 -3046 -353 5793 -2362
5028b362J303O561o548j735P005m394l773P640l343n254P050n88p445O552Q94
$$ -2362 -1059 5502 -1046 -2781 4224 -170 -3943 3697 354 -4900 2150 1562 -5883 669 1563
5043A563o263M598L346p395K524N028p652K265O242o166p31P539o422j426P384
$$ 1563 -4700 -102 3244 -4151 -1627 3401 -4251 -1986 4256 -1910 -2641 4898 -1524 -2950 4434
5058D434l486l860P148j705n369N833q7o757N689J651p266L633M155p109J535
$$ 4434 948 -2912 4236 2531 -2838 2995 2908 -3849 1840 3491 -3775 -142 4013 -3096 -1561
5073a561N654p404N08N874n159k297P585m087m711P672j551n212O374k80n795
$$ -1561 4093 -3311 -2803 3071 -2088 -4385 3200 -887 -5598 2074 523 -4689 1685 1405 -4390
5088d390N788J663o854M731L620o860K686M861p014J231N430n607j917P198n001
$$ -4390 1398 3061 -3793 938 4558 -2302 384 5245 -1769 -538 4892 -715 -2632 4566 -435
5103d35k717P058l893l520O124n68o541N945K16p129N347K764o741K470M803o925
$$ -435 -3152 3906 13 -3507 2617 2049 -4492 1453 1669 -5460 -113 2651 -4090 -1620 3183 -3742
5119c742J715O048o822N99O224n503q13P027l542m524P835k726o118P564o73n807
$$ -3742 -2027 4021 -2801 -2202 4022 -1481 -2294 4733 1191 -3333 4502 1776 -4342 3222 2549 -3258
5135c258N647J647p416L550M396p857J436N625o866r7O204o036j466Q075m838
$$ -3258 2389 4036 -3380 170 4566 -3291 -1855 3770 -3096 -3193 3011 -3025 -4491 3584 -1254
5150a254k889O445k451m266O502l35o823O886J864p773N602K387p969M284M319
$$ -1254 -4143 2302 -149 -4415 2087 1752 -5071 1815 3679 -4094 1508 3895 -4074 210 4529
5165D529o883J520N519o366k39O305m305k205N957l733l570P200j963o184O719
$$ 4529 -2354 -834 4685 -1681 -1920 4385 80 -2125 3832 99 -3471 3729 1766 -4418 2301
5180B301m68o613N630J519o507L291L519o277J867M922o252o9N967m907m91N838
$$ 2301 1833 -4780 850 2369 -4138 -847 2672 -3605 -1738 3184 -3068 -3137 2830 -2077 -2568 3270
5196C270l352l207O431j636m843O613q96n710N706N59o387N038K749p051K599
$$ 3270 -82 -3289 3142 1506 -3337 3276 2380 -3330 2376 2935 -3452 1586 4335 -2716 -117
5211a17M252o443J374M739o015n23O093m174l649P023l056m410P335j790n728
$$ -117 4135 -2308 -934 3805 -2210 -2733 3360 -814 -4463 2560 -496 -4906 2429 639 -5089
5226e089N816J232o181M082L086o354L817L570p023J796N426n333o50O707n756
$$ -5089 727 1959 -4222 -140 2946 -3408 409 3979 -3044 -1248 4178 -1155 -1805 4902 -854
5241h54j393O698l449l996O563k241m245N697j086n900N459J410o449L242L373
$$ -854 -2247 4451 1002 -2994 3569 1328 -2917 2780 1694 -4206 1253 2663 -3786 -544 2829
5256B829o341J539N316o348O69N583m712k127O366l703k592N876r38m950O473
$$ 2829 -3512 -1973 3343 -3005 -2336 3247 -1465 -3592 2774 -929 -3521 2355 1417 -3533 2940
5271B940l77o366O134J205o010L977K260o274K724M309o471O04N488o003n17O033
$$ 2940 2563 -3803 2331 3536 -2474 1503 3763 -2511 213 4522 -1949 -1345 4143 -1860 -2377 3656
5287C656n071k167O784l688l930P153j973n972N959Q51o637N915J574o749M044
$$ 3656 -1415 -3582 3202 -486 -4416 2737 764 -5208 751 1602 -5035 880 2454 -4295 -251
5302b51K813n789K193N003n802M6O692n513j244N621l172k670O750k692n044O202
$$ -251 2562 -3227 -1034 3969 -1833 -1787 4905 -608 -1852 3769 597 -2073 4677 1985 -3059 3143
5318C143j164n870N964P29o846L720M638q084K895L661n572J98N825n842j836
$$ 3143 1979 -3891 2073 2802 -4044 -324 4314 -3770 -875 2786 -2786 -2588 3237 -2605 -4441
5333d441O800m427j722O552k650l437O310j785m886N478Q35n339L966K154n916
$$ -4441 2359 -2068 -3790 2762 112 -3325 2985 1200 -3686 1792 2627 -2712 1254 3408 -2508
5348b508K687M286o342J635M233n713m09O705m996j930O075l981l628O582j764
$$ -2508 179 4465 -1877 -242 3991 -1722 -2131 4574 -422 -2352 3723 -258 -3886 2696 932
5363I32n640O330m98n608N473M06n193L159L083m980J261M576o054J544M292l940
$$ 932 -4708 1622 1124 -4484 989 1395 -3798 -639 2444 -2536 -1275 3301 -2753 -1209 3083 -857
5379h57j259O103l075l187N525k173l673N837q56n435N494k49n742M335J756o013
$$ -857 -2116 3987 912 -2275 3250 1077 -2596 3241 2385 -3050 2444 2195 -3547 788 2544 -3469
5395c469L549L005o408J474M205n188j48O512n395j653O447k457m137N797r57
$$ -3469 80 3085 -3323 -1849 2356 -2832 -2980 3532 -1863 -3516 2931 474 -3663 2134 1177
5410A177n718P410m77n633M879J301n730K408M081n892J501M886o293M6O668m964
$$ 1177 -4541 2869 2392 -3241 1638 2939 -2791 -383 3698 -2194 -693 4193 -2100 -2054 4614 -350
5426c50k774O110k820l312O172j647m694M883j16n143M966L35n827K507L759n747
$$ -350 -3124 2986 166 -3146 3026 1379 -3315 1568 1452 -3691 1275 1610 -4217 -1710 2049 -3698
5442c698K703L448n397J127O055o171j5N416k767l334O400k192m324O563j743
$$ -3698 -995 2453 -2944 -1817 4238 -1933 -1948 3468 701 -2633 3767 1575 -2749 3814 2071
5457B071n258N678N70n695L335K414o126K027M328o496J791L937m742J0M287n008
$$ 2071 -3187 2491 3061 -2634 701 3115 -3011 -984 3344 -3152 -1361 2576 -2166 -2156 2131 -2877
5473b877q76N608l122l198O484k024l319N074l92n521O225J056o146M392K371
$$ -2877 -3753 1855 -1267 -4465 2019 -5 -3324 1750 1358 -4163 2062 3118 -3028 1364 3735
5488C735o092K903L440n519K86M551l681j412N487l547k358N585k653m381N566
$$ 3735 -2357 546 3986 -1533 -1247 3304 -377 -1789 3698 151 -2207 3378 725 -3656 1910
5503A910n88n106N171L98n861L898K507o163K866M034o652K065M717m202k037
$$ 1910 1322 -3784 1387 1785 -4076 -178 2329 -3834 -968 3066 -3586 -1521 3196 -1006 -3043
5518c043O776m444j737N701k367l061N563j639m825N289M62n275M346J479o376
$$ -3043 3733 -711 -2448 3253 886 -2175 3388 1749 -3076 2213 2675 -2600 1746 3225 -3151
5533c151L222L960o178J242M979o021J98M889m491j784N588l280k680N567j567
$$ -3151 71 4031 -2147 -905 4074 -1947 -1749 3140 -1351 -3135 2453 -827 -3507 2060 493
5548D93m351N564k53n086L724K381n858K815L478n768K537M436n196o82N790n101
$$ 493 -3858 1706 1453 -3633 91 2472 -3386 -571 2907 -2861 -324 4112 -1084 -1766 4024 -1077
5564a077n82N639l826k533O057k717l944N374j279m400M644M15n071L793J751
$$ -1077 -1659 3980 154 -2379 3678 961 -2983 2391 1112 -3288 1356 1771 -3300 493 2244
5579B244o195M120L018o722J470M578m896l14N705m139k082N771l100k422N796
$$ 2244 -3951 169 3187 -3535 -2065 2513 -2383 -2697 3008 -1131 -3213 2558 -542 -2964 2832
5594B832j221m389N820n94n291M440J907n938L202M281o858J285M487o005K16
$$ 2832 1611 -2778 3042 2448 -2843 1597 3504 -2434 768 5049 -1809 -524 3963 -2042 -1826
5609a826N414m843j443N024l083k736O305l415k903M844o04m776M145J437m502
$$ -1826 3588 -1255 -2698 2326 -757 -3493 2812 -603 -3506 1338 734 -4042 103 1540 -2962
5624b962K446L621n671K244L672n509J105M712m566p42M866l829j814N926k546
$$ -2962 -516 3105 -2566 -322 3350 -2159 -1054 3658 -908 -1650 3216 -613 -2427 3499 953
5639I53l361N496q93n505N559j036m436L284K104n986L471K899o009J706M194
$$ 953 -2408 3088 2195 -3310 2249 1213 -3223 61 2165 -3821 -350 2549 -3460 -1754 2440
5654B440m746p18N501m449j309O657m049l374O091j003m180N403o37n162M714
$$ 2440 -2306 -3024 2477 -1972 -3281 3376 -673 -4047 2044 1041 -3139 2264 1627 -3535 1179
5669A179J558n222M283J774o204L383L201n327J134L882m400p11N221m479k018
$$ 1179 2737 -2485 1798 3572 -2632 751 3952 -1375 -241 3641 -759 -1470 3751 -728 -2746
5684b746N358k992l040N084j107m320M470L39m973L838K210n648K521M266n776
$$ -2746 2612 -380 -3420 1664 557 -3763 707 1046 -3927 -89 2121 -3527 -1006 3260 -2516
5699b516J283M458n141J84N504m609j741O656k769l835N681k082l060M453k66
$$ -2516 -1233 3225 -1916 -1732 3772 -837 -2578 4078 1309 -2526 3155 1073 -1987 2466 2200
5714B200m673L337J632o028L237K605n067J379M353n769k74N624m983o59O277
$$ 2200 -2473 864 2496 -3532 -295 2310 -2757 -1378 2975 -2794 -3068 2556 -2427 -3086 3191
5729C191l944l583O438j954k980N596p01m928M181K309o234L851K224n448K376
$$ 3191 -753 -4336 2102 148 -2832 2764 2063 -2865 1316 3625 -2609 1242 3466 -1982 394
5744C94L378n074J009M189m341j370N538l662k020M777k386l383N336j657n164
$$ 394 3772 -1302 -293 3896 -445 -1815 3723 61 -1959 2818 432 -2951 2385 728 -4436
5759d436N705n64n147M353J166m103J876M278o516J739N160n146n16N247l925
$$ -4436 1269 705 -4442 -89 1077 -3026 -1150 3128 -3388 -1649 3511 -1635 -2151 3096 -829
5774h29j357N507k749k705N549k015m362O043j029m706M902M13n316K946L061
$$ -829 -2186 3321 572 -2133 3416 1401 -2961 3082 2053 -2653 2249 2662 -2654 292 3353
5789C353o189L094L608o419J244M138m601q26N946l734k585O172l335l069N269
$$ 3353 -2836 258 3866 -2553 -1309 2829 -1772 -2598 3348 -386 -2971 3201 -134 -3203 2066
5804B066j386m502N340Q85n921L937K700n795L190L190n189L49M868m137q28M781
$$ 2066 680 -3822 1518 2403 -3518 419 3119 -2676 514 3704 -1485 -1136 3732 -405 -1233 3548
5820C548m816j371O044k746k924N160k192m097M782l43m372M027R56n248K677
$$ 3548 -1268 -2639 3405 659 -2265 2895 703 -3394 1388 1045 -3327 700 1656 -3592 -915
5835i15K509m599P50N158m944K81M840m734o86N612l335k860O641l113l402M944
$$ -915 1594 -3005 -2255 2903 -2041 -1760 3080 -1654 -2340 3272 -63 -2923 3718 605 -2797 2147
5851B147M80m390M081K10n646L802K157n313K028L660n655P24N283n625q41N686
$$ 2147 2627 -1763 2318 2528 -3118 684 2841 -2472 -444 3216 -2439 -1715 3568 -2057 -2898 2788
5867B788m202j955M934k299l246N591j301m245N009N76n083M228R23m915L265
$$ 2788 -1414 -3369 1565 -734 -3980 1611 310 -3935 1074 1650 -3433 795 1718 -3197 68
5882F8K939m916J676L699m672l65N544m268j054M511k740k982N608j297m534M877
$$ 68 3007 -1909 -233 3466 -1206 -1571 3973 -295 -1349 3162 422 -2560 3048 1751 -2783 2094
5898B094k06n634N029M94m983L229J612m342J576L890n359L21N100m388o16M887
$$ 2094 1888 -3746 1283 1777 -3206 23 1635 -2707 -1131 2759 -2600 -2279 2821 -1567 -2183 2704
5914B704l600k281N757j591m137N976j032m173L638P33m565L910J774n370K818
$$ 2704 -896 -3177 2580 989 -3148 2828 1796 -2377 1261 1994 -2571 1339 3113 -2257 561
5929E61K472m293L01M451m896m89M700l208k578N246k806k541M940k646l463N433
$$ 561 3033 -1260 -959 3492 -1404 -1893 2807 -401 -2979 2267 -539 -3080 1860 -786 -4249 1184
5945A184J35m484L642J310m747L285K403m962J355M228m939J88M976l590k328
$$ 1184 1319 -3165 477 1787 -2960 325 2728 -2234 -879 3349 -1590 -1402 3574 -16 -2344
5960b344N700k866k081N456k614l321M175k31m889L787J250n046L221J970n290
$$ -2344 3356 490 -1591 3865 1251 -2070 2105 1874 -3015 772 2022 -3024 197 2167 -3123
5975c123L121K948n180N8M658m027p51M881l296k006N377k828k701N825j483m768
$$ -3123 -2 2946 -2234 -2176 2482 -1545 -2296 2585 -711 -2717 2660 -168 -2869 2956 1473 -3295
5991c295N034K48m351M265J064m727K527K822n234J759L643m033j713M852m068
$$ -3295 1739 1987 -2364 1901 2965 -1762 765 3587 -1647 112 3755 -278 -1991 2861 -1207
6006a207q02M734l051l489O012k211l771M816m25l655K792J922m459K660K642
$$ -1207 -2009 2725 -326 -3815 2197 -14 -3785 1031 606 -3049 -257 1665 -2794 -134 2508
6021B508n493J874L926m704J027L994l851o39M163k499k435N251j772l688M842
$$ 2508 -2985 -1111 2815 -1889 -862 3132 -719 -1358 2805 306 -2129 3122 1350 -2338 2504
6036B504p30m351M440Q1m532K957K412n056J123M001n608J396L785m729l34N019
$$ 2504 1774 -2577 1863 1944 -2588 369 2781 -2275 -1152 2849 -2759 -1363 2422 -2307 -2641 2378
6052B378l367k186N170l099k082N206j188m552N304j53m040L547J707m719K418
$$ 2378 -989 -3175 1995 -1104 -3186 2020 832 -3720 1584 1431 -2609 938 2645 -2074 344
6067C44L270n005P00L859m936N54M682l707k071N518l240k286M980k626k957M467
$$ 344 3614 -1391 -691 3168 -1768 -1214 3468 -239 -2310 3208 -32 -2318 2662 36 -2921 1546
6083A546k55n625M935J251n046L031K702n662K525K843m231Q13M520n066L15M158
$$ 1546 1291 -4334 601 1852 -3194 -163 2539 -3123 -598 2245 -1986 -1173 3347 -1719 -1404 2754
6099B754l190j589M794j861l169M439n09m023L312J231l980K891J046m834K706
$$ 2754 -436 -2025 2769 908 -2261 2178 1669 -2354 958 2189 -1791 1100 2146 -2688 18
6114A8K913n361J390L334n174J081M060l353j909M603k215k274N504k071l751
$$ 18 2931 -2430 -1040 2294 -2880 -1799 2261 -1092 -3001 1602 -613 -2887 2617 546 -3205
6129c205M352J2m035L654J738m414L460Q82m613K000M033n130M14M705m278j321
$$ -3205 1147 1159 -2876 778 2516 -1898 1562 2444 -2169 -169 3864 -1266 -852 3853 -425 -1746
6145a746N446l927j927N546l097k764M172q45l903L397P72m386L525K285n304
$$ -1746 3700 -227 -2154 3392 295 -2469 1703 858 -3045 352 1124 -3262 263 2548 -2756
6160b756J563L134l710Q28L527m100J22M022l759o70M661k640k744N412j558l474
$$ -2756 -1193 1941 -1769 -941 2586 -1514 -1392 2630 -1129 -1799 2862 222 -2522 2890 1332 -2142
6176b142M532j309k916K996J322m153K114K599n184J274L550m724M15M360m215
$$ -2142 2390 1081 -1835 1161 2483 -1670 444 3043 -2141 -867 2683 -2041 -1626 2734 -1481
6191a481j331N460l752j811M921k355l045M757r73l408L427O26l835K687K400
$$ -1481 -2812 2648 -1104 -2915 2006 -349 -3394 1363 390 -3018 409 1035 -2800 -113 2287
6206B287l980J104L200l282o88M936m185r99M787l081k034M681k209l094N007
$$ 2287 -1693 -589 2611 -671 -1359 3577 -608 -1607 3180 99 -1935 2746 537 -2557 2450
6221B450j330l616L471N48m765K965K129m997J884L182l873J98M059m303j92M928
$$ 2450 1120 -2496 975 1523 -3242 -277 1852 -3145 -1261 1921 -1952 -1754 2305 -1998 -2190 2738
6237B738l648j696M803k116k534M560j074k676L150l0m166M197J088n468L314
$$ 2738 -910 -2606 2197 81 -2453 2107 1033 -1643 1507 1477 -2689 1508 2596 -2872 442
6252D42K349n064J591L878n289J020L965m187p18M522l331j874M685j724k959
$$ 442 2791 -2273 -682 3196 -2093 -1073 2892 -1295 -2013 2509 -822 -2696 1989 265 -2694
6267b694M080q23l818M018P76l651K519J972n213L055K703m409J174L226l301
$$ -2694 1386 563 -3255 763 1539 -2112 407 2379 -2834 221 2924 -1485 -311 2915 -386
6282c86n96M430l734j317M259k180j614L815j605l401M307q16l722L438J014m840
$$ -386 -982 3448 -286 -1603 2656 476 -1138 2677 1072 -2329 1978 1162 -2560 878 1892 -2948
6298b948K526K463m993J817L153m418L19M029l133p76L963k718j605M564j547
$$ -2948 -422 2041 -2952 -1135 2018 -2400 -2081 1948 -1185 -1961 2002 -716 -2321 2243 696
6313F96l954N319o84l119K215J344l426J935K959m961J838K997m762K84L592k985
$$ 696 -3258 2061 1377 -1742 473 1817 -1609 326 3285 -1676 162 3159 -1603 -1319 2273 -712
6329g12j146M511k874k406M273j843l046M977j068l911M661j49m392L119R93l262
$$ -712 -1858 2653 -221 -2627 1646 -197 -3243 1734 666 -3245 1416 1267 -3125 -6 987 -2275
6345b275K014K721m225P73L500l231n18M235l313j043L838j735k933M907j859
$$ -2275 -261 2460 -1765 -992 2508 -723 -1241 2994 -319 -1362 2476 741 -2192 2715 856
6360H56k324L562O3m679L348R65m252K875J512m823J864L180l703L31K953l467
$$ 856 -1468 2094 2157 -2522 826 1791 -2461 414 1926 -2897 -1033 2147 -1556 -1225 1728 -1739
6376a739n87L772k211j644M634k263k529M429o91m630M633L77l505K524J957m074
$$ -1739 -2326 1446 -765 -2409 2225 -38 -2567 1862 1171 -3459 1174 1551 -1954 570 2527 -1547
6392a547J919K595m739J433L836l935r69M466l708j173M299k860j569L694q99
$$ -1547 372 2967 -1772 -339 3497 -438 -1407 3059 -649 -1822 2477 -383 -1952 1742 843
6407H43l419L281J49m324M499K52m523L112J580l177J350K541l221p82M714l075
$$ 843 -2576 705 854 -3470 1029 1281 -3242 -130 1450 -1727 -377 2164 -1057 -1839 2875 -200
6423b00j828M949j544l508M514j699k716L601M56m777M210J044l940J397J767
$$ -200 -2028 2921 1377 -2131 2383 684 -2032 1569 2025 -2752 1458 2502 -1438 -41 1726
6438A726l852J783K264l866K44L834l943m57M173k584k076M408j178l802M508
$$ 1726 -2126 -343 1921 -1945 -1701 2133 -1810 -2267 1906 -678 -2754 1654 476 -3326 1182
6453A182j79l534L437J359n335M128J084m338K322K469m525J188L561m030K97
$$ 1182 1003 -2531 906 2265 -3070 1058 2142 -2196 126 2595 -1930 -742 2819 -1211 -914
6468i14L708k298j616L646j513k871L517j298k335K825R0l670K730J472m423K315
$$ -914 2794 496 -1120 2526 1013 -1858 1659 361 -1974 851 941 -2729 1 1473 -2950 -635
6484f35K216m160J846K465l550M00K959k655q32M042j485j930L622j991k161L769
$$ -635 1581 -2579 -733 1732 -1818 -1418 1541 -1114 -1946 2096 611 -1319 2303 312 -1849 1920
6500A920o27l215L692n35l120K726J307m286J928L287m779J074K947l515k65L252
$$ 1920 1293 -1922 1770 1235 -1885 841 2148 -2138 -210 3077 -1702 -628 2319 -1196 -1461 1791
6516A791k617j528L437j367k521M034m13l796L384L29k556K784J698m705J831
$$ 1791 -826 -2354 1083 -284 -2805 1229 816 -2980 404 733 -1823 961 2659 -2046 -215
6531b15K505l521J305K472l580J171L057l901j527N009l057k033M403r81l328
$$ -215 2290 -1231 74 2546 -1034 137 3194 -707 -2234 2775 -282 -2315 2088 1107 -2221
6546b221K987ol217L102N19l211J233K139l710J440K257k774n27M628m376k13
$$ -2221 766 760 -2457 645 1164 -2047 -814 1325 -2385 -945 1312 -1462 -1989 2639 -1737 -1950
6562a950L851k188j795M278j758k011L272J31l939M032K39l605K525R24l343J615
$$ -1950 1901 -287 -2082 2196 438 -1573 1699 1830 -2109 1923 2162 -1443 1082 2006 -1337 278
6578B78J941l211Q9L118l443n36M595l450j331L447j768j933L499j387k594M627
$$ 278 2219 -992 -903 2215 -1228 -1764 2831 -619 -1950 1497 -271 -2204 1295 -92 -2686 1941
6594A941j281l617L269J273l758J965K958m065L16K934k617Q8L320l280p19L298
$$ 1941 660 -2957 312 1585 -2173 -208 2750 -1315 -999 1935 -682 -594 2726 -554 -1273 2025
6610B025j481j349K674q58k448K915m50l164L129J147m054J778J696l610J017
$$ 2025 544 -805 1869 1011 -1437 1478 1028 -2136 993 2140 -1914 -136 1560 -2050 -1033
6625a033K660m087O38L592k954l86L726k752k135M287j004l548M211q0l605L449
$$ -1033 1627 -2460 -1822 1770 -1184 -1570 2156 -596 -2731 1556 552 -2996 1215 1135 -2470 979
6641I79K21l410L686L17l104J672K799l917j92K644k980J25L520k473o24K573
$$ 979 1200 -2210 1476 1793 -1311 361 3160 -757 -949 1695 -1285 -1160 2360 -113 -737 1836
6657A836j308k304K331o4l002L071j45l333L166J468m608K921J684k852q1L041
$$ 1836 528 -1776 555 491 -2511 560 415 -2918 248 1716 -2892 29 1713 -1139 -1220 1821
6673A821k485J58L527l510p06L690l141p09L231j310k685L058L3l573M148J5l494
$$ 1821 -664 -506 3021 -489 -1195 2495 -646 -1355 1876 566 -2119 939 972 -2601 1547 1562 -1932
6690a932K871J425l828J154J917l166O79K758l371K9L389l172m68L549k586j977
$$ -1932 939 2364 -1464 -310 1607 -1559 -880 1878 -1493 -1464 1925 -1247 -1715 1834 -752 -2729
6706b729N129k533j307K248L38l188L124J104m052K171K326l786O75K729l093
$$ -2729 2400 -133 -1440 808 1146 -2042 1082 2186 -1866 305 2631 -1155 -480 2249 -844
6721h44J02K558l117k22L069k600j686M703j517k913L236M3l276L004O98l936
$$ -844 -742 1816 -1301 -1523 1546 -1054 -2740 1963 446 -2467 769 812 -2464 540 1238 -2698
6737b698K929Q25l045J713K648l655P73K516l168l51L800k253r73L168j447k305
$$ -2698 231 1056 -1989 -276 2372 -1283 -510 2006 -1162 -1513 2287 34 -939 2229 782 -1523
6753a523K909p64k491L349M95m122K373J760l732J521J815k755o01L709l408j50
$$ -1523 1386 622 -1869 1480 1975 -2147 226 1986 -1746 -225 1590 -1165 -1766 1943 -1465 -1615
6769a615L334k479l31K813k148j704L260n78k826K988J25l326L423R04l692K096
$$ -1615 1719 -760 -1091 1722 -426 -2130 1130 552 -2274 714 839 -2487 936 1840 -1852 244
6785B44J850l806J645K098k695k49K787j915j500L443k247m89K352j240k058K947
$$ 244 2094 -1712 -67 2031 -664 -913 1874 -41 -1541 1902 -345 -834 1518 278 -1780 1167
6801A167j35l237K321Q11l649K588J534l532J265K576m519J449K592k215K11K729
$$ 1167 1032 -2205 116 927 -2722 -134 1400 -2132 -867 1709 -2810 -1361 1231 -984 -773 1956
6817A956j715j759L562j342k449L536p43k430L488n21l659K932N37l021K224J099
$$ 1956 241 -1518 2044 702 -1747 1789 1046 -1384 2104 1583 -2076 856 1393 -1628 596 1695
6833A695l363L97K790k751k12K690j280j647K998j621j846K953o29k601K235R46
$$ 1695 -1668 -1271 1519 -1232 -1444 1246 -34 -1681 1317 -304 -2150 803 174 -2427 -192 754
6849G54k391J996J176k731J077K374l728J394K803m014R92K226k176j146M057
$$ 754 -1637 359 1535 -1196 -119 2255 -1473 -79 2724 -1290 -298 1928 -248 -1394 2663
6864B663l142j226M108j427j904J366Q86l427K736L88l106K437J012l175J397
$$ 2663 -479 -1705 2403 976 -928 438 1324 -2103 633 1021 -2085 352 1364 -1811 -414
6879d14K287m068J352K611k353o64L306k837l02K679n37k949M096j032l006M141
$$ -414 1873 -2195 -843 1768 -585 -1249 2057 -780 -1082 1597 1060 -1889 2207 1175 -1831 2310
6895B310j413k607L494N70m404K418J350l103J432K185l374k66K834j887j525
$$ 2310 897 -1710 1784 2354 -2050 368 1718 -1385 47 2232 -1142 -1408 1426 -461 -1986
6910a986L399j988j018K739r73j806J824O31l250K306J062k742K151J826m122
$$ -1986 1413 -575 -1593 1146 173 -1633 191 822 -2428 -122 940 -1802 349 2175 -1947
6925a947J075K142k403J042K350k495M25L160l026j838M332j674k882K694l5k618
$$ -1947 -872 1270 -1133 -91 2259 -236 189 3349 323 -1515 2817 1143 -1739 955 920 -1698
6941a698K326M6k897K630Q43l507J971K047l605J326K210l351K58L220k174j884
$$ -1698 628 674 -2223 407 1250 -2257 -286 1761 -1844 -518 1692 -1659 -1401 1819 -355 -2239
6957b239L125p49j629L186r09k573L314K09l348K041J001k642J659J755l898J269
$$ -2239 886 137 -1492 1694 785 -1788 1526 1735 -1613 428 1429 -1213 446 2201 -1697 -428
6973d28K284l486R11L372l640l88L670k644j364L266j640k242L311r20k336K800
$$ -428 1856 -1630 -719 2653 -987 -1375 2295 -349 -1713 1553 -87 -2329 982 62 -2274 526
6989E26Q46l468J929J446l664K000J933l356J222K349k088L9K204j098k557M740
$$ 526 1372 -2096 -167 1279 -2385 -385 1548 -1808 -586 1763 -325 -286 1918 820 -1737 3003
7005C003k682j632L090m12k540K617p32k194K094O84l000J414J332k624O69K371
$$ 3003 321 -1311 1779 1367 -1173 1444 712 -1482 612 1296 -1704 -290 1042 -1582 -913 1458
7021A458k394l93K501j583j385L517k210j943L972j037k397K760K36k842L168
$$ 1458 -936 -1329 1172 -411 -1796 1721 -489 -2432 1540 503 -1894 866 1102 -1740 1428
7036A428K06l231K131J313l534K374R16k491M47K597l115O38J987j947j525L307
$$ 1428 1634 -1597 534 1847 -1687 687 1603 -888 -441 2156 -959 -321 1666 -281 -1806 1501
7052A501j251j765K819j448j882K291P09k786K204R72l237J701R79k072J041K245
$$ 1501 250 -1515 1304 -144 -2026 265 974 -1812 392 1364 -1873 -172 807 -1265 -224 2021
7068B021l172k4K878j955m15K346j073j926L345r20l375L212M23k625K651Q46
$$ 2021 -1151 -1175 1703 -252 -667 1679 606 -1320 2025 1105 -2270 942 1365 -1260 1391 2237
7084B237l473J114K459l523J142K229l094J44K486l996O74K702j783r66K276j244
$$ 2237 -1236 -122 2337 -1186 -44 2185 -909 -765 1721 -2275 -1601 1101 -682 -1648 628 -616
7100f16j738L455o43k623K694J251k700L96K417l314K167J507l241L81K741l174
$$ -616 -2354 1101 458 -2165 529 1780 -920 -524 1893 -1421 746 2253 -988 -607 2134 -1040
7116a040R90K141k594m0K038j409j484L084r03l160L042O05l094K165K61k855
$$ -1040 -50 2091 -503 -543 1495 86 -1398 1686 783 -2377 665 1270 -1824 341 602 -2253
7132b253K207R07k212P89K503l658N62L580k920j86K770j505j961L381j378k101
$$ -2253 -46 861 -1351 -562 1941 -1717 -1155 2425 -495 -681 2089 584 -1377 2004 626 -1475
7148a475L095m77l113L286l52k621J984P99k786J506J487k838O16L282l357l80
$$ -1475 1620 1143 -1970 1316 964 -1657 327 1126 -1660 -154 1333 -1505 -889 2393 -964 -1344
7164a344K735j979j003K667j442j766L477q06k882K726P43k463J899Q97k782K25
$$ -1344 1391 -588 -1591 1076 -366 -2132 1345 539 -2343 383 1126 -1337 562 1459 -1323 -1098
7180a098K980k511N82J978k671PL051k603j113K701j299k312M195j183k929K450
$$ -1098 1882 -629 -47 1931 -740 -733 2318 -285 -1398 1303 4 -2308 1887 704 -2225 225
7196B25N49k685K337J27k338J402J854k786O96K348l623J763J427k262r45L645
$$ 225 774 -1911 426 553 -1785 -383 1471 -1315 -619 1729 -1894 -131 1296 -966 -1911 1734
7212A734k034j166L310j574j550K078n9j783K270M92l655K180K041l487J322J057
$$ 1734 -300 -1466 1844 270 -1280 798 739 -1044 1226 1718 -1937 243 2284 -1203 119 1176
7228A176k401K3K724k694n35K524j340r82K656k113m63K623n30k956L082n15j586
$$ 1176 -1225 -1202 1522 -1172 -1707 817 -523 -1505 1151 -962 -1425 1198 668 -2288 794 279 -1307
7245a307J368J226l820K287K222l261J501J648k278l36K706j656m50K989k231
$$ -1307 61 1287 -2533 -246 1976 -1285 216 1864 -414 -750 1956 300 -150 2839 608
7260F08j715K515l84k316K327M64l765K802K14k404J401J706l143O25K858l164
$$ 608 -1107 1408 1024 -1292 1035 1499 -2266 536 750 -1654 -253 1453 -1690 -1065 1793 -1371
7276a371J58L075k995J30K562k350j335L946j859j301J727l16j444K686K45l292
$$ -1371 -1213 1862 -1133 -1003 1559 -791 -2126 1820 -39 -1340 387 71 -1373 1313 1558 -1734
7292a734K885M04k839J343K113l503R96K719l049k14K715k561o34L097k358j448
$$ -1734 1151 1555 -1284 59 2172 -1331 -335 2384 -665 -879 1836 -725 -1359 1738 -620 -2068
7308b068K909l30k565K539p3l225K630O32k273J222J755k294Q34J894k864N11
$$ -2068 841 511 -2054 485 412 -2813 -183 449 -1824 -602 1153 -1141 -307 1587 -1277 -766
7324g66K626k352r88L100j413j333K953j157j980J853J021l167J923O7k471J856
$$ -766 1860 -492 -1480 1620 207 -1126 1827 670 -1310 543 1564 -1603 320 387 -2084 -228
7340b28J134k250J164J069k189P26K635l633k51L355j958j241L018j480j974L265
$$ -228 906 -1344 -180 889 -1300 -574 2061 -1572 -1823 1532 -426 -1667 1351 -129 -2103 1162
7356A162j140j356K469Q47l390J805J206k495R89J767k928O61K530k280q1J922
$$ 1162 22 -1334 1135 1982 -1408 397 1603 -892 97 1864 -1064 -403 2127 -153 -234 1688
7372A688k281o77K787j654j593L247j394k515L285o64k434K315M23k872K369J334
$$ 1688 -593 -1270 1517 -137 -1730 1517 123 -2392 893 229 -2205 110 533 -2339 30 1364
7388A364l281J449K079k756L49K407k379K03K644k273q47K429j175j565L022q59
$$ 1364 -1917 -468 1611 -1145 -796 1611 -768 -565 2079 -194 -1041 1388 213 -1352 1670 811
7404H11k453K637O50l194J643J684l368J294J962l708R95K736l037L95K520j693
$$ 811 -1642 995 1645 -1549 94 1778 -1590 -296 1666 -2042 -1047 1689 -1348 -953 1567 -126
7420a26j066J864j364j036L186p63k579K801M04k433J215R22k064K164R85l409
$$ -126 -1192 672 -692 -1728 1458 695 -1884 917 1321 -1112 103 1025 -1039 1125 2110 -1299
7436a299J429K151k266m97J773k183m70L505k040j405K612j014k582K863K66k677
$$ -1299 130 2281 15 -482 1291 -892 -1362 2143 103 -1302 1310 296 -2286 577 843 -1834
7452a834K065J086l148J844P38k587J235J892k462r5L300k379m13K677k129j001
$$ -1834 231 1317 -1831 13 751 -1836 -601 1291 -1171 -1266 2034 -345 -758 1919 -210 -1211
7468a211L635j701j974L042l57l034L118o52j873J150J766k937J300J134j819
$$ -1211 2424 723 -1251 1791 1434 -1600 1518 866 -1007 143 1909 -1028 272 1406 -413
7483d13R5J815k718m03K505k380J48K494k147p59K421n81j223J915j05k738K703
$$ -413 -318 1497 -1221 -1624 881 -1499 -1351 1143 -1004 -1763 658 77 -1146 769 664 -2074 629
7500F29L12k626J972J316k301J541J134l014N84K576k941k04K795k382j57K294
$$ 629 941 -1685 287 1603 -698 843 1977 -1037 -453 2123 -818 -1022 1773 -609 -766 1528
7516A528j151k510L305n19l104L051J17k513J264J681k464J328J569k292m76K322
$$ 1528 377 -2133 1172 653 -2451 600 717 -1796 -532 1149 -1315 13 1582 -710 -1186 1136
7532A136k188J64K722k004k38K130j204j620K235j04k258K349J17k722J941Q09
$$ 1136 -1052 -888 1834 -170 -408 1722 518 -1102 1133 1029 -1229 1120 1237 -1485 456 1265
7548A265j875R78J306k998J802J915l398J78K287j908n64J901j496p91K184j456
$$ 1265 -610 368 1674 -1324 478 2393 -1005 -827 1460 -448 -1012 889 -607 -1398 786 -670
7564f70j477K262L67k469K899k91k623K135J175k678J253J725k886J175K302l035
$$ -670 -2147 115 482 -1987 912 621 -2002 133 1308 -1370 -117 1608 -1278 -103 2199 -836
7580h36J56K354j564j44J291j040j696L026n79k738K036J033l103J645L36j805
$$ -836 -680 1674 110 -34 1257 217 -1479 1547 968 -1770 266 1299 -1804 -159 177 -1628
7596a628J301J824k430R19J169k336M80J852j624j313K718j144j202K386l21k101
$$ -1628 -327 1497 -933 -14 1155 -1181 -701 1151 -473 -1786 932 -212 -1414 972 651 -1450
7612a450K940j109j505J958M78k463J701Q12k612K084P18j951j55K481k461o39
$$ -1450 1490 381 -1124 834 1312 -1151 550 1362 -1250 834 1552 -399 -554 1927 -534 -1173
7628a173L197k108j524K777o39k327L393q42k643K153P08k884K185J62j811J612
$$ -1173 2024 -84 -1608 1169 530 -1797 1596 754 -1889 264 972 -1912 273 435 -1376 236
7644B36O71k266P08K601k717N12K578l029oK734j774j579K630j98k490K438O5
$$ 236 907 -1359 -651 1950 -767 -255 2323 -706 -712 2022 248 -1331 1299 1101 -1389 1049 1114
7661A114k967K700j19k290J555J445k951J139J859l379J375K416l339m22K453
$$ 1114 -1853 847 728 -1562 -7 1438 -1513 -374 1485 -1894 -519 1897 -1442 -1864 589
7676E89j257j039K429k69j723K065K33k086J100J180k426K091N35k723J227K546
$$ 589 -668 -1707 722 453 -1270 795 1028 -1058 42 1222 -1204 887 1422 -1301 -74 2472
7692B472l557P00K400k657k95J441p81j906L679j832j525K685k03k607K844l08
$$ 2472 -1085 -385 2015 -642 -937 504 -277 -2183 1496 -336 -1861 824 621 -1986 858 550
7708E50k718K364Q79k273R67R54k128J124J351j614L45K109j917j192L920k753
$$ 550 -2168 196 1075 -1198 -231 723 -1405 -281 1070 -544 -199 1910 -7 -1199 2721 -32
7724c2j604L459o85k242J515M0j831K705m26k375J963O66k920J646R89k524O66
$$ -32 -1636 1823 1138 -1104 411 451 -1380 1325 899 -1476 487 1153 -1767 -121 868 -1656 -990
7741i90K179j700n85K907k399o79K420o04k048J995o01j596J803K25j241J428
$$ -990 1189 -511 -1096 1811 -588 -1267 1153 549 -1499 496 -105 -1701 102 327 -914 514
7757E14J409k562O85J737k480Q83J672k267l72K029k107m79K014j182k80J779
$$ 514 1923 -639 46 1783 -697 186 1858 -409 -781 1248 -859 -1338 676 -506 -786 993
7773I93q80j826K563o36j155J226P87k846J576R99j973L52J961k552M04K324j510
$$ 993 113 -1713 850 214 -941 285 1072 -1774 -198 801 -1172 -820 1141 -1411 -1007 1317 -193
7790a93o19J776j391n92J899o15k010K766L76k486K248J91k050J444J379l146
$$ -193 -812 964 -427 -1019 880 265 -1745 1021 1397 -1089 1159 1350 -700 744 2123 -1023
7806a023J327J185k395J29J878j339j025J795j507j305L786r58k194K537m92k293
$$ -1023 304 1489 -906 -777 1101 -238 -1263 532 -975 -2280 1506 548 -1646 891 399 -1894
7822a894K055Q89k844J522J436k312J487J176k218K10K195j760k01J980k071J90
$$ -1894 161 1050 -1794 -272 1164 -1148 339 1515 -703 -493 1702 -58 -259 1721 -350 -160
7838a60J853j580j302K231n55k010K629l97k143J786O43k381P99J602k314J070
$$ -160 1693 113 -1189 1042 487 -1523 1106 709 -1434 352 995 -1386 -587 1015 -1299 -229
7854b29J564k413J49J691j431j35J867r99j144K222q59j359J922K43j951J898
$$ -229 1335 -1078 -929 762 -669 -804 1063 64 -1080 1142 283 -1076 846 1089 -862 1036
7870A036J18k981K257R00k300P53Q89j246j99K934l104j05J975k135j84K233j491
$$ 1036 1154 -1827 430 1330 -970 -217 672 -574 -773 2161 -943 -1048 927 -1208 -1392 841 -650
7887f50l49K238j192j770K149K78j883J333J344k481Q52J180k098N87K223k822
$$ -650 -999 1239 47 -1723 426 704 -1179 154 1498 -983 -131 1049 -1049 -462 1761 -1061
7903a061R3K155q01j280K445j581j206K498q77p41Q95k00k327K480j23j841J949
$$ -1061 -968 1187 386 -894 1551 -30 -1236 1262 385 -356 539 339 -1988 492 369 -1472 477
7920D77Q23k437L22J633j596N00J223k020M3K562j969n43K526p55k012K467l84
$$ 477 1300 -1137 -815 818 -778 -278 945 -1075 -1032 1530 -439 -982 1544 789 -1223 1244 860
7937H60k355K265l77j077J288M87k076Q56J693l028P59K266k765R53J121j097
$$ 860 -1495 770 393 -684 604 1091 -985 -129 1564 -1464 -705 1561 -1204 -251 870 -227
7953b27l94J448j130o15J395m06j105J919o14k685K020J369k387J715R80k562
$$ -227 -621 827 -303 -918 477 71 -1034 885 271 -2414 -394 975 -1412 303 1283 -1279
7969a279R93Q77j701O47J343j845J451N18q78n81J919j236j701K301R8k145K065
$$ -1279 -286 591 -1110 -463 880 -965 486 1004 126 -455 1464 228 -1473 828 926 -1219 846
7986H46l74k589J975J104j869R08O64j666M46J825j865m61J978j657o4J682r33
$$ 846 472 -2117 -142 962 -907 1 665 -1001 -555 1270 -595 -1056 922 -735 -799 883 -50
8003e0r78K282j237p75J350k4j348J484j82j862J725J312l186J554K244k818j76
$$ -50 -1028 1254 17 -758 592 568 -780 704 522 -1340 385 1697 -1489 65 2309 -509 -685
8020f85K284j617l01J491j753m83J373m57j702K392o77j592J944P0j526J182O13
$$ -685 1599 -18 -319 1172 -581 -1064 309 -148 -1850 542 -135 -1727 217 287 -1239 -57 556
8037E56j542N36J950k531Q12K006k680K2K325j379n92K720j474j584K057n60p45
$$ 556 -986 -450 1500 -1031 -219 1787 -893 -871 1454 75 -517 2203 729 -855 1202 642 -103
8054a03N10P46k085K62J675k597J028J977k012j50J857j785k15J327j050n11J718
$$ -103 407 1153 -932 -670 1005 -1592 -564 1413 -599 -749 1108 -677 -892 435 -615 -1126 592
8071E92n25j156K004j003j266J792L58j968J516M03j404Q31N67j011K77J698j557
$$ 592 67 -1089 915 -88 -1354 438 796 -1172 344 747 -657 174 741 -270 7 1705 148
8088A48k72J598j730l47J858k194J76J826j221o19J223l39j509J859P20k318Q99
$$ 148 -124 1474 -256 -603 1255 -939 -763 1063 -158 -777 446 107 -1402 457 1177 -1141 -242
8105b42J159k225J191O83j586o5K442j738j04J974j701o86K014j060m70J540j015
$$ -242 917 -1308 -117 566 -1020 -1085 1357 -381 -485 1489 -212 -898 1116 56 -414 1126 111
8122A11p78J523j14k058K116L62j917L74J669k244J053R19j987k9K393k069J23
$$ 111 -667 856 742 -1316 800 1162 -755 -381 1288 -956 97 1016 -971 -1000 1393 -676 -553
8139e53J367q17j067J138n59r47J957J02j481J379J81j892K001R0j392k1J299
$$ -553 814 -3 -1070 68 -491 -1438 519 621 -860 519 700 -1192 809 899 -493 -514 785
8156G85r96P48R70j763m67J632j202j4Q77k08j532K170k57j978J524o8j473J608
$$ 785 -211 537 1507 -256 -723 909 -293 -307 570 362 -1170 1000 743 -1235 289 221 -1252 356
8174C56M74j490k46M73p61N19J731j975M56J568j525m90K089j459m66J172N47
$$ 356 830 -660 -906 -433 -1194 -675 1056 -919 -463 1105 -420 -910 1179 -280 -746 426 973
8191I73
$$ Imaginary data points
##PAGE= N=2
##DATA TABLE= (X++(I..I)), XYDATA
0@%%%%%%%%%%%%%Jl8Q4r5R6r6R7j12J58j90J92k20K67k98L36l80M26m87N47o08
$$ 0 0 0 0 0 0 0 0 0 0 0 0 0 0 1 -37 47 -48 48 -48 49 -63 95 -95 97 -123 144 -154 182 -198 228 -259 288 -320
33c20O81p67Q56r47J047j163J291j428J585j757J942k147K381k650K955l301L705
$$ -320 361 -406 450 -497 550 -613 678 -750 835 -922 1020 -1127 1254 -1396 1559 -1742 1963
50A963m181M747n451O335p484R054j1336J4969k1635L7711j44205j66628K44213
$$ 1963 -2218 2529 -2922 3413 -4071 4983 -6353 8616 -13019 24692 -119513 -286141 -41928
63d1928m7568n5519J41879p0254j46256J52681m449j09522J44847K0939j65641
$$ -41928 -89496 -145015 -3136 -73390 -219646 -66965 -71414 -180936 -36089 -15150 -180791
74a80791J27463Q6483j58770Q5720J46085j48917J4559J39530j20027j3659J58746
$$ -180791 -53328 33155 -125615 -39895 106190 -42727 -28168 111362 -8665 -22324 136422
85A36422j06975n8910J63473p6952j08778J56861l2237j37538J39049J7384j66377
$$ 136422 29447 -29463 134010 57058 -51720 105141 72904 -64634 74415 91799 -74578
96g4578Q9245M8874j53466P3913Q5381j60856L3495J23636j40504o479J50840
$$ -74578 14667 63541 -89925 -16012 69369 -91487 -57992 65644 -74860 -81339 69501
107F9501j12833n2190J54409p4559q5765J53340l1912j05715J41321m667j38016
$$ 69501 -43332 -95522 58887 -15672 -101437 51903 19991 -85724 55597 50930 -87086
118h7086J24480M6457j51507Q4277P8647j55600M4601J13791j37537O210J30371
$$ -87086 37394 83851 -67656 16621 95268 -60332 -15731 98060 -39477 -33267 97104
129I7104j19058l5087J40430r5708o8135J54390n3947j04726J38679j8076j29745
$$ 97104 -21954 -57041 83389 -12319 -80454 73936 19989 -84737 53942 35866 -93879
140i3879J29543K9517j41198R5315O2061j45746O5413R9039j38317K4179J19897
$$ -93879 35664 65181 -76017 19298 81359 -64387 1026 100065 -38252 -14073 105824
151A05824j28067j6605J40470r4753n4145J38981p4093r2366J38364k9578j14980
$$ 105824 -22243 -38848 101622 6869 -47276 91705 17612 -74754 63610 34032 -80948
162h0948J20353J746j37116J01570M5221j42533O7762P4363j36558L7617J06804
$$ -80948 39405 41151 -95965 5605 50826 -91707 -23945 50418 -86140 -48523 58281
173E8281j24574J077J24806j01127l3177J39761p4217o8169J39560l6745r4454
$$ 58281 -66293 -65216 59590 -41537 -74714 65047 -9170 -77339 62221 25476 -68978
184f8978J29034l522j18119J06495L1869j25806Q3196O1614j34568M6379Q9844
$$ -68978 60056 56534 -61585 44910 76779 -49027 34169 95783 -38785 7594 97438
195I7438j25199J2107J09609j17693k7675J25004q5019n8118J27605n9686r0191
$$ 97438 -27761 -15654 93955 -23738 -51413 73591 -11428 -69546 58059 -1627 -91818
206i1818J23563k1625j08535J09477J3689j25657Q9789N0663j27124O5508Q2566
$$ -91818 31745 10120 -98415 11062 24751 -100906 -11117 39546 -87578 -22070 60496
217F0496j22920K9944J05526j12360m096J24127r0000l8514J31592o2308p0460
$$ 60496 -62424 -32480 73046 -39314 -43410 80717 -9283 -47797 83795 21487 -48973
228d8973J25133l3935r5301J14785j271j16572R2406K8251j26623P0367O2454
$$ -48973 76160 42225 -53076 61709 60438 -56134 36272 64523 -62100 8267 70721
239G0721j27435L6470Q6236j18232O145J09043j00365k9395J17723p5790n5307
$$ 70721 -56714 -20244 65992 -52240 -46095 62948 -37417 -66812 50911 -24879 -80186
250h0186J23984m3488q0180J15147j4020j00621J04398K1265j12258P7889N0342
$$ -80186 43798 310 -79870 35277 21257 -79364 25034 46299 -65959 11930 62272
261F2272j16559N2176P9195j13087J9703R6163j00737j1884J10721q3011m2342
$$ 62272 -54287 -2111 77084 -36003 -16300 79863 -20874 -32758 77963 -5048 -47390
272d7390J13619n6404p1897J11115l0575r3869J03268O444j06164Q3040L4408
$$ -47390 66229 9825 -62072 49043 18468 -75401 27867 34311 -71853 11187 45595
283D5595j16277N9470O5588j11890L2708Q5565j03915L236J05479q4356k6814
$$ 45595 -70682 -11212 54376 -57514 -24806 60759 -43156 -39920 65559 -18797 -45611
294d5611J12441o5734n5901J15142l6861q1414J05375r557j00809R1759K2609
$$ -45611 66830 1096 -54805 60337 23476 -57938 47437 37880 -62929 28830 51439
305E1439j10997O7715M9817j13995M2065P2745j09444J2732R3715r4417j5397
$$ 51439 -59558 8157 57974 -56021 -13956 58789 -50655 -37923 55792 -38625 -54022
316e4022J06837p4497m3837J11586m7611o8067J08991j8412q9170R6270J1991
$$ -54022 52815 -21682 -65519 46067 -1544 -69611 39380 20968 -68202 28068 40059
327D0059j00096P9647M0014j07188N4066O4746j05385K7234Q4139r6287n358R7346
$$ 40059 -60037 19610 59624 -47564 6502 71248 -34137 -6903 77236 -19051 -24409 72937
339G2937q1577l3832J04125n8187n8678J01997l4123q1479R4713n023r5977P8140
$$ 72937 -8640 -42472 61653 3466 -55212 46785 12662 -68817 25896 20873 -75104 3036
351C036K5098j02387O0999M9838j03902L6646P4970r4692J1570R2229q1912j7063
$$ 3036 28134 -74253 -13254 36584 -67318 -30672 44298 -50394 -38824 53405 -28507 -45570
363d5570J01664o0856m2409J04542l9376o5767R9406j1678q4521Q6771J2251r8810
$$ -45570 56094 -4762 -47171 57371 17995 -47772 51634 39956 -44565 42206 54457 -44353
375d4353O7103L9179j03214M4501O1921j03648J7890Q0729r1930j0545R1767p4135
$$ -44353 22750 61929 -41285 3216 65137 -38511 -20621 60108 -31822 -42367 49400 -24735
387b4735l4673R9641n2594n9078R8393k4753p7252R2568J883r0211P7216L0618
$$ -24735 -59408 40233 -12361 -71439 26954 2201 -75051 17517 19400 -70811 6405 37023
399C7023r6973N7388N6401r7098L1217P6062q9130M704Q9606p6500k2622R6674
$$ 37023 -59950 -2562 53839 -43259 -12042 64020 -25110 -20406 69200 -7300 -29922 66752
411F6752n8227m8518R7213l5347p0085R1104j0632q6384P6806J5653r5314N8705
$$ 66752 8525 -39993 57220 21873 -48212 42892 32260 -54124 22682 38335 -56979 1726
423A726M0737r7301L8354O2290r1781J4211P8919p9530j2288R1295o1824l4767
$$ 1726 42463 -54838 -16484 45806 -45975 -31764 47155 -32375 -44663 46632 -15192 -49959
435d9959R6095m0856n7333R2679j7189p3561Q2818R752q7669O6094L1175r2485
$$ -49959 46136 5280 -52053 40626 23437 -50124 32694 42446 -45223 20871 52046 -40439
447d0439M5328N3282r1126K0541P0561q4367m383Q2576p0165k8048R1424n1034
$$ -40439 4889 58171 -32955 -12414 58147 -26220 -30603 51973 -18192 -46240 45184 -5850
459e850n1197R1083k6907p0454Q4690j663q0656P2757K2580q8477N5195M6234
$$ -5850 -57047 34036 7129 -63325 21365 19702 -60954 11803 34383 -54094 1101 47335
471D7335q8731L4140O4134q4753R513P9580p2869j4855Q7936n7723m1106R1007
$$ 47335 -41396 -7256 56878 -27875 -18362 61218 -11651 -26506 61430 3707 -37399 53608
483E3608l6038o1039Q4316j5083p7974P3660R771q5287N7833L2809r1392L8094
$$ 53608 17570 -43469 40847 25764 -52210 21450 31221 -54066 3767 36576 -54816 -16722
495a6722N5617q6865J7133P0821p7122o437Q2903o0596k7158Q8573m1656m8068
$$ -16722 38895 -47970 -30837 39984 -37138 -43575 39328 -21268 -48426 40147 -1509 -49577
507d9577Q7316j8876o5787P9233L561p6767O5461K5426q5011M6118M5675q4683
$$ -49577 37739 18863 -46924 32309 35870 -40897 24564 49990 -35021 11097 56772 -27911
519b7911K5163O2266p8973o01P3496o7543k1877Q1429n2251m3778Q0488l0516
$$ -27911 -2748 59518 -19455 -20056 53440 -14103 -35980 45449 -6802 -50580 29908 -608
531f08n9201P7647o895p3692O7706J5758q0072N3957L9078q2913L4055N6132p6918
$$ -608 -59809 17838 10943 -62749 4957 20715 -59357 -5400 33678 -49235 -15180 40952 -35966
544c5966J4039P3316o8576r158Q0496n4335l1152Q3940l7339n1929Q0790j6385
$$ -35966 -21927 51389 -17187 -26345 54151 -184 -31336 52604 15265 -36664 44126 27741
556B7741o7501P0968M806p7672N6921K6869q3925L8733M5725q3530J8622O2868
$$ 27741 -39760 31208 36014 -41658 15263 42132 -41793 -3060 42665 -40865 -22243 40625
568D0625p4866k199P4334o0087k3725Q0509m3094m1404Q1029k4459n7979P5444
$$ 40625 -34241 -36440 37894 -22193 -45918 34591 -8503 -49907 31122 6663 -51316 24128
580B4128L84o9031O3541J9678p7288M8043M0818p7865K8496N5307p5106N298O9293
$$ 24128 24512 -44519 19022 38700 -38588 9455 50273 -27592 904 56211 -18895 -13597 55696
593E5696o4433j5778P4530n0213l6060P6470l2327n2763P2613j1934o6044O4042
$$ 55696 -8737 -24515 50015 -198 -36258 40212 7885 -44878 27735 15801 -50243 13799
605A3799J0135p4482N1296K9806p5897L5354M8630p3315J5721O3943o6204l824
$$ 13799 23934 -50548 748 30554 -45343 -9989 38641 -34674 -18953 44990 -21214 -25038
617b5038P3258n4446k4110P7462l6804m2451P5853j9541n9032O8495J453p0888
$$ -25038 48220 -6226 -30336 47126 10322 -32129 43724 24183 -34849 33646 35099 -35789
629c5789N5319J9449p6531M1559L8905p7028K1939N4120p2139K578O6094n9190
$$ -35789 19530 38979 -37552 4007 42912 -34116 -12177 41943 -30196 -27618 38476 -20714
641b0714j7953P2903m4516l6136P5610k5916n1010P1618o222o3371O4032J3685
$$ -20714 -38667 34236 -10280 -46416 29194 3278 -47732 23886 17664 -45707 18325 32010
653C2010p1267M8695L4069p3826L2148N0412p1150R572O2246o3374r934O9866
$$ 32010 -39257 9438 43507 -30319 1829 52241 -18909 -9337 52909 -10465 -20399 49467
665D9467n1266l0470P2213l3976m6275P0063j6252o1543O1510M273o9875N1674
$$ 49467 -1799 -32269 39944 5968 -40307 29756 13504 -48039 13471 17744 -52131 -457
677d57K4776p1777L5509M2226p0233J8816N5964o3463k27O6840n0990j7929P0931
$$ -457 24319 -47458 -11949 30277 -39956 -21140 34824 -28639 -28866 37974 -13016 -30945 39986
690C9986l7237l6917P1279j9222n0794O5062k223o3711N5552J5390p0541M0674
$$ 39986 2749 -34168 37111 17889 -32905 32157 29934 -33777 21775 37165 -33376 7298
702G298L2415p0874K4135M8140o8173M646N7679n8558j3076O7877m5658l1215
$$ 7298 39713 -31161 -7026 41114 -27059 -22413 35266 -23292 -36368 31509 -14149 -45364
714d5364O8860k8140m6437O8127q774n8377O0870R670o5437M9541K9384o8467
$$ -45364 23496 -4644 -51081 17046 8272 -50105 10765 20435 -45002 4539 33923 -34544
726c4544L2113M4121o6399J5450N6502o0192m774O5661n0269k3165O7970l5494
$$ -34544 -2431 41690 -24709 -9259 47243 -12949 -17723 47938 -2331 -25496 42474 6980
738F980m1833O7442j8531n4298O0129j185o4807N1221J8855o8917L7561L4957
$$ 6980 -34853 32589 14058 -40240 19889 18704 -46103 5118 23973 -44944 -7383 27574
750B7574o8015K0840N0075o2274K421O1417n1972j4156O8623l8186l0818O7885
$$ 27574 -40441 -19601 30474 -31800 -29379 32038 -19934 -34090 34533 -3653 -34471 33414
762C3414k2154m6058O3596m452n5658N3711J1869o3783M2131K8032o5828K4931
$$ 33414 11260 -34798 28798 24346 -31312 22399 34268 -29515 12616 40648 -25180 -249
774b49M2021o3611Q285N4151n7793r754O0273m5781k5238O3676k9828m0054O2098
$$ -249 41772 -21839 -13554 40597 -17196 -26950 33323 -12458 -37696 25980 -3848 -43902 18196
787A8196j2728n1953N7472N339o0431M6674K3417o2452L4719L9035o4309J7047
$$ 18196 5468 -46485 10987 16326 -44105 2569 25986 -36466 -1747 37288 -27021 -9974
799i974N1946n7081J772N9367m8525j9308O5390l6347l4173O3456k0962m9542
$$ -9974 41972 -15109 -13337 46030 -2495 -21803 43587 7240 -26933 36523 15561 -33981
811c3981N9799k981n9060M9741J2855o5321L7067L0281o4982K3490M4513o2606
$$ -33981 25818 22837 -36223 13518 26373 -38948 -1881 28400 -36582 -13092 31421 -31185
823c1185O276N6021n2318r833O2178l9769k7560O6370k5262m0227O1980q336n2020
$$ -31185 -24909 31112 -21206 -31039 31139 -8630 -36190 30180 4918 -35309 26671 18335 -33685
836c3685N5253R819o0697M2796K4977o3474K8057L8985o1277J0004M8246n4402
$$ -33685 21568 31387 -29310 13486 38463 -25011 3046 42031 -19246 -9242 39004 -15398
848a5398o051N7710m5763k2704N9841l1796l6994O2008j6436m7973N3394J997
$$ -15398 -21449 36261 -9502 -32206 27635 -4161 -41155 20853 4417 -43556 9838 11835
860A1835n6616M7128J9101n9789L3835L3671n8546J9931M6726n4334J344N7121
$$ 11835 -44781 2347 21448 -38341 -4506 29165 -29381 -9450 37276 -17058 -15714 41407
872D1407m7423j2942O0007l5502l0003O1122k1228m3470N6123o782n4461M8989
$$ 41407 -6016 -18958 41049 5547 -24456 36666 15438 -28032 28091 21309 -33152 15837
884A5837J0066n9332L6304K4845o2581K2973M0479n9932Q206M9851n2241p401
$$ 15837 25903 -33429 2875 27720 -34861 -11888 28591 -31341 -23135 26716 -25525 -32926
896c2926N8785m0997k2387O1847k6701l7180O1058j0013m6593N3616M704n5295
$$ -32926 25859 -15138 -37525 24322 -2379 -39559 21499 11486 -35107 18509 23213 -32082
908c2082M4612K2695n9959L0606L4984n9812J4792M6422n3926j758N2986m5721
$$ -32082 12530 35225 -24734 5872 40856 -18956 -4164 42258 -11668 -13426 39560 -6161
920f161j8266N8722l4232l3778N7546j8837m5021N3951k356n4156M5552J4352
$$ -6161 -24427 34295 63 -33715 23831 4994 -40027 13924 11568 -42588 2964 17316
932A7316n6845L4111L0124n8069K0244M2736n2720M616N2005m6205j0021N6126
$$ 17316 -39529 -5418 24706 -33363 -13119 29617 -23103 -18487 33518 -12687 -22708 33418
944C3418l4087k3409N8639k2583l9205N5792q751m8602M8158O488n5689L7615
$$ 33418 -669 -24078 34561 11978 -27227 28565 19814 -28788 19370 25858 -29831 7784
956G784K1635n8033K4423L4883n7289R099M6731m9648n702N2901m1432k0146N9051
$$ 7784 29419 -28614 -4191 30692 -26597 -17498 29233 -20415 -26117 26784 -14648 -34794 24257
969B4257k8400l2256N5829j2529m2967N2862L330n2089M3633J7286n7097L2936
$$ 24257 -4143 -36399 19430 6901 -36066 16796 20126 -31963 11670 28956 -28141 4795
981D795L1520n5281J6190M1481n1884J292N2138m6234j4226N4804l5147k9263
$$ 4795 36315 -18966 -2776 38705 -13179 -11887 40251 -5983 -20209 34595 -552 -29815
993b9815N6838k0360m2647N1157n944m9790M6447J1644n5706L3754K5436n6015
$$ -29815 27023 6663 -35984 15173 9229 -40561 5886 17530 -38176 -4422 21014 -35001
1005c5001K2622L9470n3590Q693M9018m6270n678N4833l5895k1824N6091k2646
$$ -35001 -12379 27091 -26499 -17806 31212 -15058 -20736 34097 -1798 -23622 32469 9823
1017I823l3981N4483r652m6330M8724M213n2058L8593J7859n6489K5361L1620
$$ 9823 -24158 30325 20673 -25657 23067 27280 -24778 13815 31674 -24815 546 32166
1029C2166n4959J1654M1062n0965l446N0079m0060j7087N4068l0224l0347N4450
$$ 32166 -22793 -11139 29923 -21042 -24488 25591 -14469 -31556 22512 -7712 -38059 16391
1041A6391j4749l9480N0690m70m8496M3541J5235n2063L1829K8276n3404J9555
$$ 16391 1642 -37838 12852 12382 -36114 7427 22662 -29401 2428 30704 -22700 -3145
1053c145M0792m9753L908M7674m4500j0203N2994l5226k4970N3601k2184l7849
$$ -3145 37647 -12106 -8198 39476 -5024 -15227 37767 2541 -22429 31172 8988 -28861
1065b8861N1614q519m7647M4048O834n3155L6120K1457n6390K4153L4624n3511
$$ -28861 22753 14234 -33413 10635 17469 -35686 434 21891 -34499 -10346 24278 -29233
1077b9233J1379M5256m7248m129N1266l6709j7019N5105k5075l1725N3335j0958
$$ -29233 -17854 27402 -19846 -23975 27291 -9418 -26437 28668 3593 -28132 25203 14245
1089A4245m0845M8782L182n0893L8896J6703n3363K8651K8437n3563J3252L9669
$$ 14245 -26600 22182 25364 -25529 13367 30070 -23293 5358 33795 -19768 -6516 33153
1101C3153n0311J386M5592m2360j4348N2114l1644k5995N2968j8454l7905M9484
$$ 33153 -17158 -15772 29820 -12540 -26888 25226 -6418 -32413 20555 2101 -35804 13680
1113A3680l505m5263M3309J0619n1103L4104K5622n0581K1466L4652n0070R297
$$ 13680 10175 -35088 8221 18840 -32263 1841 27463 -23118 -1652 33000 -17070 -7773
1125g773M4247m2279q084M9592l5035k1419N2396k2362l4768M9533j0317m3942
$$ -7773 36474 -5805 -13889 35703 668 -20751 31645 9283 -25485 24048 13731 -30211
1137c0211M5005K931n0595L5984J7559n3886K6074L0157n1033J2008M0958m7325
$$ -30211 14794 17725 -32870 3114 20673 -33213 -7139 23018 -28015 -16007 24951 -22374
1149b2374o95M9210l8547j3535N2205k6757k7290N3214j4470l8088M9484j146
$$ -22374 -23069 26141 -12406 -25941 26264 -493 -27783 25431 10961 -27127 22357 21211
1161B1211m5934M1236J2999n0896K9501K5413n2548J8291L5974n0663L240M3456
$$ 21211 -24723 16513 29512 -21384 8117 33530 -19018 -727 35247 -15416 -12176 31280
1173C1280m2560j0525M8974l4745k3440N0712k0681l4517M8077p298m2765M2355
$$ 31280 -11280 -21805 27169 -7576 -31016 19696 -985 -35502 12575 5277 -37488 4867
1185D867Q017m6927L4067K1645n0652K3695L3649m8751J1035M1860m2918l469
$$ 4867 12884 -34043 24 21669 -28983 -5288 28361 -20390 -9355 32505 -10413 -13882
1197a3882M8766l4663j8653N1269k4351l0911N0394j3318m0982M4652J19m7115
$$ -13882 34884 221 -18432 32837 8486 -22425 27969 14651 -26331 18321 18440 -28675
1209b8675L7346J4248n1923K6126K6035n0405J4194L6999m6968J034M4993l9619
$$ -28675 8671 22919 -29004 -2878 23157 -27248 -13054 23945 -23023 -21989 23004 -16615
1221a6615j0998N0479k8785k4075N0923j6492l4503M8253k850m3077M1488J0787
$$ -16615 -27613 22866 -5919 -29994 20929 4437 -30066 18187 15337 -27740 13748 24535
1233B4535m8553L2061K2561n0377K0394L2035m7889O617M2589m2307r020M6893
$$ 24535 -24018 8043 30604 -19773 621 32656 -15233 -8616 33973 -8334 -17354 29539
1245B9539l5270j9299M8861k3076l2697M7847r236m1635M3101M334m7203L5437
$$ 29539 -5731 -25030 23831 755 -31942 15905 6669 -34966 8135 12469 -34734 703
1257G03J8377m9617K5802K9247m8081J3035M0449m3329q31M6119l5510j4428M9605
$$ 703 19080 -30537 -4735 24512 -23569 -10534 29915 -13414 -14245 31874 -3636 -18064 31541
1270C1541k4935k7364M8569j4403l7086M4838j283m3615L5892J1169m8580K6062
$$ 31541 6606 -20758 27811 13408 -23678 21160 19877 -23738 12154 23323 -25257 805
1282H05K3942m8930J5538L3050m5279K695M2036l9771r543M6814k9692k1135M9246
$$ 805 24747 -24183 -8645 24405 -20874 -18179 23857 -15914 -25457 21357 -8335 -29470 19776
1295A9776j8272l1005M6625n125m0113M1488Q372m5984L3248J9904m7487K1795
$$ 19776 1504 -29501 17124 11999 -28114 13374 21746 -24238 9010 28914 -18573 3222
1307C222L0639m6639Q333L9328m2497n048M5638l5745j8275M7789k4403k9068
$$ 3222 33861 -12778 -4445 34883 -7614 -12662 32976 -2769 -21044 26745 2342 -26726
1319b6726M6292j2712l8418M2371O55m4811L5659J3683m7459K5941K6085m6951
$$ -26726 19566 6854 -31564 10807 11462 -33349 2310 15993 -31466 -5525 20560 -26391
1331b6391J5019L6669m3500J935M4176l6076j1711M8393k5809k3246M7637j5502
$$ -26391 -11372 25297 -18203 -16268 27908 -8168 -19879 28514 2705 -20541 27096 11594
1343A1594l4108M5406l845m2223L8857Q138m5902K8165K0893m8469J7065L0292
$$ 11594 -22514 22892 19047 -23176 15681 23819 -22083 6082 26975 -21494 -4429 25863
1355B5863m4950N097L8571l9323p951M4896l1924j8321M5712j9495k9598M6085
$$ 25863 -19087 -13990 24581 -14742 -22693 22203 -9721 -28042 17670 -1825 -31423 14662
1367A4662p814l7932M0851N491m1964L2730J7828m5272K1798K8308m3676J0507
$$ 14662 6848 -31084 9767 15258 -26706 6024 23852 -21420 378 28686 -14990 -4483
1379d483L7197m1770k003M2300l3977j4355M5632k5943k5880M5097j4021l6127
$$ -4483 32714 -9056 -11059 31241 -2736 -17091 28541 2598 -23282 21815 7794 -28333
1391b8333M1298j766m1840L4415J1322m5727K6171K3350m5562J5550L3316m2795
$$ -28333 12965 11199 -30641 3774 15096 -30631 -4460 18890 -26672 -11122 22194 -20601
1403b0601M056M1147l6672q189M5781k7698k0314M7095j7171k9967M5503o462
$$ -20601 -16545 24602 -12070 -20259 25522 -2176 -22490 24605 7434 -22533 22970 16508
1415A6508l8846L8840P054m4965K9755J7853m6180J9449K7850m4934P722L6314
$$ 16508 -22338 16502 23556 -21409 8346 26199 -19981 -532 27318 -17616 -9894 26420
1427B6420m0906n486M2643l2243j6581M4783k2480k7883M5319j0727l4877M1317
$$ 26420 -14486 -19972 22671 -9572 -26153 18630 -3850 -31733 13586 2859 -32018 9299
1439I299L219m2294L4910J4582m4112K5021K4776m3660J3373L4902l9927J499
$$ 9299 12518 -29776 5134 19716 -24396 625 25401 -18259 -4886 30016 -9911 -8412
1451h412M0070l4559j1722M4692k5690k3527M3540j5291l3237M1177l900l9551
$$ -8412 31658 -2901 -14623 30069 4379 -19148 24392 9101 -24136 17041 13141 -26410
1463b6410L3920Q499m4306K6809J9761m4559J6640K9853m1881N214L7699l6308
$$ -26410 7510 16009 -28297 -1488 18273 -26286 -9646 20207 -21674 -16460 21239 -15069
1475a5069n465M3069k8735j6701M4736j8319k7355M3708o943l5837L8872M897
$$ -15069 -20534 22535 -6200 -22901 21835 3516 -23839 19869 12926 -22911 15961 20858
1487B0858m1906L1357J5923m4277K1445K4877m3860J0646L3395l9884k349L9528
$$ 20858 -21048 10309 26232 -18045 3400 28277 -15583 -4937 28458 -11426 -13775 25753
1499B5753l3862j4241M2940k4074k4196M3465j2999l2607M0387r51l9890L4442
$$ 25753 -8109 -22350 20590 -3484 -27680 15785 2786 -29821 10566 9615 -30275 4167
1511D167J2129m2223K5163K2409m1771J5600L1435m0054M476L7683l4237q248
$$ 4167 16296 -25927 -764 21645 -20126 -4526 26909 -13145 -8669 29014 -5223 -13471
1523a3471M2230k6322j9840M3190j7247l0161M1310o497l6986L4831N968m2000
$$ -13471 28759 2437 -17403 25787 8540 -21621 19689 13192 -23794 11037 17005 -24995
1535b4995K6023J7261m3266J7153K7223m0693O616L5173l6846m168M1155k9237
$$ -24995 1028 18289 -24977 -7824 19399 -21294 -14678 20495 -16351 -20519 20636 -8601
1547h601j5157M3577j8901k4926M2728q998l2489L7720K360l8601L2971J2539
$$ -8601 -23758 19819 918 -24008 18720 9722 -22767 14953 17313 -21288 11683 24222
1559B4222m1644K2474K2645m1961J2463L0909m0113L10L7456l3814j1649M0925
$$ 24222 -17422 5052 27697 -14264 -1801 29108 -11005 -10695 26761 -7053 -18702 22223
1571B2223k5339k2280M2312j5325l0470L8661l761l7064L4947Q646m0575K6543
$$ 22223 -3116 -25396 16916 1591 -28879 9782 6021 -31043 3904 12550 -28025 -1482
1583a482J9226m0690J7298K8953l9950O579L6494l5103m368L9964k6084j7243
$$ -1482 17744 -22946 -5648 23305 -16645 -10066 26428 -8675 -13043 26921 837 -16406
1595a6406M2396j8753k5478L9843p069l5244L6018K510l9969K8624J3772m1604
$$ -16406 25990 7237 -18241 21602 14533 -20711 15307 17817 -22152 6472 20244 -21360
1607b1360J8617K3020m0619Q566L2420l7566j928L7856k9131j3301M0410k1054
$$ -21360 -2743 20277 -20342 -11776 20644 -16922 -18850 19006 -10125 -23426 16984 -4070
1619d070k1147M0559j0674l0023L7673M1l4948L1303J1448l9137K3915K0598m0277
$$ -4070 -25217 15342 4668 -25355 12318 12359 -22589 8714 20162 -18975 4940 25538 -14739
1632a4739J3986K8932l8544K748L5579l3347q570L8898k5410j9112L9448j7261
$$ -14739 -753 28179 -10365 -7617 27962 -5385 -13955 24943 -467 -19579 19869 2608
1644B608k7795L8380o368l4413L3744N146l9317K7223J6458m0184J8445K4893
$$ 2608 -25187 13193 6825 -27588 6156 11302 -28015 -792 15666 -24518 -6073 18820
1656A8820l7745Q377L3717l4196k591L8503k8021j3399M1056j9013k3658L9493
$$ 18820 -18925 -10548 23169 -11027 -13618 24885 -3136 -16535 24521 5508 -18150 21343
1668B1343r759l1372L5895R72l7203K9096J1255m0115K0408K1005m0429J0758
$$ 21343 11584 -19788 16107 17079 -20124 8972 20227 -19888 520 21525 -18904 -8146
1680h146K8115l5234j017L6035l1285j1083L9155k2199j9383L9037j1852k8522
$$ -8146 19969 -15265 -16282 19753 -11532 -22615 16540 -5659 -25042 13995 2143 -26379
1692b6379L7608j643l3275L2342Q864l7512K4245J8869l7529J4767K6024l6461
$$ -26379 11229 9586 -23689 8653 17517 -19995 4250 23119 -14410 357 26381 -10080
1704a0080M381L3165l2011o046L5731k5360j7115L7602j6201k5353L6284q134
$$ -10080 -5699 27466 -4545 -10591 25140 -220 -17335 20267 4066 -21287 14997 6863
1716F863l2120L1932L403l6129K5175J4433l8372J8118K3885l8160Q558L1126
$$ 6863 -25257 6675 10078 -26051 -876 13557 -24815 -6697 17188 -20972 -12414 18712
1728A8712l2680q20L5714k5794j1418L7574j8699k0040L8008r836k8019L4171
$$ 18712 -13968 -14788 20926 -4868 -16286 21288 2589 -17451 20557 10721 -17298 16873
1740A6873k98l4460K9979Q557l7124K1122J7881l8682J3116K5811l6140J094L2711
$$ 16873 16575 -17885 12094 20651 -16473 4649 22530 -16152 -3036 22775 -13365 -12271 20440
1753B0440l1718p611L6420k4041j7258L7224j4571k5236L6510n277l0299L1326
$$ 20440 -11278 -18889 17531 -6510 -23768 13456 -1115 -26351 10159 4882 -25417 5909
1765E909N987l4528K5167J5613l6690J7153K4510l5162Q824K9047l1262l576L4946
$$ 5909 11896 -22632 2535 18148 -18542 -1389 23121 -12041 -3217 25830 -5432 -9008 25938
1778B5938k6468j2251L6132j8551k1844L4404q733k9329L1560J361l5154K5930
$$ 25938 -530 -12781 23351 4800 -17044 17360 8627 -20702 10858 12219 -22935 2995
1790B995J0433l6141J8752J9333l5851J0258K7874l2826Q52L2933k8132p875L5479
$$ 2995 13428 -22713 -3961 15372 -20479 -10221 17653 -15173 -14321 18612 -9520 -17395 18084
1803A8084j9313j6970L5633j1337k3694L3433j580l1788K9432P415l5160K1542
$$ 18084 -1229 -18199 17434 6097 -17597 15836 14256 -17532 11900 19315 -15845 5697
1815E697J6754l6151J2964K3095l3981L308L0331l1021o343L3054k4024j4703
$$ 5697 22451 -13700 -736 22359 -11622 -8314 22017 -9004 -15347 17707 -6317 -21020
1827b1020L5958j6360k3258L4284o084k8794L0354M127l2536K5731J2589l3630
$$ -21020 14938 -1422 -24680 9604 3520 -25274 5080 9207 -23329 2402 14991 -18639
1839a8639J7133K1677l3785Q829K8266l0142o43L2266k6079j0389L4945j8181
$$ -18639 -1506 20171 -13614 -4785 23481 -6661 -7304 24962 -1117 -11506 23439 5258
1851E258j9594L3751r469k8393L2160j292l2228K5881P767l5838J9301J6873l3623
$$ 5258 -14336 19415 9946 -18447 13713 12421 -19807 6074 13841 -21997 -2696 14177 -19446
1864a9446J0113K4214l1317J201L0464k5947p450L3827j9873j5524L5145j1491
$$ -19446 -9333 14881 -16436 -15235 15229 -10718 -18168 15659 -4214 -19738 15407 3916
1876C916k2361L2225k917k7657K9099N492l2544K2172J4032l4123J4690K1147
$$ 3916 -18445 13780 10863 -16794 12305 17797 -14747 7425 21457 -12666 2024 23171
1888B3171l2947N301K6331k9507l299L1516k4853j3402L3084j7549k0110L3065
$$ 23171 -9776 -4475 21856 -7651 -10950 20566 -4287 -17689 15395 -2154 -22264 10801
1900A0801r017k5886K9369L21l0236K6069J1133l3935J8218J8795l1101J0090
$$ 10801 1784 -24102 5267 5588 -24648 1421 12554 -21381 -3163 15632 -15469 -5379
1912e379K5459l0468J579L1039k5053p966L3647j9085j7398L3020j0959k3240
$$ -5379 20080 -10388 -8809 22230 -2823 -10789 22858 3773 -13625 19395 8436 -14804
1924a4804K9926l234k9323K5988N781l2997K0759J3148l3536J2655K1085l1172
$$ -14804 15122 11888 -17435 8553 14334 -18663 2096 15244 -18292 -5637 15448 -15724
1936a5724L378K8058k8501m518L1920k1246j1779L1678j3673j9820L3025n720
$$ -15724 -12346 15712 -12789 -17307 14613 -6633 -18412 13266 -407 -20227 12798 7078
1948G078k5134K7832L405k8971K3117J1402l1229J5073J8340l1172Q045K4707
$$ 7078 -18056 9776 13181 -15790 7327 18729 -12500 2573 20913 -10259 -2214 22493
1960B2493k8509k103K8107k3495j0893L1653j7991j7574K9882r435k3814K8380
$$ 22493 -6016 -8119 19988 -3507 -14400 17253 -738 -18312 11570 2135 -21679 6701
1972F701m49k8630K4126P548k9995J8050J7096l1340J1269K1838k7725K854K8572
$$ 6701 6252 -22378 1748 9296 -20699 -2649 14447 -16893 -5624 16214 -11511 -8657 19915
1985A9915k4622o107L1122j8364j3847L2267j3059k1534K9551l339k6754K5724
$$ 19915 -4707 -10814 20308 1944 -11903 20364 7305 -14229 15322 11983 -14771 10953
1997A0953L869l1623K0489J1582l1138J3038J8170l0358M509K5493k8078k431
$$ 10953 14822 -16801 3688 15270 -15868 -2830 15340 -15018 -10509 14984 -13094 -15525
2009a5525K9716k3348j0037L1058j3448j8035L0053o795k2843K8090K373k7884
$$ -15525 14191 -9157 -19194 11864 -1584 -19619 10434 3639 -19204 8886 11259 -16625
2021a6625K2463J0585l0184J6995J8201l1335R405K2294k7420R46K6448k3630
$$ -16625 5838 16423 -13761 3234 21435 -9900 -495 21799 -5621 -4675 21773 -1857
2033a857q157K9214j8787j5317K8984j0888k1796K6876k380k7281K4015O386l0691
$$ -1857 -10014 19200 413 -14904 14080 3192 -18604 8272 5892 -21389 2626 9012 -21679
2046b1679J8621J3518k8899J1035K1689k8476L652K6502k4018m276K9472j7899
$$ -21679 -3058 10460 -18439 -7404 14285 -14191 -10539 15963 -8055 -12331 17141 -758
2058g58j3134L0823j1982j8212K9364m861k4614K5014K535k8101K1008J0182l1020
$$ -758 -13892 16931 4949 -13263 16101 11240 -13374 11640 14175 -13926 7082 17264 -13756
2071a3756J3506J7221k9101N853K2604k7279j439K6446k1979q288K8592j5377
$$ -13756 -250 16971 -12130 -6277 16327 -10952 -12391 14055 -7924 -16212 12380 -2997
2083b997j6721K9309p266k2433K7189l67k5516K3555P902k8658J8158J4011k7198
$$ -2997 -19718 9591 2325 -20108 7081 6714 -18802 4753 12655 -16003 2155 16166 -11032
2096a1032R932K1078k6185J518K5043k3215n851K8039j7942j4785K9290j1701
$$ -11032 -1100 19978 -6207 -4689 20354 -2861 -8712 19327 1385 -13400 15890 4189
2108D189k0387K7788m853k5467K3813M125k7719J7755J1599k8046J1084J8555
$$ 4189 -16198 11590 6737 -18730 5083 9208 -18511 -756 10843 -17203 -6119 12436
2120A2436k7367N379K4336k5444j187K6424j8313r822K9757j2488j8504K9472
$$ 12436 -14931 -9552 14784 -10660 -11847 14577 -3736 -13558 16199 3711 -14793 14679
2132A4679n313k2806K5327J576k6000J9901Q235k7486J4180J5016k8127P405K0257
$$ 14679 9366 -13440 11887 13463 -12537 7364 15599 -11887 2293 17309 -10818 -3413 16844
2145A6844k5732l77K5069k3527p494K7319j5743j5226K7931r650j9102K6180j561
$$ 16844 -8888 -9265 15804 -7723 -15217 12102 -3641 -18867 9064 -586 -19688 6492 4931
2158D931k3770K2222O498k7036J8604J2222k6972J1923K0158k6392L758K3042
$$ 4931 -18839 3383 9881 -17155 1449 13671 -13301 -1378 18780 -7612 -3854 19188
2170A9188k1739m500K6590j8655j1257K7926j2763j6928K5191n704k2721K3252
$$ 19188 -2551 -7051 19539 884 -10373 17553 4790 -12138 13053 7349 -15372 7880
2182G880J755k7326J8942R490k8044J3280J5795k7556O294K1777k4176j71K5240
$$ 7880 9635 -17691 1251 10741 -17303 -4023 11772 -15784 -9490 12287 -11889 -12060 13180
2195A3180j9388q673K7337j3604j4019K7653o591j9846K4383N41k3647K1294P156
$$ 13180 -6208 -14881 12456 -1148 -15167 12486 5895 -13951 10432 10973 -12674 8620 15776
2208A5776k6998J5600J2180k5853Q486J9398k5784J493K2786k1832o561K5205
$$ 15776 -11222 4378 16558 -9295 -809 18589 -7195 -5702 17084 -4748 -11309 13896
2220A3896j6309j3560K6553r938j8588K4918l606k2363K1765M194k4631J7539
$$ 13896 -2413 -15973 10580 642 -17946 6972 3366 -18997 2768 6962 -17669 -130
2232a30J1781k6211J1809J7054k4380N076K1883k1950k530K5324j7930q919K6014
$$ -130 11651 -14560 -2751 14303 -10077 -5001 16882 -5068 -7598 17726 -204 -9123 16891
2245A6891j2375j6452K6663o165k2047K2887Q55k5043J9279O764k6111J3567J3258
$$ 16891 4516 -11936 14727 8562 -13485 9402 10257 -14786 4493 11257 -14854 -1287 11971
2258A1971k6030O621J9008k3889Q34K3715k0303o403K5755j4570j2603K6667q037
$$ 11971 -14059 -7438 11570 -12319 -11485 12230 -8073 -14476 11279 -3291 -15894 10773 2736
2271B736j8204K5035r70k2208K1639M969k4534J5944J1882k5672J0040J6790k4639
$$ 2736 -15468 9567 8597 -13611 8028 12997 -11537 4407 16289 -9383 657 17447 -7192
2284g192K548K1619k0659n200K3836j7025j1507K5223j1204j6793K3921m782k0845
$$ -7192 -4644 16975 -3684 -8884 14952 -2073 -13580 11643 439 -16354 7567 2785 -18060
2297a8060K0964K600k3849J8884R127k5605J2396J6390k4507N672K0823k1661
$$ -18060 2904 5504 -18345 539 9666 -15939 -3543 12847 -11660 -5988 14835 -6826
2309f826j590K5083j8054p271K5369j3066j3687K4994p848j8040K2129j257k2713
$$ -6826 -8416 16667 -1387 -8658 16711 3645 -10042 14952 7104 -10936 11193 9936 -12777
2322a2777J8611O244k5557J4656J2369k5814O838J7243k3446J031K2807k1282
$$ -12777 5834 12078 -13479 1177 13546 -12268 -5430 11813 -11633 -10602 12205 -9077
2334i077m703K4848j6131j1440K5955r258j6892K4626k331k0797K1414M088k3100
$$ -9077 -13780 11068 -5063 -16503 9452 194 -16698 7928 5597 -15200 6214 10302 -12798
2347a2798J7192J0566k5339J1707J5676k4028M647J9800k0892k839K3139j8290
$$ -12798 4394 14960 -10379 1328 17004 -7024 -2377 17423 -3469 -6308 16831 -1459
2359a459r577K5243j3792j4853K4304o736j9819K1721R10k3876J8941P508k4180
$$ -1459 -11036 14207 415 -14438 9866 3130 -16689 5032 5942 -17934 1007 8515 -15665
2372a5665J2268J3558k3143P097J7661k1034Q16K2650j7682p611K5181j2228j3048
$$ -15665 -3397 10161 -12982 -5885 11776 -9258 -8442 14208 -3474 -11085 14096 1868 -11180
2385a1180K5567q024j7376K2508j760k0613J8254N274k4585J5021J0586k4777
$$ -11180 14387 6363 -11013 11495 9735 -10878 7376 12650 -11935 3086 13672 -11105
2397a1105Q552J5626k3062K615K0992k1251m908K2831j5439r594K3809j0222j5186
$$ -11105 -2553 13073 -9989 -7374 13618 -7633 -12541 10290 -5149 -14743 9066 -1156 -16342
2410a6342K3366l488j9498K1090K940k2397J6911R954k3175J0957J5780k3762
$$ -16342 7024 3536 -15962 5128 8068 -14329 2582 12536 -10639 318 16098 -7664
2422g664N451J9512k1938m02K2377j8796q117K3553j2352j3420K2567o525j9479
$$ -7664 -2213 17299 -4639 -5041 17336 -1460 -9577 13976 1624 -11796 10771 4246 -15233
2435a5233K1867n69k2533J8390O347k4286J3212J2712k3634P605J7578k2157M78
$$ -15233 6634 6065 -16468 1922 8269 -16017 -2805 9907 -13727 -6122 11456 -10701 -10223
2448a0223K3538j9284m482K3797j4456j0871K5538q799j6511K2928k396j8867
$$ -10223 13315 -5969 -10451 13346 -1110 -11981 13557 4758 -11753 11175 8779 -10088
2460a0088J9124L563k2853J4898Q781k4065J0170J5477k3779K919J9775k0909
$$ -10088 9036 12599 -10254 4644 13425 -10640 -470 15007 -8772 -5853 13922 -6987
2472f987l492K1512j5935r192K3766j1992j3340K2317m895j8848K1180J825k1587
$$ -6987 -10479 11033 -4902 -14094 9672 -2320 -15660 6657 1762 -17086 4094 5919 -15668
2485a5668J8234P511k2093J2941J3023k3245P354J7534k1153J564K0837j8395
$$ -15668 2566 10077 -12016 925 13948 -9297 -1943 15591 -5562 -3998 16839 -1556
2497a556n613K3108j3491j1660K2742r228j6199K1303j775k2407J8703M734k3327
$$ -1556 -7169 15939 2448 -9212 13530 4302 -11897 9406 7631 -14776 3927 8661 -14666
2510a4666J4167R868k3234Q675J6086k2682K610K0647j9581k452K2572j5082r226
$$ -14666 -499 9369 -13865 -5190 10896 -11786 -9176 11471 -8110 -10562 12010 -3072 -12298
2523a2298K3815r844j4092K2981l390j8886J9511L308k1599J5803R057k3866J1178
$$ -12298 11517 1673 -12419 10562 7172 -11714 7797 11105 -10494 5309 14366 -9500 1678
2536A678J3688k3171N448J6680k0723p90K0531j8509o795K2339j2045j3167K2598
$$ 1678 15366 -7805 -2357 14323 -6400 -7190 13341 -5168 -11963 10376 -1669 -14836 7762
2549G762p217j6637K0553P1k0490J7614O860k2914J4124J1577k2558Q206J7213
$$ 7762 545 -16092 4461 4532 -15958 1656 8516 -14398 -274 11303 -11255 -3049 14164
2562A4164k0753K220K0117j7922m452K2543j4860r309K2384q998j5988K1679l128
$$ 14164 -6589 -4369 15748 -2174 -6626 15917 1057 -8252 14132 5134 -10854 10825 7697
2575G697k0606J9115K566k2605J4949Q538k3345J0203J4681k2690L846J7722j9338
$$ 7697 -12909 6206 8772 -13833 1116 9654 -13691 -3488 11193 -11497 -7651 10071 -9267
2588i267k185K2148j6433p293K3545j0753j3281K3324n789j7049K1741O48k0380
$$ -9267 -11452 10696 -5737 -13030 10515 -238 -13519 9805 4016 -13033 8708 9356 -11024
2601a1024J7252O778k2782J3220J2086k3052O221J7855k2615N01J9727j7129p121
$$ -11024 6228 13006 -9776 3444 15530 -7522 -1301 16554 -6061 -5560 14167 -2962 -10083
2614a0083K2835j3962j2149K1958q014j5786K0235j891j9547J8303N165k2470
$$ -10083 12752 -1210 -13359 8599 585 -15201 5034 3143 -16404 1899 7064 -15406
2626a5406J4199J0620k2007R319J5264k0810L511J8937j7685k305K1369j4827
$$ -15406 -1207 9413 -12594 -3275 11989 -8821 -5310 13627 -4058 -6363 15006 179
2638A79r302K3049q862j5033K1472l325j9739J9429K261k1529J4547P480k1913
$$ 179 -9123 13926 5064 -9969 11503 8178 -11561 7868 10129 -11400 3147 10627 -11286
2651a1286R381J3091k2881M868J7605k0580p79K0420j5963p433K3225j1977j1601
$$ -11286 -1905 11186 -11695 -6827 10778 -9802 -10581 9839 -6124 -13557 9668 -2309 -13910
2664a3910K2423o779j5605K0911J058k0784J8296N792k1053J2769J0955k2206
$$ -13910 8513 1734 -13871 7040 8098 -12686 5610 11402 -9651 3118 14073 -8133
2676h133P927J6277k2110K647J8230j7968m424K1331j4561j0947K2321r409j5055
$$ -8133 -206 16071 -6039 -3392 14838 -3130 -7554 13777 -784 -11731 10590 1181 -13874
2689a3874K1046l489j9510J9088K540k2057J5122Q915k1989J0609J4065k0761
$$ -13874 7172 3683 -15827 3261 5801 -16256 -1134 7781 -14208 -3599 10466 -10295
2701a0295L587J9430j8463k235K1062j4064q525K3236j0698j2154K0859m842j7731
$$ -10295 -6708 12722 -5741 -7976 13086 -978 -9503 13733 3035 -9119 11740 6898 -10833
2714a0833J9698J221k0239J5760N660k1471J0400J2372k2710N108J7263k0965
$$ -10833 8865 10086 -10153 5607 11267 -10204 196 12568 -10142 -5034 12229 -8736
2726h736n97J9205j6381n773K1114j1231j1854K2890p806j5679K1042j37j8980
$$ -8736 -9333 9872 -6509 -12282 8832 -2399 -14253 8637 831 -14848 6194 6057 -12923
2739a2923J8311L200k0188J4596R819k1729R604J4751k1962L777J8424j8472k634
$$ -12923 5388 8588 -11600 2996 12815 -8914 690 15441 -6521 -2744 15680 -2792 -5426
2752e426K0282j5483q522K1471j0037j4990K1490m647j8214J8207J561k0502J4531
$$ -5426 14856 -627 -9149 12322 2285 -12705 8785 4138 -14076 4131 5692 -14810 -279
2765b79P877k2903J1426J3423k1350N223J7715j9467L89J9911j5528n910K2601
$$ -279 7598 -15305 -3879 9544 -11806 -6583 11132 -8335 -7946 11965 -3563 -9473 13128
2778A3128j1923j1374K1945n935j5886J9805mj9441J6131N672k1892J2172J0507
$$ 13128 1205 -10169 11776 5841 -10045 9760 9756 -9685 6446 12118 -9774 2398 12905
2791A2905k1894O938J4938k1183O87J8917j7545m683K0969j3771r542K0724p802
$$ 12905 -8989 -2051 12887 -8296 -7609 11308 -6237 -10920 10049 -3722 -13264 7460 -342
2804c42j4901K0961j659j8859J8815L249k0372J5124R641k1651J0106J3656k0929
$$ -342 -15243 5718 4059 -14800 4015 7264 -13108 2016 11657 -9994 112 13768 -7161
2817g161M791J8045j9042j918J9857j4698q021K1234j0282j3479K0858n141j7845
$$ -7161 -2370 15675 -3367 -5285 14572 -126 -8147 13087 2805 -10674 10184 5043 -12802
2830a2802J9656l81k0432J5654N614k0424J0471J1831k2093O836J5560j8870R08
$$ -12802 6854 6473 -13959 1695 7309 -13115 -2644 9187 -12906 -6070 9490 -9380 -8472
2843h472J9518j6507m619K1177j1391j0288K1347o838j5363K0507r97j8198J7363
$$ -8472 11046 -5461 -10080 11097 -294 -10582 10765 3927 -11436 9071 8074 -10124 7239
2856G239M128k0571J2630R701k1667Q274J3335k0196K540J7165j8687k776J9408
$$ 7239 11367 -9204 3426 13127 -8540 -266 13069 -7127 -4587 12578 -6109 -8885 10523
2869A0523j3550r367K1670r225j4405J9603l093j6950J8659J908k0075J5699P818
$$ 10523 -3027 -12394 9276 51 -14354 5249 2156 -14794 3865 5773 -14302 1397 9215
2882I215k0697J0194J3927k0952N798J6821j8578r68K0048j5810p054K1654j1089
$$ 9215 -11482 -1288 12639 -8313 -2515 14306 -4272 -5240 14808 -1002 -8056 13598 2509
2895B509j1942K1342o786j6006J8897r40j9303J6158M164k0707J1538J0719k1486
$$ 2509 -9433 11909 5123 -10883 8014 7074 -12229 3929 8093 -12614 -1076 9643 -11843
2908a1843O333J5642k0437K293J8178j6699k967J9936j3113q968K1671p365j4429
$$ -11843 -5510 10132 -10305 -8012 10166 -6533 -9500 10436 -2677 -11645 10026 2661 -11768
2921a1768K0722k123j7753J8270L280k0186J3971Q564k0994Q884J3116k0281L383
$$ -11768 8954 6831 -10922 7348 10628 -9558 4413 12977 -8017 867 13983 -6298 -2915
2934b915J6019j8354q97J8271j4897q383K0428j0024j2697K0246n022j6400J8072
$$ -2915 13104 -5250 -6147 12124 -2773 -11156 9272 -752 -13449 6797 1775 -14625 3447
2947C447R59j8633J5691O161k0145J1725J1194k0293N619J7410j8939P98J9023
$$ 3447 4406 -14227 1464 7625 -12520 -795 10399 -9894 -4275 13135 -5804 -5006 14017
2960A4017j5827m730K0481j1211j1375K0611o834j4948J8916j332j7905J5205
$$ 14017 -1810 -6540 13941 2730 -8645 11966 5132 -9816 9100 7768 -10137 5068
2972E068L481j9862J2242Q971k1453Q030J3532j9830K544J7413j7348k687J8805
$$ 5068 8549 -11313 929 9900 -11553 -3523 10009 -9821 -7277 10136 -7212 -9899 8906
2985H906j2322q969K0570p210j4088K0761l091j6818J8658K558j9899J4961O756
$$ 8906 -3416 -12385 8185 975 -13113 7648 4557 -12261 6397 8955 -10944 4017 10773
2998A0773j9207R357J2771j9957M926J5511j8528n79J8082j5970o276K0352j1851
$$ 10773 -8434 923 13694 -6263 -1337 14174 -4354 -4933 13149 -2821 -9097 11255 -596
3011e96j1584K0000o002j5452J8990j185j8100J5515N161k0199J1706J0145j9875
$$ -596 -12180 7820 1818 -13634 5356 4171 -13929 1586 6747 -13452 -1746 8399 -11476
3024a1476Q125J4135j8786K953J7156j5723l785K0320j2143r466K0522p639j3407
$$ -11476 -3351 10784 -8002 -5049 12107 -3616 -7401 12919 776 -8690 11832 4193 -9214
3037i214J9363l415j6768J7086K257k0109J3874O878j9743Q062J1803j9811L811
$$ -9214 10149 6734 -10034 7052 9309 -10800 3074 9952 -9791 -1729 10074 -9737 -5926
3050e926J6365j7859j638J8221j4012p539K1000j0265j0877J9218l640j5513J8416
$$ -5926 10439 -7420 -9058 9163 -4849 -12388 8612 -1653 -12530 6688 3048 -12465 5951
3063E951J294j7863J5442N080j9267J1175J1276k0146N586J5838j8511o5J8016
$$ 5951 7245 -10618 4824 9904 -9363 1812 13088 -7058 -1472 14366 -4145 -4210 13806
3076A3806j5373n606J8785j0787j0627J8877p050j4363J7958j689j6898J5142
$$ 13806 -1567 -7173 11612 825 -9802 9075 2025 -12338 5620 3931 -12967 2175
3088B175L681k0069J2356R514j9829P730J3831j8345K758J7015j6194k489J9424
$$ 2175 5856 -14213 -1857 7657 -12172 -4442 9389 -8956 -6198 10817 -5377 -7866 11558
3101A1558j3018o153J9080q718j1633J8493l911j5091J6961K187j8346J2953P179
$$ 11558 -1460 -7613 11467 2749 -8884 9609 5698 -9393 7568 9755 -8591 4362 11541
3114A1541k0474R161J1248j9884L853J5237j7861n77J7658j4794n663J8261j0099
$$ 11541 -8933 228 11476 -8408 -4555 10682 -7179 -7756 9902 -4892 -10555 7706 -2393
3127b393j0658J9286m784j4569J8495l58j7359J5830M763j8629J1783J0326j8765
$$ -2393 -13051 6235 1451 -13118 5377 5019 -12340 3490 8253 -10376 1407 11733 -7032
3140g032O162J4179j7524J213J7384j5968n125J9306j1407r240J9224q267j3290
$$ -7032 -870 13309 -4215 -3002 14382 -1586 -6711 12595 1188 -8052 11172 2905 -10385
3153a0385J8295m071j6294J5880K689j8940J2719P433j9232Q017J2462j7630K813
$$ -10385 7910 3839 -12455 3425 6114 -12826 -107 7326 -11906 -3889 8573 -9057 -6244
3166f244J6550j7210n35J7938j3417o224J9964r355j0094J8183m717j5067J8709
$$ -6244 10306 -6904 -7439 10499 -2918 -9142 10822 1467 -8627 9556 4839 -10228 8481
3179H481k61j7103J3980M974j7991R294R880j8524N257J3574j7844K94J6500j5052
$$ 8481 8220 -8883 5097 10071 -7920 1374 11254 -7270 -2013 11561 -6283 -5989 10511 -4541
3193d541m993J8774j1456r344J8119o329j3020J6896m99j6103J4847M640j8331
$$ -4541 -9534 9240 -2216 -11560 6559 230 -12790 4106 3607 -12496 2351 6991 -11340
3206a1340J1752R104j7378O887J2498j6898K138J6527j5770k575J6689j1362p320
$$ -11340 412 9516 -7862 -975 11523 -5375 -3237 13290 -2480 -5055 11634 272 -7048
3219g048J7762p517j2020J7016k920j6081J6156R27j7444J2414P053j9981Q963
$$ -7048 10714 3197 -8823 8193 5273 -10808 5348 6275 -11169 1245 8298 -11683 -2720
3232b720J0944j9323N093J4355j5485q83J7170j3696m478J8193r586r399J8501
$$ -2720 8224 -11099 -6006 8349 -7136 -8019 9151 -4545 -9023 9170 -416 -9815 8686
3245H686l709j4622J7246K62j6848J4611M409j7514J0498R104j8854O393J2264
$$ 8686 4977 -9645 7601 7863 -8985 5626 10035 -7479 3019 12123 -6731 -338 11926
3258A1926j7017K90J6020j4815l974J6525j1240q320J8032p775j2273J8202k834
$$ 11926 -5091 -4801 11219 -3596 -7570 8955 -2285 -10605 7427 -348 -12621 5581 2747
3271B747j5886J5929K767j7675J2629O979j7585P815J2778j7352L760J4561j5829
$$ 2747 -13139 2790 5557 -12118 511 7490 -10095 -2280 10498 -6854 -3094 11467 -4362
3284d362j286J7690j2443n520J6958q235j0841J7259l231j5029J4966L68j6519
$$ -4362 -5648 12042 -401 -5921 11037 2802 -8039 9220 5989 -9040 5926 6294 -10225
3297a0225J2015N147j7954R239R079j6802M015J4553j7473R57J5652j3087m527
$$ -10225 1790 6937 -11017 -1778 7301 -9501 -5486 9067 -8406 -7449 8203 -4884 -9411
3310i411J8242j0579q836J8714n898j2399J7086l96j5850J4251M253j7391J1293
$$ -9411 8831 -1748 -10584 8130 2232 -10167 6919 6523 -9327 4924 9177 -8214 3079
3323C079Q356j7563O543J2103j6799J558J4402j5041k844J6557j1531o891J5470
$$ 3079 11435 -6128 415 12518 -4281 -2723 11679 -3362 -6206 10351 -1180 -8071 7399
3336G399p293j1186J5588j759j5401J5439J667j5827J1387O030j6957Q666J1063
$$ 7399 106 -11080 4508 2749 -12652 2787 4454 -11373 14 6044 -10913 -2247 8816
3349H816j6706M401J4052j5643M04J6060j3058m456J7072r358q837J6901m871
$$ 8816 -7890 -3489 10563 -5080 -4676 11384 -1674 -6130 10942 1584 -7253 9648 4777
3362D777j2520J5519q01j6244J3510L146j6971J0351O779j5980N360J2613j7112
$$ 4777 -7743 7776 6975 -9269 4241 7387 -9584 767 7546 -8434 -3074 9539 -7573
3375g573J534J4148j4160l448J7411j0411p886J7252o435j1063J6612j973j3892
$$ -7573 -6039 8109 -6051 -9499 7912 -2499 -10385 6867 432 -10631 5981 4008 -9884
3388i884J4107K992j5470J1431N935j6329Q501R640j5897K364J4482j5088j019
$$ -9884 4223 7215 -8255 3176 9111 -7218 1283 10923 -4974 -2610 11872 -3216 -4235
3401d235J5077j2013o141J5910p745j0501J5889m187j4022J5269P98j5055J1713
$$ -4235 10842 -1171 -7312 8598 853 -9648 6241 2054 -11968 3301 4099 -10956 757
3414G57M632j6043R099R382j6144M891J2286j4404J16J5219j2530l629J7071r688
$$ 757 5389 -10654 -1555 7827 -8317 -3426 8860 -5544 -5428 9791 -2739 -6368 10703 1015
3428A015q899J7512o025j1378J6043j990j3773J2977K173j5047R347O603j5995
$$ 1015 -7884 9628 3603 -7775 8268 6278 -7495 5482 7655 -7392 1955 8558 -7437
3441g437O130R840j6058K125J2729j2921k257J4991j0466o701J6313o709j1207
$$ -7437 -1307 8533 -7525 -5400 7329 -5592 -7849 7142 -3324 -10025 6288 -421 -11628
3454a1628J7738l960j3046J4742J427j4981J1552O733j6388R060R258j5576L962
$$ -11628 6110 2150 -10896 3846 5273 -9708 1844 8577 -7811 1249 10507 -5069 -1107
3467a107J2530j4292J61J4048j3011m518J6308q656r559J5563n176j2488J4685
$$ -1107 11423 -2869 -2708 11340 -1671 -6189 10119 1463 -8096 7467 2291 -10197 4488
3480D488o82j3926J0971M725j6335R032Q124j5578N668J1023j5159J365J5258
$$ 4488 3806 -10120 851 5576 -10759 -1727 6397 -9181 -3513 7510 -7649 -6284 8974
3493H974j2976k578J5180q706p477J6126n846j0413J5548j815j3372J3326J655
$$ 8974 -4002 -6580 8600 -106 -7583 8543 2697 -7716 7832 6017 -7355 5971 7626
3506G626j4132R352O221j5312O275J0305j6124K080J2947j4361n52J3605j1168
$$ 7626 -6506 2846 9067 -6245 30 10335 -5789 -3709 9238 -5123 -5675 7930 -3238
3519c238n512J5338p846q956J5091m583j0899J3915J369j4871J2792L831j4634
$$ -3238 -8750 6588 -1258 -10214 4877 294 -10605 3310 4679 -10192 2600 6431 -8203
3532h203Q254Q707j4508M264J1216j3274L9J3911j1722l358J4508r364p180J5245
$$ -8203 51 8758 -5750 -1486 9730 -3544 -3505 10406 -1316 -4674 9834 470 -6710 8535
3546H535n250j1427J4987k607j4477J2659K876j4535Q734O970j4935N684R596
$$ 8535 3285 -8142 6845 4238 -10239 2420 5296 -9239 -505 6465 -8470 -2786 6810
3559F810j3978K207J2117j1823j803J4061q880o286J5228o333q775J4608l227
$$ 6810 -7168 -4961 7156 -4667 -6470 7591 -1289 -7575 7653 1320 -7455 7153 3926
3572C926j1543J3224J405j4194J0860N854j5932P521P730j4288L268J1358j3373
$$ 3926 -7617 5607 7012 -7182 3678 9532 -6400 1121 8851 -5437 -2169 9189 -4184
3585d184m31J3170j1751m774J5088q635q233J4053l952j1308J3831m25j3013J1755
$$ -4184 -4615 8555 -3196 -7970 7118 -1517 -9750 4303 351 -10957 2874 2449 -10564 1191
3599A191M318j4170Q301Q407j4948M887J1284j3361J864J2471j1958k401J4343
$$ 1191 5509 -8661 -360 8047 -6901 -2014 9270 -4091 -2227 10244 -1714 -4115 10228
3612A0228r907n676J4186n743r312J3007k457j2097J1465K254j4850R347O658
$$ 10228 321 -5355 8831 3088 -6224 6783 4326 -7771 3694 5948 -8902 445 7103
3625G103j5530O083Q872j4212K466J1842j2915l81J4221j0458n361J4658o681
$$ 7103 -8427 -2344 6528 -7684 -5218 6624 -6291 -6672 7549 -2909 -8270 6388 -293
3638b93p856J4176l346j1088J3887M43j3414J2430L206j4300Q297P691j4311L843
$$ -293 -8149 6027 2681 -8407 5480 5923 -7491 4939 8145 -6155 2142 9833 -4478 -635
3652f35J0330j2645j81J1928j1202l639J4217q950p719J3983m986j0579J3441
$$ -635 9695 -2950 -3131 8797 -2405 -6044 8173 -777 -8496 5487 501 -10078 3363
3665C363j295j2399J1134L072j3021Q523O064j3450N938R751j3607K426J1845
$$ 3363 2068 -10331 803 3875 -9146 -623 5441 -8009 -2071 7680 -5927 -3501 8344
3678H344j1417j123J3172r471n224J4789o383r143J4605l681j1709J2311L77j2899
$$ 8344 -3073 -4196 8976 -495 -5719 9070 2687 -6456 8149 4468 -7241 5070 5447 -7452
3692g452J0152L567j4351P164P305j3887L590J0745j3146J92J2643j0106l893
$$ -7452 2700 6267 -8084 -920 6385 -7502 -3912 6833 -6313 -6121 6522 -3584 -7477
3705g477J3681p229p603J3860l004j0412J3577q06j2572J1551L533j4327Q798
$$ -7477 6204 -1025 -8628 5232 2228 -8184 5393 4587 -7985 3566 7099 -7228 1570
3718A570O617j3759N711R907j3753J434J1544j0920l468J3295q565o645J3438
$$ 1570 8187 -5572 139 10046 -3707 -2273 9271 -1649 -5117 8178 -387 -7032 6406
3731F406o495q494J2827k503j1827J1482K393j2904Q155O229j4199O339Q745j2637
$$ 6406 -89 -8583 4244 1741 -10086 1396 3789 -9115 -960 5269 -8930 -2591 6154 -6483
3745f483L261J0877j1196m35J2594r631l870J4138p260p810J3831l699j1185J2380
$$ -6483 -3222 7655 -3541 -3976 8618 -1013 -4883 9255 1995 -5815 8016 4317 -6868 5512
3759E512M39j2172J0240K235j3065P600N923j3280L471R099j2196O73J0989r856
$$ 5512 5951 -6221 4019 6254 -6811 789 6712 -6568 -3097 6002 -6194 -5521 5468 -4388
3773d388l506J3670q511n759J3699n009r022J2511r39j0844J1865K253j2507Q761
$$ -4388 -7894 5776 -2735 -8494 5205 196 -8826 3685 2746 -8098 3767 6020 -6487 2274
3787B274N685j2575M591J0208j4852L265J1700j1820k827J3420r005o098J3571
$$ 2274 7959 -4616 -25 10183 -4669 -1404 10296 -1524 -4351 9069 64 -6034 7537
3800G537o767q838J2651k262j1192J0819J356j2478R122M055j2737O254P966j2831
$$ 7537 770 -8068 4583 2321 -8871 1948 3304 -9174 -52 4003 -8734 -2480 5486 -7345
3814g345L902J0252j1814J80J2235r718l463J2813o009p035J3135l938r075J1871
$$ -7345 -3443 6809 -5005 -4825 7410 -2308 -5771 7042 1033 -6002 7133 3195 -5880 5991
3828E991m74j1719J0459K974j3808Q630N892j3812M764Q484j2132J004J1226j0487
$$ 5991 5517 -6202 4257 7231 -6577 2053 7945 -5867 -1103 7381 -4751 -3747 7479 -3008
$$ [...]
##END NTUPLES=NMR FID
##END=
