##TITLE=1H_CA-8570-05
 CDCl3, 32 sc, 
 7.3.2019
##JCAMPDX= 6.0         $$ Bruker NMR JCAMP-DX V2.0
##DATA TYPE= NMR FID
##DATA CLASS= NTUPLES
##ORIGIN= UXNMR, Bruker Analytische Messtechnik GmbH
##OWNER= root
$$ XWIN-NMR		Version 3.5
$$ Thu Mar  7 12:04:30 2019 Russian Standard Time (UT+4h)  she@DPX200
##.OBSERVE FREQUENCY= 200.1316
##.OBSERVE NUCLEUS= ^1H
##.DELAY= (6, 6)
##.ACQUISITION MODE= SIMULTANEOUS
##.ACQUISITION SCHEME= undefined
##.AVERAGES= 32
##.DIGITISER RES= 18
##SPECTROMETER/DATA SYSTEM= spect
##.PULSE SEQUENCE= zg30
##.SOLVENT NAME= CDCl3
##.SHIFT REFERENCE= (INTERNAL, CDCl3, 0, 15.7039)
##AUDIT TRAIL= $$ (NUMBER, WHEN, WHO, WHERE, WHAT)
$$ ##TITLE= Audit trail, XWIN-NMR		Version 3.5
$$ ##JCAMPDX= 5.01
$$ ##ORIGIN= Bruker BioSpin GmbH
$$ ##OWNER= she
$$ F:/spectra/data/she/nmr/H-F/1/audita.txt
$$ ##AUDIT TRAIL=  $$ (NUMBER, WHEN, WHO, WHERE, WHAT)
(   1,<2019-03-07 12:03:41.73 +0400>,<she>,<DPX200>,
      <continue with go, POWCHK disabled, PULCHK disabled
       configuration hash MD5:
       00 E9 B6 7A A2 85 ED C7 34 08 36 98 17 FE 4E 26
       data hash MD5: 16K
       82 38 A3 76 FF 0E 6E EE 61 8C 4F 64 F0 EF 98 69>)
$$ ##END=
$$ 
$$ hash MD5
$$ FC D8 7E 42 1B 1A 55 51 75 FD 35 1C DD C5 C4 4A
##$RELAX= 
##$RELAX= 
##$RELAX= 
##$RELAX= 
##$RELAX= 
##$RELAX= 
$$ Bruker specific parameters
$$ --------------------------
##$DU= <F:/spectra>
##$EXPNO= 1
##$NAME= <H-F>
##$PROCNO= 1
##$TYPE= <nmr>
##$USER= <she>
##$AMP= (0..31)
100 100 100 100 100 100 100 100 100 100 100 100 100 100 100 100 100 100 
100 100 100 100 100 100 100 100 100 100 100 100 100 100 
##$AQSEQ= 0
##$AQ_mod= 1
##$AUNM= <au_zg>
##$AUTOPOS= <>
##$BF1= 200.13
##$BF2= 200.13
##$BF3= 200.13
##$BF4= 200.13
##$BF5= 200.13
##$BF6= 200.13
##$BF7= 200.13
##$BF8= 200.13
##$BYTORDA= 1
##$CFDGTYP= 0
##$CFRGTYP= 5
##$CHEMSTR= <none>
##$CNST= (0..31)
1 1 145 1 1 1 1 1 1 1 1 1 1 1 1 1 1 1 1 1 1 1 1 1 1 1 1 1 1 1 1 1 
##$CPDPRG= <>
##$CPDPRG1= <>
##$CPDPRG2= <>
##$CPDPRG3= <>
##$CPDPRG4= <mlev>
##$CPDPRG5= <mlev>
##$CPDPRG6= <mlev>
##$CPDPRG7= <mlev>
##$CPDPRG8= <mlev>
##$CPDPRGB= <>
##$CPDPRGT= <>
##$D= (0..31)
0 1.2 0 0 0 0 0 0 0 0 0 0.03 0 0 0 0 0 0 0 0 0 0 0 0 0 0 0 0 0 0 0 0 
##$DATE= 1551945710
##$DBL= (0..7)
120 120 120 120 120 120 120 120 
##$DBP= (0..7)
150 150 150 150 150 150 150 150 
##$DBP07= 0
##$DBPNAM0= <>
##$DBPNAM1= <>
##$DBPNAM2= <>
##$DBPNAM3= <>
##$DBPNAM4= <>
##$DBPNAM5= <>
##$DBPNAM6= <>
##$DBPNAM7= <>
##$DBPOAL= (0..7)
0.5 0.5 0.5 0.5 0.5 0.5 0.5 0.5 
##$DBPOFFS= (0..7)
0 0 0 0 0 0 0 0 
##$DE= 6
##$DECBNUC= <off>
##$DECIM= 24
##$DECNUC= <off>
##$DECSTAT= 4
##$DIGMOD= 1
##$DIGTYP= 9
##$DL= (0..7)
0 120 120 120 120 120 120 120 
##$DP= (0..7)
150 150 150 150 150 150 150 150 
##$DP07= 0
##$DPNAME0= <>
##$DPNAME1= <>
##$DPNAME2= <>
##$DPNAME3= <>
##$DPNAME4= <>
##$DPNAME5= <>
##$DPNAME6= <>
##$DPNAME7= <>
##$DPOAL= (0..7)
0.5 0.5 0.5 0.5 0.5 0.5 0.5 0.5 
##$DPOFFS= (0..7)
0 0 0 0 0 0 0 0 
##$DQDMODE= 0
##$DR= 18
##$DS= 0
##$DSLIST= <SSSSSSSSSSSSSSS>
$$ [...]
##$SUBNAM2= <"">
##$SUBNAM3= <"">
##$SUBNAM4= <"">
##$SUBNAM5= <"">
##$SUBNAM6= <"">
##$SUBNAM7= <"">
##$SUBNAM8= <"">
##$SUBNAM9= <"">
##$SW= 24.9336934301222
##$SWIBOX= (0..15)
0 0 2 0 0 0 0 0 0 0 0 0 0 0 0 0 
##$SW_h= 4990.01996007984
##$TD= 16384
##$TD0= 1
##$TE= 0
##$TE2= 300
##$TE3= 300
##$TEG= 300
##$TL= (0..7)
0 120 120 120 120 120 120 120 
##$TP= (0..7)
150 150 150 150 150 150 150 150 
##$TP07= 0
##$TPNAME0= <>
##$TPNAME1= <>
##$TPNAME2= <>
##$TPNAME3= <>
##$TPNAME4= <>
##$TPNAME5= <>
##$TPNAME6= <>
##$TPNAME7= <>
##$TPOAL= (0..7)
0.5 0.5 0.5 0.5 0.5 0.5 0.5 0.5 
##$TPOFFS= (0..7)
0 0 0 0 0 0 0 0 
##$TUNHIN= 0
##$TUNHOUT= 0
##$TUNXOUT= 0
##$USERA1= <user>
##$USERA2= <user>
##$USERA3= <user>
##$USERA4= <user>
##$USERA5= <user>
##$V9= 5
##$VALIST= <valist>
##$VCLIST= <CCCCCCCCCCCCCCC>
##$VD= 0
##$VDLIST= <DDDDDDDDDDDDDDD>
##$VPLIST= <PPPPPPPPPPPPPPP>
##$VTLIST= <TTTTTTTTTTTTTTT>
##$WBST= 1024
##$WBSW= 4
##$XGAIN= (0..3)
0 0 0 0 
##$XL= 0
##$YL= 0
##$YMAX_a= 264161
##$YMIN_a= -428536
##$ZGOPTNS= <>
##$ZL1= 120
##$ZL2= 120
##$ZL3= 120
##$ZL4= 120
##$ABSF1= 10
##$ABSF2= 0
##$ABSG= 5
##$ABSL= 3
##$ALPHA= 0
##$AQORDER= 0
##$ASSFAC= 0
##$ASSFACI= 0
##$ASSFACX= 0
##$ASSWID= 0
##$AUNMP= <proc_1d>
##$AZFE= 0.1
##$AZFW= 0.1
##$BCFW= 1
##$BC_mod= 2
##$BYTORDP= 1
##$COROFFS= 0
##$CY= 11.3945322036743
##$DATMOD= 1
##$DC= 2
##$DFILT= <>
##$DTYPP= 0
##$F1P= 18.9103706918063
##$F2P= -1.10871071338519
##$FCOR= 0.5
##$FTSIZE= 0
##$FT_mod= 4
##$GAMMA= 1
##$GB= 0.15
##$INTBC= 1
##$INTSCL= 1
##$ISEN= 128
##$LB= 0.24
##$LEV0= 0
##$LPBIN= 0
##$MAXI= 10000
##$MC2= 0
##$MEAN= 0
##$ME_mod= 0
##$MI= 1.114404
##$NCOEF= 0
##$NC_proc= 0
##$NLEV= 6
##$NOISF1= 3.799351
##$NOISF2= 2.8
##$NSP= 1
##$NTH_PI= 0
##$NZP= 0
##$OFFSET= 15.70392
##$PC= 1
##$PHC0= -8863.756
##$PHC1= 22.40014
##$PH_mod= 1
##$PKNL= yes
##$PPARMOD= 0
##$PSCAL= 0
##$PSIGN= 0
##$REVERSE= no
##$SF= 200.130013532006
##$SI= 16384
##$SIGF1= 3
##$SIGF2= 2
##$SINO= 400
##$SIOLD= 16384
##$SREGLST= <1H.CDCl3>
##$SSB= 0
##$STSI= 0
##$STSR= 0
##$SW_p= 3612.71676300578
##$SYMM= 0
##$S_DEV= 0
##$TDeff= 0
##$TDoff= 0
##$TI= <>
##$TILT= no
##$TM1= 0
##$TM2= 0
##$TOPLEV= 0
##$USERP1= <user>
##$USERP2= <user>
##$USERP3= <user>
##$USERP4= <user>
##$USERP5= <user>
##$WDW= 1
##$XDIM= 8192
##$YMAX_p= 0
##$YMIN_p= 0
$$ End of Bruker specific parameters
$$ ---------------------------------
##NTUPLES= NMR FID
##VAR_NAME=  TIME,          FID/REAL,        FID/IMAG
##SYMBOL=    X,             R,               I
##VAR_TYPE=  INDEPENDENT,   DEPENDENT,       DEPENDENT
##VAR_FORM=  AFFN,          ASDF,            ASDF
##VAR_DIM=   8192,          8192,            8192
##UNITS=     SECONDS,       ARBITRARY UNITS, ARBITRARY UNITS
##FACTOR=    0.0002004,     1,               1
##FIRST=     0,             0,               0
##LAST=      1.6414764,     0,               0
##MIN=       0,             -428536,         0
##MAX=       1.6414764,     264161,          0
$$ Real data points
##PAGE= N=1
##DATA TABLE= (X++(R..R)), XYDATA
$$ [...]
3344c459Q279p105k917R663n894n708R756j891q052Q994k4q512P695K361q916
3359e730O114N251r949L138P569r020J206Q024p131k211Q988n768m333R208k849
3374B507p385Q666k75q879P560R62q032O033K984r835L914O812j0058J290P893
3389D157p601j230Q494n139l945R718m048o349R856j924p126Q253J292q501O569
3404B476K670r115N067N627r825J773P913q683n66P883p110k229Q886n043n212
3419e488Q683k805p182Q589M43q478O721K637q919N315N172r851L412P338q644
3434c057K04Q430o560j544Q446n055m220Q728k729p041Q412o81p935O977J380
3449C755q728O184L673r363L003O052r378J141P781o377k189Q389o045k866Q920
$$ plain form
3344 -3459 4820 -2285 -5202 4461 -1433 -7141 2615 724 -7328 1666 1642 -6870 825 3186 -5730
3359 -5730 384 5635 -4314 -1176 6393 -2627 -1421 6603 -528 -2739 6249 481 -3852 5356 2507
3374 2507 -4878 3788 3513 -5366 2194 3156 -4876 1157 4141 -5694 -1780 5032 -5026 -3736 4157
3389 4157 -3444 -4674 3820 -1319 -5264 4454 406 -5943 3913 1989 -5137 3116 4408 -4093 2476
3404 2476 5146 -3969 1098 6725 -3100 -1327 6586 -2097 -2663 5220 -1890 -4119 4767 -276 -5488
3419 -5488 3195 390 -6792 1797 2240 -6238 483 3120 -5799 -484 4688 -5163 -1751 5587 -3057
3434 -3057 -2853 5577 -983 -2527 5919 864 -3356 5372 2643 -4398 4014 3333 -4602 2375 3755
3449 3755 -4973 1211 4884 -4479 -1476 4576 -4802 -3661 4120 -2257 -4446 3943 -2102 -4968 3952
3464C952m555n502R353j308p595Q156Q79p688N906L460q757M551N190q994K329
3479f23P265q544L8P833o507k808Q470n007n100R301k619p540P136Q67p197N073
3495C8K914q588M742M655q438K651P082q160K95P416o468j040Q051n060m301R461
3511E250k388o818Q289j97p975O636J999q854N368L477q902L421O074r270J039
3526b851P231o490k457Q391n583l273Q467l734n629P888m72p001P110J343p536
3541d596N979K981q671M789N848r835J988P387o776j386P951n701k821Q189m387
3556I39m921P732j827o754P327K29p593M720L120q767M202N362q414K004P394
3571D753p700m10O778m990j946P999m835m362R102k658o276P586n2o258O240J193
$$ plain form
3464 3952 -603 -6105 3248 1940 -5655 2501 3380 -4308 1598 5058 -3699 852 6042 -2952 -623
3479 -623 6642 -1902 -1864 5969 -538 -3346 5124 117 -4983 4318 1699 -5841 1295 2162 -5035 38
3495 38 2952 -5636 -894 3761 -4677 -2026 5056 -3104 -2809 4607 -1861 -2901 5150 90 -4211 5250
3511 5250 2862 -3956 4333 4136 -3839 2797 4796 -4058 1310 4787 -4115 -694 5380 -3890 -2851
3526 -2851 4380 -2110 -4567 3824 -1759 -5032 3435 -299 -5928 1960 1488 -5513 1597 2940 -4596
3541 -4596 1383 4364 -4307 482 6330 -3505 -1517 5870 -906 -2292 5659 -42 -2863 5326 939
3556 939 -3982 3750 1923 -4831 2496 2725 -4868 -148 2972 -5795 -1593 3769 -4645 -2641 4753
3571 4753 -2947 -3357 3421 -1569 -3515 4484 -351 -4713 4389 1731 -4545 3041 2989 -3269 2971 4164
3587D164p501N388K666q325L021N483o962n3O084n882j243O987n757k412P510
3602C168l518n474P668m53p376P038J500p509M852L649p620M170N026q153J954
3617a078O454o322m95O855n741k264P563l926m981Q049j512o995O732K2o928N312
3633G45K141p917L948M245p542K659N596p744RP599o067j425P534m060m051Q357
3649D027l005n601P825N1o926N422J978p107M794L567p814K692N648p909K89O824
3665D755n978j952P495n122l630P801l188n947P558q79o367O241J011o615N058
3680B41K438p119L567N016p761J871O631o259j172P363m724l123Q106l771m712
3695c408P619j634o315O232L1o567N526J914p162L299M138p214J082O057o501
$$ plain form
3587 4164 -3337 2051 4717 -3608 -587 4896 -2066 -2119 3965 -1917 -3160 3827 -1930 -4342 3168
3602 3168 -350 -5824 1844 1391 -5985 1053 2553 -4956 -104 3545 -4075 95 5121 -3032 -1078
3617 -1078 5376 -946 -1441 5414 -327 -2591 4972 1046 -3935 4114 2602 -4393 2339 2361 -4567 745
3633 745 2886 -5031 -1083 3162 -4380 -1721 3875 -3869 -3860 3739 -2328 -3753 3781 -279 -4330 4027
3649 4027 1022 -4579 3246 3297 -3629 1793 3771 -3336 1458 5025 -2789 -97 5551 -2358 -2069 4755
3665 4755 -1223 -3175 4320 -802 -4432 3369 181 -5766 1792 913 -5454 787 1798 -4817 241
3680 241 2679 -4440 -873 4143 -3618 -1747 4884 -1375 -2547 4816 92 -3031 5075 1304 -3408
3695 -3408 4211 2577 -3738 2494 2525 -4042 1484 3398 -3764 -465 3673 -3541 -2459 3598 -2903
3710b903j684Q060n136l086P767m029l246P091j363n706O623l00o336N770K373
3725C895p695M387L948p030K117N515o102n00O112n276j337N669l734l783P602
3740C788l219n284O536k87o197N032J500p036M363L485p988L816N828p764P04
3755b723P021n597j534O959m180k899P013k986m372O727o88o553O302J186o233
3770b557L505L073p263L133M082p028J435N614o271q49O377m930k230O996l771
3785f84l734O882j661n978O261P54o412M720K813o429M179L249o341K116N367
3800E102o996J99O552m498k524N807l246l424O665k759m752O113L20p494N841
3815I06J153o588M301K735p041K963M615o282K69O993n573j809O777l983l046
$$ plain form
3710 -2903 -4587 3473 -1663 -4749 3018 -1011 -4257 2834 1471 -4235 2388 2088 -4248 1522 3895
3725 3895 -3800 587 4535 -2495 -378 5137 -965 -1465 4647 -629 -1966 3703 -31 -3814 3788
3740 3788 569 -4715 1821 1534 -4663 369 1869 -5167 -804 2681 -5307 -1491 4337 -3427 -2723
3755 -2723 4298 -1299 -2833 4126 -54 -2953 4060 1074 -3298 3429 2741 -3812 2490 3676 -2557
3770 -2557 948 4021 -3242 -109 3973 -3055 -1620 3994 -2277 -3126 3251 -1679 -3909 3087 -684
3785 -684 -4418 2464 803 -5175 1086 1840 -4572 148 2961 -3468 711 3960 -2381 -265 5102
3800 5102 -1894 -1695 4857 359 -2165 3642 396 -3028 3637 878 -3874 2239 2559 -4935 906
3815 906 2059 -4529 -228 2507 -4534 -1571 3044 -3238 -2969 4024 -1549 -3358 3419 -564 -3610
3830c610P475k633n038P015j108n331N761Q70o639M321L077o707K075M858o903
3845b517Q62N113m558j809O312m713k789P169m146l617P092k005n245N973O22
3860A744n969M489K030o114M305L785p254K685M224n733J22O260n026j646O729
3875D631l873l411O693k290n143N819m23o103M978J882o639L618L195o888K236
3890a718N023o707Q26N595n231o23N429l680j894O257k872m139O877j729m588
3905c174M970J110n566L711L487o706K803M417o577O60N635n999k63N166m247
3920e73k826N965k367m363O456k229m703N366N22n806M183L219o657K747M031
3935B965o042J269N704n272p19O421m225l019O766l068l741O701j652n350N763
$$ plain form
3830 -3610 3865 1232 -3806 3209 2101 -3230 2531 3401 -3238 1083 4160 -2547 -472 4386 -2517
3845 -2517 -1655 3458 -1100 -2909 3403 -1310 -4099 3070 -1076 -4693 2399 394 -4851 1122 1744
3860 1744 -4225 264 2294 -3820 485 4270 -2984 -299 3925 -1808 -1686 4574 -452 -2098 4631
3875 4631 758 -2653 4040 1750 -3393 2426 2003 -4100 878 2760 -3879 -261 2934 -3954 -1718
3890 -1718 3305 -3402 -2576 3019 -2212 -2835 2594 -1086 -2980 3277 405 -3734 3143 1414 -3174
3905 -3174 1796 2906 -2660 1051 4538 -2168 635 5052 -1525 -865 4770 -1229 -1492 3674 -573
3920 -573 -3399 2566 199 -4164 2292 63 -4640 726 1248 -4558 -375 2844 -3813 -1066 2965
3935 2965 -3077 -1808 3896 -1376 -2095 4326 101 -2918 3848 780 -2961 3740 2088 -3262 2501
3950B501Q48o288M511J343o130L165L214o458K479L696n792M82N824n802r42O117
3966B768l031l827O361j886n051O801l61m955M713J815o408M369J955n687K944
3981E20L929o497J587M506m499j513O316m161k767N913l193l728N905j541n493
3996d716N293J088n949M028K233o004L663L223o193J352N514n555r17O329l698
4011c09k154O294k833l807O173j105n617N784Q27o370M608K031o687L321L278
4026C434o570K276M675o120j10N400m275k256N674l645k188N722k051l479N160
4041A647j38n670N495J018n469M017K140n466K751L568n690O56M936l818j887
4056a910N836l680k817N847k961l813N982j065n111M991Q51n743L426K284n793
$$ plain form
3950 2501 3349 -2939 1572 2915 -3215 -50 3164 -3294 -815 2881 -2911 -2429 3395 -2407 -3349 2768
3966 2768 -263 -4090 2271 385 -4666 2135 1774 -3181 1532 3347 -3061 1308 3263 -2424 520
3981 520 4449 -2048 -461 4045 -454 -1967 4349 188 -2579 3334 141 -3587 2318 777 -4716
3996 -4716 577 1665 -4284 -256 1977 -4027 -364 2859 -3334 -1982 3532 -2023 -2940 3389 -309
4011 -309 -2463 3831 998 -2809 3364 2259 -3358 2426 3253 -3117 1491 3522 -3165 156 3434
4026 3434 -3136 -860 3815 -2305 -2415 2985 -1290 -3546 2128 -1517 -3705 2017 -34 -3513 1647
4041 1647 1509 -4161 1334 2352 -3117 900 3040 -2426 325 3893 -1797 -1141 3795 -23 -1910
4056 -1910 3926 246 -2571 3276 315 -3498 2484 1419 -3692 1299 2150 -3593 -167 2117 -3676
4071c676K990L829o554J685M793n090j010N845m125j520O001k615l745N773j329
4086A252m577N617N90n552M071K358o249L244K484n375J516N003o091n14N483
4101C260m019j969N309l317k604N395j519m787M820R48o172M707K026n931L793
4116f0K431m852K228M137n817Q75N492m935j642N753l061k723N219j557m643N713
4132B558j203m446M386M97m993L404K013n713K612L253n749J115M978m755r71
4147c014N392l455k117N855k602l397N786p90m911N950m13n031M350J518n113
4162a992K324L931o109J098N289n801l75N192m009j977N108k580l698O016k066
4177C51m290N087j73n123M046J252m389K423L290n741K223M098n275P38N340m347
$$ plain form
4071 -3676 -686 3143 -3411 -1726 3067 -2023 -3033 2812 -1313 -2833 3168 553 -3192 2581 1252
4086 1252 -3325 2292 2882 -2670 1401 3759 -2490 754 3238 -2137 -621 4382 -1709 -2223 3260
4101 3260 -759 -2728 2581 -736 -3340 2055 536 -4251 569 1517 -4655 52 2078 -3853 -60
4116 -60 2371 -2481 -253 3884 -1933 -1058 4434 -501 -2143 3610 549 -2174 3045 1488 -3155 2558
4132 2558 1355 -3091 1295 1792 -3201 203 2216 -3497 -885 2368 -3381 -2266 2712 -2043 -3014
4147 -3014 2378 -1077 -3194 2661 59 -3338 2448 1658 -3253 2697 2284 -2747 1603 3121 -1992
4162 -1992 332 4263 -1846 -748 4541 -1260 -1635 3557 -452 -2429 2679 99 -3599 2417 351
4177 351 -3939 1148 975 -4148 -102 1150 -3239 -816 2474 -3267 -1044 3054 -2221 -1483 3857 -490
4193d90j810N433l084k004N664k018m995O385j028n070M306J431n545K821K775
4208B771n984K644L570n315M09M361m636o66N414l386k258N097k678k457N073
4223A959j144m127M200J605m679K451K445m916K818K631n091J075M184m127l93
4238a109M756l940j917M704k458l828N840j224m629N143j25n113L574J728m196
4253b794K528J964n435K487M082m844qM741l540j478N960l542k115N331j976l382
4269b021M842k61n717M975J003n022K847K199n346J779M195n859N99M326m357
4284a818p30M489k911k149N124k128l726N383l52n472N388J198n178L119K894
4299C131n678K828K852n085J525M587m366j515N024k820j994M541k602l091N010
$$ plain form
4193 -490 -2300 3133 49 -1955 3709 1691 -3304 3081 2053 -3017 1289 2720 -2825 -4 2771
4208 2771 -3213 -569 3001 -2314 -1905 2456 -2180 -2846 2568 -818 -3076 2021 -657 -3114 1959
4223 1959 815 -3312 888 2493 -2186 265 2710 -2206 612 3243 -1848 -773 3411 -716 -1109
4238 -1109 3647 -293 -2210 2494 36 -3792 2048 824 -3805 1338 1213 -3900 -326 1402 -2794
4253 -2794 -266 1698 -3737 -1250 2832 -2012 -2020 2721 -819 -2297 3663 121 -1994 3337 1361 -2021
4269 -2021 2821 2560 -3157 1818 2821 -2201 646 2845 -2501 -722 3473 -2386 -1787 2539 -1818
4284 -1818 -2548 1941 -970 -3119 2005 -123 -3849 1534 1182 -4290 1098 2296 -2882 237 3131
4299 3131 -2547 281 3133 -1952 -427 4160 -206 -1721 3303 483 -1511 3030 428 -2663 2347
4314B347j237m092M234M02n417M436J845n942L433J851m693J551L258l887q14
4329b725N318l631j268N023k829k566N095j570m177N601M03m971L539K429o135
4344b464L356K084m463J397L611n261k26N250m382j779N354k989k588N275k147
4359B8l254M456j06n084M760O67m438L221K573n575L314L243o077J001M605m228
4375h94o89N057l201j627M131k046l502N156j156m081M462M59n704L942J764n082
4391c011K345K790m829J553L772m646K28M235l661j868N563k030l285N111j311
4406I56l459M952l22n430M536J483m536K467K488m487J011L508l991j061N452
4421C567m206j779M976k430l363N158j736l538M358n35m370M863J086n949L197
$$ plain form
4314 2347 1110 -2982 1252 1654 -3763 673 2518 -3424 9 1860 -2833 -1282 1976 -1911 -2725
4329 -2725 2593 -1038 -2306 2717 -112 -2678 2417 847 -3330 2271 2674 -2297 1242 3671 -2464
4344 -2464 892 2976 -1487 -90 3521 -1740 -1966 3284 -1098 -2877 2477 -512 -3100 2175 28
4359 28 -3226 1230 1124 -3960 800 1467 -2971 250 2823 -2752 562 3805 -2272 -1271 3334 -894
4375 -894 -1583 3474 273 -1354 2777 731 -2771 2385 1229 -2852 1610 2069 -3635 307 2071 -3011
4391 -3011 -666 2124 -2705 -1152 2620 -2026 -1798 2437 -1224 -3092 2471 441 -2844 2267 956
4406 956 -2503 2449 2127 -3303 1233 2716 -1820 647 3135 -1352 -341 3167 -824 -1885 3567
4421 3567 -639 -2418 2558 128 -3235 1923 187 -3351 1007 472 -3898 965 2051 -3898 -701
4436g01K500m525K419K780m598J528L837m503j75M119k444k333N319k324l164
4451b265M527r01m314N548j15n021K619K122m753J727L628n263J148L574l834
4466a573j160N091l667j338M781k395k715M521o87l690M454K93n034M067J438
4481B386n144L124K883n126J493L904m721J88M490l861j856M614k094k695M698
4496B283j694l736M522j64m519L269J717n344L494K029m800K290K614m594Q26
4511a807M329l734n11L880j912k798N827k142l194M319j013l736M023J253n427
4526b643L749J888m890J456K969m623J261L927m062j314M632l260k113N114k558
4541d67k340M449j179l694L840N14m229L308K114m060K136K644m098Q10L294l627
$$ plain form
4436 -701 1799 -2726 -307 2473 -2125 -597 3240 -1263 -1438 2681 237 -2096 3223 899 -2265
4451 -2265 2262 1361 -2953 2595 2480 -2541 78 2200 -2553 -826 2802 -2461 -1313 2261 -1573
4466 -1573 -2733 2358 -1309 -2647 2134 -261 -2976 1545 858 -2832 1622 1915 -3119 948 2386
4481 2386 -2758 366 3249 -1877 -384 3520 -1201 -1013 3477 -384 -2240 2374 280 -2415 2283
4496 2283 589 -3147 1375 1211 -3308 -39 1678 -3666 -172 1857 -2943 -653 1961 -2633 -1807
4511 -1807 2522 -1212 -1723 2157 245 -2553 3274 1132 -2062 2257 1244 -2492 1531 2784 -2643
4526 -2643 1106 2994 -1896 -440 2529 -2094 -833 3094 -968 -2282 2350 -910 -3023 2091 -467
4541 -467 -2807 1642 463 -3231 609 1123 -3106 202 2316 -1744 392 3036 -1062 -252 3042 -585
4557e85p09M945l934j800N158k322l166M590j112l871M542j58m786M148R53m636
4573b743K230K205m475J267L923m750Q39L942l919j350N208k916k270N015j550
4588F56k224L541k58l785L826M55m245K752J499l955J468L135m198P21L831m038
4604h19j428N325l582k129M362j291l328N217j797l564L844N61m627L339J964
4619B047n044K766K986m331M99L776m021k00M269k609j876M158j249k959L684
4634A896m72l667L873k5l755L073O95l857J433L015m809J396L257m577K74M396
4650B146l094j515M460k059k067M084j821k897M488n93l475L447J497m304K175
4665D72K552n015K118K958m441N05L751l518j391M939k821k648M347k106k355
$$ plain form
4557 -585 -1294 3651 -283 -2083 3075 753 -2413 2177 1065 -2806 1736 1578 -3208 940 1893 -2743
4573 -2743 -513 1692 -2783 -1516 2407 -2343 -1504 2438 -1481 -2831 2377 -539 -2809 2206 656
4588 656 -1568 1973 1715 -2070 1756 2211 -2034 718 2217 -1738 -270 2865 -1333 -612 3219 -819
4604 -819 -2247 3078 -504 -2633 1729 438 -2890 2327 530 -3034 810 1371 -3256 83 2047
4619 2047 -2997 -231 2755 -1576 -1077 2699 -1322 -1522 2747 138 -1738 2420 1171 -1788 1896
4634 1896 1424 -2243 1630 1605 -2150 923 1618 -2239 -806 2209 -2600 -1204 2053 -2524 -2250 2146
4650 2146 -948 -2463 1997 -62 -2129 1955 134 -2763 1725 1132 -2343 1104 2601 -1703 472
4665 472 3024 -1991 127 3085 -1356 -851 2900 -618 -2009 2930 109 -2539 1808 -298 -2653
4680b653L991m04m218L687R26m481L227J043l671J432L882m847J411L705l997
4695i67q00M647l343j067L558j337k492M166j479l353M125L54m321L291J685m917
4711b250J977J740l225R84L348m173r1M108l481p84L084j816j835M043j645k623
4727b639L942m78l258K708K157m700K448K431l883J802K448m218M22L816l454
4742d56r64M080k582j546L280j379k336L577r20l664L783O04m678K718J936l997
4758b544J599L445l930K46L635m188O12L590k543j818M223j401k684L642r00k702
4774a718L137P75l619K272J240l564J776J894l944R95K660l549M4L410l352o14
4790b157L861j887k576L809q26k882K857L57l503L394Q00l444J938K921m287J530
$$ plain form
4680 -2653 1338 934 -3284 403 1329 -3152 75 1118 -2553 -1121 2761 -2086 -675 3030 -967
4695 -967 -1767 2880 -463 -1530 2028 691 -1801 2365 886 -2467 1658 2012 -2309 982 2667 -2250
4711 -2250 -273 1467 -1758 -774 2574 -1599 -1690 2418 -1063 -1847 1237 -579 -2414 1629 -16 -2639
4727 -2639 1303 825 -2433 275 2432 -2268 180 2611 -1272 530 2978 -1240 -818 2998 -456
4742 -456 -1420 2660 78 -1468 1812 433 -1903 1674 754 -2910 873 1477 -3201 -483 1453 -2544
4758 -2544 -945 2500 -1430 -1184 2451 -1737 -1125 2465 -78 -1896 2327 926 -1758 1884 984 -1718
4774 -1718 1419 2194 -1425 847 2087 -1477 299 2193 -1751 -756 1904 -1645 -1601 1809 -1543 -2157
4790 -2157 1704 -183 -2759 1050 224 -2658 199 556 -2947 447 1247 -2197 -259 2662 -1625 -95
4806i5K356l456O7L898k520j306M190l047k188M668j149l385L724j040k894L212
4822A035O82m202K013K411l613P53K553l925J165K880l177r6L413k505j962M643
4838B068j471k700L696p64k637L558m5l852L202J512m347J783K410l683R52K819
4854B501l764r2L881l534q43L337j471k179L162n99k627K940L98l491K427J485
4870A531l995K535J185l124J510K861l917P40L398k493j050L561j847k250L308
4885A953p41k414K206p6k974L313M49l549J301K178l317J159J721k745J81L430
4901B075l044j503M578k385k350L605n34k569L448n21k753L205Q20m165K230K098
4917B235l406J303K484l393K35L145l597k49L191k105j456L863j586k431L046
$$ plain form
4806 -95 2261 -1195 -1128 2770 250 -1056 3134 87 -2101 2567 1418 -1967 1757 717 -2177 1035
4822 1035 1717 -2485 -472 1939 -1674 -921 1632 -2293 -1128 1752 -1425 -1521 1892 -613 -2575 2068
4838 2068 597 -2103 1593 829 -1808 1750 1705 -2147 1055 2567 -1780 3 2413 -1270 -318 2501
4854 2501 -1263 -1355 2526 -1008 -1851 1486 15 -2164 998 399 -2228 712 1110 -2381 46 1531
4870 1531 -2464 71 1256 -1868 -358 2503 -1414 -674 2724 231 -819 2742 895 -1355 1953
4885 1953 1212 -1202 1004 928 -2046 1267 1716 -1833 -532 1646 -1671 -512 1209 -1536 -1355 2075
4901 2075 -969 -2472 2106 -279 -2629 976 442 -2127 1321 800 -1953 1252 2072 -2093 137 2235
4917 2235 -1171 132 2616 -777 -542 2603 -994 -1243 1948 -157 -1613 2250 664 -1767 1279
4932A279q34k972L359k35l320K949J165m218J590K628l161Q99K542l014M5L165
4948A867k332o06L457j330k523L437l59l475L951p85k703K529M12l641K049J976
4964A924l240J123J867l222N11K673k617p64K990j863j353L171m81l079K990n
4980F25k606K254O15k803K064J961l186O72K179j751m91K670l260OL056j999j523
4997a517L466n21k782L185j742j770K249P57l535K120J417l136O62K799l290R37
5013g01J772j988l75L358k430j383M151k086j742K779k60k777K643Q12k827J702
5029F48J143l536J521J931k661K45K844l226K04J814j138j751K582j019k106L386
5045H81o73k760L022R16l701L017L74k330J586J292k407Q77J661k410M57K787
$$ plain form
4932 1279 445 -2527 832 597 -2723 226 1391 -2827 -1237 1391 -1770 -871 1671 -1343 -1298 1867
4948 1867 -465 -1071 2386 1056 -1467 1970 1611 -1864 2087 1302 -1401 1128 1540 -2101 -52 1924
4964 1924 -1316 -193 1674 -1548 -1037 1636 -981 -1745 1245 -618 -1971 1200 719 -2360 630 625
4980 625 -1981 273 888 -1915 149 2110 -1076 -404 1775 24 -467 2203 -1057 -1051 2005 6 -1517
4997 -1517 1949 1428 -1354 1831 89 -1681 568 1325 -2210 -90 1327 -1809 -1147 1652 -1638 -701
5013 -701 1071 -917 -1292 2066 -364 -1747 2404 318 -1424 1355 1095 -1682 961 1773 -1054 648
5029 648 1791 -1745 -224 1707 -954 -709 2135 -1091 -887 927 -211 -1962 620 -399 -2505 881
5045 881 208 -2552 470 1386 -2315 702 1076 -1254 332 1624 -783 94 1755 -655 -198 2589
5061B589k821j070L844j922j839K744j334j387K108M11k904K917k09l044J653
5076b64J691l005Q84K209l332O27K939l147j02L221k534k26K197n72k192L440
5092A834j254k131K379P57l692L275O43l198J592J577l021J207J689j860p13K487
5108A571j986j202L372j356k396K992o73k293K642o88k386K832L91l228K045J706
5124A343k440L16K845l249P32K215j652r91K968j492j517K433j76k859K977q7
5140A366l084L087k52l228K107J772l414J290J911k262k8K176k347k04K448k232
5156h94q07K902j452j679K843J10k714K907Ok474J831Q68k628Q89K258k151P27
5173E42J496k542O00K299k613r77K761j081j546K513q89j800K085k31l007K173
$$ plain form
5061 2589 -232 -1302 2542 620 -1219 1525 191 -1196 912 1323 -1581 1336 1127 -1917 -264
5076 -264 1427 -1578 -694 1515 -1817 -1190 1749 -1398 -1500 1721 -813 -1039 1158 586 -1606 1834
5092 1834 580 -1551 828 1585 -2107 1168 1811 -1387 205 1782 -1239 -32 1657 -203 -916 1571
5108 1571 -415 -1617 1755 399 -1997 995 322 -1971 671 -17 -2403 429 820 -2408 -363 1343
5124 1343 -1097 -781 2064 -1185 -453 1762 110 -881 2087 595 -922 1511 1335 -1524 1453 1366
5140 1366 -1718 1369 1117 -2111 -4 1768 -1646 -356 1555 -707 -735 1441 -906 -1110 1338 -894
5156 -894 -1701 1201 -251 -1930 913 1023 -1691 1216 1222 -1252 579 1447 -1181 -292 1966 -185 542
5173 542 2038 -504 96 2395 -218 -1195 1566 485 -1061 1452 563 -1237 848 617 -2390 -217
5189b17J209k591J152J933l135J152K060k767P3K800k545m50L110j287r29J506
5205A074l54j447J709J33k045J505J137l067J709J159k712J258J699k657L45K060
5221A506k533m42K398j419j443L197j240k259K772O5k041J758O25k503J366J758
5237A565l003R84K490k402R5K018k049r02K970j855j050L156j872j569K363k57
5253F82k006K375J98l140J398J960k977J475O03j689L84K383k762m01K993j685
5269b09j041K281p81j545K507o37j484K540j70l009K614N22k879K125O40k338
5285h64J053J520k372n2K047k076n25K970j761j302K286j087j275J654N70k590
5301a804K284L97k638J404J633k614Q68J185q06m85J758j727k25K160j204j188
$$ plain form
5189 -217 992 -1599 -447 1486 -1649 -497 1563 -1204 -1131 1669 -876 -1326 1784 497 -432 1074
5205 1074 720 -727 982 1115 -930 575 1712 -1355 354 1513 -1199 59 1758 -899 -554 1506
5221 1506 -1027 -1469 929 -490 -1933 1264 24 -2235 537 602 -1439 319 944 -1559 -193 1565
5237 1565 -1438 -454 2036 -366 -271 1747 -302 -1204 1766 -89 -1139 2017 145 -1424 939 682
5253 682 -1324 1051 1249 -1891 -493 1467 -1510 -35 568 -1121 -737 1646 -1116 -1517 1476 -209
5269 -209 -1250 1031 250 -1295 1212 575 -909 1631 1461 -1548 1066 1588 -1291 834 1474 -864
5285 -864 189 1709 -663 -715 1332 -744 -1269 1701 -60 -1362 924 -163 -1438 216 786 -1804
5301 -1804 480 877 -1761 -357 1276 -1338 -470 715 -91 -576 1182 -545 -770 1390 186 -1002
5317a002K180n94j590K277p60k078K002O87k657K146N09k414Q25J823k498K0K250
5334A126k563j4K293j650o92K773j202j793K894p28j996K304M50k303J986R50
5350A835l105R70J780j914Q8K232k822L31K141j801p97K434j424j742K838n82
5366D62k191K032J90j712J240P16j877R46J229k232P88J810k480N18K086j879
5382c54n66L097j925j029K054m02j364J551J54k072J252N24j801J066O11k075
5398a279R10J575k226L43J712j668n52J816j231p21K454j311j348K097K13k637
5414a853K275L65k182J466J536k864J225K225l164N50K151j102q44J312j558Q9
5430c73J734j063k297L197r03j362J426p2j996J608J457k866J187J564k590J329
$$ plain form
5317 -1002 1178 584 -1006 1271 511 -1567 435 1122 -1535 611 1120 -1294 -469 1354 -1144 -1124 1126
5334 1126 -1437 -1451 842 -808 -1500 1273 71 -1722 1172 444 -1552 752 1202 -1101 885 1835
5350 1835 -1270 -300 1480 -434 -346 1886 -936 -605 1536 -265 -1062 1372 -52 -1794 1044 462
5366 462 -1729 303 493 -1219 21 737 -1140 -194 1035 -1197 -409 1401 -1079 -561 1525 -354
5382 -354 -920 2177 252 -777 1277 875 -489 1062 1216 -856 396 920 -881 185 796 -1279
5398 -1279 -369 1206 -1020 -677 1035 -633 -1185 631 -600 -1321 1133 -178 -1526 571 784 -1853
5414 -1853 422 787 -1395 71 1607 -1257 -32 2193 -971 -421 1730 628 -216 1096 -462 -373
5430 -373 1361 298 -1999 1198 295 -1067 359 287 -1709 -101 1356 -1510 -323 1241 -1349 -20
5446b0M75r51n5K105j725n05K182k040o43K623p78k200L351j569o46Q77P84k434
5464a169J531R49k246P89J243j823K19J708j932K54J627j719j033K783j041k452
5480b312L253o90k411K684L42k166J741N92j974O45J950k007j97K272j854m09
5496e41K302j728r60K086n30j622K677r82k208J828K50k102J966O95l329K055
5512a43J841k686O34J638j789m71K237j514o60J922j520r81K021K55j688J681
5528G77M75j735J359N12k429R80J466k112O51J333j659o28K568j489j398J868
5544E39o03j299J701l97j095J529l65j676J642J77j284O15J725k676J130J338
5560A001j531P9K073j707l80K194j529q53J984r52q89J806j022j135J466L12j913
$$ plain form
5446 -20 455 -496 -551 1554 -171 -676 1506 -534 -1177 1446 668 -1532 1819 250 -396 481 1265 -1169
5464 -1169 362 1311 -935 -146 1097 -726 -507 1201 -731 -477 1150 -569 -1602 1181 140 -2312
5480 -2312 941 251 -2160 524 866 -1300 441 1033 -941 -296 1654 -353 -550 1722 -132 -541
5496 -541 1761 33 -927 1159 629 -993 1684 702 -1506 322 572 -1530 436 1131 -2198 -143
5512 -143 1698 -988 -354 1284 -505 -976 1261 -253 -913 1009 -511 -1492 529 784 -904 777
5528 777 1252 -483 876 1388 -1041 -61 1405 -707 -56 1277 -382 -1010 1558 69 -1329 539
5544 539 -64 -1363 338 -59 -1154 375 10 -1666 -24 153 -1131 -516 1209 -1467 -337 1001
5560 1001 -530 -451 1622 -85 -465 1729 200 -653 1331 379 -510 1296 274 -861 605 917 -996
5577i96N67J531k549J228N69j330O2K040k076N6K275j891q46K369j398l66J601
5594H46j51k567K725M43k966K010O66k085Q76J212j960K62K307k488J18K168k050
5611f34j53J863j167j319K003m85j964K199O3k174J443J064j814O05J709k682
5627a443J594J448k505L82J487j625l09K738j668j226K138l02j514J664L87k629
5643a383J156J753k266J042R44k269M95J887k475O94J229j703k03K165j973p06
5659a613K461r52j820J789N07k032J906N85k178J706K41n25J79J226k166L69J336
5676A019n32q19K002j447j185K227j151o05J499n43j820J079J1r94R08J294k219
5693a276Q28J513k685J005J542j934L11J303j237m88K097o11j550K127p61j207
$$ plain form
5577 -996 -429 1102 -1447 -219 350 -980 -918 1122 -954 -898 1377 -514 -1360 1009 -389 -755 846
5594 846 695 -1872 853 1296 -1670 340 1006 -1079 -203 1009 -951 -689 1618 -870 -752 1416 -634
5611 -634 -787 1076 -91 -1410 593 108 -1856 343 406 -1768 -325 739 -1075 -470 1239 -1443
5627 -1443 151 1599 -906 -524 963 -662 -971 1767 99 -1127 1011 709 -805 859 1246 -1383
5643 -1383 -227 1526 -740 302 1246 -1023 -528 1359 -1116 -422 807 -896 -1099 1066 -907 -1613
5659 -1613 848 -104 -1924 -135 372 -1660 246 831 -1347 359 600 75 254 1480 -686 -317 1019
5676 1019 487 -332 1670 223 -962 1265 114 -491 1008 465 -1355 -276 -265 -1259 -351 943 -1276
5693 -1276 -448 1065 -1620 -615 927 -1007 -696 607 -630 -1118 979 368 -1182 945 184 -1023
5709a023J380N13j986J558Q27j823O91J389k835N82K160k169k37J931j502j089
5725a633J897n14j017J517k94j294J376L79k068J385P40j093O86M11j444M54K480
5742A968k729O33J361j420l72K189j654j198K187p75j275K275j36j867J214j04
5758B97j518J100Q09j343N29J069j654l4J950k140n7J376j127o28K869j561j221
5775a284K294o34j991J876N60j929J471Q85k461J264J275k362R38J607k013m61
5791i65K367j442o81J991j319p78K190r73j520J367j39j263J484M60k159J702
5807C22Q79k782J191J028j214J40J419j202k0J055m80j451K236K34k347J484K89
5824G81j600J536j21j290J399N78j957K31J463k002J75K132j345j157K228j264
$$ plain form
5709 -1023 357 870 -1116 442 1269 -554 137 1526 -1309 -727 1433 -736 -973 958 -544 -1633
5725 -1633 264 -250 -1267 250 -44 -1338 38 417 -1651 -266 474 -619 67 478 -966 -512 1968
5742 1968 -761 -128 1233 -187 -559 1630 -24 -1222 965 190 -1085 1190 1054 -813 401 297
5758 297 -1221 -121 688 -655 -126 943 -711 -745 1205 -935 -992 384 -743 -1371 1498 -63 -1284
5775 -1284 1010 376 -1615 261 821 -1108 363 1248 -1213 51 1326 -1036 -98 1509 -504 -965
5791 -965 1402 -40 -721 1270 -49 -827 1363 390 -1130 237 98 -1165 319 779 -1380 322
5807 322 1201 -1581 -390 638 -576 -436 983 -219 -239 816 336 -1115 1121 1355 -992 492 781
5824 781 -819 717 596 -694 705 1283 -674 -443 1020 -982 -807 1325 -20 -1177 1051 -213
5840b13o36J937j697n28K494j012j725J737K99j445J188N20j976J645J80j127
5856c59N06J198j746n8J947j050j345J502j4j833K413j044r62J433L3j928J840
5873E33N38k552J504Q06k238J235R74j124r44K103r83l10J523r13j086J844n12
5890C98j034J515k12j549J702k68r45M46P98r68K55R61k087k93K793k429k62J937
5908G58j269r84J956n09m60J089O7j757J106M96j522M41J026j209J019L99j201
5925e54M64J051j626k76J975r49o42J149m90o11J313j81j414J213M41k336J558
5942H5L65p73J01R36j235L65J717j766m13J421j397n33J693o34n54J523m45j863
5960a407K092j54j696J357J091k035K31J756j798L49K155k436j07K276k177j74
$$ plain form
5840 -213 -849 1088 -609 -1137 1357 345 -1380 357 656 -789 399 919 -1057 588 768 -359
5856 -359 147 1345 -401 -459 1488 438 -907 595 581 -1252 1161 117 -845 588 621 -1307 533
5873 533 1071 -1481 23 829 -1409 -174 800 -324 -1268 835 -148 -458 1065 152 -934 910 398
5890 398 -636 879 667 -882 820 552 -393 53 851 -117 138 1099 -988 -1281 1512 -917 -1179 758
5908 758 -511 -1495 461 -48 -508 581 648 -1109 -3 493 -1029 -588 438 -771 248 647 -554
5925 -554 -90 961 -665 -941 1034 85 -557 592 102 -509 804 623 -791 422 863 -1473 85
5942 85 450 -323 -222 714 -521 -156 1561 -205 -618 803 -594 -1127 566 -68 -622 901 456 -1407
5960 -1407 685 531 -1165 192 1283 -752 -521 1235 -563 -214 1941 -495 -602 1674 -503 -677
5976f77J829j961m0J150m19j492J688J109k695J071J361j668P15J335k536J268
5992C8M68j232L68J729j558k78J668j104j060J733k46j469J715J0j907J538P39
6009A152k572J156J081k247J620N84j529N6K005j671j012K304j591p8K067j717
6025c92j032K448q07j580J998n46r84Q04J136j879N27J643j520J83Q03j047j98
6042d43J753j593r96K006j11j424J228l84j474J725K2j619J287J320k237J148
6058B08L29j446L46J264j596K06J714j070l38K063j235j539K415m93j736J189
6074B81R57k446J589K56j730J111J000j512J77J665j598p0J211j265j000K578
6090A204k013J32J087m20j008J640n09k101K367P10j844J295lj553P49J340j919
$$ plain form
5976 -677 1152 -809 -849 301 -118 -1610 78 1187 -1508 -437 924 -744 -29 1306 -1230 38
5992 38 506 -726 -358 1371 -187 -465 1203 99 -961 772 526 -943 772 782 -1125 413 1152
6009 1152 -1420 -264 817 -1430 190 774 -755 -699 1306 -365 -1377 927 -664 -742 1325 -392
6025 -392 -1424 1024 217 -1363 635 89 -895 -91 1045 -834 -307 1336 -184 -1 802 -245 -443
6042 -443 1310 -283 -1279 727 616 -808 420 36 -1438 287 309 -1310 -23 1297 -940 208
6058 208 537 -909 -563 701 -895 -689 1025 -45 -383 1680 445 -1094 1321 828 -908 281
6074 281 1238 -1208 381 637 -1093 18 1018 -494 -317 1348 -250 -320 891 -374 -1374 1204
6090 1204 -809 -677 410 -10 -1018 622 113 -1988 379 1089 -755 540 537 -1016 -267 1073 -846
6107h46O45J556j451n38J738j479p15K319j474p41J465O03k356J659j18j992K139
6124D14L27k040J156R50j847R14J166k634P94K260k194o88K441r04r27J779o20
6141C47j450J712M2j654J223O27j685J008J296k184O51O28o80m86J526q97j121
6158a097J985n36j668K231j084m97P34N41j391Q27L07j373Q33M97l14K18J363
6175A576j817m39J844r95J5J060j723K03J749j461r65J865m89j481K016j05j832
6192i79J232O39k461J054J266j780Q08Q58j377K67R90o21j024J774l55j083J097
6209C05J05j839K066M63k027J503O63j433J38Q62j645N88J331j787M89J611j285
6226A08m73J139o32p28P96l36j069J843j14j834J413L02j291Q49O39k167J455
$$ plain form
6107 -846 -201 1355 -96 -634 1104 -375 -1090 1229 -245 -986 479 1082 -1274 385 267 -1725 414
6124 414 741 -1299 -143 807 -1040 -126 1040 -1594 -800 1460 -734 -1422 1019 115 -812 967 347
6141 347 -1103 609 651 -1003 220 847 -838 170 1466 -718 -67 561 -119 -605 921 24 -1097
6158 -1097 888 352 -1316 915 -169 -666 68 609 -782 45 352 -1021 -188 309 -5 213 1576
6175 1576 -241 -680 1164 169 184 1244 -479 -276 1473 12 -953 912 423 -1058 958 853 -979
6192 -979 253 892 -1569 -515 751 -1029 -221 637 -740 -473 517 -104 -1128 646 291 -792 305
6209 305 410 -1429 637 1100 -927 576 1239 -194 -56 806 -839 -251 1080 -707 -218 1393 108
6226 108 -365 774 142 -586 210 -126 -1195 648 534 -1300 113 415 -876 -27 612 -1555 -100
6243a00Q86j776O30J350j503k58J820j199j059K079m20j087R25K99j247J032J327
6260A699k381N33J111k097Q47P15j070Q03P69j651j11J898j294j137K073o57j400
6277a350J805k91j277J687N7j658J267J312k532L72K153k152P26J275j264n50
6293d20J800j656o76J804m37j093J135m6j213J204j10j483J334Q04k307M18J453
6310E11j919J147J034j145n07J593n59m75J253m30j138J328k47j214J496p2j374
6327g18J268M91j612N0J634j642P50Q42j936M89N44p36p68K148q57j702K279p30
6345b06q22R57K92j398K020n55j112O27P21j821O79K273j699k55K024j707k21
6362b03J388j388n37J641o10j034J228j54r47J363m80r20J186L27k143J315R46
$$ plain form
6243 -100 786 -990 -360 990 -513 -771 1049 -150 -1209 870 450 -637 288 587 -660 372 1699
6260 1699 -682 -149 962 -1135 -288 427 -643 160 929 -722 -833 1065 -229 -1366 707 50 -1350
6277 -1350 455 164 -1113 574 631 -1027 240 1552 -980 -608 1545 -607 119 1394 130 -420
6293 -420 1380 -276 -952 852 415 -678 457 411 -802 402 292 -1191 143 947 -1360 -942 511
6310 511 -1408 -261 773 -372 -879 714 155 -320 933 503 -635 693 446 -768 728 656 -718
6327 -718 550 1041 -571 -521 1113 -529 221 1063 -873 -384 160 -576 -1344 804 -53 -1755 524 -206
6345 -206 -1028 -71 221 -1177 843 288 -824 -197 524 -1297 -618 1655 -44 -299 1725 18 -203
6362 -203 1185 -203 -740 901 291 -743 485 331 -616 747 267 -653 533 860 -1283 32 978
6379I78j616L11J063j025o75J767o31j395J504j29q10J073j59j571J918J87j836
6396a046J536J274k234Q73R24j921j23J508q57K10J051j580p0J238p70o18Q00
6413A95j72j069J359l01o70J107o0j549J366N66j605M62J859j694K66J163o50
6430E73j133J320o47j221K274o29q93J071R4j307P75O73k072J223M96j747J397
6447B47O93j269k10J090p31n99J757j196q02J734j313q08K654p09j135J223N1
6464F77j223Q04R35j885J008N91j273K28J294j641p3J720r11n70J090l12j260
6481h01J414m95n76J436n72j683J341P90j652O27J239j971O10J071j138j48J519
6498A011j352n81J481m96j487K561q00j094J134r3j102J675n06j278R65K46o85
$$ plain form
6379 978 -638 -327 736 -289 -964 803 172 -1223 281 152 -658 415 256 -1315 603 790 -1046
6396 -1046 490 1764 -470 403 1327 -594 -717 791 -66 144 1195 -385 -455 783 13 -605 195
6413 195 23 -1046 313 12 -658 449 389 -1160 206 772 -833 -371 1488 -206 60 1223 573
6430 573 -560 760 113 -1108 1166 537 -356 715 809 -498 277 950 -1122 101 597 -1150 247
6447 247 940 -329 -539 551 -180 -779 978 -218 -1020 714 -599 -1407 1247 538 -597 626 677
6464 677 -546 258 1193 -692 316 907 -366 -138 1156 -485 -558 1162 251 -319 771 459 -801
6481 -801 613 118 -458 978 406 -1277 64 854 -798 -171 1068 -903 -293 778 -360 -508 1011
6498 1011 -341 -922 559 63 -1424 1137 337 -757 377 284 -818 857 351 -927 38 284 -401
6515d01m53J253j333K08J777j915l45J795j180J54L57j65m78O96N1r90P84P72
6533E87j255J056P72j757O63M84j260M98J519j476l23K120j467r29J206k61q35
6550f58J058L00j643J419O71k492J640N77k511R08J813k165J10J706j284k86J456
6567F19p19n66Q04J82m85O81l66n71J182L44j852P51R7m95L87O27r08K90Q47j287
6587d38l49J458m94q53J551j198p75J113m5p69J000J52j764J847O1r91K11J101
6605H18j175J39Q63q51N14J188j657n72J903j307l99J778n84j009J593q47j026
6622f31Q61R04k033J495j71j228P20N98j151J07R32p36q01J331l45r05K025r97
6640b5j037J186Mq95J279j42j265J307K47j555Q85R93k182J269Q71j414l1J039
$$ plain form
6515 -401 -854 399 -934 -726 1051 -864 -1209 586 -594 -440 -83 -248 -726 -30 21 -969 -185 587
6533 587 -668 388 1160 -597 66 550 -710 -212 1307 -169 -492 1628 161 -768 438 177 -658
6550 -658 400 700 -943 476 1147 -1345 295 872 -1639 -731 1082 -1083 -973 733 -551 -837 619
6567 619 -100 -666 138 320 -165 516 150 -421 761 1105 -747 4 101 -394 -7 620 -288 2 849 -438
6587 -438 -787 671 177 -676 875 -323 -1098 15 -30 -799 201 353 -1411 436 497 -494 -283 818
6605 818 -357 -218 645 -206 308 1496 -161 -733 1170 -137 -536 1242 658 -351 1242 395 -631
6622 -631 230 1134 -899 596 425 -803 -83 515 -636 -529 403 -333 -1134 197 -148 -1053 972 -25
6640 -25 -1062 124 128 -767 512 370 -895 412 659 -896 -11 982 -1200 69 940 -474 -505 534
6658E34k92m34J319p47q95J047m81r40R02Q1j127J853l74j250Q87L62j517R75
6676i7R58j748K93J421r65l55Q98p46p51J977l10j218R62J36j516J899k60j683
6694a105J322N78j102K46Q58j889R43Q48j276J19P31o31m77J350m98r80J483n05
6712A5o73J276J3j318k5K050j959M12J261j364j33J025k74r75J396o51r31J408
6730E53m22o45J599j187j295J747L91j725R61K29r22R27L91j730K37J587r35n91
6748h30J893j099o49J500q30o33J110P7j277J566o94m04J379n11j576J151R40
6765A113j704K27J014p69l41J458o47j132J291j039r81K399l82j756J063M44j188
6782i30Q38P47j758Q88J091j851P58J620k379J024R60j552M37J134j191j60J666
$$ plain form
6658 534 242 -192 1127 380 -515 532 51 -889 13 94 -1033 820 446 -804 83 445 -1072 -97
6676 -97 861 -887 -594 827 -138 -493 405 -341 -1092 885 575 -643 319 455 -1061 838 578 -1105
6694 -1105 217 795 -307 -61 797 -1092 -149 699 -577 -458 273 -358 -835 515 17 -963 520 15
6712 15 -658 618 631 -687 -712 1338 -621 -209 1052 -312 -445 580 306 -669 727 76 -855 553
6730 553 131 -514 1085 -102 -1397 350 741 -984 -23 206 -716 211 602 -1128 -891 696 -239 -830
6748 -830 1063 -36 -685 815 -15 -648 462 539 -738 828 134 -270 1109 598 -978 173 1113
6765 1113 -591 -364 650 -119 -460 998 351 -781 510 -529 -1510 889 507 -1249 -186 258 -930
6782 -930 -92 655 -1103 -215 876 -975 -217 1403 -976 48 1008 -544 -107 1027 -164 -324 1342
6799A342j576q05K141p64j001J082O02j445M64O29j734P27J078j273o8O73o22
6816e50k99J308p94q15J745r59m48J701o86r83J235L04j126Q29l60m58N36Q45
6834A025k355J359J253j296n91J345m76p18J332j516J2J421o63j124J208l76r44
6851a104J133N45j861Q15O39q04N70N64j475N82J711j242n78J021p47J40O65j08
6869D66r79O42J45q69J096k1r35J73P98j133L77O10j465J35J309j369J94J159
6887C33r59j31R80o56k87J331j45j503J693%j336Q36O58j656M23P34m39OL59j03
6907A38m40J340j083k63J319j324q00J919p99p05O41N11j321J231L82j378J78
6924d54R76j511J166R5j325O81J350j491K67O35o0j037J843q32q53R32M61j517
$$ plain form
6799 1342 -234 -1039 1102 338 -663 419 1021 -424 40 669 -1065 -338 740 -533 -601 72 -550
6816 -550 -849 459 -335 -1150 595 -364 -812 889 203 -780 455 759 -367 462 102 -356 180 1025
6834 1025 -1330 29 1282 -14 -605 740 264 -454 878 -638 -626 795 132 -992 216 -160 -1104
6851 -1104 29 574 -1287 -472 167 -637 -67 497 -978 -396 1315 73 -505 516 -231 -91 574 466
6869 466 -513 129 274 -595 501 480 -455 -282 516 -617 -240 370 -1095 -960 349 -1020 -826 333
6887 333 -626 -757 223 -433 -720 611 466 -1037 656 656 -680 156 814 -842 -419 315 -124 -118 241 138
6907 138 -302 1038 -45 -308 1011 -313 -1113 806 7 -698 -57 454 -867 364 746 -632 -454
6924 -454 522 -989 177 272 -1053 -372 978 -513 -246 389 329 -708 1135 303 -550 382 843 -674
6942f74J003m4q82J264O23j926M88R96j313o21J837p05q59J777j386k78J148k98
6960A50j173J386j0j199J058Pj462J283J99o02J54R21m84j71J213j293l70J662
6978A269j159m32J277j071q61J683o53q48J462j073l39L36Q09j040R61k9j197
6995i05N98Q85r55m19J474j087J39O59n95m96J273q6j060L11O01m17N84Q7q51
7014b60O87K46j196N01N10j267M01P72j007j20J390p03m23J525j140p56J508l74
7032B94j132J140M19j578J141j31q16M65J099j572O61J073j422j17J185n46k31
7049f8R40q70n3N16o2j204J455j73j110P41J63n67L26R20k231J032J042j966O19
7068e50O86q86mJ071j56j066J155q9j242J414M95j804J370O72j787K39J204j050
$$ plain form
6942 -674 329 285 -597 667 1290 -636 -148 848 -465 -1086 751 46 -813 964 -422 -700 448 150
6960 150 -1023 363 353 -846 212 219 -1243 40 239 -363 -209 712 228 57 1270 -23 -393 1269
6978 1269 110 -322 955 -116 -977 706 53 -795 667 -406 -745 -409 400 -640 321 292 -905
6995 -905 -307 578 -377 -796 678 -409 -270 389 -206 -702 571 485 -575 -264 337 -80 504 591 -260
7014 -260 427 673 -523 -22 488 -779 -378 394 -613 -733 657 -46 -469 1056 -84 -840 668 294
7032 294 -838 302 721 -857 284 153 -663 -198 901 -671 -10 1063 -359 -476 709 163 -68
7049 -68 872 2 -51 465 403 -801 654 481 -629 112 275 -292 34 954 -1277 -245 797 -1169 -550
7068 -550 136 -750 -754 317 161 -905 250 161 -1081 333 828 -976 394 1066 -721 -482 722 -328
7086c28O98N56n05q15J130q67J65Q68r65k23R18j4j099J004k65j117M36J136j546
7105h33P93N32j359L19J230n51o71J437o78p21J496p75q19J157j18q37J021o44
7123b1m65R51j3j240J712j3j212q7P15p96J84J008j232n83J348j084P6J131p32
7142c53j117K564j418j189J455N88k024J773K59j473J308K28q00m37J600o84m92
7159b12R56j71o26J048r40o46O67j73k42K95N97j534J510L69j421N63K72j097
7177g85K09J557k007N45R50r51j76J809p17r52J293r39l54R97K71j390O74O40
7195F74j181O78K89j392J056Q86j667L83P80o8q98J015r75k79J245o66o57O98
7213g9K35j255J393k47j020J357P69j621M68R30p77p73R12l74p9P04p84o35J774
$$ plain form
7086 -328 370 926 421 -394 736 -131 34 902 -63 -286 632 618 -481 523 258 -859 -423 713 -833
7105 -833 -40 492 -867 -548 682 131 -540 897 219 -502 994 219 -600 557 439 -398 623 -21
7123 -21 -486 465 452 -788 924 911 -301 -388 327 -469 -285 723 -509 -1092 256 -828 -752 379 -353
7142 -353 -1470 1094 -324 -1513 -58 530 -1494 279 538 -935 373 601 -199 -636 964 280 -212
7159 -212 744 573 -53 995 55 -591 76 -97 -339 -44 553 -981 529 898 -523 40 312 -785
7177 -785 -576 981 -1026 -481 469 -482 -658 1151 434 -518 775 -164 -518 479 750 -640 34 674
7195 674 -507 171 460 -932 124 1010 -657 -274 506 438 -460 555 -420 -699 546 -120 -777 -79
7213 -79 156 -1099 294 47 -973 384 1153 -468 0 930 153 -620 292 -82 -161 543 -241 -876 898
7232H98p26q31J538p01j220J714k04j078J103M57j705N05J106j546J92R66q02
7249c34k61J064m15o43J187q50m16R32l54n06J048J20j262J355L51j984J296N66
7267H94j608O77J090j087q3P10m78o99J355r65n43J259q62r00J842L1j696J488
7285D25L77k005R50J039j586O53J126j781O78J033j314N58J246j120j389J815
7301G05n35q29J557q91m48Q32M11j613J142O20j908J016N70q93k83J233p66k18
7319b98J445j815l4J517j389K06O76l09m74Q55q6q67M87J021j122O49N50j238
7337b26K96P90r89K42R56j133q60K036j053r51J119n28n43J359L04k148J606l
7355B74j855J250J552j776M02J069j384M70J253j550m40J172p18j66J217o97j504
$$ plain form
7232 898 172 -659 879 178 -1042 672 468 -610 493 950 -755 -250 856 -690 -498 468 -334
7249 -334 -595 469 54 -589 598 -252 -668 264 -90 -596 452 572 -690 665 1016 -968 328 894
7267 894 -714 -37 1053 -34 -117 593 115 -584 771 -194 -737 522 -340 -1240 602 633 -1063 425
7285 425 802 -1203 -253 786 -800 -147 979 -802 -124 909 -405 153 1399 279 -1110 705
7301 705 170 -659 898 7 -441 391 802 -811 331 951 -957 59 629 -264 -547 686 -80 -298
7319 -298 1147 -668 -702 815 -574 -368 308 -1 -475 380 294 -573 -86 935 -187 462 1012 -226
7337 -226 70 860 -129 113 1069 -64 -924 1112 59 -892 227 -301 -844 515 819 -1329 277 274
7355 274 -1581 -331 1221 -555 -153 916 -468 2 1255 -295 -735 437 -281 -447 770 73 -1431
7372a431K085l43j046J628J16j358J006J08j602J585l4j256L88R67j524N74M10
7389B73q3p36J523j087j325K224l84j234J127k71j159Q01N70j038Q34O23q14L44
7407A88O25j501P48J230p70p28J213q90j76P12q00o78O52J128j772R89P43j751
7425h38J106K67j653N10J443j521J41J654j815k63J715p80J7N36m96p16J380m08
7443B79m34M37L24j144J025K68j315P65J106j308l60J514j966Q24Q40j243J99
7460a89N75j068m60J791m42r52J490m63j022N89P81j596J234O91j521O04R10j283
7478c31K82J566j689q44J505n47l63J235r71r17J858k83p22N35M91j518j20J794
7496I61j880K68J111o27j005K068j222n30J446q60n32J408n0j953J857j49p44
$$ plain form
7372 -1431 654 311 -735 893 1009 -349 657 765 -837 748 714 -542 -154 813 -711 -137 273
7389 273 190 -546 977 -110 -1435 789 405 -829 298 27 -1132 -331 239 -799 35 658 -156 188
7407 188 813 -688 60 1290 520 -208 1005 115 -61 651 -149 -827 -175 953 -819 170 913 -838
7425 -838 268 535 -1118 -608 835 -686 -545 1109 -706 -969 746 -34 -17 519 23 -693 687 279
7443 279 -155 282 606 -538 487 755 -560 205 1311 3 -357 1157 -809 15 855 -388 -189
7460 -189 386 -682 -1142 649 207 -745 745 282 -740 -151 630 -966 268 959 -562 42 952 -331
7478 -331 -49 1517 -172 -1016 489 -58 -421 814 -157 -1074 784 501 -221 314 805 -713 -833 961
7496 961 -919 -651 460 -167 -1172 896 -326 -856 590 -270 -802 606 556 -1397 460 311 -433
7513d33R01N39k035J385P18j449O54J46q06l80J515p50p38J321j064l28J127p28
7531d05j64J178R9j705J277J12j640J478L37j214P12P11j660M73P91j081K99J751
7549A349j477o26J548o74o58J290l09m62O33k72p65R02O69j716P42J83q10m26
7567h79J549j709j97J635j285n75J969m42j603K290q75q07J542m04j058J243K90
7584F84j025L97K13p49L46J401j795j3J511j005m01O16K28p50L39L73p62R55J16
7603F79j249L70Q09j058M8J281j858M84J114j393k4J465r48q6P06j56q55J398
7621G27p20o97J652n40j156J363l7k018J634K53j109K98Q45p81J43J215j198j68
7639b94J360j343p82K125j822j94K042j013q42O89K44p65J045K98j713P60J344
$$ plain form
7513 -433 468 1007 -1028 357 1075 -374 280 426 -380 -760 755 5 -733 588 -476 -804 323 -405
7531 -405 -569 609 708 -997 280 392 -1248 230 567 -647 65 776 -884 -411 380 -701 -402 1349
7549 1349 -128 -754 794 120 -538 752 443 -19 614 342 -423 479 1148 -568 174 357 -453 -879
7567 -879 670 -1039 -1236 399 -886 -1461 508 66 -1537 753 -122 -929 613 209 -849 394 684
7584 684 -341 56 269 -480 -134 1267 -528 -541 970 -35 -436 180 408 -342 -3 370 -392 563 679
7603 679 -570 -200 609 -449 -401 880 -978 -494 620 -773 -797 668 -280 -366 340 184 -671 727
7621 727 7 -690 962 422 -734 629 592 -1426 208 461 -648 -350 495 -286 -143 1072 -126 -294
7639 -294 1066 -277 -1059 1066 -756 -950 1092 79 -763 -74 170 -595 450 748 -965 -205 1139
7656A139k144J115J020j692J45J583j302l82J358n31j014J071n33m23J037n81
7672a34r35J467kj442O58L34p68Q69N79j525J050J83q95L38J494j485n06J266
7690E46K36j883J782j42j480J489N71j380N95R52k201J600J94j374K01Q85r78
7707c87m9J060p55o05J492j038j198K623r48j565J547k34q89J137M42j405N61
7724b11J177j650L09Q95q20j94J999j383o41R93q35k8L53M84p94J037k39r80J161
7743F33k26j708O61J552j543K0M95n0m20J095j030k61J024n90k59O85k36n62J226
7762E06m32j205J449l8j063J508J53j744Q09J028j376R14J64j698M24J118k51
7779B66j001J834j281r06J529P7j043O50k30q39P43J121k247Q47J248j273L68
$$ plain form
7656 1139 -1005 110 1130 -562 -417 1166 -136 -518 840 309 -705 366 -167 -590 447 -134
7672 -134 -1069 398 396 -1046 -388 -54 -822 47 626 -899 151 334 -561 -223 1271 -214 -720 546
7690 546 782 -1101 681 539 -941 548 1119 -261 334 1286 -915 685 879 -495 -294 591 -387
7707 -387 -436 624 -131 -736 756 -282 -1480 1143 195 -1370 177 -57 -946 191 633 -772 -211
7724 -211 966 -684 -375 520 -300 -494 1505 122 -519 474 -361 -389 -36 448 -346 691 452 -528 633
7743 633 407 -1301 -640 912 -631 -611 -116 -166 -586 509 -521 -782 242 -348 -607 78 -158 -720 506
7762 506 74 -1131 318 280 -783 725 878 -866 -57 971 -405 509 673 -1025 -601 517 266
7779 266 -735 1099 -182 -1088 441 518 -525 125 -105 -944 -201 920 -1327 -480 768 -505 -137
7796a37Q80j083K28Q32q36n17J254o63k75Q90l15m25R74p61j112J820j68j460
7814h74J205J39p53J37R62j167L09J145j759Q9J396r34j036J845q24r34J559P3
7832E78j323J388J87j572J737j02j575N15R51o84L4P79p62m73J011m97o82J425
7850I35p72o02J016m82o39Q43J37j453J046J40q41P12O96j451M61P38j740M6J747
7869E37r79m02J677r96q28J480J48j051J136j76j148J607n04p90L2J269j438O65
7887B39O28j322M16P23p86j489K692j448l14O38j13l99Q30k89j065J236K05r53
7905e71R51L34j965J314N05o34L04J271k179m3J258q52K5P77q53r48J367J24p94
7924f09N85Q58j484O82R98j462L54J100j095k33J224j101l25J003j213j06J933
$$ plain form
7796 -137 743 -340 -112 720 -116 -633 621 -42 -317 573 258 -167 807 46 -1066 754 586 -874
7814 -874 331 470 -283 -146 816 -351 -42 1103 -656 -567 829 -105 -1141 704 -120 -1054 505 578
7832 578 -745 643 830 -742 995 893 -682 -167 784 100 134 913 151 -322 689 192 -490 935
7850 935 163 -439 577 95 -544 299 436 -1017 29 169 -672 40 736 -715 -254 484 -1256 -1210 537
7869 537 -442 -844 833 -163 -991 489 637 -414 722 546 -602 1005 501 -289 -257 1012 -426 239
7887 239 867 -455 -39 684 -102 -1591 1101 -347 -661 -23 -136 -535 295 6 -1059 177 382 -571
7905 -571 380 714 -1251 63 568 -66 238 1509 -670 -713 545 -307 -282 495 -358 -1306 61 185 -609
7924 -609 -24 834 -650 32 1030 -432 -78 1022 -73 -306 918 -183 -508 495 -718 -824 1109
7941A109n55j224J416n14k80O73k45q83N70N42j091M31R65j700L45J184p10n21
7959d88J306r92o21J367n99p87J500n69j277J657j73q12N67Q8p54K73Q71j200
7977f43P6P08o79M13R17j001j62R97l34n62J533j389m27R96J54j172R31J86k133
7996a591J866M33j298P26O25j337M04J074j318M53O56q98j62R17m86l52J080n94
8014A98p01J069j59q62O03O74j805J529R39j542k54K212j917N33L05l72r90O57
8032A17K76q91Q37l16j240J207k86p04J832l95j323N54J080j391j3J081q04o2
8050d41J677j256r00J878j498mQ58P12j740J139N98j214J042k17j325Q71Q89k019
8068i50M77J263j386Q59N58r90m70J215r26o61J777r81o32J823k15j621P23L82
$$ plain form
7941 1109 554 -670 746 232 -48 625 380 -503 67 609 -482 -51 914 -786 -441 743 33 -488
7959 -488 818 -174 -795 572 -27 -814 686 117 -1160 497 324 -488 79 167 -587 -314 557 -643
7977 -643 -567 141 -538 -125 792 -209 -371 626 292 -270 1263 -126 -553 443 597 -575 356 542 -1591
7996 -1591 275 708 -590 136 761 -576 -172 902 -416 37 693 -205 -367 550 64 -288 792 198
8014 198 -503 566 407 -455 148 822 -983 546 1485 -57 -311 1901 -16 517 822 450 -540 117
8032 117 393 -498 339 23 -1217 -10 -296 -1000 832 437 -886 -332 748 -643 -656 425 -379 -441
8050 -441 1236 -20 -920 958 -540 -544 314 1026 -714 425 1023 -191 851 634 -691 180 1069 -950
8068 -950 -473 790 -596 263 821 -169 -639 576 -350 -1011 766 -215 -847 976 761 -860 -137 245
8086B45m16K63P86j791J733M63j602P19J054k144k93J802n20q28J653j748j87
8103h11J215R2j539J210o3m06L47K77j571P86M14q62O93N31p03KJ042r02l00J840
8123A292j243l85J05N32j564J870k1j414J304o9q18P45J080j691M75J118k193
8140h77N72Q87q70p5P24o79l79J363q23n99O41k6r18J239M56j610R39R1n60N43
8160C9R56j408K04R55r51m84J927j792l54J873r23p34J276l53r04P20o0o60K95
8179c78Q20j071Q41P69j260j09P22o56M73M87p78m
$$ plain form
8086 245 -171 92 878 -913 820 1283 -319 400 1454 -690 -983 819 299 -529 1124 -624 -811
8103 -811 404 496 -1043 167 104 -302 45 322 -1249 -463 -49 -911 -218 313 -390 -388 654 -248 -548 1292
8123 1292 49 -336 -231 301 -1263 607 586 -828 476 407 -411 334 1414 -277 198 1316 -877
8140 -877 -305 582 -288 -363 361 -318 -697 666 -157 -756 -115 -141 -1059 180 636 -974 -35 56 -504 39
8160 39 995 -413 -209 746 -205 -689 1238 -554 -908 965 42 -692 584 231 -673 47 -13 -673 -378
8179 -378 442 -629 212 981 -279 -388 334 -322 151 638 -140 -144
8191a44
$$ Imaginary data points
##PAGE= N=2
##DATA TABLE= (X++(I..I)), XYDATA
0@%%%%%%%%%%%Ol8O4o4O4o4R5j27J28j59J91k13K45k83L25l64M18m76N36o03O80
32C61p66Q55r52J056j171J306j456J608j776J971k185K421k682K972l300L677
48A939m107M606n196N904o772P860r278J1212j4016J8472k6666M6601j82890k76205
62d28536K17126O0193J6080M6043j09020j23289J30226K7841n2166J06071L0584
73g8847j13379P7214P5363n0069R5507R3331j18507J3408J04651q0448r526J16724
85A25422o3919m1662J05418n5623q9992Q8644j4420q1410P5810k1153j24025P5741
97b1169M8988j06856L9846N3278j18818Q723Q4379q3826K506J05122q1037n1193
109a20057J02119l1386m6256R4035l3426p2038J08668J3535q7885Q1849K6640
$$ plain form
0 0 0 0 0 0 0 0 0 0 0 0 0 6 -32 32 -32 32 -32 63 -64 64 -95 96 -117 128 -155 170 -194 224 -252 284 -319 361
32 361 -405 450 -502 554 -617 689 -767 841 -935 1036 -1149 1272 -1410 1562 -1738 1939
48 1939 -2168 2438 -2758 3146 -3626 4234 -5044 6168 -7848 10624 -16042 30559 -152331 -428536
62 -428536 -211410 -151217 -135137 -89094 -198114 -321403 -191177 -163336 -215502 -109431 -78847
73 -78847 -192226 -115012 -39649 -89718 5789 99120 -19387 -5979 98672 18224 8698 125422
85 125422 61503 19841 125259 69636 -20356 68288 53868 -27542 48268 27115 -96910 -21169
97 -21169 27819 -79037 -39191 14087 -104731 -96008 -11629 -95455 -92949 12173 -68864 -120057
109 -120057 -17938 -49324 -95580 -1545 -34971 -107009 1659 15194 -72691 9158 35798
120C5798j12118N8729P5453q8723K8148P5029r3835L543R8989p1013l3423Q9793
132F6370o2966n2470J00868k6500o5101Q9515k0258r6567Q6213K4834j08061N3438
144a0685N4168r3514L5020P2272q7650J1084Q2882p9256j5264R5758o2126l8761
156c6072J01808l4544o1806R1750j8582q5515Q2772J2044r8403N9924M1301r6801
168d2124L4708N9357q4029J3824O1148q6422j358R6454o5301l5223R4593m2014
180C613n5303R2323j5659o9153Q3215M066q6422O9091L9613q3949L9910M4143
192F5488q7307K5290O5906q1253O980Q0388p7979l1643R2484m7882n1273Q5968
204D5167k7645o9194P6228l813p6230P0287J9595q9512M8992M3265q5263K9954
$$ plain form
120 35798 -76320 -17591 57862 -30861 -2713 72316 -21519 -17976 81013 10000 -23423 66370
132 66370 3404 -49066 51802 25302 -39799 49716 29458 -67109 19104 43938 -64123 -10685
144 -10685 43483 -50031 -15011 57261 -30389 -19305 63577 -15679 -30943 64815 2689 -36072
156 -36072 65736 31192 -30614 61136 42554 -42961 39811 51855 -46548 13376 54677 -42124
168 -42124 -7416 51941 -32088 -18264 42884 -43538 -44896 51558 -13743 -48966 45627 3613
180 3613 -51690 40633 24974 -44179 39036 43102 -43320 25771 65384 -18565 21345 65488
192 65488 -21819 3471 69377 -11876 -4896 75492 -2487 -34130 58354 10472 -40801 45167
204 45167 17522 -51672 24556 20743 -55487 14800 34395 -55117 -6125 37140 -48123 -18169
216a8169N9684p9127J6145P8393p8742j9590R2277n1386m2171Q7709k6911n8087
228c9975P7477j1465o6724P5288O979q8398N6368L6685q2855L6398N1136q6349
240c5435J3961O8731p5968j1008Q1966n8751l6288Q4063l2314m8564P2782j8859
252D316n8741P5543K011p7257O3507K8404q1400M3499N2422q0106J7651N9200
264D9049p1997J327P4477o0124k6662P8013m0871m4031P1838k4992n5730P1377
276B1674q476p0440O6651J7931q4666M4562M5313p4001K2357N3022p0500P938
288b8635O9406o0954j3198P6788m7226l6171P6612k7052m7043P5204j3539o6491
300d2299O8764J1931p8818M8820L7274p7284K6636M7345p0166J1197N7951o6629
$$ plain form
216 -18169 41515 -37612 -21467 56926 -21816 -41406 50871 -515 -42686 45023 18112 -39975
228 -39975 37502 26037 -40687 34601 41580 -46818 9550 46235 -36620 -222 50914 -35435
240 -35435 -21474 47257 -28711 -39719 42247 -16504 -52792 31271 -1043 -49607 23175 4316
252 4316 -54425 21118 23129 -54128 9379 37783 -43617 -118 52304 -27802 -10151 49049
264 49049 -22948 -21621 52856 -7268 -33930 44083 3212 -40819 31019 6027 -49703 21674
276 21674 13198 -57242 9409 27340 -57326 -12764 32549 -41452 -19095 33927 -36573 -28635
288 -28635 40771 -20183 -33381 43407 -3819 -39990 36622 9570 -37473 37731 24192 -42299
300 -42299 26465 38396 -40422 8398 45672 -31612 -4976 42369 -27797 -16600 41351 -25278
312b5278m899P0837n8172l0952P7512l2465m5132P2165j8068o0485O9375N659
324B0097p0525N6875K9100p4264L3252M5137o6019K1494N2582o6158M505O7396
336E3472n9229k1952P6056l8853m2143O9568j9378n4094O2417n653o5218N6909
348A1902J7265p1478L6747L3432o7117K4194M6134o5839R971O2644o0893j3810
360c6848P3332m1539l4378P1933k0545m6295O2450p985n4385O0286R800o7293
372c1467M5570K9202p0008K9106M3604o5743J1990N3278o4875o518O9455m9311
384e717l3755O6321k7505m1483O1730j5715n1081O1319J109o6132N2105K4935
396B6131o8718L5635M2306o5221J8068N3122o0432r7O5857m9765k1769O6608l2660
$$ plain form
312 -25278 -30177 40660 -17512 -48464 29048 -3417 -48549 23616 5548 -54937 14438 20097
324 20097 -50428 6447 35547 -38717 -5465 39672 -26347 -4853 47729 -18429 -13924 53472
336 53472 -5757 -27709 48347 9494 -32649 36919 17541 -36553 25864 20211 -45007 11902
348 11902 29167 -42311 -5564 27868 -39249 -15055 31079 -34760 -24789 37855 -23038 -36848
360 -36848 36484 -5055 -39433 32500 11955 -34340 28110 20125 -34260 26026 35826 -31467
372 -31467 14103 43305 -26703 2403 46007 -19736 -7746 45532 -19343 -25861 43594 -5717
384 -5717 -39472 26849 -656 -42139 19591 3876 -47205 14114 15223 -50909 1196 26131
396 26131 -42587 -6952 35354 -29867 -11799 41323 -19109 -19206 46651 -3114 -24883 41725 9065
409I065l6644O3269j8089m6087N8939p785o0360N5811J4981p1410L5688L5785
421C3163o4136J8352M4011n9896M297N4442n2157j3021O4277l8040k9751O2335
433B3876k1011l9751N9953r285n2808N8348J0971o5586M2681L3349o3227K1382
445a108M1715n6032R412M7515n5049n560N9627m4418k7078O1749k8514l7999N9294
458B3554j5320n1532N5868M748o1463M4749K5945o3007K7716L7134n6387J6320
470a1675M6680n4563K130N7816m9454j7022O6132l1272l6627O1314j6319m5978
482b8838N5061k420n6596M7736J7594o4154L0347L2145n7456J7892L7994n6438
494b7133N785N2836n2382j3242O2410l6208l1469O0242j6638m0736N4186n674
$$ plain form
409 9065 -27579 35690 17601 -28486 30453 22668 -37692 18119 33100 -38310 -2622 33163
421 33163 -30973 -12621 31390 -28506 -24209 30233 -21924 -34945 29332 -8708 -38459 23876
433 23876 2865 -36886 23067 13782 -39026 19322 30293 -35293 7388 40737 -22490 -1108
445 -1108 40607 -15425 -6013 41502 -13547 -19107 40520 -3898 -30976 30773 2259 -35740 23554
458 23554 8234 -43298 12570 17318 -44145 604 26549 -36458 -8742 28392 -27995 -11675
470 -11675 35005 -19558 -17428 40388 -9066 -26088 40044 8772 -27855 33459 17140 -28838
482 -28838 26223 23803 -32793 14943 32537 -31617 -1270 30875 -26581 -8689 29305 -27133
494 -27133 -21348 31488 -20894 -34136 28274 -7934 -39403 20839 4201 -36535 17651 11977
506A1977m8196N0609J1190n6505L7963K7643n5740K2270L7983n4606J0156M8002
518D2746n2833p766N8888l9597k8571N6304k1594l7696N1169j2129m4835M7129
530A1215K481n4503M1283K0564n9134K6793L6462n4614J2673M3993n1086K51N6090
543C2468m0106k0020N8697k4949l2667N2575j2216l7953N0920m817n2201M8202
555A7933J5615n9667K9266L1218n6400J4931M0027n2280K95M8621m5132j4314
567b9887N5276l1426k9006N2172j8146l5850N2173p242m7589M9179J1213n5257
579c4390L6517K9120n4972J9352L8620m7367O542M3545m5394o794N2284l4953
591B110k3125N2723k3079l4308M8333j0779m3327M5304K904n4356L7801K4383
$$ plain form
506 11977 -36219 14390 25580 -30925 7038 34681 -21059 1211 39194 -15412 -5256 42746
518 42746 -10087 -17853 41035 1438 -27133 29171 7577 -30119 21050 8921 -35914 11215
530 11215 13696 -40807 476 21040 -38094 -11301 25161 -29453 -16780 27213 -23873 -23622 32468
543 32468 -7638 -27658 31039 6090 -26577 25998 13782 -24171 26749 21932 -30269 17933
555 17933 33548 -26119 3147 34365 -22035 -7104 32923 -19357 -19062 29559 -15573 -29887
567 -29887 25389 -6037 -35043 17129 -1017 -36867 15306 8064 -39525 9654 20867 -34390
579 -34390 2127 31247 -23725 -4373 34247 -13120 -6578 36967 -8427 -15221 37063 2110
591 2110 -21015 31708 8629 -25679 22654 11875 -31452 13852 16756 -37600 201 24584
603B4584n4952J8799L2607m6944J0526L8339m5347J112M8831l8688j5890N5292
615B8269k3788k9942N0641j1140l8438M8307J425m9231M0052J7257n2094K4660
627E978K8648m9269J3414L3691m6801K494M3729m4647j2930N3003l0863k9721
639c3274N0820j4896l7937M5536k503m4344M2032J0583m9475L2168K6878m8646
651b3058J8580L4561m6587J0194M2637m4325n762N2943l3025k5645N2201j6955
663A5759l3997M3676q520m1010M1167L277m8598L2830J9411n1089K0300K9699
675B2905m7476R919L8598m5506l383M9380l4167j9186M9736j9467k8556M6170
687A8967p959l4516M0984N96m2194L9093J4364m9429K4424L0461m7870J1131L5566
$$ plain form
603 24584 -30368 -11569 21038 -25906 -15380 22959 -22388 -21276 27555 -11133 -27023 28269
615 28269 4481 -25461 25180 14040 -24398 23909 25334 -23897 16155 33412 -18682 5978
627 5978 34626 -14643 -1229 32462 -14339 -11845 31884 -12763 -25693 27310 -3553 -33274
639 -33274 17546 2650 -35287 10249 7746 -36598 5434 16017 -33458 -1290 25588 -23058
651 -23058 -4478 30083 -16504 -6310 36327 -7998 -13760 39183 6158 -19487 32714 15759
663 15759 -18238 25438 16918 -24092 17075 20352 -28246 4584 23995 -27094 -6794 22905
675 22905 -24571 -14652 23946 -21560 -24943 24437 -9730 -28916 20820 1353 -27203 18967
687 18967 11008 -23508 17476 18072 -24122 14971 29335 -20094 4330 34791 -13079 -1948 33618
700C3618m3686k33M1701l8955j4003M8061k6166k7377M2608j2864l2504M1501
712A1701o120m1758M1287J0478m9429K9136K6022m6939J5885L5581m2272M781
724a1647M1131l8419o809M7284k8571k1628M6517j7100k9726M3820q261l8591
736b2000M0896M019m8844L0941K1409m9182J5314K9950m2293O095L5063m0306
748a8938l965M2331l2962j6692M7237k1276k8440M5252p862l3801M1444J767m2368
761b8273L5427J7804m5273K1233K8221l9881R239L1713l7613J684L9029l7850
773d540j2396M5122k3387k7557M2534j3245l3183L8690k526m0870L3777J1601
785A4020m3990K3372K2944m2469J4353L0447l8231M916L8156l6983o141M5917
$$ plain form
700 33618 -10068 -10301 31400 -7555 -21558 26503 337 -27040 15568 2704 -29800 11701
712 11701 5581 -36177 5110 15588 -33841 -4705 21317 -25622 -9737 25844 -16428 -11647
724 -11647 29484 -8935 -15744 31540 2969 -18659 27858 10758 -18968 24852 16591 -22000
736 -22000 18896 22915 -25929 5012 26421 -22761 -7447 22503 -19790 -13695 21368 -18938
748 -18938 -22903 19428 -13534 -30226 17011 -4265 -32705 12547 4685 -29116 12328 14095 -28273
761 -28273 7154 24958 -20315 918 29139 -10742 -1503 30210 -7403 -5719 33310 -4540
773 -4540 -16936 28186 4799 -22758 19776 6531 -26652 12038 9512 -31358 2419 14020
785 14020 -29970 -6598 16346 -26123 -11770 18677 -19554 -14638 23518 -13465 -19606 26311
797B6311k7182k1194M6042j2850l1366L9886l629l5924L6474N443m3445K9093
809G659J8672m4493J6204K6798m1740O538L3905l8972m736M2603l1798j9436M5220
822A6424j7241k8630L9523n808l1903L7371J560l9641L3465J6315m3349K1907
834gK6773m0420R648L2757l8183N56M0871l3436j4862M3263k1019k5751L8403
847A8593j0027l1004L6201k792l7615L3361Q894m3314K3623K3092m3394J2012
859a2370L1279l6886J931L6388l2527q339M3106k4308k0099M1631j2048k6410
871a8652L7120m932l2762L6269N659m1748K6973K0387m2956J2918K7737l7611
883a1598M796L1768l6368n435L7730k8197j6851M0855j7789k6648L8146p914l1863
$$ plain form
797 26311 -871 -22065 23977 11127 -20239 19647 16018 -19906 16568 22011 -21434 7659
809 7659 26331 -18162 -1958 24840 -16900 -10362 23543 -15429 -20165 22438 -9360 -28796 16424
822 16424 -817 -29447 10076 4268 -27635 9736 11296 -28345 5120 21435 -21914 -7
834 -7 26766 -13654 -4006 28751 -9432 -8876 31995 -1441 -16303 26960 5941 -19810 18593
847 18593 8566 -22438 13763 10971 -26644 6717 15611 -27703 -4080 19012 -24382 -12370
859 -12370 18909 -17977 -16046 20342 -12185 -20524 22582 -1726 -21825 19806 7758 -18652
871 -18652 18468 13536 -19226 17043 22702 -19046 7927 28314 -14642 -1724 26013 -11598
883 -11598 -6802 24966 -11402 -16837 20893 -7304 -24155 16700 -1089 -27737 10409 2495 -29368
896b9368L7644K621l9685L0357J7455m1132J8213K7213l6677Q442L0178l3523
908h262L74L7443l1014j1238M1176k1381k4700L9695j0478l1099L5575r60l8126
921b2995K9091J0853m1410K0561K3129l8852Q176K7526l4656L037L3833l2778
933a4485p249M1039k3091k1573M0911j0524k6592L5862k138l2570L1921Q345l8159
946a8303K4943J9594l8113J2745K5429l6043N203L1778l4342o127L8369k8141
958c008j9014L9865j4595k7598L4627o190l0576L1167L794l5983K7363J4723l8678
971b4103J8195K4753l6617Q254L1615l3171r73L8479k9422j3683M0889j5976k4699
984a6459L5658p513k8297L2821j057l4302K9746R352m1306K1571K1686l9180Q801
$$ plain form
896 -29368 8276 10897 -28788 1569 19024 -22108 -3895 23318 -13359 -4917 25261 -8262
908 -8262 -7888 29555 -1459 -12697 28479 7098 -17602 22093 11615 -19484 16091 15131 -22995
921 -22995 6096 16949 -24461 -3900 19229 -19623 -11447 16079 -18577 -15540 18293 -14485
933 -14485 -21734 19305 -3786 -25359 15552 5028 -21564 14298 12160 -20410 11511 19856 -18303
946 -18303 6640 26234 -11879 866 26295 -9748 -4545 27233 -7109 -13236 25133 -3008
958 -3008 -22022 17843 3248 -24350 10277 4087 -26489 4678 8472 -27511 -148 14575 -24103
971 -24103 -5908 18845 -17772 -9518 22097 -11074 -12047 26432 -2990 -16673 24216 8240 -16459
984 -16459 19199 11686 -16611 16210 15153 -19149 10597 19949 -21357 214 21900 -17280 -8479
997h479K7856l5529J157L3756l0024j1074L8808k0311k0604L7401j1015k5097
1009b3155L3676k290l0252L1629P748l7573K4723K0039l8706J2256K7983l4143
1021h065K613L1032l0242o559L5699k4548j7945L6134j3947k5167L2460n623l1282
1034b5440L2276L660l7469K6667J5740l8708J4379K5282l2251M579K8917k9059
1046a1427r90L3523k5646j2144L8880j7032k2348L6099p154k8320L2356P75l4601
1059a8029K8292J1875l9590J6733K3185l6074P479K5631l3140N12L1661k9913
1071a1378q641L6725k2058k0337L7518j0695k7040L3573m49l0718K8594R758l5903
1084b1051K1937K0343l5106J1524K5517l0558L328K9303k9492n003L6588k4806
$$ plain form
997 -8479 19377 -16152 -14995 18761 -11263 -22337 16471 -3840 -24444 12957 1942 -23155
1009 -23155 10521 8231 -22021 9608 17356 -20217 4506 24545 -14161 -1905 26078 -8065
1021 -8065 -5452 25580 -4662 -11221 24478 -70 -18015 18119 4172 -20995 11465 5842 -25440
1034 -25440 6836 10496 -26973 -306 15434 -23274 -8895 16387 -15864 -11285 17632 -11427
1046 -11427 -12417 21106 -4540 -16684 22196 5164 -17184 18915 11761 -16559 15797 16572 -18029
1059 -18029 10263 22138 -17452 -719 22466 -13608 -6129 19502 -13638 -13126 18535 -11378
1071 -11378 -20019 16706 -5352 -25689 11829 1134 -25906 7667 7218 -23500 5094 14852 -21051
1084 -21051 886 21229 -13877 -2353 23164 -7394 -4066 25237 -4255 -9258 27330 2524
1096B524j9520L6902j1537k6086L2087m436l1287K9398M243l5191K2400J4882
1108A4379l5979J3718K2940l3298N342K9675l0445j887L4746k5867j3651L8055
1120A7728j3947k2477L4060m647k6567K8687K084l1670K7216J1121l6878J7779
1132B489K1518l5058O982K5684l1148k065L1893k6870j2189L5963j9394k0508
1144b2703L3384q493k5213K9801j019k9600K8159Q183l5718K2727J9771l5577
1156a6298J0602K7614l1544L026L0197k7683o485L5166k1353j7525L4443j2470
1168G690k3407L1194n079k9486K9139M290l5584K2826J4928l6223J2058K4335
1180A6681l2535L684K7467k7562l567L2273k3148j3112L5339j4610k1052L3096
$$ plain form
1096 2524 -16996 19906 8369 -17717 14370 9934 -21353 8045 12288 -22903 -503 14379
1108 14379 -21600 -7882 15058 -18240 -12898 16777 -13668 -15555 19191 -6676 -20327 17728
1120 17728 3781 -18696 15364 10717 -15850 12837 14921 -16749 10467 21588 -15290 2489
1132 2489 24007 -11051 -4069 21615 -9533 -11598 20295 -6575 -18764 17199 -2195 -22703
1144 -22703 10681 2188 -23025 6776 5757 -23843 4316 12499 -23219 -492 19279 -16298
1156 -16298 -5696 21918 -9626 -6600 23597 -4086 -10571 24595 3242 -14283 20160 7690
1168 7690 -15717 15477 10398 -19088 10051 14341 -21243 1583 16511 -19712 -7654 16681
1180 16681 -15854 -12170 15297 -12265 -15832 16441 -6707 -19819 15520 910 -20142 12954
1192A2954m998k6260K9972J961l1296K5588J3969l5628J4714K2174l1542N285
1204c107K4906k8610m25K8943k6714r915L3116j8878k0000L2866r028k5579K9217
1217F792r99k9708K6214J0013l4499J8793J8930l2100R839K5010k8950K274K8666
1230B0275k6193n437L4748k1341j7743L6122j0756k5179L1204k841k9315K6322
1242I866N069l1748K0284J4276l4964J1891K2390l0893L354K6727l0040k516L2910
1255A6606k3893j4373L4992j2385k2920L1459k991k5496K7806K781k9285K4555
1267F856J3316l4122J5497K0682l0828O462K5817k9008j945L0821k5095j2646
1279a4193L4196j6462k1504L0565o487k5491K6649l77k9271K4904P864l3388J8838
$$ plain form
1192 12954 7956 -18304 11668 13629 -17667 7921 21890 -13738 976 23150 -8392 -3107
1204 -3107 21799 -6811 -7236 21707 -5007 -14922 18194 -684 -20684 12182 3154 -22425 6792
1217 6792 5793 -23915 2299 12312 -22187 -3394 15536 -16564 -6725 18285 -10665 -8391 20275
1230 20275 -5918 -11355 23393 2052 -15691 20431 9675 -15504 15700 12859 -16456 9866
1242 9866 14935 -16813 3471 17747 -17217 -5326 17064 -13829 -10475 16252 -13788 -16304 16606
1255 16606 -7287 -21660 13332 947 -21973 9486 6495 -19001 8805 11586 -17699 6856
1267 6856 20172 -13950 1547 22229 -8599 -2137 23680 -5328 -7273 23548 -1547 -14193
1279 -14193 20003 3541 -17963 12602 6115 -19376 7273 6896 -22375 2529 10393 -22995 -4157
1292d157J9162l2749Q050K6273k8530O31K9659k5389o507L3057j8132j6848L3081
1305A7601r020k2844K9270l142k6409K6671M502l3018K1601J5474l5162J0605
1317c871K3467l0628J924K5936k6519n706L0738k1341j4050L2988j2914k0903
1329b0879K9488l537k6236K7696L782l0030K3566J3692l3413J4740K2706l0577
1341i002M626K5335k5327k307K8545k3181j0874L2273j6656j9738L0345o935k5031
1354a7927K6870P79k9545K2685R326l2829J5764J9465l1084O984K3664k6200l67
1367a2415K7378k3404n733L1442j7933j6129L2695p780k3388K8065l96k6635K4829
1380A0596P068l1102J8280J5145l0781Q850K0927k8145K717K4387k6331m766K9664
$$ plain form
1292 -4157 15005 -17744 -9694 16579 -11951 -11320 18339 -7050 -13557 19500 1368 -15480 17601
1305 17601 8581 -14263 15007 11865 -14544 12127 16629 -16389 5212 20686 -14476 -3871
1317 -3871 19596 -11032 -9108 16828 -9691 -15397 15341 -6000 -20050 12938 24 -20879
1329 -20879 8609 5072 -21164 6532 10314 -19716 3850 17542 -15871 -1131 21575 -9002
1341 -9002 -4376 20959 -4368 -6675 21870 -1311 -12185 20088 3432 -16306 14039 7104 -17927
1354 -17927 8943 9722 -19823 2862 12188 -20641 -4877 14588 -16496 -9512 14152 -12048 -12415
1367 -12415 14963 -8441 -14174 17268 -665 -16794 15901 8121 -15267 12798 12402 -14233 10596
1380 10596 17664 -13438 4842 19987 -10794 -1944 18983 -9162 -6445 17942 -8389 -13155 16509
1393A6509k1935j3711L1443j2267k1950K9420k702k6279K4633N207k8394K1543
1405A517J3258l1657J4620K1095k9036N110K4859k5026j703K9629k3635j0451
1417a1420L3012j5005k1453K9299m828k4410K5458j20k7555K1859P807l0090J4652
1430b794J7441l0505O853K3291k7093j050K7769k2700q158L1735j6035j6972L0142
1443A1924o490k1393K6016l01k4390K3890N461k8633J9024J4946l0670Q548K3005
1456B0937k7427L97K5248k3247p291K8207j8675j4784K9174j0838k0975K6302
1468G028k665k4355K4264L341k8433K0576J3247l0649J2149K1958k6917K349K5200
1481A7093k3284k144K7822k0018j1575L0885j3230j8410K8478o243k3029K5049
$$ plain form
1393 16509 -5426 -19137 12306 39 -21911 7509 4807 -21472 3161 8368 -20026 1517
1405 1517 14775 -16882 -2262 18833 -10203 -5093 19766 -5260 -6963 22666 -969 -11420
1417 -11420 21592 6587 -14866 14433 9605 -14805 10653 10533 -17022 4837 12644 -17446 -2794
1430 -2794 14647 -15858 -9005 14286 -12807 -13857 13912 -8788 -16946 14789 -1246 -18218 11924
1443 11924 5434 -15959 10057 9756 -14634 9256 14717 -13916 5108 20054 -10616 -2068 20937
1456 20937 -6490 -6093 19155 -4092 -11383 16824 -1851 -16635 12539 1701 -19274 7028
1468 7028 4363 -19992 4272 7613 -20820 -244 13003 -17646 -5497 16461 -10456 -8107 17093
1481 17093 -6191 -8335 19487 -531 -12106 18779 5549 -12861 15617 9374 -13655 11394
1493A1394J035k8919K1933R426l0947J3051J8481k8608M551K2646k4952j279K4801
1506A2613k1042q356K9272j5176j6815L0548p321k2178K6581R51k4961K2327Q436
1519A4879k8424J5808J6747k8290Q198K1177k5341J743K2692k2648n440K7431
1531A8532j8868j5081K9268j0153k2041K5806j501k4757K1435N021k7316J8590
1543a065J2514k8196R882K0375k5577L756K3299k2456k363K6198j8431j0818L0065
1556A7183j1609j9372K7561k978k3076K2491K643k5686J9128R129k8094J2827
1568A47J7164k8469M305K2449k4965j738K4943k0942j0183K9833j4487j7602K7833
1581H288n429k1163K4171P32k3274K1526O911k6904J6893J5750k8211Q084K2179
$$ plain form
1493 11394 12429 -16490 5443 14869 -16078 -3027 15454 -13154 -8603 14043 -10909 -12188 12613
1506 12613 -8429 -16785 12487 -2689 -19504 11044 3723 -18455 8126 9077 -15884 6443 14879
1519 14879 -13545 2263 19010 -9280 -1082 20095 -5246 -3503 19189 -3459 -8899 18532
1531 18532 -336 -15417 13851 3698 -18343 7463 5962 -18795 2640 7661 -19655 -1065
1543 -1065 11449 -16747 -6865 13510 -12067 -8311 14988 -7468 -9831 16367 -2064 -12882 17183
1556 17183 5574 -13798 13763 10785 -12291 10200 12843 -12843 6285 15414 -12680 147
1568 147 17311 -11158 -6853 15596 -9369 -11107 13836 -7106 -17289 12544 -1943 -19545 8288
1581 8288 2859 -18304 5867 6599 -16675 4851 11762 -15142 1751 17501 -10710 -2626 19553
1594A9553k4951J12K5220k1890o763K6888j6066j4865K7357q331k1200K3335j172
1607G227k3202K0782M170k7605J7660J2709k8726J0024J9616k5082J269K3622
1619A2464k0722l840K5749j7106j0037K7202r960j7536K5607k610k1533K2132
1631I810J770k4258J9262R915k8642J2203J7560k5883L141K0757k2394l157K3711
1644A3795j9246r106K6833j4070j6355K6106n830k1620K4182J067k4428K0488
1656A816Q646k6549J4674J6916k6958O679K0830k1479k29K3187j9782n532K6084
1669A8303j6134j4015K7197q345k1083K4252j336k2949J8538N661k5585J5221
1681b75J2411k7126P420J8855k3221J514K1743k0570l620K4973j6481j1673K8830
$$ plain form
1594 19553 -5398 -5286 19934 -1956 -8719 18169 2103 -12762 14595 6264 -14936 8399 7227
1607 7227 -15975 4807 8977 -18628 -968 11741 -16985 -6961 12655 -12427 -11158 12464
1619 12464 -8258 -12098 13651 -3455 -13492 13710 3750 -13786 11821 9211 -12322 9810
1631 9810 11580 -12678 6584 16499 -12143 60 17620 -8263 -5122 15635 -6759 -9916 13795
1644 13795 -5451 -14557 12276 -1794 -18149 7957 2127 -19493 4689 5756 -18672 1816
1656 1816 10462 -16087 -1413 15503 -11455 -4776 16054 -5425 -5654 17533 -2249 -7781 18303
1669 18303 2169 -11846 15351 7006 -14077 10175 8839 -14110 4428 10089 -15496 -275
1681 -275 12136 -14990 -7570 11285 -11936 -10422 11321 -9249 -12869 12104 -4377 -16050 12780
1694A2780j0507j7958K4602p45k0722J9892M298k3205J6700J0066k5025J0984
1706A160J6533k5015M183J9962k1878k278K3133j9194j0200K6308j1789j7244
1718a6319K3637l864k1360K1465K422k2569J7835O581k4295J4379J4363k5117
1730a2842P158K0295k1427m38K3515j8209o917K5348j3323j4543K5366n743j9759
1743a1519K1296k39k0994J8241M003k4617J4842J2200k6479Q461J7980k3218k68
1756a0311K1543j9240m728K3904j5418j0960K4753q309j6882K3720k604j8972
1768a3504K0038L097k2850J7813R495k5234J1692J7047k3557K081K0022j8726
1780b586l628K1734j6243r523K3401j1603j5954K3395n003k0136K0855Q06k1731
$$ plain form
1694 12780 2273 -15685 8917 8172 -12550 7342 11640 -11565 5135 15201 -9824 1160
1706 1160 17693 -7322 -3139 16823 -5055 -7333 15800 -3394 -13594 12714 925 -16319
1718 -16319 7318 3454 -17906 3559 5981 -16588 1247 7828 -16467 -2088 12275 -12842
1730 -12842 -5684 14611 -6816 -7254 16261 -1948 -8865 16483 3160 -11383 13983 8240 -11519
1743 -11519 9777 9538 -11456 6785 10788 -13829 1013 13213 -13266 -4805 13175 -10043 -10311
1756 -10311 11232 -8008 -12736 11168 -4250 -15210 9543 1234 -15648 8072 5468 -13504
1768 -13504 6534 9631 -13219 4594 14089 -11145 547 17594 -5963 -3882 16140 -2586
1780 -2586 -6214 15520 -723 -10246 13155 1552 -14402 8993 3990 -16146 4709 5515 -16216
1793a6216J6968Q272k4640J2171J4306k2983M715J9762j9690m32K0470j6219n388
1806h904K3626j2676j3212K4300n642j8514K1141L56k1718J7790N846k3718J3288
1819A963J2052k3842N418J7736k1604L72J9267j8512m643K1832j4159j1371K4685
1832I194r162j7041K2900j292j9789J8918M711k1240J4410J1327k2909R586J5471
1845A5084k0975K351J9706j9021k473K1055j5654q748K3544j1281j6223K2064
1857I429k892k0356J8697J560k0257J4548O967k2301J1596J2962k2073M348J8479
1870A0707j9129j354K1514j6560o765K3925j1317j2712K2930n009j6961J8927
1882H196J967j9494J6352N173k1429J2617J0659k2320O018J6826k1105p53J9148
$$ plain form
1793 -16216 752 9024 -15616 -3445 10861 -12122 -7407 12355 -7335 -7767 12703 -3516 -8904
1806 -8904 14722 2046 -11166 13134 7492 -11022 10119 10475 -11243 6547 12393 -11325 1963
1819 1963 14015 -9827 -4409 13327 -8277 -7905 11362 -7150 -11793 10039 -4120 -15491 9194
1832 9194 32 -17009 5891 4599 -15190 3728 8439 -12801 1609 12936 -9973 -387 15084
1845 15084 -5891 -3540 16166 -2855 -5328 15727 73 -8675 14869 3588 -12635 9429
1857 9429 6537 -13819 4878 6438 -13819 729 7696 -14605 -3009 9953 -12120 -7772 10707
1870 10707 -8422 -9776 11738 -4822 -11587 12338 1021 -11691 11239 6230 -10731 8196
1882 8196 10163 -9331 7021 12194 -9235 3382 14041 -8279 -2261 14565 -6540 -7293 11855
1895A1855j6923n835K1553j4359j1442K3648p944j6333K0055j207j7657J6359
1907A770M305k0256J5085J0090k2967R289J7036k1000J929J9064j6696l096K0038
1920A4591j3231r446K2183r735j4876K1627l702j8450J6993J411j9610J4507P286
1933I548k2785R665J4361k1797L944J6770j7300k075J8769j3978o218K0903j0580
1946g73j2145K2224m844j6072J8390J696j8470J5152O246k0325J1654J1648k1386
1959g005M684J6565j8209j185J7925j5986o194K0122j2377j0625K0823o911j6516
1972a4889J9125o51j6885J4954M391j9219J2232J0470k0878P355J5291j8031J324
1985e411J8195j6039l476K0433j3866p639K0997p918j4656J8956k068j7144J6032
$$ plain form
1895 11855 -5068 -10903 10650 -3709 -15151 8497 553 -15780 4275 3068 -14589 1770
1907 1770 6075 -14181 904 10994 -11973 -2684 14352 -6648 -4719 14345 -2351 -5447 14591
1920 14591 1360 -8086 14097 4362 -10514 11113 7411 -11039 5954 7365 -12245 2262 9548
1933 9548 -13237 -3572 10789 -11008 -7064 9706 -7594 -9669 9100 -4878 -11096 9807 -773
1946 -773 -12918 9306 4462 -11610 6780 8476 -9994 5158 11404 -8921 2733 14381 -7005
1959 -7005 -2321 14244 -3965 -5150 12775 -3211 -9405 10717 -1660 -12285 8538 1627 -14889
1972 -14889 4236 3585 -13300 1654 6045 -13174 -942 9528 -11350 -3995 11296 -6735 -5411
1985 -5411 12784 -3255 -6731 13702 -164 -7803 13194 5276 -9380 9576 7508 -9636 6396
1998F396L292j9887J3050O526k0699R264J2476k1116L516J6837j7504k435J9065
2011H781j4693o417K1472j0139j2650K0200k707j6231J7750J539j6325J3908N467
2024I955j8941J1110J1503k0019M851J6150j7943n61J7059j4133n916J9322j1471
2037I66j1255J9046n796j5941J7601J68j7744J4287L993j9015J2275R297k0067
2050a2185P371J4745j8257J371J7797j4799l211J8181j1368p922J9778o957j3113
2063h569J8617k112j6686J5342K091j7478J2473O803k0032Q450J2832k0104J892
2076f481J6814j5882m125J7569j2336o857J8298q941j1370J8876l078j5056J6589
2089D020J225j6849J4535P021j9129R551J1899j7952L637J5492j6072j339J6376
$$ plain form
1998 6396 9688 -10199 2851 9377 -11322 -2058 10418 -10698 -7182 9655 -7849 -10284 8781
2011 8781 -5912 -12329 9143 -996 -13646 6554 3847 -12384 5366 6905 -9420 4488 9955
2024 9955 -8986 2124 13627 -6392 -1541 14609 -3334 -3895 13164 -969 -6885 12437 966
2037 966 -10289 8757 2961 -12980 4621 4789 -12955 1332 5325 -13690 -1415 7882 -12185
2050 -12185 -4814 9931 -8326 -6955 10842 -3957 -7168 11013 -355 -8277 11501 4544 -8569
2063 -8569 10048 7936 -8750 6592 8683 -8795 3678 10481 -9551 -1101 11731 -8373 -6481
2076 -6481 10333 -5549 -9674 7895 -4441 -11298 7000 -1941 -13311 5565 2487 -12569 4020
2089 4020 5245 -11604 2931 9952 -9177 374 12273 -5679 -2042 13450 -2622 -3961 12415
2102A2415j2555n039J6901j0354j0042J8155o507j3995J6018R16j7962J3340M517
2115E808j8730J0894R170j8479N819J4272j6509j30J6250j3262l148J7539j1097
2128a603p927J9592o346j3794J8215p87j5398J4061L865j7794J1482Q003j8503
2141f934O543J2190j7762J576J4826j5495k774J6414j2055p061J8047q556j2599
2154a3640J8754k300j5981J5261K367j5914J2311O021j7351R847J0872j7899N546
2167b106J3334j4577j441J6939j2828n033J7735j0267r757J7938m845j5107J5752
2180E737N62j6280J2238L959j6061R505Q240j8548N605J3516j6776Q74J5487j3204
2194e146m015J7351r741q430J7870n359j2360J6427j94j3990J3218L383j6312
$$ plain form
2102 12415 -140 -5179 11722 1368 -8674 9481 2974 -11021 4997 5913 -12049 1291 5808
2115 5808 -12922 -2028 7142 -11337 -5518 8754 -7755 -7885 8365 -4897 -8045 9494 -1603
2128 -1603 -9530 10062 3716 -10078 8137 7350 -8048 6013 9878 -7916 3566 11569 -6934
2141 -6934 -391 11799 -5963 -4387 10439 -5056 -7830 8584 -3471 -10532 7515 -1041 -13640
2154 -13640 5114 2814 -13167 2094 4461 -11453 858 6879 -10472 -625 10247 -7652 -2106
2167 -2106 11228 -3349 -4790 12149 -679 -5712 12023 1756 -8001 9937 5092 -10015 5737
2180 5737 6299 -9981 2257 6216 -9845 -340 7900 -10648 -5043 8473 -8303 -7429 8058 -5146
2194 -5146 -9161 8190 -1551 -9981 7889 2530 -9830 6597 6403 -7587 5631 9014 -7298
2207g298J0983P458j7458O215J2481j7500J667J5506j4234m860J6746j1987o211
2220h492J5543p318j1408J6477k418j4512J3450K636j5967J2233O234j6994Q849
2233a687J0790j6627K598J5433j3726j789J5979j1414n052J6372q757r165J7418
2246A0373n236j3097J4879P07j5919J1670M330j7092R022Q633j6916L469J3280
2259H103j5029j323J5272j1806m152J5491r437p171J6714n524j2058J6674r15
2272D839j4016J3131L917j5801J0326P913j6435O440J1749j5976J390J4518j3064
2285a069l229J4489j0458p005J5950p539j1560J5634k025j4260J2824K404j5019
2298a0863R927O249j5394P336J0398j5445K735J3733j3148j897J5694j0573n225
$$ plain form
2207 -7298 3685 11143 -6315 -100 12381 -5119 -3452 12054 -2180 -7040 9706 -2281 -8492
2220 -8492 7051 -267 -11675 4802 2384 -12128 1322 3958 -12009 224 6458 -10536 -1687
2233 -1687 9103 -7524 -4926 10507 -3219 -5008 10971 -443 -5495 10877 2120 -7045 10373
2246 10373 5137 -7960 6919 7626 -8293 3377 7707 -9385 -363 8270 -8646 -5177 8103
2259 8103 -6926 -8249 7023 -4783 -8935 6556 -2881 -10052 6662 1138 -10920 5754 4839
2272 4839 -9177 3954 7871 -7930 2396 10309 -6126 314 12063 -3913 -2523 11995 -1069
2285 -1069 -4298 10191 -267 -7272 8678 1139 -10421 5213 3188 -11072 1752 4156 -10863
2298 -10863 -936 5313 -10081 -2745 7653 -7792 -5057 8676 -4472 -6369 9325 -1248 -6473
2311f473J6963q002j0090J6553k696j4013J4084J955j5529J1576M250j5957Q690
2324A311P449j6360M767J2057j4844j183J4373j0929n593J4726q088r461J7351
2337E576m495j2325J5101K23j3771J0695N595j5085J1100O480j5665O445J1692
2350A1566j5648R65J4894j2956l140J4508r778o874J5900o261j1908J4784j988
2363D064j4124J2967K305j5209R928O480j6005O555J0381j5866K726J3947j3366
2376e217j398J3494q171n606J5151o947r232J5893l337j1840J3520J145j3796
2389f341J0347M731j5214P978Q733j6305L179J2439j3216k034J3297j0339n065
2402g810J3856q073q043J5223m774j1745J4302M46j3873J2056L932j4282Q805
$$ plain form
2311 -6473 10490 2488 -7602 8951 6255 -7758 6326 8281 -7248 4328 8578 -7379 1311
2324 1311 8760 -7600 -2833 9224 -5620 -6803 7570 -3359 -8952 5774 -2314 -11775 5576
2337 5576 1081 -11244 3857 4080 -9691 1004 6599 -8486 2614 9094 -6571 -126 11566
2350 11566 -4082 -3117 11777 -1179 -4319 10189 411 -6463 9437 3176 -8732 6052 4064
2363 4064 -10060 2907 5212 -9997 -69 6411 -9594 -3039 7342 -8524 -5798 8149 -5217
2376 -5217 -6615 6879 -1292 -6898 8253 1306 -7926 7967 4630 -7210 6310 7455 -6341
2389 -6341 4006 8737 -6477 1501 10234 -6071 -2892 9547 -3669 -5703 7594 -2745 -7810
2402 -7810 6046 -2027 -10070 5153 379 -11366 2936 3382 -10491 1565 5497 -8785 20
2415B0P387j4324M504J2186j3378R36J3233j1815k972J4972r454p290J5350n776
2429C579j1477J3795n22j4327J2046L035j4528P832O703j5109O232R506j4475
2442g710J944J2613j2293k037J4120r642m625J5396p939q540J5769k802j2509
2455h255J3032K419j3413Q963O034j4151O485R292j4552K448J1369j2601j928
2468d858J3641j0540n861J5046q464q611J4615l111j3206J3101J975j4026J0943
2481F44L846j3157P802P450j4959N620J1946j3347O49J3293j0631m497J4541p837
2495A363p013J4193m351j1790J3983j26j3688J0726L197j3899Q759N879j5193
2508g960N955R940j4985J026J3234j1538l495J3983q849o179J4269n382r474J4336
$$ plain form
2415 20 7407 -6917 -2413 9773 -3605 -2669 10564 -1251 -4223 10749 1295 -5995 9355 3579
2429 3579 -7898 5897 5375 -8952 3094 6129 -8399 -567 6136 -8973 -2741 6765 -7710
2442 -7710 -5766 6847 -5446 -7483 6637 -3005 -7630 7766 -173 -8713 7056 4254 -8255
2455 -8255 4777 7196 -6217 2746 8780 -5371 1114 10406 -4146 -1698 9671 -2930 -4858
2468 -4858 8783 -1757 -7618 7428 -1036 -9647 4968 1857 -11349 1752 3727 -10299 644
2481 644 4490 -8667 -865 6585 -8374 -2754 9192 -4155 -3506 9787 -844 -5341 9200 1363
2495 1363 -5650 8543 4192 -7598 6385 6259 -7429 3297 6494 -7405 1354 7233 -7960
2508 -7960 -2005 7935 -7050 -6024 7210 -4328 -7823 6160 -2689 -8868 5401 19 -9455 4881
2522D881j545j2126J2439K622j3387R119O403j4290N964R371j3942K792J2421
2535A0722j2381k333J2971r163n472J3446p420q492J4251l945j2001J1670K526
2548D379j4303R955N369j4742P030Q154j3356L403J1484j2787l87J3971r821m260
2562e911J4372q507n922J4575m723j0755J4154k19j4347J1789L590j4788Q150
2575A458O369j4335N214R310j4059Q07J2095j1148k708J3061r276n925J4414n994
2589g17r142J4434k023j2513J2716K856j3381Q050O630j2549N877R033j3252K272
2603a709J2108j1858k075J3094r004n476J3486o696r623J4533l429j2166J1710
2616B895J630j2978Q614M070j3270O985O776j3028L890J0443j2026j26J3446r396
$$ plain form
2522 4881 3336 -8790 3649 6271 -7116 2003 8406 -5884 80 9451 -4491 -1699 10722
2535 10722 -1659 -3992 8979 -184 -5656 7790 370 -8122 6129 2184 -9817 1853 4379
2548 4379 -9924 31 5400 -9342 -2312 5842 -7514 -4111 7373 -5414 -5801 8170 -1651 -5911
2562 -5911 8461 -46 -5968 8607 3884 -6871 7283 7064 -7283 4506 8096 -6692 1458
2575 1458 7827 -6508 -1294 8016 -6043 -5236 6859 -4289 -6997 6064 -3212 -9137 5277 -717
2589 -717 -9859 4575 2552 -9961 2755 5611 -7770 280 6910 -5639 238 9271 -3981 -1709
2603 -1709 10399 -1459 -3534 9560 556 -4920 8566 1870 -7753 6780 3351 -8815 2895
2616 2895 4525 -8453 161 4231 -9039 -2054 4722 -8306 -4416 6027 -5999 -6125 7321 -2075
2630b075m631J3545o402p638J4499m007j0277J3494Q7j2780R645L891j2260O523
2644A614O888j4043N076R692j3923J186J1890j0839m613J3364p579p236J3251
2657D728m847j0551J3860q76j2200J1404K629j2521Q452O391j3232N787R737j4092
2671e331K617J3132j1709k096J3089q693n932J3494o542q596J3088k652j1072
2684g203J1307J201j3160Q356M942j3816O758P735j4442L694J1574j1917j986
2697f957J2995q759m366J2710o145o416J3036l801j0222J2867J077j2961J0298
2710C356M545j3971P669P235j3288L961J0084j3098k31J2018r948l828J1748p803
2724a551n782J2922n477r326J2224o35j2382J0542L730j2487P713O292j2873N308
$$ plain form
2630 -2075 -6706 6839 437 -7201 7298 3291 -6986 6508 6595 -6185 3460 7351 -4909 1614
2644 1614 8502 -5541 -465 9227 -4696 -3510 8380 -2459 -7072 6292 -1287 -8523 4728
2657 4728 -119 -10670 3190 2314 -9886 1518 4147 -8374 78 6469 -6763 -976 8761 -5331
2671 -5331 -2714 10418 -1291 -3387 9702 1009 -4923 8571 2029 -6567 6521 3869 -7203
2684 -7203 4104 5305 -7855 501 5443 -8373 -1615 6120 -8322 -4628 6946 -4971 -6957
2697 -6957 6038 -2721 -7087 5623 -522 -6938 6098 2297 -7925 4942 6019 -6942 3356
2710 3356 7901 -6070 1599 8834 -4454 -493 9591 -3507 -3738 8280 -1668 -5496 6252 -1551
2724 -1551 -7333 5589 112 -9214 3010 2375 -10007 535 4265 -8222 -509 5783 -7090 -1782
2738a782R536j2770J624J1576j0726j750J3108q253n369J3514o515q446J3227
2751F974k046j1635J0584K002j2959Q596M605j1872N381O962j3793L410J0641
2764F850j2234j227J2665r404m112J2916o372p087J3090l039j0928J2466J528
2777E112j2049R589L850j2146O838P472j2878L863J0590j2999j89J2375j0343
2790i15m008J2273o786p861J3131m446r687J2273j434j1549J0081K948j2282P795
2804d67N446j2285N002R030j2910J666J1867r955k899J3031p338n690J2991m619
2818B870q935J3161k030j0771J0661J559j2364P722N214j2683N673O921j2605
2831e607K669J0739j1871k533J2096p959m449J1930n929p406J2244k810j0203
$$ plain form
2738 -1782 7754 -5016 -3392 8184 -2542 -4292 8816 563 -4806 8708 2193 -6253 6974
2751 6974 4928 -6707 3877 5879 -7080 1516 6121 -5751 -370 6592 -7201 -3791 6850
2764 6850 -5384 -6611 6054 -3350 -7462 5454 -918 -8005 5085 2046 -8882 3584 5112
2777 5112 -6937 2652 6502 -5644 1194 8666 -4212 -349 10241 -2758 -2947 9428 -915
2790 -915 -4923 7350 564 -7297 5834 1388 -8299 3974 2540 -9009 1072 4020 -8262 -467
2804 -467 4979 -7306 -2304 6726 -6184 -4518 7349 -2606 -5505 7526 188 -5502 7489 2870
2818 2870 -6065 7096 5066 -5705 4956 6515 -5849 1873 7087 -5596 77 6998 -5607
2831 -5607 -2938 7801 -4070 -6603 5493 -2466 -6915 5015 -914 -8320 3924 1114 -9089
2844i089J1874J662j2286R482M307j2112O050Q385j2640L211J0199j1310o18J2202
2858I317r317m222J1776o780o413J2047m276r534J2041j448j1682R589L296j2716
2872h322P607N623j1714L676R115j1691J099J1505j0380k491J2897p586n385J1849
2886E802l925q228J2771j912j1192J0777K641j2150P375N472j2127N218P137j2173
2900d514J953J0147j1098j745J1514q284n226J2483o304p314J2394k268j1026
2913i288J1313J463j1221Q331M593j1800O076P197j1589M161R934j2663M60J1982
2927H949r063l853J1853n903o765J1789m108r503J1213k79j1637Q970L220j1657
2941f774O220N784j2578M332Q660j1949J129J1029r159l452J2717o909n699J1926
$$ plain form
2844 -9089 2785 4447 -7839 1643 5950 -6162 -112 8273 -4367 -1156 9043 -2267 -2885 9317
2858 9317 0 -4222 7554 774 -5639 6408 2132 -7402 4639 3191 -8491 1098 4394 -8322
2872 -8322 -715 4908 -6806 -3130 5985 -5706 -4607 6898 -3482 -5973 6924 -662 -6047 5802
2886 5802 1877 -6351 6420 4508 -6684 4093 6734 -5416 1959 7431 -4696 522 7659 -4514
2900 -4514 -2561 7586 -3512 -5257 6257 -2027 -7253 5230 -1074 -8388 4006 1738 -9288
2913 -9288 2025 3488 -7733 598 5191 -6609 -533 6664 -4925 -764 9170 -3493 -3033 8949
2927 8949 -114 -3967 7886 1983 -4782 7007 2899 -6604 4609 4330 -7307 1663 4883 -6774
2941 -6774 -554 5230 -7348 -3016 5644 -6305 -5176 5853 -3306 -6758 5959 -950 -6649 5277
2955E277l797q455J2195q23j1074J0414K888j2169P734N180j1509M320Q502j2011
2969c328R48J0573j0547k918J1950p369n884J1852n360p747J1607k155j0216J0634
2983B040J274j1602P620N082j2036O992O295j1464K994J0073j0481o89J1731q490
2997f61l762J1973n294p046J1901l740r027J1094n58j1083R167L167j2816O418
3011b67O142j2038L702Q609j1510N46J0069q394l868J2083o882n103J1404l400
3025A093r054J2029m71j0705R522L218j1770O990O216j1066L792Q165j1086J469
3039a658R772r328k746J1279p353n208J1283n589p003J0296j906j0185J0672J852
3053D178j2118P462M546j0713M889P515j1947L202R517j0836l19J1648p670n407
$$ plain form
2955 5277 1480 -6975 5220 4397 -6677 3737 6625 -5544 2190 7370 -4139 181 8683 -3328
2969 -3328 -2380 8193 -2354 -5272 6678 -691 -6575 5277 -83 -7830 3777 1622 -8594 2040
2983 2040 3314 -8288 -668 4414 -7622 -630 5665 -5799 -2805 7268 -3213 -3902 7829 -661
2997 -661 -4423 7550 2256 -4790 7111 3371 -5656 5438 4880 -6203 2964 6131 -6685 -267
3011 -267 5875 -6163 -2461 6148 -5362 -4816 5253 -3141 -7009 5074 -1808 -6911 4493 1093
3025 1093 -7961 4068 3597 -7108 2414 5632 -6138 852 7068 -3998 -206 7959 -3127 -1658
3039 -1658 8114 -1214 -3960 7319 -34 -5242 6041 452 -6551 3745 1839 -8346 2326 4178
3053 4178 -7940 -478 4068 -6645 -1756 5759 -6188 -2986 6531 -4305 -4624 7024 -646 -6053
3067f053J3085n304o536J0943k654q744J0456M27j1176P863M304j1287M566O327
3081F217j1109K971Q483j1592M81J0615q912l934J1409n806n886J1149l581q362
3095g857J0972o05r784Q759L541j0301O400N225j0686M433P994j1261J064J0469
3109H363r596k312J0837o898n371J0731m164p795J0690j736j0167R732Q29j0772
3123g629P145N161j1771N078P419j1367K041R976j0113j837J1817o960m212J1273
3137F021n461n889J0313k170q523J0046J025j0626Q031L918j1299M676P275j1513
3151d176K860Q125j0362n64R926p678m421J0158m935o016J0493l714p330J0776
3165C142m27j0410Q819L557j1778P256N501r763K936P987j0301J191J0282r310
$$ plain form
3067 -6053 7032 1728 -4808 6135 3481 -5263 5193 5620 -5556 2307 6611 -4676 -110 6217
3081 6217 -4892 -1921 6562 -5030 -4549 6066 -2846 -6780 4629 -1177 -7063 4086 505 -7857
3095 -7857 3115 2510 -7274 1485 5026 -5275 1125 6350 -4336 97 8091 -3170 -2106 8363
3109 8363 -1233 -3545 7292 394 -4977 5754 1590 -6205 4485 2749 -7418 2314 3143 -7629
3123 -7629 -484 4677 -7094 -2016 5403 -5964 -3923 6053 -4060 -5897 5920 -1040 -5252 6021
3137 6021 560 -5329 4984 2814 -5709 4337 5362 -5264 2767 6685 -4614 62 7337 -4176
3151 -4176 -1316 6809 -3553 -4117 5809 -1869 -6290 3868 -1067 -7083 3410 -304 -7634 3142
3165 3142 2715 -7695 1124 4681 -7097 159 5660 -4103 -1167 6820 -3481 -2290 7992 -1318
3179a318k574J1065o524m440J0481m648p718J1207j940r982R087K032j1414O632
3193e4M847j0767M113O806j0502J814R232r795j140J0393o993l943J0821m559
3207B73o521J0699k233q086J0241J195j0593O981M465j0243M473N771r627K195
3221a010Q130r691n48J0235q281m110J0500n209o259R750k611q040Q970n1q582
3236f807P737K547r612N131N967j0261L373Q084r855R77R646q551k484J1034n936
3251I90m750R320k640q052R802j204r199R698O83j0150O359M474j0961M206O985
3266E561j0686J234Q906q620j630J0017o407m918J0901m335n779Q840j291p173
3280e380Q775O80j0090P732L893r277M272O339j0328K784P877r182n32R487p591
$$ plain form
3179 -1318 -3892 7173 649 -3791 6690 2042 -5676 5531 3591 -6391 2696 4728 -6686 -54
3193 -54 4793 -5974 -1861 4945 -5557 -3743 5489 -4306 -5446 4947 -2046 -5989 4832 273
3207 273 -6248 4451 2218 -5868 4373 5568 -5025 1956 6421 -3822 651 6422 -3205 -1010
3221 -1010 7120 -2571 -3119 7116 -1165 -5275 5225 16 -6243 3507 896 -7144 1826 1775 -6807
3236 -6807 930 3477 -6135 -1004 4963 -5298 -1925 6159 -3696 -2719 6927 -1624 -4108 6926 990
3251 990 -3760 5560 2920 -5132 4670 3466 -5733 3965 4648 -5502 857 5331 -5630 -1424 5561
3266 5561 -5125 -3891 5015 -3605 -5235 4782 -1625 -6543 4358 23 -5756 3084 1793 -5380
3280 -5380 3395 4075 -6015 1717 5610 -3667 605 6944 -3384 -600 7277 -1905 -2437 7050 -541
3295e41m169J0554n378n755Q845k309p899R630m36j0038Q212K870r854M547N916
3310D195r365L101P118r392O04Q961p407k198J0208n799l855R330l439o768J0221
3325E515j569q967Q347K015j0230N820M509r371K869O753r766N88Q343q317j695
3340e156R863o515m436R374l289o231R240j651p922R075J362r428O357M009q560
3355c908L233O234q097K307P702r398n30R124o963l900R989m282o072R496k874
3370B061p797Q530J46r820P735K855r530M807M481r303L089O981q430N23R376
3385E704p333k742Q734m322m353Q887k335o729Q482m96q439P765K490r193N411
3400A531M791r923L402N794q959R41Q477q672k909J0764o292m869R469l914n647
$$ plain form
3295 -541 -4710 5844 466 -5289 3556 1247 -6652 2978 2542 -7496 716 3586 -6268 -1721 4195
3310 4195 -5170 -2069 5049 -4343 -3739 5222 -2185 -4383 5825 26 -3829 5501 2062 -4706 5515
3325 5515 3946 -5021 3326 5341 -4889 931 5440 -3931 -1062 5691 -4075 -3487 4856 -3461 -5156
3340 -5156 4707 -1808 -6244 3130 -159 -6390 2850 1199 -6723 2352 3714 -5714 643 4652 -3908
3355 -3908 -675 5559 -2538 -231 7471 -1927 -2457 6667 -296 -4196 5793 1511 -4561 4935 2061
3370 2061 -5736 2794 2940 -6880 855 3710 -5820 -1013 3468 -5835 -2746 4235 -4195 -3672 5704
3385 5704 -1629 -4371 4363 41 -4312 4575 2240 -4489 3993 3497 -4942 2823 5313 -3880 1531
3400 1531 6322 -3601 -199 5595 -3364 -2423 6054 -2618 -5527 5237 -1055 -5924 3545 -369 -6016
3415f016Q966j533q317Q355R81q698N956M665q488L252O348r006K540P226q390
3430b159j349R406n490l870Q823l398n704P806k005o902P997J71r251O583L286
3445C944r158M423N023q800J807P362q306o21Q252n484l537R261m868l829Q789
3460D258k949n170P554n81p547P094K646r331N397M146q339K915N375q014O02
3475a944Q309p753k496Q713n123m572Q254l808n301Q379j709p805P874J560r159
3490f581O191L871p589K642N937p762J574P478p836n77Q376o217l100Q758l395
3505A770m567P286j805p428P595J257q342M946L454q142L252N290q620K058N842
3520C846p510j019Q800o368l103R043m313m255Q165k380n552P134J84p740P142
$$ plain form
3415 -6016 2950 1417 -6900 1455 2436 -6262 -306 4359 -4129 -877 5471 -3535 -995 6231 -2159
3430 -2159 -3508 5898 408 -3462 5361 1963 -3741 4065 2060 -4842 3155 3326 -5925 658 3944
3445 3944 -5214 -791 4232 -4568 -2761 4601 -3705 -4326 3926 -1558 -5095 4166 -702 -4531 4258
3460 4258 1309 -3861 3693 3112 -4435 2659 5305 -4026 1371 5517 -2822 93 5468 -2546 -1944
3475 -1944 6365 -1388 -3884 4829 -294 -4866 3388 -420 -5721 2658 949 -6856 1018 2578 -6581
3490 -6581 -390 3481 -4108 -1466 4471 -3291 -1717 5761 -2075 -2652 5724 -493 -3593 5165 1770
3505 1770 -2797 4489 2684 -4744 2851 4108 -4234 712 4166 -3976 -724 4566 -4054 -1996 3846
3520 3846 -3664 -4683 4117 -2251 -5354 3689 -624 -4879 3286 906 -4646 2488 2672 -5068 2074
3535B074K753q426M039M861p964K561N636p542J63P349o821j955Q544n149m696
3550d573P822j592p293Q321j154p507O656J525p863M820M416q181K625N895p432
3565c515J041P179p301j123R080n624l723Q234k242n777P903j206o142O700O22
3580D106q548O277K982p984L088M830q076J134O522p209n86P592n732l118P715
3595B993m040m299P759j968o001P986m49p184O080K624q111M247N495q034K868
3610c4N633o810k39P121n801k389P168l812m560Q235l404n623P217j208o984O844
3626A354J842q756M510L958p518K816N155p207O09O744o351n16Q171n196l405
3641c790P428k789m541P690j676o644P575J219p961M362M038p763L124M283p591
$$ plain form
3535 2074 4827 -3599 440 5301 -2663 -102 5534 -2008 -1845 5504 -1317 -3272 5272 123 -4573
3550 -4573 3249 1657 -5636 2685 1531 -5976 680 2205 -5658 -838 3578 -4603 -1978 3917 -3515
3565 -3515 -2474 4705 -2596 -3719 5361 -263 -3986 4248 2006 -3771 4132 2926 -3216 3484 4106
3580 4106 -4442 1835 4817 -3167 -79 4751 -3325 -2191 4331 -2878 -3464 4128 -1604 -4722 2993
3595 2993 -1047 -5346 2413 445 -5556 2430 1981 -5203 877 3501 -4610 -363 5132 -2902 -34
3610 -34 5599 -1211 -1450 5671 -130 -2519 4649 837 -3723 4512 1108 -4515 2702 1494 -5490 1354
3626 1354 3196 -5560 -1050 2908 -4610 -1794 3361 -3846 -3237 3507 -2844 -3360 4811 -385 -3790
3641 -3790 3638 849 -3692 3998 2322 -4322 3253 4472 -3489 873 4911 -2852 272 4555 -3036
3656c036J711N974p016r38P296n327k864P044k909n486P453j832n299O754O16
3671B141p567N210L809p751L844M399p218K569N327o835L21P457n932k647P858
3686D985l394m722P538k496n882P063q03o380N437K138q582M536L580o844J791
3701b035M984o191M73O499o173j480P541l805m131P838l146m587P177j273n635
3716c944N970J749p423N293K982p301K558N294p142J230N373o622r40P293n522
3731a152k891P543l856m041O983k107n307O032O44p271M848L556p336K811M987
3746C443o693J538N790o302P84O090m773l008P756k621m897O963j673n416O679
3761C660j424o262O103J888p743L623L741o725J582N295o824K59N939o114j324
$$ plain form
3656 -3036 -1325 4649 -2367 -3305 3991 -1336 -4200 2844 -65 -5551 1902 70 -5229 1525 2141
3671 2141 -5426 -216 3593 -4158 -314 4085 -3133 -564 4763 -2072 -1751 5706 -226 -2873 4985
3686 4985 1591 -3131 4407 1911 -3971 3092 2289 -4091 1346 3484 -5098 -562 3018 -3826 -2035
3701 -2035 2949 -3242 -2769 3730 -2443 -3923 3618 -187 -4318 3520 374 -4213 2964 1691 -3944
3716 -3944 2026 3775 -3648 1645 4627 -2674 -116 5178 -1964 -734 4639 -1983 -2923 4370 -1152
3731 -1152 -4043 3500 -356 -4397 2586 479 -4828 1204 1848 -5423 -575 2981 -4355 -1544 3443
3746 3443 -3250 -1712 4078 -2224 -1440 4650 -123 -3131 4625 2004 -2893 4070 2397 -3019 3660
3761 3660 2236 -4026 2077 3965 -3778 -155 3586 -3139 -1557 3738 -3086 -2827 3112 -3002 -4326
3776d326P241l774l734P358k659m408O892j521n263O723R65o755M075L751p028
3791b463K321M751o069J207N169n798j367P214n028l741P040k628m588O653j467
3806A206o267O646M93o792M591K633o994L513M062o272J294N667o309j13O152
3821C510m288j938P641m622m111P143j075n189O430o38n624M407K322p573L933
3836C28L476p175K319N058o558P6O314o077j368O492l505m197O878k379l993N871
3852A560j6n842N409J307o113M043L339n963J912N009n987O25N255n382j590P117
3868D683m292l910O884k171m498O129j435n050M798O75o896N491K429o493K205
3883a451M691o542R91N052n749M62O516m690l028O913k924l053N860j470m429
$$ plain form
3776 -4326 2915 -859 -4593 2765 106 -4302 2590 1069 -4194 2529 3494 -3261 814 4565 -2463
3791 -2463 -142 4609 -1460 -253 4916 -882 -2249 4965 -63 -3804 3236 608 -3980 2673 1206
3806 1206 -5061 1585 2078 -4714 -123 2510 -4484 -971 3091 -3181 -1887 3780 -2529 -2642 3510
3821 3510 -778 -2716 4925 303 -3808 3335 2260 -2929 3501 2863 -2761 1646 3968 -3605 328
3836 328 3804 -3371 -1052 4006 -2552 -2476 3838 -2239 -3607 2885 -620 -4817 2061 -318 -4311 1560
3852 1560 1544 -4298 1111 2418 -3695 348 3687 -2276 -364 4645 -1342 -717 4538 -844 -2434 4683
3868 4683 391 -3519 3365 1194 -3304 2825 1390 -3660 1138 1813 -5083 408 2837 -3656 -1451
3883 -1451 3240 -3302 -2311 2741 -3008 -2546 3970 -720 -3748 3165 241 -2812 3048 1578 -2851
3898b851N364M90o004M947K184o664K690M642o953J002N063n902J22N309n084
3913a645j961O482k757m181N921j639m883O468j041n100N250J253o868M689L173
3928C161o161J725N674n732L18N240m798j222O217l410m215O607j845m450O202
3943C311j181n860N631O73o808M427K640o589K962L317n136Q60M523n016p50N826
3959B830m158k307O857l303l797P070j905m517N803M77o297N016J956n898K474
3974C01M368o443R62N171n958M15N024m892j407N856l926l758O034n80n814O223
3990A576n63n389N014J661o430L662L315o117K517L769n055J50O018n580r48O855
4006D455l863l887O760j516m640N102o87m613M569N06n684M174K728o567J886
$$ plain form
3898 -2851 2513 3003 -3001 1946 4130 -2534 156 4798 -2155 -1153 3910 -1992 -1870 3439 -1645
3913 -1645 -3606 2876 119 -4062 1859 220 -4663 1805 764 -4336 914 2167 -4701 -12 3161
3928 3161 -3000 -1275 4399 -1333 -1015 4225 -573 -1795 4422 1012 -3203 3404 1559 -2891 3311
3943 3311 2130 -3730 1901 2574 -4234 193 2833 -3756 -794 2523 -2613 -1753 2770 -2246 -2996 2830
3959 2830 -1328 -3635 3222 -81 -3878 3192 1287 -3230 2573 3050 -3247 1769 3725 -2173 301
3974 301 4669 -1774 -812 4359 -1599 -1184 3840 -1052 -2459 3397 -529 -4287 1747 1167 -4647 1576
3990 1576 1013 -4376 638 2299 -4131 -469 2846 -3271 -754 3015 -2040 -1890 4128 -1452 -2400 4455
4006 4455 592 -3295 3465 1949 -2691 2411 1724 -2889 1680 2186 -3498 676 3404 -3163 -1277
4021a277M465n576K64M563n438l01O288m389k506O569k460l988N299m18m661N173
$$ plain form
4021 -1277 3188 -2388 -2124 2439 -2999 -3300 2988 -1401 -3907 2662 202 -3786 1513 1095 -3566 1607
$$ [...]
8191C08
##END NTUPLES=NMR FID
##END=
