##TITLE=1H_CA-8566
 CDCl3, 8 sc, 
 11.2.2019
##JCAMPDX= 6.0         $$ Bruker NMR JCAMP-DX V2.0
##DATA TYPE= NMR FID
##DATA CLASS= NTUPLES
##ORIGIN= UXNMR, Bruker Analytische Messtechnik GmbH
##OWNER= root
$$ XWIN-NMR		Version 3.5
$$ Mon Feb 11 14:03:58 2019 Russian Standard Time (UT+4h)  she@DPX200
##.OBSERVE FREQUENCY= 200.1313
##.OBSERVE NUCLEUS= ^1H
##.DELAY= (6, 6)
##.ACQUISITION MODE= SIMULTANEOUS
##.ACQUISITION SCHEME= undefined
##.AVERAGES= 8
##.DIGITISER RES= 18
##SPECTROMETER/DATA SYSTEM= spect
##.PULSE SEQUENCE= zg30
##.SOLVENT NAME= CDCl3
##.SHIFT REFERENCE= (INTERNAL, CDCl3, 0, 15.7039)
##AUDIT TRAIL= $$ (NUMBER, WHEN, WHO, WHERE, WHAT)
$$ ##TITLE= Audit trail, XWIN-NMR		Version 3.5
$$ ##JCAMPDX= 5.01
$$ ##ORIGIN= Bruker BioSpin GmbH
$$ ##OWNER= she
$$ F:/spectra/data/she/nmr/H-F/1/audita.txt
$$ ##AUDIT TRAIL=  $$ (NUMBER, WHEN, WHO, WHERE, WHAT)
(   1,<2019-02-11 14:02:39.59 +0400>,<she>,<DPX200>,
      <created by zg, POWCHK disabled, PULCHK disabled
       configuration hash MD5:
       00 E9 B6 7A A2 85 ED C7 34 08 36 98 17 FE 4E 26
       data hash MD5: 16K
       DE 8A CF 50 45 6D 3C 7B 9E 65 AF 14 F2 18 9C 8B>)
$$ ##END=
$$ 
$$ hash MD5
$$ 59 49 30 41 C1 D0 BF D1 71 4A B3 B8 AD D7 49 AF
##$RELAX= 
##$RELAX= 
##$RELAX= 
##$RELAX= 
##$RELAX= 
##$RELAX= 
$$ Bruker specific parameters
$$ --------------------------
##$DU= <F:/spectra>
##$EXPNO= 1
##$NAME= <H-F>
##$PROCNO= 1
##$TYPE= <nmr>
##$USER= <she>
##$AMP= (0..31)
100 100 100 100 100 100 100 100 100 100 100 100 100 100 100 100 100 100 
100 100 100 100 100 100 100 100 100 100 100 100 100 100 
##$AQSEQ= 0
##$AQ_mod= 1
##$AUNM= <au_zg>
##$AUTOPOS= <>
##$BF1= 200.13
##$BF2= 200.13
##$BF3= 200.13
##$BF4= 200.13
##$BF5= 200.13
##$BF6= 200.13
##$BF7= 200.13
##$BF8= 200.13
##$BYTORDA= 1
##$CFDGTYP= 0
##$CFRGTYP= 5
##$CHEMSTR= <none>
##$CNST= (0..31)
1 1 145 1 1 1 1 1 1 1 1 1 1 1 1 1 1 1 1 1 1 1 1 1 1 1 1 1 1 1 1 1 
##$CPDPRG= <>
##$CPDPRG1= <>
##$CPDPRG2= <>
##$CPDPRG3= <>
##$CPDPRG4= <mlev>
##$CPDPRG5= <mlev>
##$CPDPRG6= <mlev>
##$CPDPRG7= <mlev>
##$CPDPRG8= <mlev>
##$CPDPRGB= <>
##$CPDPRGT= <>
##$D= (0..31)
0 1.2 0 0 0 0 0 0 0 0 0 0.03 0 0 0 0 0 0 0 0 0 0 0 0 0 0 0 0 0 0 0 0 
##$DATE= 1549879359
##$DBL= (0..7)
120 120 120 120 120 120 120 120 
##$DBP= (0..7)
150 150 150 150 150 150 150 150 
##$DBP07= 0
##$DBPNAM0= <>
##$DBPNAM1= <>
##$DBPNAM2= <>
##$DBPNAM3= <>
##$DBPNAM4= <>
##$DBPNAM5= <>
##$DBPNAM6= <>
##$DBPNAM7= <>
##$DBPOAL= (0..7)
0.5 0.5 0.5 0.5 0.5 0.5 0.5 0.5 
##$DBPOFFS= (0..7)
0 0 0 0 0 0 0 0 
##$DE= 6
##$DECBNUC= <off>
##$DECIM= 32
##$DECNUC= <off>
##$DECSTAT= 4
##$DIGMOD= 1
##$DIGTYP= 9
##$DL= (0..7)
0 120 120 120 120 120 120 120 
##$DP= (0..7)
150 150 150 150 150 150 150 150 
##$DP07= 0
##$DPNAME0= <>
##$DPNAME1= <>
##$DPNAME2= <>
##$DPNAME3= <>
##$DPNAME4= <>
##$DPNAME5= <>
##$DPNAME6= <>
##$DPNAME7= <>
##$DPOAL= (0..7)
0.5 0.5 0.5 0.5 0.5 0.5 0.5 0.5 
##$DPOFFS= (0..7)
0 0 0 0 0 0 0 0 
##$DQDMODE= 0
##$DR= 18
##$DS= 0
##$DSLIST= <SSSSSSSSSSSSSSS>
##$DSPFIRM= 0
$$ [...]
##$SUBNAM2= <"">
##$SUBNAM3= <"">
##$SUBNAM4= <"">
##$SUBNAM5= <"">
##$SUBNAM6= <"">
##$SUBNAM7= <"">
##$SUBNAM8= <"">
##$SUBNAM9= <"">
##$SW= 20.0189088683792
##$SWIBOX= (0..15)
0 0 2 0 0 0 0 0 0 0 0 0 0 0 0 0 
##$SW_h= 4006.41025641026
##$TD= 16384
##$TD0= 1
##$TE= 0
##$TE2= 300
##$TE3= 300
##$TEG= 300
##$TL= (0..7)
0 120 120 120 120 120 120 120 
##$TP= (0..7)
150 150 150 150 150 150 150 150 
##$TP07= 0
##$TPNAME0= <>
##$TPNAME1= <>
##$TPNAME2= <>
##$TPNAME3= <>
##$TPNAME4= <>
##$TPNAME5= <>
##$TPNAME6= <>
##$TPNAME7= <>
##$TPOAL= (0..7)
0.5 0.5 0.5 0.5 0.5 0.5 0.5 0.5 
##$TPOFFS= (0..7)
0 0 0 0 0 0 0 0 
##$TUNHIN= 0
##$TUNHOUT= 0
##$TUNXOUT= 0
##$USERA1= <user>
##$USERA2= <user>
##$USERA3= <user>
##$USERA4= <user>
##$USERA5= <user>
##$V9= 5
##$VALIST= <valist>
##$VCLIST= <CCCCCCCCCCCCCCC>
##$VD= 0
##$VDLIST= <DDDDDDDDDDDDDDD>
##$VPLIST= <PPPPPPPPPPPPPPP>
##$VTLIST= <TTTTTTTTTTTTTTT>
##$WBST= 1024
##$WBSW= 4
##$XGAIN= (0..3)
0 0 0 0 
##$XL= 0
##$YL= 0
##$YMAX_a= 142907
##$YMIN_a= -181703
##$ZGOPTNS= <>
##$ZL1= 120
##$ZL2= 120
##$ZL3= 120
##$ZL4= 120
##$ABSF1= 10
##$ABSF2= 0
##$ABSG= 5
##$ABSL= 3
##$ALPHA= 0
##$AQORDER= 0
##$ASSFAC= 0
##$ASSFACI= 0
##$ASSFACX= 0
##$ASSWID= 0
##$AUNMP= <proc_1d>
##$AZFE= 0.1
##$AZFW= 0.1
##$BCFW= 1
##$BC_mod= 2
##$BYTORDP= 1
##$COROFFS= 0
##$CY= 11.3945322036743
##$DATMOD= 1
##$DC= 2
##$DFILT= <>
##$DTYPP= 0
##$F1P= 18.9103706918063
##$F2P= -1.10871071338519
##$FCOR= 0.5
##$FTSIZE= 0
##$FT_mod= 4
##$GAMMA= 1
##$GB= 0.15
##$INTBC= 1
##$INTSCL= 1
##$ISEN= 128
##$LB= 0.24
##$LEV0= 0
##$LPBIN= 0
##$MAXI= 10000
##$MC2= 0
##$MEAN= 0
##$ME_mod= 0
##$MI= 1.114404
##$NCOEF= 0
##$NC_proc= 0
##$NLEV= 6
##$NOISF1= 3.799351
##$NOISF2= 2.8
##$NSP= 1
##$NTH_PI= 0
##$NZP= 0
##$OFFSET= 15.70392
##$PC= 1
##$PHC0= -8673.404
##$PHC1= 2.60018
##$PH_mod= 1
##$PKNL= yes
##$PPARMOD= 0
##$PSCAL= 0
##$PSIGN= 0
##$REVERSE= no
##$SF= 200.130013532006
##$SI= 16384
##$SIGF1= 3
##$SIGF2= 2
##$SINO= 400
##$SIOLD= 16384
##$SREGLST= <1H.CDCl3>
##$SSB= 0
##$STSI= 0
##$STSR= 0
##$SW_p= 3612.71676300578
##$SYMM= 0
##$S_DEV= 0
##$TDeff= 0
##$TDoff= 0
##$TI= <>
##$TILT= no
##$TM1= 0
##$TM2= 0
##$TOPLEV= 0
##$USERP1= <user>
##$USERP2= <user>
##$USERP3= <user>
##$USERP4= <user>
##$USERP5= <user>
##$WDW= 1
##$XDIM= 8192
##$YMAX_p= 0
##$YMIN_p= 0
$$ End of Bruker specific parameters
$$ ---------------------------------
##NTUPLES= NMR FID
##VAR_NAME=  TIME,          FID/REAL,        FID/IMAG
##SYMBOL=    X,             R,               I
##VAR_TYPE=  INDEPENDENT,   DEPENDENT,       DEPENDENT
##VAR_FORM=  AFFN,          ASDF,            ASDF
##VAR_DIM=   8192,          8192,            8192
##UNITS=     SECONDS,       ARBITRARY UNITS, ARBITRARY UNITS
##FACTOR=    0.0002496,     1,               1
##FIRST=     0,             0,               0
##LAST=      2.0444736,     0,               0
##MIN=       0,             -181703,         0
##MAX=       2.0444736,     142907,          0
$$ Real data points
##PAGE= N=1
##DATA TABLE= (X++(R..R)), XYDATA
0 0 0 0 0 0 0 0 0 0 0 0 0 0 0 8 -8 8 -8 8 -16 16 -16 24 -25 32 -40 45 -49 57 -69 79 -89 103 -117 131 -149
35 -149 168 -188 210 -236 264 -293 325 -361 401 -442 489 -540 595 -655 723 -797 878 -967
53 -967 1066 -1178 1305 -1448 1613 -1805 2031 -2301 2632 -3051 3596 -4342 5423 -7149 10352
68 10352 -18327 84708 72251 -103588 -78877 24782 126641 88737 -9251 -63566 -11291
79 -11291 54244 67140 -8874 -88544 -95674 -21779 52972 72222 4597 -81392 -98103 -31129
91 -31129 42374 60139 7279 -41852 -20719 40360 58562 13304 -50491 -52702 15123 72244
103 72244 56423 -6741 -61542 -61812 -17477 15019 10377 -11528 -30857 -27319 -5338 4420 -8135
116 -8135 -24959 -27316 2729 47076 55512 20107 -16294 -20201 14559 51281 46951 15463 -1305
129 -1305 4579 20324 21270 -3073 -23444 -19260 -4756 8128 8353 -11442 -29813 -30588 -18884 -1198
143 -1198 7194 -4557 -14979 -6634 8512 17019 7539 -11980 -12392 7370 20895 19611 6792 -8246
157 -8246 -9311 -3382 -4618 -6301 -6669 -9134 -6213 -1778 -3371 -7362 -16070 -23052 -10783 11064 20773
172 20773 15354 1740 -5796 3843 13043 10063 8354 14307 22393 24921 12021 -6853 -10673 -4313
186 -4313 1210 6984 8534 4247 -2474 -16455 -26325 -18547 -4529 790 471 -2546 -1445 1752 -7109
201 -7109 -19029 -13277 5543 20474 21104 5841 -6393 -3971 -1481 -4282 -1827 5356 12907 12359
215 12359 -2373 -14594 -12991 -8300 -5650 -2178 2635 9205 8744 -6044 -17769 -11198 2283 11500
229 11500 11027 5584 6890 11132 4111 -5854 -4992 4219 14527 15215 3744 -2827 -1277 -3301 -7545
244 -7545 -8015 -3567 3509 4024 -5641 -11229 -7701 -5142 -5369 -6317 -4418 4494 8691 1053 -4683 -2747
260 -2747 2355 6165 4223 693 5141 9742 5787 -444 -3337 -2439 1268 175 -3799 -1022 2405
275 2405 -296 -4748 -8445 -7820 -1940 267 -1368 850 4625 3911 723 -3849 -3911 3245 7698 6705
291 6705 6765 5718 2391 -982 -5413 -5602 930 5143 3026 477 -3323 -6315 -7733 -9454 -6964 1359
307 1359 5596 3837 116 -3778 -4289 -1659 -327 2205 9246 11537 7896 1961 -3777 -3332 1023 2215
323 2215 3032 5866 4740 -455 -6365 -11261 -8486 -1429 907 261 474 -1182 -2966 -5586 -8432 -3674
339 -3674 4902 7749 5304 2200 -336 -110 147 -2336 539 6173 7163 3347 -2497 -5701 -3377 -982
355 -982 -2321 -1988 1040 2098 595 -3696 -6345 -2114 3459 2852 1470 1976 3358 4343 1214 -1905
371 -1905 931 5161 4622 1560 -783 -490 1601 73 -4023 -3467 -664 91 -1568 -4557 -4091 -508
387 -508 590 -2884 -3525 -1748 802 1510 -763 -1043 1802 3232 568 -1728 -1287 1477 3808 1857
403 1857 -685 399 811 -718 -2391 -2570 727 4149 2111 -1160 -1714 -912 16 59 -221 2294 5177
420 5177 3129 -766 -2101 -1721 740 2428 1164 1356 2907 782 -2631 -4055 -3127 353 2677 970
436 970 -555 -813 -1987 -2933 -3635 -2171 1154 3344 1013 -1166 -2492 -2489 -1787 -1390 -469 2216 3366 557
454 557 -1888 -2787 -1643 683 1757 1371 2722 2954 700 -1477 -1626 -58 2973 3197 1461 1084 855
471 855 -569 -1262 -1449 -144 2011 1938 -232 -1517 -1555 -1160 -832 -658 -179 1556 1278 -689 -1758 -1038
489 -1038 -138 1425 335 -397 553 385 -914 -1835 -1479 -234 904 -775 -2134 -1420 -689 -521 -809 -774
507 -774 252 1398 120 -822 -160 1397 2212 2282 1092 1269 1921 1126 -53 325 1215 2205 1296 -616
525 -616 -1959 -1406 -946 -997 -887 -265 890 151 -1665 -2427 -895 497 1176 910 473 1032 891 -827 -1185
544 -1185 130 1293 2088 1040 -862 -1236 -1234 -1669 -1861 -780 251 903 -381 -2300 -1970 -975 283 537
562 537 1117 1482 1485 974 -235 -379 865 2128 2332 1055 244 276 -425 -1485 -1065 130 804 441 -940
581 -940 -1814 -1341 -798 -764 -113 294 1159 1102 84 -938 -217 754 1173 1140 977 581 400 -504 -1398 -883 237
602 237 583 -113 -1316 -1418 -1276 -1175 -1169 -420 566 801 718 -336 -609 232 1156 1290 1026 1279 1015 363 -651
623 -651 -627 401 863 461 -6 -839 -1042 -1045 -1201 -976 -53 534 380 -314 -819 -561 109 544 790 1076 1063
644 1063 398 -250 -727 -448 349 824 382 -135 -747 -908 -1086 -951 -498 307 389 185 -437 -716 -431 165
664 165 416 803 1268 1044 507 -266 -478 -36 882 528 369 -100 -148 -860 -1089 -1129 -578 359 175 -116 -533
685 -533 -672 -156 -264 262 564 1093 993 86 -332 -329 386 355 390 268 336 -128 -838 -1267 -725 -8 39 181
707 181 -573 -656 -640 -274 -227 198 709 943 523 35 -243 -115 236 443 501 494 420 -359 -706 -1024 -568 -60 46
730 46 -36 -435 -396 -925 -684 -318 372 752 467 168 -201 -82 -134 238 670 677 605 185 -283 -748 -415 -365 23
753 23 188 -125 -376 -723 -653 -784 -284 377 678 392 -73 -17 -25 -63 137 522 877 749 -4 -652 -611 -629 -288
776 -288 48 -16 5 -238 -577 -911 -557 -45 137 660 359 210 -84 -46 -113 471 551 1075 673 -11 -365 -377
798 -377 -294 -341 85 164 -65 -363 -561 -746 -604 -362 176 448 189 43 5 120 -75 660 788 739 733 22 -456
821 -456 18 -283 104 155 240 -80 -490 -629 -1004 -381 -463 -23 74 228 101 -211 -133 209 625 812 825 284
843 284 -62 -54 93 -146 134 241 411 -162 -371 -820 -570 -555 -346 -254 235 174 -267 -442 -359 43 290 644
865 644 820 672 227 184 30 -281 301 421 439 -191 -597 -616 -548 -440 -251 101 -262 -20 -508 -428 -355 12
887 12 313 725 711 540 118 86 -258 -115 634 414 455 430 -383 -366 -465 -133 40 -51 -13 -166 -275 -629 -272
910 -272 -10 -37 111 528 103 -99 -81 -94 194 490 642 330 119 -296 -271 -55 -297 47 277 -12 -80 -233
932 -233 -583 -239 74 83 151 246 -194 123 -76 -149 303 304 455 177 -30 -93 -70 -155 162 232 157 -110 -301 -204 -277
957 -277 -207 -53 -139 452 234 -276 30 -154 -227 30 257 221 127 -13 -353 26 -304 -178 251 357 156 6
979 6 -142 -325 313 56 -89 433 210 -56 -210 -308 141 81 117 129 73 -181 -451 -411 -568 -51 81 60 -108
1002 -108 -104 -164 -166 -243 -226 229 424 430 171 172 -211 55 216 204 304 245 -303 -167 -500 -688 -330 -187 -159 -211 -250
1027 -250 -237 -268 149 -79 355 380 108 66 -114 199 242 168 -20 403 256 -32 -242 -472 -411 -127 -82 -366 -499
1050 -499 -724 -674 -402 -290 -352 222 -16 -69 56 174 323 446 487 461 663 381 135 38 -271 -102 131 -211
1072 -211 -484 -162 -422 -431 -573 -491 -381 184 -38 36 -24 -104 408 283 529 659 544 367 67 80 82 345 111
1095 111 -64 -27 -275 -451 -552 -702 -335 301 -49 -617 -346 -101 -40 16 112 166 575 481 97 -2 101 328
1117 328 406 336 91 328 18 -470 -477 -267 -90 -292 -178 -277 -197 -200 -215 -382 269 22 42 297 352 349 133 262
1141 262 63 353 111 375 -15 -107 -351 -214 -154 -172 -296 -207 -146 -246 -481 -373 -93 163 -43 65 40 228
1163 228 -89 59 -43 116 372 438 -61 -61 -98 121 -197 -4 -144 -275 -230 -476 -177 -249 -71 183 12 -279
1185 -279 -218 88 218 73 235 16 523 213 -279 130 123 64 82 -281 -427 -136 -364 -298 -270 257 77 51 -196
1208 -196 -532 279 34 94 319 233 278 417 -70 -181 -116 113 -132 240 -48 -13 18 -421 -429 51 -86 -19 206
1231 206 -174 -112 109 -209 -161 461 509 465 412 -24 43 118 -42 5 -210 279 57 -108 -292 -730 -209 47 30
1254 30 -83 -21 119 -2 -297 -196 267 207 430 401 300 354 -20 12 71 -7 -10 105 -128 -462 -288 -275 -360 -163
1278 -163 -192 -113 -22 -42 -350 27 17 158 384 -59 305 381 -40 -32 37 9 340 -53 -127 -50 -167 -16 -438 -151
1302 -151 -255 -255 -44 -321 -121 -34 354 -111 -223 362 69 438 239 293 389 290 95 277 -136 214 176 -136
1324 -136 -257 5 -109 -299 -514 -596 -171 -7 41 -152 -3 -32 -142 180 -177 177 537 285 -37 179 -80
1345 -80 94 39 158 87 230 252 -240 -308 -519 -158 -48 -120 121 210 9 -151 -181 -160 142 191 299 96 -21
1368 -21 115 118 47 -24 323 311 330 -58 -124 -116 159 -161 -43 73 126 -177 -273 -480 -291 93 -87 -15 436 74
1392 74 22 56 -168 -338 79 279 180 -193 -153 -106 -108 70 203 353 217 153 88 120 64 -16 -41 101 150 -133 70
1417 70 -44 -249 -273 80 -114 -156 -128 211 213 0 -45 -173 170 182 -44 -124 211 190 52 115 -126 21 -223 -108
1441 -108 -74 -270 114 184 -112 -246 116 -145 -89 -13 -151 198 155 -25 -215 65 218 480 333 376 214 286
1463 286 87 87 -217 -3 187 -72 -283 -507 -214 -214 114 -196 -113 173 219 -64 84 -140 -12 367 420 150
1485 150 153 200 -100 -150 2 206 177 82 30 -104 -221 -195 -334 -301 -144 290 210 176 -27 25 182 46 253 145
1509 145 384 220 471 91 28 86 -157 16 132 172 91 -173 -27 -243 -170 -180 -342 -42 -181 101 -55 -36
1531 -36 -191 297 388 296 85 388 337 -6 34 144 107 177 -61 -126 -155 -207 -55 -195 -400 -193 90 -135 -229 -173
1555 -173 -304 316 332 -47 -101 313 284 -58 -110 -152 106 65 -215 -141 123 16 20 -415 -321 -108 -74 -80 204 -125
1579 -125 -219 255 -48 -296 23 223 143 46 -55 161 221 -247 -375 -26 85 58 30 -56 -2 -252 -113 -110 -7
1602 -7 115 -33 -218 -129 -71 -177 -35 -156 30 97 178 280 85 -238 75 286 70 -172 1 194 -70 -280
1624 -280 -166 38 94 235 -117 -199 208 107 64 82 -170 0 278 -211 -175 176 74 139 -129 -155 50 -49 -56
1647 -56 33 -84 106 243 -52 -8 -73 241 37 160 36 1 461 53 -311 146 368 -28 60 -91 -125 -29 -234
1670 -234 -74 -125 49 123 -83 -226 -30 17 253 2 -356 155 79 80 268 -152 -87 -53 17 99 -74 181 3
1693 3 153 -94 320 -321 2 -131 -147 37 192 -1 85 131 100 -164 182 207 -51 -9 285 -79 29 -30 170
1716 170 -79 -314 -350 -86 96 190 -39 -169 -71 -149 -355 -55 -25 213 -46 251 196 -144 376 -149 -133 243
1738 243 183 209 -124 10 -98 -86 -240 -81 -38 253 -61 32 -289 -33 167 104 -104 -262 -128 146 154 -37 -169
1761 -169 212 69 84 27 -38 -35 142 -53 -124 43 -136 -85 67 -156 -221 24 121 -142 96 -3 59 120 109 -23
1785 -23 2 -286 248 -191 -66 288 -90 63 -12 308 42 57 -228 -115 -78 -24 -44 189 -151 14 310 -77
1807 -77 -54 -180 148 -108 -162 11 -26 275 -1 -115 68 166 167 -217 -89 -97 -21 -41 -56 -86 4 75 -406 -35 -196
1832 -196 76 382 -244 -18 -58 52 -141 47 -33 55 -28 -247 -188 39 -164 57 122 88 -43 98 170 -7 211
1855 211 257 -127 59 -45 166 216 216 66 -117 177 291 228 7 -145 29 -69 63 -89 -140 229 -129 -35 42
1878 42 98 93 94 -142 117 3 67 -84 -62 -19 93 261 363 17 -128 107 -84 -181 -227 67 149 -160 -146 72
1902 72 -105 55 166 -45 178 407 -51 -48 -26 -196 21 181 -45 -31 95 -242 -137 -122 108 13 -130 -166 25
1925 25 289 129 118 -40 42 174 184 258 -43 -97 170 122 -52 -155 155 -255 80 -246 -107 -109 9 1 -361 -143
1949 -143 278 -50 112 -71 -110 10 -39 36 219 104 229 -88 14 311 21 250 -6 11 119 -95 -59 68
1971 68 -50 -60 169 61 -158 17 249 104 130 -68 34 366 102 -98 60 275 -38 86 -239 -33 164
1992 164 163 -286 -115 68 94 93 -245 -164 199 84 -123 50 176 102 24 59 -56 79 59 148 -59 109 87 -56
2016 -56 -138 85 -44 55 4 -51 -30 162 193 -7 -85 -24 42 144 -91 130 72 -9 172 100 -82 81 175 315 -75
2041 -75 -111 74 -192 -88 -8 -116 349 223 91 135 68 -119 109 -210 -74 67 100 139 -3 100 -162 238
2063 238 -258 54 -177 79 -199 -205 103 -47 399 -151 -173 230 -51 42 -85 67 190 -100 -30 320 153 109
2085 109 -3 199 -39 -97 -13 -362 -268 -226 85 21 -87 4 -206 43 12 141 30 -91 -126 31 -61 -62 137 3
2109 3 16 108 -238 142 27 187 19 62 227 -30 -49 -67 44 -145 179 -99 387 -89 -71 61 38 88 353
2132 353 -44 -52 -230 -41 128 56 -92 -80 -91 148 -95 61 -7 -26 15 82 8 -143 -61 166 1 -163 137 -26
2156 -26 266 131 -119 136 -233 -64 -58 -154 77 1 105 -84 248 -48 -200 -159 -125 147 12 221 43 -45 106
2179 106 203 318 -115 185 68 220 68 76 -93 -143 -211 -271 -170 -251 47 29 -257 309 -18 82 -91 -135 0
2202 0 239 -193 306 -4 -77 -92 -27 158 -88 -76 75 13 170 -96 -103 91 93 81 128 -4 -95 150 65 -30 419
2227 419 -172 109 35 150 -124 56 -57 13 -215 -95 -59 -24 25 153 -135 40 124 -52 -94 102 -114 98
2249 98 182 13 66 -107 224 -103 -85 78 -34 -112 -301 -105 -81 46 202 76 -45 -117 -123 -221 89 147 -63 114
2273 114 -123 -58 49 151 114 -107 -42 420 151 -153 49 12 115 37 -8 -16 153 326 163 -123 4 49 -66
2296 -66 111 -266 -177 -81 26 -65 -24 52 91 35 248 79 199 -119 -144 -34 -55 -169 20 49 -165 -56 39 -155
2320 -155 -162 -62 40 -145 106 59 -198 195 -129 -1 95 -129 308 -134 -85 3 -298 -88 -3 -55 -73 14 -291
2343 -291 58 -31 -39 -206 -26 18 8 -71 -87 -188 82 -182 21 124 233 -113 46 -69 101 91 -355 -133 55
2366 55 -215 -268 -161 23 111 -115 -135 88 -112 7 186 122 61 116 97 -4 -47 -177 179 -49 -209 -63 165
2389 165 145 52 39 60 54 50 29 -50 95 48 -59 -79 -57 -6 138 -174 -126 -77 -30 -142 31 -73 -125 -237 -172 -159 -100
2416 -100 161 -103 -205 86 37 3 -6 -227 159 -114 5 216 -53 -248 -13 -82 -181 -204 48 -138 48 -150
2438 -150 -228 60 -165 58 -28 -106 70 107 10 104 128 46 1 -50 128 -127 206 135 -8 98 -248 -155 -84 -32 70
2463 70 138 -154 -210 -365 80 101 33 52 -180 57 286 15 78 172 -61 -6 -101 252 -201 111 51 124 -253 -89
2487 -89 40 -202 -105 88 -62 72 -157 99 -333 -58 136 -91 187 -34 -6 99 -149 -251 145 18 -176
2508 -176 78 9 8 -24 82 -194 241 -50 78 -46 -175 16 -67 59 51 116 -171 82 40 46 23 -265 74 76 39
2533 39 199 107 -188 -306 -209 -42 22 -74 -124 42 0 86 -21 -107 -127 350 209 180 63 101 74 249 139 -85
2557 -85 131 -60 68 103 -2 208 -261 -166 -278 -37 172 -161 -86 -98 -27 5 67 4 -179 -57 -82 95 -61
2580 -61 95 -172 -155 -45 -186 255 0 158 534 16 41 195 -61 -192 77 -187 -89 159 -197 49 -58
2601 -58 -268 283 -51 319 25 -201 144 -144 -95 -23 36 -227 -64 232 -70 35 9 158 -243 40 182 46
2623 46 -32 -17 8 -184 -247 170 91 -171 -18 -91 -13 -159 163 -136 77 -143 -30 54 95 -64 -142 85 -90 -161
2647 -161 -82 1 -80 139 171 -101 73 -98 -21 -68 -170 -45 40 50 50 -70 8 -13 -42 -127 -212 -82 -14 23 44 37 126
2674 126 43 24 -27 -144 35 -174 117 -130 1 -100 -135 -103 6 37 -7 80 219 53 77 39 76 43 19 66 16
2699 16 -21 310 416 -168 -127 -152 48 -15 -25 -107 46 50 -14 27 84 -145 -167 -118 132 -259 -201 55 50 -159 -48 -52
2725 -52 -86 189 -138 -14 81 243 -192 94 203 -39 71 -37 -156 -42 189 -68 20 -144 58 158 22
2746 22 367 -9 157 -45 110 -41 -186 25 6 -134 -137 -15 -49 17 62 -244 -165 363 56 85 -109 279 24
2769 24 -87 29 53 30 31 20 155 28 13 56 -18 86 -127 -18 -54 128 70 89 51 47 152 77 -70 -180 -148 -191
2795 -191 -55 -55 44 -105 -191 -91 0 40 286 85 80 136 146 -31 -43 -159 124 175 127 112 -220 119 345 29 -152
2820 -152 98 -356 67 18 266 -143 72 -7 399 -91 156 219 -289 1 -155 91 -13 -86 12 220 160 -276
2842 -276 -35 -42 -5 -164 -33 137 41 -73 -96 165 -89 -153 201 -246 -112 177 7 -200 97 62 -219 12
2864 12 45 164 -40 5 114 213 50 158 74 -284 385 -120 125 -293 -32 -46 73 31 16 -123 -101 -30 159
2887 159 64 209 -168 -4 47 -37 -93 212 -157 8 -181 19 -5 -164 90 -62 -58 17 -123 91 -72 133 230
2910 230 25 5 -97 -196 -167 -161 -115 -61 -148 -60 64 -107 105 -144 42 111 181 322 -50 172 -227 -68 69 -67
2934 -67 141 -6 65 -69 -118 -174 72 112 -176 152 -92 68 2 -49 22 -17 -80 176 -140 -74 47 28 -249 -235
2958 -235 -150 -248 -77 15 -147 -106 -56 105 242 -65 114 -111 -265 60 -146 -54 -53 -130 29 -72 45 42 0 -187
2982 -187 -8 19 157 88 304 -114 190 2 -87 -192 -6 -53 -97 -17 56 -62 -298 138 -13 135 97 -48 -72
3005 -72 -102 134 82 39 -169 33 48 -109 -250 -244 213 33 -31 14 350 -59 112 159 -276 -26 -129 -12 -31 -138
3029 -138 37 69 228 -196 -87 -46 -177 -143 -58 65 -39 66 81 -268 -237 -124 -256 -48 -48 18 -10 -40 -92 113
3053 113 152 127 221 130 -185 -208 144 -281 77 253 150 88 -98 -71 63 -198 -69 33 -15 239 3 -61 216
3076 216 197 -13 -259 -118 -130 182 -92 73 8 34 -20 -91 -62 81 243 101 -49 -2 202 273 -120 -135 96
3099 96 -27 -55 163 -173 -116 102 -213 -78 13 118 -132 -68 72 12 -103 16 -169 112 66 101 79 -102 -60
3122 -60 -56 -13 -216 -184 -49 -17 -3 116 -37 -147 -217 -259 -12 22 -4 31 81 -163 -147 -120 -60 -13 -48 -200 -11 -138
3148 -138 -342 -118 32 79 -33 -201 340 117 308 36 -96 -29 155 8 18 -221 141 57 -61 78 -60
3169 -60 -216 46 284 -105 -418 -168 187 -121 -127 29 -156 81 -75 179 301 -142 79 -55 -70 -31 210 6
3191 6 -67 150 121 240 -111 57 -159 -71 -236 203 -88 111 -42 79 -206 -174 -150 -72 159 -165 -64 -87 158
3214 158 -70 -49 209 -11 31 31 -241 161 -76 -7 53 -4 75 194 -9 -53 59 -34 -113 -4 74 -162 -67 -28 -83
3239 -83 329 85 111 168 -12 66 97 -147 307 90 -192 -9 -20 -45 -37 40 178 87 -234 269 54 62 -255 39
3263 39 24 -42 -16 30 -76 -112 -107 -125 151 -86 392 -13 70 -17 -149 40 74 -23 7 41 -222 -268 -52 42 -36 98
3289 98 -450 120 71 -92 105 84 -141 107 -89 97 92 -130 -66 41 -271 51 101 82 260 -12 -97 -88 -169 277
3313 277 -55 251 -15 142 -12 25 204 -268 -120 101 121 12 -52 -22 96 14 -137 -52 27 -15 -75 84 104
3336 104 -71 -125 41 -21 143 116 171 -9 184 -123 -104 -252 216 170 -116 187 226 40 -64 75 3 -130 -132
3359 -132 -79 192 -87 -349 117 -63 137 187 -228 -59 -69 10 -12 66 -196 -252 76 227 -135 -20 188 180 102
3382 102 -56 200 -249 82 -191 -93 -94 296 84 36 100 143 -153 8 143 -374 -163 -190 -150 -11 -29 -14 -251
3405 -251 186 98 90 54 -163 -231 84 263 -201 -194 -199 113 214 -25 -2 101 -263 28 86 52 350 -71 -86 -108 49
3430 49 -102 -36 165 96 42 -4 72 101 -265 38 25 -108 337 33 -56 -60 32 40 143 59 56 32 -187 -18 121 12
3456 12 -224 -59 58 323 -72 7 -100 -170 -129 -30 167 251 -57 84 119 -41 132 -109 -4 -157 85 -111
3478 -111 34 68 23 38 306 -138 80 -57 118 -212 -92 51 351 -115 20 37 176 -177 128 70 88 20
3500 20 -116 -9 5 94 48 30 221 -63 67 -23 267 -56 151 -133 -46 -25 73 -55 -95 105 -161 173 159 35
3524 35 -232 199 32 -214 133 -287 11 -178 -201 102 -67 36 -500 -249 -95 -114 -27 39 -198 -76 174 -97
3546 -97 55 -60 85 21 7 -86 -266 -44 148 30 291 22 26 68 123 -22 67 42 -194 -98 18 -97 -44 29
3570 29 41 -77 146 187 44 -46 -24 130 80 31 70 208 187 -137 -40 -97 -35 59 189 22 -77 137 135 -72 188
3595 188 -32 -7 113 -19 104 -57 -319 25 -91 -188 194 -154 129 -129 70 72 84 -14 -236 -336 34 111
3617 111 -286 -1 -35 211 302 83 239 143 -287 5 -145 -48 -110 185 23 -278 85 156 -210 4 111 138
3639 138 -46 -224 189 72 60 197 -24 183 -104 -38 -1 15 214 -80 -118 -97 23 -18 68 -132 136 22 41
3662 41 -123 -116 -175 69 73 198 185 122 180 2 -29 -234 -205 32 -243 9 131 102 -115 -119 -98 -152 98 -18 105
3687 105 -20 214 -55 83 -239 19 132 123 -20 -274 221 -117 -67 -86 -99 -115 -186 148 86 13 -49 140 180 -97
3711 -97 126 137 15 -146 -119 110 194 -7 -159 -22 128 44 -5 22 403 6 -133 -48 141 34 13 9 -2 -167
3735 -167 134 -201 69 -137 -215 -102 -5 -202 -121 -18 397 124 28 210 26 4 39 139 -286 117 -82 76
3757 76 43 105 64 374 -20 292 -184 -156 50 -80 -56 -87 157 -134 -97 221 -57 -234 207 34 -154 86 119
3780 119 82 -127 70 -139 193 -36 -66 201 85 61 113 47 -25 -41 50 208 23 -304 -11 -119 71 -106 10
3803 10 123 -204 31 44 -175 41 -58 57 -102 -162 -194 -21 49 260 2 247 71 169 -170 -108 85 220 -229
3826 -229 261 142 -25 -28 -8 92 -242 16 300 27 195 120 106 269 -13 -170 -43 55 174 -42 -41 -51 -47 108
3850 108 -387 -173 58 -193 -8 -171 49 202 -137 -1 -7 -242 -23 240 -105 11 63 83 -145 -19 40 21
3872 21 50 -173 90 23 -124 -177 -183 -55 126 46 -96 -78 172 -311 -178 49 -361 157 217 -265 -123 -283 -64
3895 -64 -150 -212 -76 29 42 53 -117 -44 1 -64 207 65 186 -217 -208 -65 -304 149 116 92 -60 106 39 -125
3919 -125 -44 3 104 -190 81 -26 -68 32 57 -178 -144 -16 -50 90 -16 -30 -155 200 160 198 -151 48 -36
3942 -36 377 51 -226 272 -58 72 -312 -127 -77 -341 -106 -153 -93 19 -114 138 -198 89 53 88 -63 58
3964 58 6 -23 -166 -90 -92 -25 213 -131 115 -107 -86 -201 -87 141 138 -121 -16 155 -415 213 -99 32 50 -223
3988 -223 -81 -29 21 -128 -125 106 -196 -283 45 -263 36 4 -81 -8 -376 -34 -12 -182 101 -356 -13 -33 -81 64
4012 64 3 117 193 -53 92 -13 -69 141 54 -156 -208 -41 -32 -93 252 -205 -134 -181 -2 116 8 -69 163 77
4036 77 -165 -206 29 -125 -122 201 46 -200 -5 -28 84 -168 -176 1 52 -112 51 145 -62 71 -108 -76 59
4059 59 -75 59 -13 47 -255 145 189 -48 109 -1 -160 -330 -255 -14 49 67 -191 -157 -52 -10 -183 -228 46
4082 46 -113 237 54 -1 34 36 -186 87 284 170 42 27 -109 36 -106 -124 -96 -112 32 -160 151 363 -480
4105 -480 -205 -85 187 -49 -418 110 -42 -97 -93 247 17 8 -74 -272 72 -14 266 -207 396 89 -277 -204 46
4128 46 -78 95 -168 116 60 -166 -123 34 195 -132 218 -23 39 -26 80 -10 -160 -174 7 -11 -135 158 -115
4151 -115 -74 138 13 -139 -56 145 -386 213 -84 27 41 -40 -59 35 70 -9 246 -38 212 -17 153 -106 106
4174 106 -18 -104 50 67 157 -3 124 18 -155 15 -2 87 74 220 -148 -86 36 -8 -18 -129 -63 47 -27 220
4198 220 -147 169 -143 -155 -187 0 48 112 79 130 109 -29 64 -8 -190 -199 -38 53 97 -124 30 -50 128 -12 -55
4223 -55 173 39 -23 -32 130 -78 -23 97 -4 160 188 47 -253 62 181 31 -130 -81 -111 -33 9 96 116 -124
4247 -124 -30 3 -45 141 -100 79 15 10 24 -61 -295 -287 -144 -76 -69 -38 64 -78 -305 -280 -30 89 53 -43 101 155
4273 155 -31 61 -62 98 41 -147 101 134 159 44 -32 135 -19 -298 -64 -40 -179 -40 -36 -148 -186 177 66
4296 66 -124 70 11 97 -147 -294 79 214 96 86 -226 272 -255 120 -237 -18 16 -240 -268 13 116 -76
4318 -76 -99 260 -133 -8 206 94 -138 -153 59 64 115 130 119 34 34 168 -35 -11 146 207 120 44 86 7 -93 226
4344 226 11 166 91 -11 163 -123 167 -34 368 16 -34 279 -70 -40 27 48 -38 -32 71 -94 30 161 202
4367 202 61 -56 -105 133 351 -51 176 236 236 -95 192 187 -188 64 -114 14 -366 -113 169 -14 -3 144
4389 144 -37 89 -29 -83 -85 -30 -249 177 19 -19 243 -41 -254 -70 82 -229 95 36 14 132 -146 149
4411 149 -156 -45 -217 -218 206 -166 -88 287 -147 152 -130 181 252 -142 180 -148 -104 -82 -127 -31 231 153 -82
4434 -82 -23 -146 36 22 -91 -42 110 -30 58 -35 132 -283 -27 -180 -104 -164 73 8 -182 33 129 69 -166 -277
4458 -277 -4 218 -37 168 95 -50 192 -164 9 29 64 -235 -30 190 41 84 17 -56 -243 -172 109 135 -30
4481 -30 117 110 60 114 -16 85 29 -291 54 -65 41 43 -37 -51 -116 -119 -150 92 41 43 -104 97 22 -131 -192 75
4507 75 28 91 -71 -124 -266 217 188 -289 67 -145 104 197 -152 -9 14 13 -12 -148 120 -80 -146 129 -195 -70
4531 -70 -50 -1 58 49 153 252 218 129 -166 216 1 -140 164 164 -11 106 -31 75 -164 -53 124 -32 -226 46
4555 46 16 -139 -92 -88 -33 45 -313 -4 -237 -110 163 -113 -92 -255 -114 41 159 275 -140 78 -34 27 -114
4578 -114 -203 125 -54 338 -88 8 -42 423 240 157 -61 135 40 -29 -75 4 33 -37 11 -52 313 21 119 -69
4602 -69 81 -40 -45 -12 -62 9 99 277 240 74 -91 -58 27 128 -160 -80 -100 128 177 154 -288 -417 159 -236 39
4627 39 108 288 107 119 -6 92 -134 132 38 86 79 59 98 250 157 -284 55 126 313 213 -39 25 -88 67
4651 67 60 276 60 27 73 86 -48 -3 135 -113 -50 65 37 -86 -97 39 116 32 -75 -314 -279 -267 -86 -35 -83
4676 -83 147 -397 -68 56 -72 -19 -55 -124 144 -146 114 -125 213 199 -192 -200 211 247 -5 68 159 -92 201
4699 201 226 -301 -283 -88 -27 -39 372 240 188 164 -25 -223 -207 181 38 -154 96 -148 135 -148 -217 226 -263
4722 -263 -100 -82 -226 7 74 -137 86 38 -171 -127 14 76 -14 120 -275 47 25 377 125 -224 -33 -4 -61
4745 -61 -163 165 -11 106 15 91 -54 -70 -129 -21 124 -59 -161 -39 2 53 44 74 0 86 -198 169 73 -11 -57
4770 -57 28 -87 177 88 -161 -133 21 -111 -54 80 80 52 72 -154 125 -43 62 -79 234 -182 -49 83 12
4793 12 57 -42 -145 -186 -129 -272 -154 -18 79 312 194 -257 -223 -33 270 133 111 86 -167 -27 110 -15 -83
4816 -83 199 -95 -105 -64 304 243 37 -84 -184 -209 -91 -327 -216 16 195 -28 67 -158 9 114 -211 -35
4838 -35 -96 201 154 -24 100 -3 22 28 106 -21 23 125 -33 28 209 24 -134 -135 -17 -279 24 45 -254 48
4862 48 -84 50 -146 -3 -200 24 -400 0 74 -42 5 -232 169 -52 42 -120 62 135 -277 -11 220 -2
4884 -2 92 188 -182 -67 -79 110 -19 27 102 -31 -222 -45 -139 73 27 -27 91 -17 -141 -50 24 136 227 162 163
4909 163 54 -43 -197 190 -86 -13 -344 62 79 209 -179 172 167 84 113 73 16 143 -134 -156 -93 18 191 -174
4933 -174 94 84 73 -204 125 -484 77 -231 -7 54 213 203 68 152 -47 -6 -99 25 157 -145 -79 222 14
4956 14 75 4 77 163 142 337 143 6 136 -201 -74 3 87 -27 -251 311 151 -81 -36 -25 123 -67 51
4979 51 139 -317 -161 -130 -2 -103 163 -79 -141 -88 135 69 91 277 39 65 -129 -75 149 -150 89 276 46
5002 46 232 57 -105 65 -72 83 142 -75 100 -105 43 49 -14 -239 120 46 -61 17 52 -18 -101 296 -21
5025 -21 -27 107 -82 -102 -233 96 170 37 245 -77 174 81 -56 -231 -255 125 -62 -42 -198 60 -51 -10 88
5048 88 31 61 47 169 -94 -190 30 -156 -23 82 89 -132 -204 -9 -141 70 330 74 59 109 -287 -56 -28 137
5072 137 84 50 139 58 205 -133 -273 158 204 31 43 38 -122 62 33 -214 -81 283 301 -274 -75 62 1 -163
5096 -163 260 24 129 54 17 -76 -8 40 -128 -153 -108 29 70 -112 181 -53 -229 154 210 91 -19 -29 20 138
5120 138 -119 65 95 22 13 8 60 -84 -109 -81 179 -92 -9 32 -10 141 362 21 96 83 24 -45 301 -293 -53
5145 -53 196 41 -175 -13 -74 176 -65 -267 25 -101 -229 -97 -133 9 70 367 263 -84 268 -136 -157 76
5167 76 52 112 -71 -332 -195 -20 209 -71 5 -12 -55 -111 -42 135 -86 124 -137 216 -48 -54 95 -308 -66
5190 -66 -11 -2 48 -39 71 166 -134 54 -110 47 -17 10 -139 -104 -274 -129 -41 -140 148 -6 -123 -185 -228 -18 -171
5215 -171 257 173 -19 84 -98 -161 -69 10 -67 -103 -116 -42 11 71 -136 -39 -46 -131 47 223 127 -34 -305 152 -96
5240 -96 -79 -48 69 17 15 -18 135 120 -237 87 -77 -61 -141 -54 -236 154 -66 -62 -36 191 -363 -20 -282 -270 71
5265 71 -4 185 -159 75 56 -80 200 47 57 149 51 -216 -71 -84 -33 -178 10 165 168 -139 -126 28 -113 51
5289 51 -15 -77 -105 42 69 6 225 191 -69 -53 -62 222 0 141 -88 53 -54 42 30 -97 116 -17 -60 -249
5313 -249 91 31 -89 12 -241 -11 51 45 -34 -53 -78 -37 -54 140 -304 -72 -55 -55 20 65 -18 -63 -82 -195 145 395
5339 395 150 91 39 -20 -10 -135 -62 -189 88 70 462 -94 20 274 -106 -57 212 88 -26 3 127 109 170
5362 170 -42 -17 -80 244 -237 -88 -71 50 23 -100 53 109 23 92 -17 150 23 21 -299 -17 -80 -241 -124
5385 -124 -90 -54 -263 -22 -145 24 117 -22 -32 232 -148 -34 254 -224 -67 -200 82 -59 -148 239 108 -124
5407 -124 -21 239 -198 -22 -263 -65 11 -258 -62 143 28 -66 139 -61 -33 -155 -12 157 77 -137 86
5428 86 -24 -51 33 35 -153 -60 42 151 -176 -48 25 204 20 -28 21 -193 98 -96 23 -6 -152 -62 202 -48
5452 -48 18 143 123 -99 151 86 -56 38 -117 77 -92 171 295 234 -128 -84 21 81 140 -153 28 30 -10 9
5476 9 -49 -54 100 -61 -175 184 -178 -149 -169 -25 70 -200 20 40 163 17 302 60 281 219 86 -110 -333
5499 -333 -94 127 132 -343 65 -66 -116 45 283 -161 -119 180 81 -7 58 32 11 25 -263 -40 -7 -65 183 275
5523 275 -147 115 85 213 -24 3 78 -15 36 -86 49 146 161 86 28 211 -59 141 93 -59 161 -19 -140
5546 -140 -232 -283 -26 143 9 -104 -117 -311 -11 -18 278 -64 -186 9 -29 68 -160 137 39 -228 -96 182 109
5569 109 -10 -51 126 229 -165 81 -283 21 -31 33 -119 -92 -136 -158 12 -70 -146 39 -108 -79 -208 -110 154
5592 154 -136 -93 -120 203 -100 111 -22 202 311 129 -283 99 122 -168 -297 51 -120 37 148 -42 147
5613 147 -178 46 123 -176 -54 41 -79 26 -81 59 -133 33 77 115 381 55 66 -9 124 -251 335 -65
5635 -65 4 84 97 -29 -198 -64 14 194 -291 -131 13 50 -206 8 269 86 -315 -93 -103 125 47 229 0
5658 0 2 -144 222 -169 -137 -97 -269 4 -93 119 -145 171 24 152 -135 -133 -44 166 234 51 331 199 31 262
5682 262 95 43 -73 -29 122 -83 -134 285 -53 -501 117 -118 -382 7 119 -30 48 -19 -164 77 -148 4
5704 4 212 -66 37 309 318 44 151 84 242 88 -65 -245 163 24 161 106 105 16 172 116 140 2 53 -52
5728 -52 70 -148 197 80 165 29 173 -228 -193 -186 302 -37 -204 -83 159 158 -80 -56 201 -150 328 36 -21
5751 -21 110 60 188 -197 59 20 -131 -175 -109 -25 -55 21 -225 -172 -145 -22 -111 -102 -45 23 -166 137 -136 -18 39
5776 39 33 -103 67 77 74 143 55 -165 170 47 -234 202 -31 -40 -8 349 -239 -30 -98 -23 -211 -88 -505 -92
5800 -92 -13 56 12 97 92 48 -50 17 50 -150 -45 145 -225 178 -30 -138 -258 143 -89 -15 53 -72 -124 244 39
5825 39 29 165 18 8 38 28 -131 134 120 11 -53 -283 4 -152 -169 -183 -150 34 -93 -188 242 161 -255 213
5849 213 -61 -131 -41 -195 62 -115 -169 75 49 103 114 -2 -204 -112 -49 -278 176 -215 226 140 -348 56 154
5872 154 153 118 -54 60 103 -111 -90 -62 -31 18 -63 -71 1 20 -1 51 -259 186 -317 -78 300 2 -22 107 118 234
5898 234 -1 72 60 13 -26 268 -245 -28 212 128 59 91 -53 -180 -119 115 195 -267 -312 -90 199 20 100 -228
5922 -228 135 30 -37 -131 -134 22 -161 101 58 126 -233 -67 -34 53 -169 -372 184 -144 98 -170 69 117 -200
5945 -200 -136 -63 -48 -173 -317 -72 -96 -57 -45 -13 -33 -112 85 -55 -242 177 186 -189 248 162 76 -215 67 32 -2
5970 -2 -96 -210 44 -335 -25 -25 -286 37 109 280 -218 -259 -29 -83 281 147 -34 -178 38 -104 73 131 7
5993 7 -29 -127 73 100 -69 -163 -5 32 84 -66 1 92 179 -4 -123 62 117 195 227 171 88 -56 175 -5 -107
6018 -107 238 -162 157 52 -118 82 19 -96 25 -66 164 -105 -184 -178 81 -274 -189 197 -176 28 130 -185
6040 -185 -353 5 -122 -162 -14 -89 -8 253 -49 121 23 89 23 352 -112 86 -194 366 76 1 136 54 9
6063 9 27 -77 110 -83 36 -40 -76 81 -116 65 24 -76 61 41 -94 -28 17 8 -184 -53 47 245 -108 193
6087 193 95 -5 241 91 -122 -205 -332 -153 43 19 -15 83 25 142 17 108 -65 3 204 -291 112 49 -98
6110 -98 -19 61 289 -207 54 -40 -43 42 0 247 15 76 127 -8 -296 4 186 -67 4 -194 -15 -111 69 57
6134 57 110 138 -131 221 -136 119 203 8 24 197 -89 -118 152 -30 -42 -33 33 -186 42 -92 -160 -11 -42 -17
6158 -17 128 -24 108 56 96 -206 -184 30 270 -69 -40 124 -217 -85 -131 -38 123 -316 -85 -49 36 -220 106
6181 106 -173 205 123 331 -177 -9 -86 -5 -13 2 -47 -129 149 23 -192 116 102 -255 -66 124 -7 -61 182
6204 182 33 -26 106 139 62 -3 -218 176 -5 -131 45 -4 34 -167 -189 147 -107 101 155 180 -11 -33 -105 -128
6228 -128 57 -160 -444 -16 75 54 -56 -60 -243 84 98 58 35 209 145 40 6 -11 -71 -87 146 -9 174 -68
6252 -68 -119 -119 125 434 -35 42 -62 -24 274 -28 -87 -90 166 32 149 265 -74 34 -217 -155 -65 55 3 44
6276 44 -36 -16 26 195 128 55 -282 31 7 -217 90 110 86 237 -131 46 19 -45 -112 -48 -102 37 160 -210 283
6301 283 -69 -68 -74 42 118 203 180 -143 -158 86 -87 -155 11 152 0 -80 -59 -202 55 -32 -206 60 -70 141
6325 141 88 74 50 95 -106 -125 -87 -31 30 323 46 125 30 138 235 -119 66 -113 321 161 30 0 125 -302
6349 -302 -42 104 -177 -265 -134 -98 -225 74 -26 -74 -77 39 133 -190 12 -164 -120 -5 234 -396 0 30 50
6372 50 -42 -77 -25 35 -125 264 -35 28 -89 46 90 198 -121 171 -138 -19 349 49 -3 178 18 88 253
6395 253 -88 78 -246 139 65 32 101 134 -35 132 -74 2 -129 202 29 352 -65 -169 -211 -86 78 55
6417 55 87 -411 -19 -183 1 52 174 -56 -210 91 52 300 219 -62 113 -100 -99 -27 168 -191 242 97 359
6440 359 -173 48 -79 182 62 133 174 -146 -67 50 54 149 -55 -134 -21 -111 -54 -148 149 213 -112 48 223 237
6464 237 84 -188 -154 -64 335 -6 -71 22 -126 120 141 -80 85 -169 31 -50 209 0 68 382 -10 94
6486 94 -7 69 81 45 27 -133 -13 167 -93 195 -166 -39 101 17 -73 -179 -136 106 21 -162 25 -14 -207
6509 -207 -21 -2 -30 37 -242 -13 -42 115 -44 -101 -151 -33 -45 52 -33 -119 -162 20 113 -174 27 73 115 -10 243
6534 243 59 -137 -82 -115 -142 42 -83 -7 24 243 -3 334 -115 191 -89 -1 33 -110 79 -175 173 198 174
6557 174 60 -87 -200 32 -15 -204 0 -50 180 49 161 -15 -28 -62 70 121 376 128 205 43 23 3 268
6580 268 223 244 152 143 123 18 102 -9 -64 3 -230 25 -255 -21 -203 -210 -145 160 -29 -35 -193 242 -54 -242 -228
6605 -228 25 80 289 38 -106 -347 -85 -52 56 170 40 145 43 184 -302 155 -20 47 -48 -7 64 147
6627 147 -3 -82 65 51 -131 137 73 46 2 173 130 -187 125 67 -256 50 -19 104 92 -319 144 -271 -51
6650 -51 -51 -36 368 150 -63 120 21 218 87 -339 -48 -1 14 -3 71 21 -278 65 125 137 157 12 -126 25
6674 25 422 240 55 -463 -47 17 -83 119 64 -199 -64 48 16 -123 -11 -67 -61 -4 -193 259 -5 -188 -90
6697 -90 117 -116 -52 -297 56 143 248 -121 33 53 -69 -79 87 -107 26 100 135 109 -299 -36 43 -163 37
6720 37 231 81 157 53 360 67 -21 38 -21 21 76 191 122 -317 5 22 180 -32 229 -57 -9 161 62 52
6744 52 41 -94 -54 -198 -8 -117 153 58 -188 147 -23 115 51 -177 -135 83 -169 119 -122 -45 -172 68
6766 68 327 -28 -131 184 13 31 4 45 -252 -77 -3 -89 99 191 -154 -145 91 17 66 -81 123 -52 65 117
6790 117 -6 -91 -15 100 -68 -96 14 -53 206 -353 251 -50 -92 42 -136 173 -346 124 -52 -165 -36 -122
6812 -122 -125 294 -36 55 57 -102 -105 274 16 59 204 -196 92 151 -188 138 -149 21 22 175 -7 -17 192 -50
6836 -50 71 -72 -111 -188 -79 245 -57 65 188 77 66 -31 304 -141 -3 3 -100 -123 89 -113 -123 -149 -55 -73
6860 -73 -23 87 256 -152 -269 -60 -40 218 -111 168 27 -87 147 -10 -91 -240 -26 -23 -233 -51 -63 -8 -24
6883 -24 103 60 130 -65 -69 200 38 81 -17 224 -111 -210 249 66 -36 114 -167 -87 66 -113 115 -54 260
6906 260 142 -181 -122 10 75 22 -75 -264 140 -164 292 -63 -123 -95 128 242 -86 -86 86 202 29 -86 35
6929 35 -157 132 92 -106 -146 -6 -184 -6 41 -237 36 61 197 93 241 97 42 47 -240 38 55 43 122 -65
6953 -65 4 24 226 93 29 -31 -143 -52 -107 15 118 -151 107 234 37 127 202 -162 -86 305 -162 -120 104 95
6977 95 -13 307 -43 -11 0 53 212 -95 -144 58 159 -112 -165 -53 1 232 59 -19 228 -111 119 -90 17
7000 17 68 -46 -68 -240 326 -43 -82 195 83 61 -186 117 202 144 74 237 -46 -88 10 11 -186 97 22 165
7024 165 20 -3 33 76 52 -98 131 5 -97 182 -162 -37 240 -277 -14 -207 -61 -127 49 305 -62 -243
7046 -243 22 9 -140 200 72 49 259 29 -204 32 -55 184 -50 63 162 -251 18 100 52 142 90 -58 -340
7069 -340 -155 -168 -39 84 152 -122 -250 -227 -33 151 32 115 -143 -225 -73 20 -27 285 -1 96 -67 -267 143
7092 143 -488 -203 -59 -145 240 -107 25 -27 -162 -2 164 -260 -44 -127 -12 73 -3 -383 28 2 193 -24
7114 -24 15 -53 -90 96 -86 -159 -254 156 -151 106 145 -45 -82 -35 268 0 -197 73 277 -120 195 33 -36
7137 -36 53 147 -158 -10 134 7 19 21 50 16 -133 -136 39 -183 -201 6 -11 -45 -137 -128 -68 -8 129 -154 148 -111
7163 -111 103 -164 37 101 -1 -106 -12 -194 -221 35 -30 202 -61 -88 -146 -221 -101 -72 -394 -91 -51 52 -120
7186 -120 -140 -150 186 -249 51 150 140 118 8 4 -94 77 -79 -229 62 127 -192 218 60 137 -5 68 -247 111
7210 111 -67 104 -54 3 3 125 106 87 -327 -92 -113 -70 24 291 54 205 207 -357 62 -63 85 35 -261 -246
7234 -246 205 -89 197 -46 195 89 -190 -171 94 40 -164 112 -10 -77 109 -217 -46 31 -6 24 199 -6
7256 -6 -372 -82 -27 61 240 120 -95 -19 -215 153 140 -119 -239 65 22 -225 129 -12 -62 124 26 10 39 -61
7280 -61 39 -117 -119 -24 128 37 -10 -71 114 322 37 -36 81 -161 -71 226 -13 16 -19 29 -77 -8 -32 -3 -112
7305 -112 300 67 86 -190 -62 -66 -119 12 -134 66 -203 -61 38 91 78 -117 186 241 -49 129 -260 -160 11
7328 11 -81 -111 -146 -190 164 94 -88 -145 243 337 346 50 -26 -19 329 -238 -148 -10 203 172 129 102 -195 96 -96 -11
7354 -11 91 -168 -39 -141 11 28 150 60 -168 -20 -4 -131 -131 165 16 40 -189 101 -222 155 115 19 -75
7377 -75 91 284 139 -179 -7 88 125 -211 100 67 6 76 126 150 47 53 22 75 155 167 -90 174 -240 -8 63
7402 63 75 44 111 -91 -53 163 99 286 -98 115 257 -57 -75 -43 70 -70 -46 -55 47 -158 95 -9 90 -145
7426 -145 124 187 -91 113 21 -111 11 -60 12 -32 -32 -105 255 -107 -64 44 115 -36 -8 155 -176 -92 -20 -2 108
7451 108 274 42 -302 312 18 -19 179 -237 31 187 -225 -80 -380 -89 -55 -35 253 22 98 200 -93
7472 -93 44 72 -67 43 225 -183 -149 102 -22 89 -29 -124 87 -215 46 58 91 16 12 -167 -179 15 138
7495 138 -41 68 13 -89 -13 16 85 -170 91 91 123 -66 4 -339 56 29 -124 91 -70 -40 34 9 -152 83
7519 83 221 -50 -119 162 -17 -145 24 21 34 -76 147 55 176 -144 149 33 139 73 71 53 -105 25 -274
7542 -274 -52 22 146 116 222 61 -126 -37 209 -65 44 -11 156 -58 -66 62 25 -22 -88 170 -67 -97 -87 -140
7566 -140 25 126 53 82 106 92 18 -124 -309 -23 16 115 -95 -44 34 -156 -120 -15 20 -12 128 -216 3 31
7590 31 -201 31 -33 71 -43 62 23 107 60 134 -59 25 -192 227 105 23 -57 21 -194 -133 -14 -108 104 -162
7614 -162 -92 37 161 -263 34 -58 66 -59 225 -25 177 198 67 -76 84 18 -109 97 -38 32 254 1
7636 1 33 55 -90 163 -69 -6 -120 186 -100 -112 -198 28 81 144 -54 81 33 -95 33 -115 -79 149 140 -129
7660 -129 69 87 107 -223 90 -107 47 156 222 -124 26 -122 102 -41 75 6 132 9 -131 36 -65
7681 -65 -244 -60 -232 -19 216 90 309 -58 -152 110 5 -51 274 171 35 -81 -9 203 -215 -78 1 267
7703 267 72 -222 15 146 53 -27 -76 90 239 -157 -346 -257 -160 -57 13 15 12 -207 100 341 38 -303 27
7726 27 -126 -34 -31 -51 125 -19 127 182 -111 -222 -74 173 18 222 240 55 -66 -59 -250 117 60 156 94 -203
7750 -203 -178 -26 -140 -29 -78 -47 -196 32 -3 -62 62 -115 68 -171 211 30 82 84 -11 -30 203 20 52 91
7774 91 22 -155 -142 144 -43 -114 315 -96 31 95 120 -51 117 -3 42 -115 -121 -253 296 151 -66 140 -124
7797 -124 66 41 -138 109 278 -214 -62 23 34 56 -76 -81 5 26 -68 87 10 -151 -56 62 -69 -55 95 -72
7821 -72 133 137 140 -51 -187 59 219 -161 -444 -169 291 176 223 205 91 -45 110 11 24 2 121 -97 -92 269
7845 269 -162 188 -23 36 163 -174 -53 166 -149 40 127 227 -41 100 51 -104 -260 128 58 -182 49
7866 49 -96 -133 -189 -41 31 -19 -189 101 108 -57 -39 -227 297 235 -88 -23 -16 -380 -120 -88 -30 68 -180 174 -269
7891 -269 170 -31 -175 -97 41 -187 -54 -172 -122 22 70 67 -131 -150 42 16 133 -114 -187 87 -99 -34 107
7914 107 37 165 268 300 -105 -139 -56 253 24 62 225 -270 -24 149 148 129 -42 -92 97 147 -69 173 -67
7937 -67 -102 146 -115 162 79 -29 81 -133 85 36 -262 -250 -111 -78 -55 114 112 -125 96 185 -22 -94 -221 -101
7961 -101 184 -175 -221 -195 165 251 -79 -287 -54 15 -20 -150 144 -86 45 -44 -70 139 -76 -34 -37 -120 -32 126
7985 126 -16 5 -135 128 -235 6 43 -298 -123 -138 97 6 17 277 77 98 -106 15 -119 89 156 76 -15
8008 -15 -65 -204 -78 8 -89 -27 232 -181 -73 89 171 71 -186 131 -117 82 34 -41 126 127 -106 37 57 82
8032 82 47 243 -5 -126 -49 -93 -190 -95 62 -120 -55 -65 29 62 -191 -94 159 178 6 144 176 -51 -134 -152 40
8057 40 120 -15 -213 -36 -42 -193 -82 30 129 256 -46 -37 22 8 -51 263 256 -47 -42 -86 -107 -14 -34 -223 34 -1
8083 -1 -158 -88 -65 25 -31 -35 19 -73 194 -177 41 -301 -43 72 73 115 191 79 -171 -145 -152 83 -83 -27 146 -126
8109 -126 221 17 169 -33 21 31 -81 -284 -195 2 88 -39 -88 -18 137 130 -37 17 74 -179 63 -61 101
8132 101 33 112 122 47 -37 58 10 -402 -69 148 71 -184 -24 -160 -319 -114 50 -11 37 145 149 -147 110 66
8156 66 -114 -166 211 -71 71 -25 -80 -157 -85 -39 -80 128 291 42 87 51 215 -157 -35 -108 -169 5 -45 1 -274
8181 -274 190 13 -100 9 -125 97 11 46 -138 151
8191A51
$$ Imaginary data points
##PAGE= N=2
##DATA TABLE= (X++(I..I)), XYDATA
0 0 0 0 0 0 0 0 0 0 0 0 0 0 0 0 0 -8 8 -8 8 -8 8 -16 16 -16 24 -24 32 -33 40 -48 55 -63 70 -79 89 -97 112
37 112 -125 137 -152 172 -192 210 -233 258 -286 315 -347 383 -421 463 -510 565 -622 688 -762
56 -762 848 -945 1060 -1195 1360 -1562 1822 -2163 2637 -3346 4513 -6789 12915 -67531 -181703
71 -181703 -58939 86499 142907 50937 -59578 -73594 22691 99069 90288 8489 -52094 -30802
83 -30802 45806 84958 55967 -23079 -80403 -56970 19983 58529 24792 -45851 -74601 -23515
95 -23515 45807 46233 -14773 -64577 -42004 35760 81339 46368 -14619 -40579 -15958 28824 42149
108 42149 13964 -13099 -18102 -4712 10782 1365 -31708 -53627 -45652 -10367 25748 19409 -26470
121 -26470 -56953 -45043 -4852 27432 21338 -1629 -474 19720 30995 21507 -3521 -12474 11444
134 11444 39380 46624 32294 804 -24507 -22182 -5686 10801 16190 1802 -12016 -10510 -6956
147 -6956 -11079 -19757 -24041 -7607 21438 29395 12184 -9525 -21131 -11224 9083 18344 18454 15386
161 15386 5587 -3268 -6665 -10305 -10847 -9003 -8309 -52 7637 -2700 -21789 -32439 -26787 -5239
175 -5239 10444 5058 -3822 -2805 1491 3855 836 -2757 7006 20454 21250 15818 10429 4457 2947
190 2947 1448 551 8779 14316 5921 -5572 -9414 -6478 -142 -4459 -14978 -10445 2467 6486 286
205 286 -10153 -12512 -758 5797 205 -1637 3772 9035 9900 1204 -5403 -866 2900 -873 -2106
220 -2106 1400 5684 4705 -7823 -18304 -11988 -1742 268 -2359 -4497 -256 5311 -2088 -12975
234 -12975 -10067 2112 12986 15197 7132 2849 5605 2616 -3313 -1699 6418 14724 15063 3638
248 3638 -5279 -5258 -5704 -7993 -5888 -79 7628 7717 -5365 -16676 -14455 -7350 -934 2176 2758 6589
264 6589 7609 -909 -9318 -7659 340 9425 12578 8235 5526 3415 -3993 -9055 -6219 177 7690
279 7690 7651 -744 -5736 -6280 -8628 -8553 -5768 -363 6987 7132 -572 -4993 -4433 -2259 1587 4851 6600
296 6600 9986 8394 758 -3023 -2229 -26 2591 2606 1090 1963 -137 -6176 -8330 -6762 -3246 -55
312 -55 -1240 -3467 -1271 -146 -1860 -2780 -1493 1901 6001 4597 1912 4106 5414 3479 1359 -341
328 -341 1567 4440 2837 -827 -517 137 -1090 -3938 -7010 -5334 4 822 -1875 -2190 -1639 -525 -1640
345 -1640 -4027 -2316 4150 6351 4268 1154 -793 399 1104 -1555 -1377 3723 5367 2233 -3318 -7176
361 -7176 -5146 -1616 -2067 -1957 808 2757 1278 -3411 -7021 -3418 3069 4914 4265 3799 3611 3429 -151
378 -151 -3366 -424 5500 7201 4265 479 -2152 -1385 -2205 -4373 -2599 2160 3783 1303 -4057 -7034
394 -7034 -4155 -1258 -1076 -321 2146 3095 1889 -3073 -5364 -1957 2206 2740 1582 505 574 447 -2684
411 -2684 -4743 -1765 2125 2861 1141 -1796 -2069 -403 -754 -1971 455 2840 3665 2143 -843 -1410
427 -1410 1211 2171 1183 1225 1641 2388 1505 -1005 -1764 957 1675 737 -302 -1284 54 578 -1094 -1558
445 -1558 215 636 -335 -1444 -2197 -591 1188 -112 -1682 -1191 -809 -1033 -1657 -2211 -545 1734 507
462 507 -1112 -1483 -1083 106 687 -42 1419 2672 1625 -416 -1200 -593 1610 2386 1445 1196 1475 292
480 292 -1579 -2141 -1304 1505 2502 795 -465 -669 -939 -1048 -1427 -245 2691 3149 1125 -997 -1544 -1092
498 -1092 185 275 508 1834 1612 -824 -2962 -3606 -2220 -101 -85 -711 -481 -412 -1801 -2748 -2374 -394
516 -394 1992 2450 762 197 44 427 399 328 1532 3115 2738 558 -1031 -1321 -110 743 -20 -259 496
535 496 97 -1308 -2500 -1785 -46 1491 620 10 343 486 452 -267 15 1537 2556 1295 -238 -705
553 -705 -529 166 -178 -1031 -471 -240 -924 -2244 -2589 -1584 78 351 -411 -786 -178 -150 -221 19 662 2301
573 2301 1995 951 14 307 637 709 444 300 844 405 -1213 -1847 -1286 8 429 244 -579 -315 -368 -995
593 -995 -691 -31 1236 2173 1346 254 148 48 183 401 570 999 1137 123 -1544 -1792 -1116 -626 -380
612 -380 -537 -503 -203 -657 -1535 -1204 124 984 1194 802 380 398 214 238 471 793 1573 1170 -175 -1369
632 -1369 -831 -703 221 102 -115 110 -194 -877 -1284 -1042 -79 800 581 219 199 252 5 -200 114 1007 1388
653 1388 751 -304 -803 -495 -434 -110 -22 -42 -78 -503 -1279 -1204 -352 -267 562 366 330 81 -87 -352 -163 497
675 497 1232 1159 475 -285 -491 -277 -268 -350 -97 362 363 -603 -1215 -895 -483 169 439 318 304 166 -296 -201 128
698 128 941 1185 789 429 -119 -179 -446 -495 -337 373 262 -171 -1013 -953 -936 -492 -57 65 321 362 40 -424
720 -424 -312 235 920 1053 677 608 48 -327 -496 -558 0 534 440 -240 -924 -938 -590 -271 -318 193 594 290
742 290 -233 -314 -422 199 649 616 686 468 -164 -173 -602 -153 241 619 329 -364 -523 -646 -638 -305 -463 69 335
765 335 25 -491 -139 -25 324 777 860 777 537 185 -228 3 129 596 680 3 -335 -608 -611 -562 -367 154
787 154 2 64 -216 -341 -427 -168 346 447 534 835 304 165 -101 97 278 495 278 67 -191 -702 -598
808 -598 -540 -421 -183 -162 -143 -357 -185 -391 -104 -11 720 745 815 452 49 258 -23 296 712 420 101 -98
830 -98 -884 -759 -583 -262 -181 170 -164 -579 -657 -333 -301 73 294 527 505 17 175 101 221 708 543 558 321
853 321 -117 -403 -523 -347 -70 -36 119 -476 -548 -564 -792 -218 67 225 224 389 149 8 142 178 480 659
875 659 458 671 106 -333 -185 -95 -5 231 -225 -412 -224 -738 -865 -483 -85 15 301 186 -255 51 -196
896 -196 -37 486 652 573 210 -13 -364 -187 -72 84 159 26 -240 -383 -596 -622 -526 -144 -18 189 -220 -357
918 -357 -174 -200 114 406 500 358 289 -82 119 110 -12 374 52 -37 -82 -345 -463 -260 51 -173 235 67 -304
941 -304 -274 -166 20 62 187 437 128 161 -204 -296 118 248 281 113 -30 -64 -445 -630 -22 -18 32 165 129 -58
965 -58 198 -39 -30 216 297 373 37 47 -333 -364 -130 -53 129 123 85 -44 -408 -73 -160 207 -69 121 136 277 206
990 206 226 49 289 457 384 144 -97 -53 61 -27 -150 120 -17 -317 -209 -459 -561 -138 173 17 25 123 5
1013 5 190 -140 155 547 554 507 307 -72 -79 256 4 -288 154 -141 -179 -496 -729 -399 -164 -307 -47 16 23 100
1037 100 -40 -384 221 709 447 439 484 139 -42 -40 -1 245 237 -5 -103 -251 -606 -540 -341 -409 -127 -80 -114 -289
1061 -289 -521 -67 59 258 428 423 347 415 402 -24 32 479 473 163 -246 -293 -319 -556 -323 -11 -183 -174 -346 -204
1085 -204 -615 -417 17 200 239 492 445 380 319 -50 284 537 295 272 458 222 -25 -147 -205 -143 283 -274
1107 -274 -457 -188 -703 -256 -369 -116 204 265 80 -106 195 123 344 379 315 107 156 55 16 185 -265 72
1129 72 -174 -321 -440 -478 -676 -158 -143 -102 -264 -27 -81 140 43 120 541 391 -98 293 229 108 69 5 214
1152 214 305 201 -221 -226 -103 -503 -286 32 -180 100 -126 -545 72 -358 -221 278 397 -71 138 -66 -95
1173 -95 -10 -149 -17 264 12 -323 -74 -127 -328 2 -139 -168 304 -294 -174 4 -47 -81 24 -107 87 188
1195 188 228 -35 -179 7 415 283 147 161 161 -202 -387 -97 -188 180 329 16 -125 -16 -20 18 138 33 573
1218 573 486 246 172 170 -116 -31 300 69 4 131 -205 -46 -539 -417 24 -296 -329 -307 -5 -149 -90 -123 89
1241 89 350 441 79 281 202 102 315 34 72 186 137 -55 -329 -29 -213 57 -70 -391 -335 134 -177 -109
1263 -109 -19 301 135 -70 -107 594 479 220 209 121 -95 185 -204 -133 152 53 -183 -272 -197 -132 -382 -401 -22
1286 -22 -265 26 9 174 -357 -213 32 85 137 282 273 116 43 -48 -108 -252 67 88 -68 -106 -296 -225 -420 -482
1310 -482 -197 63 332 -208 -114 -166 -84 43 -104 90 132 389 91 -128 246 168 -48 426 304 230 147 -275
1332 -275 -474 -561 8 -290 223 -48 -303 213 2 -206 74 -225 -3 133 -1 42 193 76 -148 -242 -215
1353 -215 -72 27 123 -149 56 -45 -165 -444 -433 157 -6 -26 -304 42 -22 177 -122 -35 -17 174 -22 -342
1375 -342 110 -44 145 92 -32 150 -4 188 -194 -451 -207 123 258 91 -19 65 -115 -357 -61 -415 -9
1396 -9 46 -15 -97 207 -150 71 -71 39 81 297 449 -203 1 -23 117 -92 34 227 450 18 114 -180 -312
1419 -312 -120 -92 -142 -2 110 -53 -255 -203 -312 68 -169 -50 -42 88 165 122 -130 -7 138 135 -5 228 -47
1442 -47 -93 52 -63 -66 -86 -25 -123 0 -101 -128 -131 -292 -163 115 -79 148 -23 16 52 42 42 203 167 232 177 -97
1468 -97 -120 1 197 -153 -66 -80 -6 163 -164 -302 -77 40 122 -7 -236 -245 69 -47 153 -21 221 232 154
1491 154 80 351 181 3 158 52 19 -101 104 -239 -348 -199 -81 -400 -333 -95 -119 118 -78 102 31 79
1513 79 -96 217 191 42 409 -10 -43 -242 269 61 273 -184 53 154 -54 -429 -125 -246 42 -51 -161
1534 -161 -93 -200 -112 134 -57 82 279 181 126 -50 26 63 -43 322 63 51 263 -180 -97 -281 -214 -156 -55
1557 -55 -167 -240 77 -81 -74 -39 -215 20 150 84 390 210 96 -65 -77 64 251 135 40 -34 -306 84 -155
1580 -155 -122 -321 -49 97 11 -191 -240 28 6 9 -22 -116 118 286 1 37 -65 -1 260 77 -106 -127 -40 -199
1604 -199 -181 -99 -197 8 -118 -122 13 242 249 35 -300 184 241 184 -77 -13 -228 30 63 -108 80 -37 -135 139
1628 139 85 -40 150 -236 7 -36 85 -311 314 57 163 191 303 25 218 -63 111 185 -309 -174 72
1649 72 -40 -216 -16 -75 119 32 -98 -180 61 59 201 104 -189 181 180 28 83 221 33 448 6 -33 52 -101
1673 -101 -6 -264 -125 218 150 -250 17 16 5 88 -192 -79 138 76 24 -138 194 148 54 147 -10 177 177 -130
1697 -130 -142 -28 -260 26 76 8 12 22 32 -79 -316 218 124 50 -84 12 -125 33 100 140 134 118 -163 154 47
1722 47 -46 -53 -30 -250 -194 -84 53 -442 -39 -196 -139 174 -124 158 167 252 211 283 -116 14 116 -7 -49 80
1746 80 124 220 10 -235 -188 -36 -127 265 -274 225 -102 260 -21 -335 265 -30 1 87 179 146 -30 -116 -279
1769 -279 101 -9 33 112 39 29 -22 219 -107 26 321 -30 83 -280 212 84 -93 -280 -117 15 84 239
1791 239 -133 12 46 14 -261 -151 -11 71 -14 41 53 102 255 182 73 -51 -145 -52 -17 -160 54 223 24 90
1815 90 -269 105 84 -172 -17 170 196 256 -88 31 13 48 81 189 -51 165 84 -244 -505 -153 -1 69 137
1838 137 -145 1 -182 94 25 -65 -67 -85 -66 -193 -224 -125 -306 -141 -133 -36 245 133 -334 -119 156 61 224 100
1862 100 -59 -33 107 50 103 7 107 -46 -39 -126 -43 133 -123 -140 -392 -198 106 -28 120 -62 75 239 48
1885 48 -138 47 -16 8 -87 225 -123 -62 -178 -122 -202 100 -20 -119 -337 -319 -98 47 -275 54 -15 208 20
1908 20 83 228 -22 107 32 -71 130 18 60 192 -205 -227 -121 -50 -14 -117 82 50 -221 -46 -68 -180 -169
1931 -169 -24 30 -118 352 20 -65 20 -287 212 -189 -189 70 196 191 -194 -29 17 -173 -212 22 -316 -153 9
1954 9 2 16 29 250 158 90 -208 64 311 25 -106 4 221 -33 48 70 104 -1 349 -53 -55 0 107 83 -183
1979 -183 140 130 -4 76 -150 -24 158 266 144 -104 -138 182 -17 -137 92 17 67 -61 116 -235 121 -92
2001 -92 -182 28 77 87 -269 -383 -307 94 -22 -60 -196 79 -168 117 -70 -140 214 71 -152 -231 -125 20 73
2024 73 156 -313 -243 147 106 56 -55 -71 -76 48 -46 183 -31 111 -71 -59 206 -57 -92 -106 40 -38 264 -324
2048 -324 -3 316 -116 344 106 -52 -13 114 133 229 162 -137 252 17 45 -108 54 111 127 -330 130 -133
2070 -133 -125 41 -141 -18 -13 -82 -127 -50 -94 86 -8 34 -97 82 164 216 355 217 -48 180 -67 -254 -118 -31
2094 -31 -35 11 21 -46 -43 -233 -23 -407 -60 -239 -94 7 168 197 152 -97 -205 98 85 -15 222 120 43 -29
2118 -29 -145 112 51 -53 52 -220 -28 36 -140 -170 -93 -125 186 -140 156 149 44 -250 56 -148 -108 -283 -22
2141 -22 295 -302 128 -170 -32 -50 -184 -32 68 -124 -162 -242 -6 68 -163 -11 -27 253 -169 107 194 252 188
2164 188 -21 79 -103 -110 -102 253 -74 1 172 127 -52 -237 -140 -85 86 70 -60 136 71 64 188 187 116 -146 275
2189 275 -97 20 -4 114 -150 297 155 1 76 -41 174 -224 -133 -76 -22 -181 -64 9 -56 -12 -48 288 -33
2212 -33 -118 -82 176 55 4 -22 65 6 -58 44 -18 -104 79 -8 -109 184 122 -39 20 -132 115 41 -89 265 22
2237 22 221 43 220 -45 71 -9 74 -114 -196 112 61 63 -109 189 -25 -67 -76 33 -27 126 34 -20 -156 235
2261 235 -158 22 -91 -115 -27 -15 -74 -47 -55 58 7 89 126 373 -297 3 112 -132 229 44 -40 87 152 -25
2285 -25 23 -13 21 -180 59 281 44 -85 -165 144 -162 -237 -4 27 -280 208 -4 -35 -126 27 -56 -13 139 -23
2309 -23 226 -135 83 -33 -217 -27 10 35 180 -49 55 15 -93 62 -228 160 46 79 -3 174 -57 -163
2331 -163 -117 93 14 -378 89 -244 286 -40 18 -107 127 -38 -6 67 14 -80 101 -35 48 -229 -101 248 -106
2354 -106 214 -248 192 -39 -115 -138 -146 33 -87 251 53 -14 40 206 64 26 189 -248 157 176 37 98 -234
2377 -234 -128 -132 81 -43 242 -103 -24 -43 110 -126 -213 -85 -126 -130 -156 -5 -131 -115 72 63 118 -167 -42 -181
2401 -181 11 91 0 -85 58 -13 -84 -17 -211 227 -36 128 4 -114 -128 -266 -151 -152 -11 -175 35 101 207
2424 207 -26 -62 71 106 196 52 156 198 98 -106 220 -154 -48 111 253 -81 13 -144 -43 -148 -11 158
2446 158 270 32 -134 45 -60 -114 -299 149 272 -48 162 283 172 0 189 206 -135 -169 16 -169 102
2467 102 -143 188 -42 -127 -89 -114 -225 -42 205 19 -116 36 89 94 -10 60 377 152 377 209 -53 -174
2489 -174 -146 -25 79 115 109 6 260 -120 94 -139 -47 28 -8 -199 -4 105 -3 106 -30 -77 15 -203 -244
2512 -244 -118 -75 10 71 -129 -130 -189 -307 106 -237 -125 77 -206 -160 101 -89 218 -160 -123 77 -31 337 285
2535 285 62 47 11 -53 17 -107 340 -69 99 -147 57 45 117 18 -45 -265 -263 -5 7 15 -56 74 170 -63 -211
2560 -211 147 -36 236 106 32 118 115 -95 114 -152 -1 37 -161 -109 -68 257 -78 -148 72 47 85 -196 30
2583 30 195 20 52 108 116 80 -138 76 -58 34 100 64 11 -42 -25 -298 11 -222 77 208 -183 258 87 195
2607 195 -348 72 -8 138 73 140 -154 62 -20 -32 35 -132 -158 -117 193 114 134 126 -93 -26 -94 -122 121 52 206
2632 206 20 317 67 -121 -124 -83 58 144 -15 -253 -60 181 -58 163 -120 -76 -18 -116 112 -89 40 -46 -22
2655 -22 -33 174 -131 71 95 65 -37 -11 71 -120 -336 62 -224 -70 4 -58 -50 25 -59 -246 119 73 -24 -80 208
2680 208 -139 -52 -25 7 139 -148 -96 332 101 151 46 -66 170 89 28 -293 56 21 -207 -119 102 120 -26
2703 -26 -104 -191 79 -122 -116 -90 -344 59 94 -196 -218 220 -160 -69 -137 10 -219 -53 68 -191 -285 -163 -176 -235
2727 -235 81 -155 -146 7 -161 100 -2 223 -118 69 -121 -80 118 109 144 183 21 29 -97 -271 -103 -15 -97 -93
2751 -93 -205 -5 135 -87 56 -12 140 -11 -234 -8 45 122 -43 -36 6 -215 57 48 -52 -151 -30 206 -21
2774 -21 37 -78 -117 -93 -99 6 -23 216 6 -51 52 12 -79 -112 9 239 9 -304 -79 -174 139 -118 96 53
2798 53 92 -204 -181 -269 -95 -4 -22 136 -64 -159 119 96 -47 65 45 -41 -119 -150 44 209 93 160 -234 -109
2822 -109 80 75 -203 42 18 159 40 -15 -121 -271 -6 20 100 120 -100 10 145 -185 -27 -66 -249 -133 -126
2845 -126 354 54 68 -168 -134 38 146 -54 -102 52 233 367 -180 136 9 278 -19 -49 -16 23 -141 -62
2867 -62 64 92 80 9 -35 72 120 -7 72 40 75 188 -322 -195 -172 -171 285 245 128 -32 157 351 -140 -14
2891 -14 152 192 -79 55 5 198 292 -57 58 211 369 -369 33 -28 -11 65 44 -257 -154 -89 -109 28 -260
2914 -260 -260 248 206 -61 186 80 -73 71 127 -158 221 48 20 175 -93 158 -109 101 -172 -61 -8 16
2936 16 73 -112 89 29 -161 -228 -167 -122 -18 98 -95 -21 -73 -119 47 47 -44 294 174 111 -39 86 20 -94 -48
2961 -48 -224 -257 142 -92 -218 142 -53 -295 -277 -49 196 140 18 -225 23 15 -41 174 12 -272 380 154
2983 154 201 51 -158 -36 416 -289 101 90 -11 -21 64 30 -70 -75 175 66 103 132 -43 -75 54 75 37 -139
3007 -139 -415 -338 -83 159 60 45 16 3 18 -65 -161 -385 43 -167 -13 -387 20 156 -130 38 -37 34 116 11
3031 11 -86 237 -94 128 -89 -14 -98 -89 -70 -64 55 66 146 -120 -45 -98 -25 -239 -1 423 15 21 -124 -226 -116
3056 -116 251 -129 -131 -21 -229 238 -167 52 92 31 -9 -272 2 203 15 199 -178 -45 2 -101 3 26
3078 26 -138 -29 81 121 40 23 -42 -249 62 2 -136 -61 -57 -39 81 -64 249 111 87 264 -92 68 71 -161
3102 -161 104 135 -9 173 -296 -123 -19 63 -157 10 -71 222 21 14 -34 -151 193 -212 243 -251 -74 203
3124 203 213 135 -282 -196 -15 -35 15 78 -79 37 -67 -297 107 6 220 37 -195 22 -224 -253 82 123 75
3147 75 -305 41 11 73 -189 63 -135 -40 -54 -54 273 231 60 90 -321 -272 -131 86 105 86 -148 9 -104 -76
3171 -76 41 273 -140 209 49 -60 366 -112 12 -97 -130 -8 -216 -77 74 -88 87 87 -85 -7 -232 25
3193 25 59 -68 95 126 -33 -97 -105 -31 -112 295 68 15 265 -105 52 -215 -74 -113 -23 170 4 87 138 -87
3217 -87 127 23 192 -77 -65 -23 -115 -172 245 -102 -139 -126 -71 217 -86 64 -8 -97 21 117 -178 277 5 -53
3241 -53 -20 49 -41 192 140 -106 -171 177 223 97 49 -114 148 72 110 103 383 292 24 150 -92 -53 26 66 -69
3266 -69 -64 -33 -71 -161 137 69 -89 125 -22 163 275 32 -6 -205 21 38 79 -349 -199 122 -193 146 67 74
3290 74 256 203 107 108 -206 274 -204 104 -153 -25 26 -8 -39 -36 -13 283 -225 88 261 291 149 -286 91 -137
3314 -137 140 167 -111 36 183 176 -5 -51 -73 -2 259 258 -245 159 78 50 -28 -75 -81 196 -50 -105 -89 -335 84
3339 84 66 -54 233 239 107 -251 -32 -42 -72 -197 239 -22 122 -119 0 -280 163 64 67 -18 9 247 8 -186
3363 -186 -106 259 -37 117 -153 45 -155 -27 73 132 17 -18 92 6 -151 -27 -61 169 -174 -59 -87 50
3385 50 140 -5 -194 -39 198 57 -48 59 80 -26 -101 -205 309 -19 58 -127 -81 -150 -82 114 41 -186 41
3408 41 99 6 -137 37 56 -189 -114 -54 77 -16 -278 -25 95 -163 -402 -146 -66 88 8 78 -47 110 -9
3431 -9 -269 67 24 -23 -197 25 -308 -121 -126 23 149 -217 82 -340 -41 8 180 173 -146 -114 26 -120 -56 89
3455 89 -32 72 99 -259 59 217 17 -167 306 202 -58 1 62 125 -1 -30 -220 -46 -186 125 -1 129
3477 129 -7 87 -35 69 146 56 124 149 -346 274 -72 -118 12 10 -25 -15 31 40 217 -172 -82 -87 96 92 131 -169
3503 -169 -217 53 -275 99 -82 26 -133 -80 -147 87 49 -21 -22 -39 30 -59 90 -25 62 127 91 133 -41 -197 -85
3528 -85 52 52 -19 -245 183 -4 156 -56 -228 13 -242 1 237 182 85 -40 36 42 209 69 -92 -14 -156
3551 -156 -364 -214 -37 98 -33 79 132 113 -218 -124 -50 66 -164 100 166 -43 47 50 270 -128 66 261 -132
3574 -132 -129 -143 -185 175 167 333 -17 -14 -130 -150 142 210 153 177 42 217 80 -112 -163 -210 154 -232 -287 19 4
3599 4 9 -36 -150 192 13 114 46 76 24 -111 62 -45 41 -101 89 -132 78 147 -29 -331 -294 195 35 -19
3623 -19 251 -20 -162 218 98 -191 181 -47 18 -218 -244 -32 11 -174 204 116 -40 126 -129 -229 84 -191
3645 -191 91 178 36 0 101 148 -45 64 6 72 103 -111 -126 117 -23 -187 89 269 51 181 142 -71 107
3668 107 -180 241 195 14 -71 211 221 -114 -90 81 -212 282 -54 -243 -60 -45 38 39 65 -103 -44 -270 27
3691 27 67 -153 -37 -118 48 -67 -34 -261 150 10 -227 -67 34 3 175 -21 155 -49 -28 86 175 40
3713 40 13 -220 56 38 -130 -57 -206 -87 98 -87 -56 -38 -97 53 27 40 23 142 101 -65 174 -191 114 -139
3737 -139 193 -116 -260 123 142 -93 -15 -18 118 123 -181 87 -4 167 -196 95 164 -230 -40 -60 129 271 71
3760 71 -182 -105 -42 -39 -93 -58 53 -61 -271 -130 93 256 -32 1 41 20 -114 -135 -132 76 301 -51 -276 -159
3784 -159 -137 30 24 -114 -182 109 119 149 25 74 -150 -166 -99 321 -70 188 114 -89 180 -97 123 -314 -110
3807 -110 -166 -136 68 -125 64 14 237 -127 92 116 319 142 -81 98 25 -142 -37 -293 -73 -279 -6 -63
3829 -63 156 -3 143 -5 -65 180 -12 -141 139 -75 -87 -120 4 23 -170 177 81 -238 1 -5 -232 -23 84
3852 84 39 -123 -110 -414 218 1 -11 67 -21 112 85 -291 -221 -238 -104 -139 -259 -151 0 -25 127 -97 -193 142
3876 142 -23 124 104 31 135 39 -21 1 -65 237 44 -220 -304 128 81 -225 -214 124 -65 208 -9 -153 -13
3899 -13 -164 184 -113 -7 -102 -92 -32 154 210 232 -266 87 -28 -158 -82 113 -72 -102 -66 -217 36 57 -8 23
3923 23 -89 -223 120 -59 -144 117 -73 92 98 -181 -80 -4 -68 23 -96 -1 106 -230 -147 -27 19 19 -102 -49
3947 -49 -155 -196 -15 44 -187 -195 113 -72 -15 119 105 -27 26 87 91 15 123 92 -137 146 -36 -26 224 146 75
3972 75 47 -42 101 -108 -39 222 33 2 28 -143 133 214 205 5 -101 23 141 54 -224 -95 142 200 -82 -8
3996 -8 -127 -36 43 -50 47 64 -11 51 65 -172 -165 253 -99 1 71 -82 105 -241 98 6 74 -191 -68 -9 248
4021 248 -132 -114 -155 77 -69 94 20 -66 101 -274 -117 2 -26 8 -243 -95 -103 -49 -107 -308 -173 -22 112
4044 112 86 148 -221 -132 70 -193 48 36 185 -280 -313 -162 -8 131 -9 12 -47 104 -36 25 37 61 81 121
4068 121 68 266 58 8 -2 -108 -207 36 -31 -206 -130 -88 -44 130 -39 -68 -90 21 -193 -169 -19 -57 -122 -47 36
4093 36 139 -29 16 240 39 -190 -11 194 232 -101 -138 68 69 91 -543 62 20 -82 89 -71 0 310 7
4116 7 -66 80 -90 202 -37 58 -274 225 -210 95 76 -119 -68 -161 132 26 -38 -146 -37 138 -141 111 -65
4139 -65 -60 -16 -50 71 196 62 84 -168 18 -57 -58 112 35 -102 -287 -143 -277 110 15 -22 -41 -147 19 -33 380
4164 380 -101 35 -81 -116 55 74 142 -80 21 5 -159 -73 112 -1 49 215 102 80 -246 110 48 136 -36
4187 -36 54 -124 -226 18 -106 -100 -43 128 -63 81 91 -38 -135 166 -23 -29 -10 61 32 -34 -141 -25 117 36 -23
4212 -23 131 66 -246 163 100 -115 -117 15 -84 -31 47 23 91 -14 -118 -5 -61 128 18 -242 306 -60 -93 16
4236 16 -208 -4 -40 -96 12 51 89 -218 -94 176 -159 193 5 55 -51 -271 -179 -158 169 -276 71 -182 55
4259 55 212 -66 75 115 41 -114 68 -118 184 123 175 0 136 184 258 -50 -81 -111 50 76 170 17 -36 32
4283 32 -150 -217 -169 232 138 31 -210 -186 27 41 -7 62 -27 -58 -122 44 10 -237 -117 45 43 341 -10 -12 10 51
4309 51 -45 129 -69 61 59 -33 8 -134 -240 12 -86 -25 109 -173 -116 -56 -163 20 -124 82 108 41 -52 88
4333 88 38 206 -138 -118 -145 -117 -154 -285 -101 -22 -54 -96 61 31 314 51 180 -251 -125 176 -205 264 -142
4356 -142 102 -125 167 -140 70 283 -52 -232 -232 -165 120 178 -30 163 161 30 -99 -244 -127 8 37 346
4378 346 -158 49 -79 -48 83 128 -44 -11 -72 60 -178 38 68 195 -146 -43 205 -68 -184 43 -225 59
4400 59 76 -241 -28 33 -15 36 27 67 -203 142 -99 58 101 -62 201 139 -1 125 4 168 -106 -57 -15 46
4424 46 47 32 66 120 -29 90 5 -40 -4 -108 109 -135 24 19 -50 114 -33 178 -212 166 -403 -65 46 -38
4448 -38 49 43 62 -338 200 122 -49 -46 84 -269 -110 -137 -235 -280 195 -170 38 169 16 35 19 106 -364 24 -9
4473 -9 3 -97 17 -86 134 -47 -4 -226 -124 178 -126 -448 -55 4 -10 -229 -17 49 261 142 23 146
4495 146 -219 56 -23 5 10 -6 -118 -113 152 309 95 95 -56 0 166 128 -66 -93 -156 6 -124 -67 -9 -49 144
4520 144 -138 23 -7 133 75 -168 -282 204 215 -197 198 86 49 26 -11 160 142 215 -58 -220 -233 -23 236
4543 236 -272 10 -188 -142 -85 -21 -233 103 -110 179 77 -62 -63 -25 225 16 3 -32 125 -182 65 -97 -46
4566 -46 172 77 -28 -132 264 -64 -31 -11 -146 216 33 8 -22 152 -105 224 8 19 100 -98 -14 14 79 -176
4590 -176 -137 81 25 137 -61 -22 33 -140 -67 119 33 -87 47 87 194 -35 -70 63 -44 229 66 258 41
4613 41 -102 -103 97 -89 -92 221 -121 -331 201 -113 -1 -73 123 -30 73 -6 -90 -56 180 -110 -36 -199 -137 -36
4637 -36 -63 -38 -114 -177 181 65 140 -61 38 187 -180 -95 -62 -2 -170 197 -104 -58 -31 -58 -355 -24 -165 7
4661 7 -93 -26 -45 186 109 -52 103 179 -26 -150 385 93 -88 -175 35 123 -16 -72 -91 44 43 -15 20 47 -112
4686 -112 -3 -263 -22 -155 -171 -289 63 -131 -34 -3 147 0 24 -160 39 -158 -55 148 -59 8 -80 78
4708 78 -305 -178 125 61 -107 -73 196 259 164 -12 -44 97 -156 157 -165 -35 -102 48 255 192 -281 -161 25
4731 25 104 -105 -209 -81 60 -139 -97 -59 8 76 -27 131 175 -62 -2 118 -272 -99 -253 -145 237 -34 -15
4754 -15 -43 -130 19 -110 123 131 -139 172 78 -74 -46 -91 -351 122 -162 -123 145 -47 22 -138 318 -1 55 199
4778 199 157 140 181 112 -48 -124 187 248 54 135 -228 -10 0 415 39 -1 2 -16 -62 193 -29 103 93 -172 83
4803 83 -195 270 192 35 -6 281 155 -40 -203 -313 103 190 -142 141 -197 50 -79 54 207 -85 45
4824 45 -125 -172 101 69 56 -179 -3 -203 -99 -143 -9 84 -226 242 262 102 36 -342 -217 -58 -195 -15 35
4847 35 12 99 -30 135 88 57 -57 56 -37 209 -278 110 -146 185 136 -208 60 -269 -70 -127 -8 36 209
4870 209 81 59 -97 -43 -28 197 -27 159 -168 29 -13 -242 -360 -86 24 -302 31 -284 -11 -6 53 9 -63
4893 -63 -60 -290 -266 -41 -48 45 -141 -106 -125 -98 257 100 9 -355 267 202 -147 -314 -81 142 -278 193 69 3
4917 3 78 -271 163 -47 215 31 443 -86 437 9 214 -147 -8 102 147 159 32 -241 -188 -28 -81 52
4939 52 -149 121 225 119 -124 68 117 -125 139 3 -341 81 127 52 -57 204 85 -1 -127 -136 -195 205 406
4962 406 -119 -161 -14 20 173 24 -191 98 -159 -116 162 96 106 -53 29 115 -222 47 8 124 -63 -123 74
4985 74 -121 -200 -100 -35 -120 144 128 -77 50 -54 63 158 413 28 -33 -146 -30 -37 -212 57 -225 -150 -45
5008 -45 211 -89 114 122 25 -159 -106 -268 -106 119 -125 -213 -131 -64 -4 -148 76 32 -145 -57 -89 -76 -243 61
5032 61 -248 89 -180 187 101 -80 67 -86 62 22 42 61 65 128 -72 -29 -55 117 57 -10 9 -139 -201 -155 -217
5057 -217 -109 170 49 -12 87 -27 -40 -26 93 -224 -96 73 79 70 47 -127 72 -62 -235 -46 336 -69 -167
5080 -167 -3 -63 -3 -35 60 -139 -135 -206 -240 -379 139 118 -192 93 191 13 110 120 7 -74 193 181 364 -1 -41
5105 -41 -135 -33 0 -96 60 61 44 -127 -241 116 -62 -76 -106 66 67 -174 50 123 76 50 -234 143 66 160 -89
5130 -89 -125 160 -374 -53 -372 25 -26 60 -36 56 192 60 170 132 199 231 -150 -169 -141 72 107 82 49 161 -75
5155 -75 101 -53 -75 -40 233 -89 36 88 81 32 67 485 2 -196 188 -233 -16 106 -58 -199 44 90 93 77
5179 77 -22 81 29 27 200 -157 -144 -85 -35 55 -210 4 191 128 -135 -93 49 -81 -174 -193 -35 7 -90 -309 -163
5204 -163 -84 -25 -19 -139 -35 -60 -142 -123 4 -103 -61 98 -124 60 230 2 357 -77 206 -88 180 150 36
5227 36 -46 -17 55 18 61 -128 -16 96 29 -144 166 -114 24 37 133 253 -134 -44 56 83 -56 -10 11 215
5251 215 285 -156 23 -60 -23 -30 135 88 44 77 -16 254 -14 -393 -117 -220 -4 -101 -30 -237 -129 -389 -260 -95
5275 -95 80 -17 -117 257 -237 -218 39 84 191 103 -103 -27 -26 -28 -40 89 24 302 82 -65 61 131 -91 8 31
5300 31 47 -26 394 -69 42 109 72 -6 -9 -342 -21 153 -110 -60 64 -164 -72 -35 -108 65 -114 140 7 15 -129
5325 -129 139 24 -211 62 85 -118 82 241 -113 -69 -107 -62 116 -237 112 -5 -142 110 -119 -139 252 58
5347 58 106 -114 114 47 -109 193 -53 81 -9 -13 -239 -254 66 373 39 -136 -30 230 193 82 159 -147 104
5370 104 22 -166 -196 157 1 238 137 -146 -18 -37 -79 221 159 -5 -80 -9 -58 -87 -222 131 82 -76 -120 77
5394 77 -33 -223 -61 154 127 -160 11 -205 188 -61 -233 -121 164 186 73 -84 -108 -37 -24 152 -35 -116
5416 -116 145 -472 -35 -49 -73 60 -195 215 -208 113 72 16 67 -46 -126 -240 -115 -106 132 -203 -3 -201 -198
5439 -198 71 -22 109 -12 148 53 -81 -187 -136 -228 -25 -92 116 -33 -106 -116 -116 -134 -37 -55 157 31 -326 120
5463 120 245 -35 136 339 122 81 60 27 -263 -67 220 13 -61 105 237 -146 -145 333 -104 56 -55 49
5485 49 -318 49 28 -16 -42 -44 -89 174 -29 258 5 82 281 74 -174 -29 -32 153 -107 30 -255 -133 -44 -94
5509 -94 105 -134 -35 190 251 12 23 -13 -160 226 289 -7 247 -68 37 11 -87 -132 -44 59 -126 -40 36 154
5533 154 56 -6 -39 -116 -141 -111 -166 -28 -21 49 -359 -90 21 9 -308 -207 -87 -150 -59 -121 193 113 179 38 72 -264
5559 -264 -179 65 36 112 -148 41 -150 -115 -39 141 -131 -4 138 -192 -17 33 -299 232 79 -6 67 -20 15
5582 15 257 65 -243 -130 55 113 -17 -47 -260 -19 9 -144 71 -26 -95 64 57 -149 302 41 -73 95 59
5605 59 58 -25 60 165 71 -8 5 27 68 64 -50 -57 32 -270 -63 28 -37 132 42 21 -71 -200 169 121 289 176 28
5632 28 -40 -64 -145 -200 -189 -116 16 -117 72 -125 -127 255 -329 200 133 -219 -94 -7 3 137 4 73 199 -57
5656 -57 -64 263 52 -143 225 31 -65 48 -165 -144 -32 -39 25 -85 -80 -98 -276 228 19 -199 40 31 -65 174 -113
5681 -113 15 202 -177 -63 -74 17 -189 -23 -141 -140 -27 -138 -39 -113 -92 106 -98 -170 -80 90 19 -125 42
5704 42 -18 145 -118 111 -191 -136 -140 -4 -26 203 -47 203 -1 -211 140 87 -99 113 109 259 -157 88 212
5727 212 -64 49 54 -103 15 9 80 -2 6 -186 -59 8 -32 -59 125 -57 138 -31 17 -61 23 -282 -271 130 148
5752 148 85 37 -105 -32 199 176 72 -134 -56 -64 -111 -155 117 -48 195 -45 248 167 27 130 45 43 64 -205 267
5777 267 -111 144 -207 111 134 -27 -33 114 0 -127 -39 -328 -40 213 187 34 288 -11 303 -256 -43 -2
5799 -2 318 -24 30 -155 -217 -130 143 168 -96 -238 -55 -101 -116 93 71 318 -67 94 -11 63 42 64 201 -84
5823 -84 -155 -1 246 -29 -18 51 129 -127 -62 20 -140 -83 66 -46 -151 -29 83 -42 32 57 146 -122 -65 108
5847 108 -149 -23 109 106 -138 107 -57 -140 -45 -229 -59 199 286 229 -67 -288 -159 -90 110 181 204 166 -65
5870 -65 42 -132 -96 97 181 -264 -185 -92 52 -82 -123 73 38 -87 -148 124 169 -26 141 32 38 103 -22 -202
5894 -202 125 -272 -147 -170 -113 -168 76 321 -16 -31 -90 214 298 133 159 -182 -112 -170 201 4 -42 103 -134
5917 -134 -251 -16 268 -59 161 68 129 -89 -176 -5 18 95 -23 84 167 -49 7 40 12 366 20 63 -33 48
5941 48 24 125 173 -75 -266 -168 -25 -134 -12 -84 48 141 62 -61 19 30 50 -210 61 -112 -198 46 -23 142
5965 142 -178 -12 -246 6 -33 63 -263 188 184 -312 -76 -174 239 6 -201 216 152 -164 57 98 16 155 86
5988 86 -64 257 -105 163 99 -95 -347 147 212 -194 -84 22 134 95 74 -25 -254 171 15 58 -155 -96 182
6011 182 -189 -53 -170 125 -93 140 -9 -26 -42 -88 -86 35 -96 144 74 185 -28 -75 133 6 25 190 -91
6034 -91 -9 -50 -100 177 -81 10 -86 131 37 283 105 -127 246 46 36 -325 198 -262 295 65 -118 -188 -141
6057 -141 -75 -65 -67 -47 59 66 -1 -61 34 -53 30 167 -119 -50 73 -10 69 149 -177 -187 -95 -142 -160 319 -159 -22 178
6084 178 -303 168 105 118 9 -86 -9 241 49 -50 -47 183 68 43 190 192 -62 -146 -200 256 13 289 -113 -65
6108 -65 42 63 -17 -28 -156 25 47 286 108 -150 79 117 -8 -100 0 -154 85 -4 -193 -41 -57 -312 -4
6131 -4 109 24 61 98 26 -108 -28 260 -400 144 98 78 -77 63 -50 -197 -206 188 -53 79 -3 -77 154 -35
6155 -35 105 -122 -14 -141 -159 -74 4 -98 166 -200 -269 19 104 -168 248 -13 85 149 46 8 240 -75 -12
6178 -12 -130 171 -60 181 -163 -73 -36 22 -40 85 -44 31 -47 -38 -79 -91 118 -34 231 229 -177 -43 -81 -189 209
6203 209 145 -147 -144 -26 -99 -160 90 186 95 89 138 143 -19 37 55 -31 -152 -110 -43 -143 198 24 128 -175 60 -32
6229 -32 -150 71 -104 81 -242 32 -245 149 -95 -12 35 -142 157 125 59 27 25 -84 125 -121 136 137 -194
6252 -194 -110 57 151 13 25 238 -138 94 262 -102 30 -79 45 -90 -169 -79 -137 287 0 117 -76 34
6274 34 -41 -136 -293 175 199 -26 -26 -230 10 353 54 66 -236 -47 43 -38 -38 -257 145 -87 -89 261 -34 -105 -180
6299 -180 -255 -82 -181 135 -14 196 -125 163 -179 234 38 -1 -57 -98 85 173 57 109 96 101 178 -77 305 25
6323 25 -46 -227 -61 31 35 204 19 -189 -35 148 -125 15 -142 50 129 293 -93 -403 41 3 69 129 153
6346 153 -5 169 -144 -97 -132 -29 124 183 -65 71 186 -176 -167 19 -167 -85 170 -145 298 -359 -302 44
6368 44 28 24 133 54 24 -7 64 -96 7 159 123 93 -79 51 -127 40 -19 125 167 153 111 -17 -16 -172 -67
6393 -67 -239 43 -86 -121 -41 -35 -48 0 46 171 61 76 98 -123 4 35 -86 31 -192 21 243 120 16 18
6417 18 -144 -106 -236 -33 91 141 324 -67 156 -40 18 -22 -181 39 -235 -126 -211 -77 245 -115 53 -308
6439 -308 110 -27 138 -49 -303 -62 -51 -42 2 11 59 -245 -81 -42 2 151 -45 166 60 -60 78 -271 -71
6462 -71 26 -45 83 -129 -54 -121 118 262 47 -8 255 44 254 247 -7 -165 11 -37 -145 -65 -83 191 79 79
6486 79 -75 -16 8 -52 81 172 342 -84 -54 -221 196 -244 57 -201 -123 -91 47 77 -106 391 -343 112 -20
6509 -20 1 -177 124 -157 160 -222 197 86 -96 -105 -162 -171 -173 -359 -88 -88 -41 -16 -38 157 -205 333 -16 186 72
6534 72 -267 37 -43 -98 -21 105 -38 92 -145 58 119 -94 -92 188 55 -206 -22 -179 79 -251 22 -285
6556 -285 134 -204 89 162 -39 -13 -38 -182 116 144 -5 91 131 -21 78 198 -24 -122 23 -148 126 135 14
6579 14 210 95 138 272 162 87 231 -20 83 155 -138 48 -33 -102 16 -84 213 -75 -87 80 168 73 287
6602 287 -51 92 -94 -115 -28 412 117 -71 22 -72 130 166 119 12 300 -141 97 62 90 28 -54 -46 149 44
6626 44 -119 -10 -72 75 53 -39 145 -276 -195 5 -1 309 -78 -385 -45 -41 173 -121 -15 -40 -233 -35 0 244
6650 244 280 55 -67 -56 -73 -94 21 -137 28 12 -101 28 161 -181 163 135 -259 -298 100 257 -256 -234 9
6673 9 -75 74 -152 221 -129 77 139 86 109 15 54 -251 116 -192 -33 290 -48 -15 -5 -77 -11 -199 87 44
6697 44 14 -37 36 67 -107 69 -234 -374 -17 49 -81 192 -14 -73 9 -101 57 92 -131 -28 85 -52 149
6720 149 338 -92 -22 -5 157 23 -303 263 231 163 -170 74 -253 121 -41 -236 -218 166 -83 -97 -10 -204
6742 -204 -54 182 -278 -8 -158 93 176 -30 15 39 14 21 -87 -105 190 194 -79 -95 14 -84 230 73 -214 12
6766 12 -109 12 -84 -42 25 -366 -337 55 -79 62 -218 65 115 61 -28 -152 48 54 -10 -193 -100 26 115 -10
6790 -10 122 -126 -181 -164 -277 182 -52 -204 121 73 303 21 -47 -166 163 -65 90 59 -128 -23 98 64
6812 64 156 111 124 -36 152 -61 -189 -119 0 -146 -80 -20 -24 -84 -64 -19 -93 28 -99 116 -269 -248 -24 -5 44
6837 44 71 -26 -77 -149 136 14 -159 130 -181 -76 80 -45 61 292 -146 -141 -34 13 -115 22 -261 -206 -17
6860 -17 228 105 41 183 -9 32 82 90 -104 -48 -171 -21 -184 77 -172 371 115 193 -29 -16 -90 -231 -26
6883 -26 44 -83 8 259 87 -63 147 6 -73 -217 26 -54 -19 -16 -19 23 213 108 -143 -78 -231 -177 -231 -193 -58
6908 -58 -30 -96 -65 62 -102 43 54 48 144 -53 -70 109 -238 -332 -4 43 140 69 54 99 -9 -11 55 -165 -73 88
6934 88 58 -45 -26 -141 253 18 62 49 -107 187 -185 -162 -391 -155 109 -141 25 121 80 -135 -34 135 -153
6957 -153 -214 135 -114 302 26 132 192 -27 -37 289 84 -4 -68 -208 163 28 4 -26 -88 -67 -40 -10 37 -65
6981 -65 -18 121 -94 168 -17 -45 -150 -194 22 -9 103 -263 102 317 -6 205 130 53 -137 -63 141 192 -180
7004 -180 27 -97 -61 -25 147 -292 -72 -151 -216 216 73 -57 -153 70 153 -128 127 81 -350 -4 -311 80
7026 80 -124 14 39 -135 -53 -226 137 79 -94 172 -112 117 -316 134 -10 166 138 -5 42 202 -235 95
7048 95 288 -102 30 -221 -40 176 131 160 81 -125 45 50 139 260 -75 -62 300 -128 -152 105 226 -47 -175
7071 -175 56 -95 -23 31 -192 -182 -1 84 -31 99 -97 -88 112 -195 163 -26 59 249 -64 -292 54 67 -16
7094 -16 153 -136 227 107 11 134 -8 -287 159 -287 -79 -77 117 -46 -58 182 163 -55 3 65 -190 103 171
7117 171 109 7 3 162 285 -146 -36 164 2 -135 53 -1 -91 40 -44 -243 -18 227 -170 -18 125 -155
7139 -155 -59 -63 30 -71 134 209 74 -169 24 145 -146 -151 -336 -208 115 52 55 -62 88 -167 15 -153 -26
7162 -26 57 166 -16 -324 -287 -239 -57 -58 -94 -17 30 120 186 -113 192 -45 93 141 180 -195 57 -141 -59 63 155
7187 155 -199 -217 -156 51 -11 -2 -36 53 14 62 -97 -32 -21 -53 212 -108 -47 -90 -61 202 -44 338 -110 -441 70
7212 70 137 -158 28 123 -80 167 66 -126 -193 -37 -58 172 29 89 101 -76 -176 -89 37 -84 140 46 56
7235 56 -38 11 40 206 -161 -4 -140 79 -160 121 -84 146 -71 -83 18 357 112 -4 34 249 29 -177
7257 -177 124 -99 -243 -101 79 -218 38 69 -54 58 75 8 5 -97 81 50 163 89 -116 12 -122 -8
7279 -8 -49 -124 66 -101 -17 -149 -85 -42 295 -63 81 -172 -274 13 104 -271 -26 -24 -86 -105 -88 53 -79 228
7303 228 211 -110 54 58 -72 -73 -138 -365 -77 -16 95 115 -124 146 44 183 -186 -54 -11 74 -64 96 28 199
7327 199 -108 123 34 -199 315 -64 211 137 -37 149 31 -124 211 150 -15 83 -120 178 100 -5 -280 -8
7349 -8 90 77 -181 19 12 -46 34 -46 67 -62 54 -56 98 281 -376 163 207 -103 -225 -117 315 183 -123
7372 -123 2 -9 -116 -10 -40 -151 -125 277 162 -57 -49 325 40 164 -132 218 143 -48 125 186 -7 -166
7394 -166 43 314 62 141 -21 160 -13 -44 68 -133 -70 72 256 145 157 -71 51 80 -97 -12 -119 -95
7416 -95 -44 -71 -107 -32 178 142 -16 -1 54 48 -69 -155 -49 55 151 179 17 -58 145 124 179 118 69 193 -222 -57
7442 -57 270 61 122 -126 -186 -111 301 44 -111 72 -49 54 309 222 128 10 239 -82 -220 102 52 308
7464 308 173 156 -131 -107 -66 166 56 195 42 -41 184 -144 56 168 169 41 -147 119 -114 -24 113 -99
7486 -99 23 -30 135 208 -155 -217 173 -56 -154 -115 23 75 29 -62 -25 -112 -4 -59 -32 36 45 -78 41 256 178 57
7512 57 51 -48 1 -383 -10 -114 -311 -75 -98 -56 139 244 -96 -118 254 -6 -205 -110 -103 -261 344 -222 52 124
7536 124 -154 -259 182 -111 42 -58 54 62 -86 -2 -196 -67 76 -197 226 136 45 167 -112 86 141 -71
7558 -71 62 89 -13 -74 -11 17 2 41 57 -199 109 -207 -169 142 -127 5 139 28 32 22 -192 90 202 -69
7582 -69 -109 -65 301 -46 -12 283 135 -1 120 53 -88 101 -2 -284 50 -103 59 144 7 11 -207 -35 221
7605 221 -46 155 289 117 54 -29 170 -276 18 12 -175 -188 -122 79 -120 -119 -178 180 87 -35 17 -36 -41 18 -190
7630 -190 -305 -4 -27 80 -34 28 106 141 175 -23 -119 -5 71 -55 184 -55 72 110 64 106 220 -57 308
7653 308 -28 12 60 -146 -309 126 311 44 64 33 144 150 -111 186 -288 -28 -19 8 125 13 -317 -44 96
7676 96 -249 -283 -89 275 -27 105 112 -88 -86 -102 97 217 15 -104 -94 -23 10 45 -146 -25 64 129 46 -102 40
7701 40 66 285 48 247 -71 42 49 -166 -77 -50 147 -43 40 150 85 39 -214 99 -185 14 34 55 22 -251
7725 -251 -192 -120 -95 -224 11 -109 -93 21 -18 267 -220 -211 112 -98 125 -48 -138 -102 59 -98 190 -2 -3 -4
7749 -4 -22 14 -108 -86 191 6 55 204 172 -21 -153 163 -163 120 -119 -150 -5 -48 -153 -99 -72 184 284 -94
7773 -94 110 -342 45 -20 -178 211 -110 -249 95 -45 39 88 0 -102 21 168 -6 13 -30 -43 -111 270 194
7796 194 -17 -20 -147 -170 -155 84 -178 -257 -120 59 -170 25 319 172 30 152 103 215 173 138 -198 -165 284
7819 284 -77 -44 -56 -33 -165 138 51 154 -204 -6 -237 -13 -280 -36 32 112 164 -90 169 70 -42 -175 -38
7842 -38 -101 57 114 -151 118 390 1 -111 -60 279 131 75 -27 8 45 -6 244 127 -87 17 79 46 130 -167
7866 -167 -221 36 149 42 96 22 -60 190 219 124 -267 -149 35 162 -151 28 -74 -207 -6 -70 -29 -54 -61 -4
7890 -4 -35 -49 -141 36 -71 -302 -48 90 20 79 -78 -16 -84 57 14 51 54 -297 -95 -58 -196 88 -130 -175 110
7915 110 70 -73 67 253 -137 -218 72 102 -111 271 162 10 167 10 314 -62 117 352 -42 -132 -24
7936 -24 66 -71 -79 -42 58 36 -199 189 22 -82 -209 280 4 -176 -141 -136 238 -31 -21 25 1 -155 -71 282
7960 282 73 57 164 -156 151 170 -2 24 -6 -10 206 80 114 54 -133 12 -271 64 -78 -126 -255 -170 -33
7983 -33 -112 -165 115 -60 -155 25 56 86 37 -170 -49 -24 0 45 -143 74 156 45 -112 91 -16 30 -90 -191
8007 -191 210 -278 61 294 -169 -78 -211 -45 8 158 -35 -306 -56 -122 -58 -72 142 -295 -48 -51 124 88 223
8030 223 -277 -118 -85 235 -46 -50 -118 147 144 -60 -185 -248 -120 -212 -191 168 -272 193 -91 52 -2 285 -56
8053 -56 98 256 -15 -135 -100 -31 236 -115 -105 12 -158 212 -115 61 -190 131 -150 -360 -23 -66 -123 117
8075 117 309 140 -28 49 199 -100 170 -23 -142 -69 182 2 -30 -78 -56 -104 66 226 -455 38 -196 -24
8097 -24 -319 -73 -114 -109 37 -178 344 -119 -138 -100 -109 -110 115 297 -231 -22 16 38 -116 148 -220 -63 53 48 -191
8122 -191 -52 110 65 -22 158 -162 87 -42 -5 1 -111 151 -37 62 -50 -23 -35 -180 163 -22 7 -69 -176
8145 -176 -125 -200 -46 87 179 100 53 -25 24 -63 -171 -231 36 -20 -22 217 123 137 64 158 51 -38 96 53 240 203
8171 203 -13 -105 38 -237 88 -11 168 -62 145 48 6 -233 -161 13 -66 109 72 -119 -105 -114
8191a14
##END NTUPLES=NMR FID
##END=
