##TITLE=1H_CA-8565
 DMSO, 8 sc, 
 8.2.2019
##JCAMPDX= 6.0         $$ Bruker NMR JCAMP-DX V2.0
##DATA TYPE= NMR FID
##DATA CLASS= NTUPLES
##ORIGIN= UXNMR, Bruker Analytische Messtechnik GmbH
##OWNER= root
$$ XWIN-NMR		Version 3.5
$$ Fri Feb  8 17:29:29 2019 Russian Standard Time (UT+4h)  she@DPX200
##.OBSERVE FREQUENCY= 200.1313
##.OBSERVE NUCLEUS= ^1H
##.DELAY= (6, 6)
##.ACQUISITION MODE= SIMULTANEOUS
##.ACQUISITION SCHEME= undefined
##.AVERAGES= 8
##.DIGITISER RES= 18
##SPECTROMETER/DATA SYSTEM= spect
##.PULSE SEQUENCE= zg30
##.SOLVENT NAME= CDCl3
##.SHIFT REFERENCE= (INTERNAL, CDCl3, 0, 15.7039)
##AUDIT TRAIL= $$ (NUMBER, WHEN, WHO, WHERE, WHAT)
$$ ##TITLE= Audit trail, XWIN-NMR		Version 3.5
$$ ##JCAMPDX= 5.01
$$ ##ORIGIN= Bruker BioSpin GmbH
$$ ##OWNER= she
$$ F:/spectra/data/she/nmr/H-F/1/audita.txt
$$ ##AUDIT TRAIL=  $$ (NUMBER, WHEN, WHO, WHERE, WHAT)
(   1,<2019-02-08 17:27:44.85 +0400>,<she>,<DPX200>,
      <created by zg, POWCHK disabled, PULCHK disabled
       configuration hash MD5:
       00 E9 B6 7A A2 85 ED C7 34 08 36 98 17 FE 4E 26
       data hash MD5: 16K
       22 E3 63 A4 8D 55 C5 51 6D DB 67 32 27 58 05 F5>)
$$ ##END=
$$ 
$$ hash MD5
$$ 50 3A 30 49 D2 48 57 67 95 69 F5 54 63 7E 3B A6
##$RELAX= 
##$RELAX= 
##$RELAX= 
##$RELAX= 
##$RELAX= 
##$RELAX= 
$$ Bruker specific parameters
$$ --------------------------
##$DU= <F:/spectra>
##$EXPNO= 1
##$NAME= <H-F>
##$PROCNO= 1
##$TYPE= <nmr>
##$USER= <she>
##$AMP= (0..31)
100 100 100 100 100 100 100 100 100 100 100 100 100 100 100 100 100 100 
100 100 100 100 100 100 100 100 100 100 100 100 100 100 
##$AQSEQ= 0
##$AQ_mod= 1
##$AUNM= <au_zg>
##$AUTOPOS= <>
##$BF1= 200.13
##$BF2= 200.13
##$BF3= 200.13
##$BF4= 200.13
##$BF5= 200.13
##$BF6= 200.13
##$BF7= 200.13
##$BF8= 200.13
##$BYTORDA= 1
##$CFDGTYP= 0
##$CFRGTYP= 5
##$CHEMSTR= <none>
##$CNST= (0..31)
1 1 145 1 1 1 1 1 1 1 1 1 1 1 1 1 1 1 1 1 1 1 1 1 1 1 1 1 1 1 1 1 
##$CPDPRG= <>
##$CPDPRG1= <>
##$CPDPRG2= <>
##$CPDPRG3= <>
##$CPDPRG4= <mlev>
##$CPDPRG5= <mlev>
##$CPDPRG6= <mlev>
##$CPDPRG7= <mlev>
##$CPDPRG8= <mlev>
##$CPDPRGB= <>
##$CPDPRGT= <>
##$D= (0..31)
0 1.2 0 0 0 0 0 0 0 0 0 0.03 0 0 0 0 0 0 0 0 0 0 0 0 0 0 0 0 0 0 0 0 
##$DATE= 1549632464
##$DBL= (0..7)
120 120 120 120 120 120 120 120 
##$DBP= (0..7)
150 150 150 150 150 150 150 150 
##$DBP07= 0
##$DBPNAM0= <>
##$DBPNAM1= <>
##$DBPNAM2= <>
##$DBPNAM3= <>
##$DBPNAM4= <>
##$DBPNAM5= <>
##$DBPNAM6= <>
##$DBPNAM7= <>
##$DBPOAL= (0..7)
0.5 0.5 0.5 0.5 0.5 0.5 0.5 0.5 
##$DBPOFFS= (0..7)
0 0 0 0 0 0 0 0 
##$DE= 6
##$DECBNUC= <off>
##$DECIM= 32
##$DECNUC= <off>
##$DECSTAT= 4
##$DIGMOD= 1
##$DIGTYP= 9
##$DL= (0..7)
0 120 120 120 120 120 120 120 
##$DP= (0..7)
150 150 150 150 150 150 150 150 
##$DP07= 0
##$DPNAME0= <>
##$DPNAME1= <>
##$DPNAME2= <>
##$DPNAME3= <>
##$DPNAME4= <>
##$DPNAME5= <>
##$DPNAME6= <>
##$DPNAME7= <>
##$DPOAL= (0..7)
0.5 0.5 0.5 0.5 0.5 0.5 0.5 0.5 
##$DPOFFS= (0..7)
0 0 0 0 0 0 0 0 
##$DQDMODE= 0
##$DR= 18
##$DS= 0
##$DSLIST= <SSSSSSSSSSSSSSS>
##$DSPFIRM= 0
$$ [...]
##$SUBNAM2= <"">
##$SUBNAM3= <"">
##$SUBNAM4= <"">
##$SUBNAM5= <"">
##$SUBNAM6= <"">
##$SUBNAM7= <"">
##$SUBNAM8= <"">
##$SUBNAM9= <"">
##$SW= 20.0189088683792
##$SWIBOX= (0..15)
0 0 2 0 0 0 0 0 0 0 0 0 0 0 0 0 
##$SW_h= 4006.41025641026
##$TD= 16384
##$TD0= 1
##$TE= 0
##$TE2= 300
##$TE3= 300
##$TEG= 300
##$TL= (0..7)
0 120 120 120 120 120 120 120 
##$TP= (0..7)
150 150 150 150 150 150 150 150 
##$TP07= 0
##$TPNAME0= <>
##$TPNAME1= <>
##$TPNAME2= <>
##$TPNAME3= <>
##$TPNAME4= <>
##$TPNAME5= <>
##$TPNAME6= <>
##$TPNAME7= <>
##$TPOAL= (0..7)
0.5 0.5 0.5 0.5 0.5 0.5 0.5 0.5 
##$TPOFFS= (0..7)
0 0 0 0 0 0 0 0 
##$TUNHIN= 0
##$TUNHOUT= 0
##$TUNXOUT= 0
##$USERA1= <user>
##$USERA2= <user>
##$USERA3= <user>
##$USERA4= <user>
##$USERA5= <user>
##$V9= 5
##$VALIST= <valist>
##$VCLIST= <CCCCCCCCCCCCCCC>
##$VD= 0
##$VDLIST= <DDDDDDDDDDDDDDD>
##$VPLIST= <PPPPPPPPPPPPPPP>
##$VTLIST= <TTTTTTTTTTTTTTT>
##$WBST= 1024
##$WBSW= 4
##$XGAIN= (0..3)
0 0 0 0 
##$XL= 0
##$YL= 0
##$YMAX_a= 303634
##$YMIN_a= -499923
##$ZGOPTNS= <>
##$ZL1= 120
##$ZL2= 120
##$ZL3= 120
##$ZL4= 120
##$ABSF1= 10
##$ABSF2= 0
##$ABSG= 5
##$ABSL= 3
##$ALPHA= 0
##$AQORDER= 0
##$ASSFAC= 0
##$ASSFACI= 0
##$ASSFACX= 0
##$ASSWID= 0
##$AUNMP= <proc_1d>
##$AZFE= 0.1
##$AZFW= 0.1
##$BCFW= 1
##$BC_mod= 2
##$BYTORDP= 1
##$COROFFS= 0
##$CY= 11.3945322036743
##$DATMOD= 1
##$DC= 2
##$DFILT= <>
##$DTYPP= 0
##$F1P= 18.9103706918063
##$F2P= -1.10871071338519
##$FCOR= 0.5
##$FTSIZE= 0
##$FT_mod= 4
##$GAMMA= 1
##$GB= 0.15
##$INTBC= 1
##$INTSCL= 1
##$ISEN= 128
##$LB= 0.24
##$LEV0= 0
##$LPBIN= 0
##$MAXI= 10000
##$MC2= 0
##$MEAN= 0
##$ME_mod= 0
##$MI= 1.114404
##$NCOEF= 0
##$NC_proc= 0
##$NLEV= 6
##$NOISF1= 3.799351
##$NOISF2= 2.8
##$NSP= 1
##$NTH_PI= 0
##$NZP= 0
##$OFFSET= 15.70392
##$PC= 1
##$PHC0= -8683.312
##$PHC1= 14.80018
##$PH_mod= 1
##$PKNL= yes
##$PPARMOD= 0
##$PSCAL= 0
##$PSIGN= 0
##$REVERSE= no
##$SF= 200.130013532006
##$SI= 16384
##$SIGF1= 3
##$SIGF2= 2
##$SINO= 400
##$SIOLD= 16384
##$SREGLST= <1H.CDCl3>
##$SSB= 0
##$STSI= 0
##$STSR= 0
##$SW_p= 3612.71676300578
##$SYMM= 0
##$S_DEV= 0
##$TDeff= 0
##$TDoff= 0
##$TI= <>
##$TILT= no
##$TM1= 0
##$TM2= 0
##$TOPLEV= 0
##$USERP1= <user>
##$USERP2= <user>
##$USERP3= <user>
##$USERP4= <user>
##$USERP5= <user>
##$WDW= 1
##$XDIM= 8192
##$YMAX_p= 0
##$YMIN_p= 0
$$ End of Bruker specific parameters
$$ ---------------------------------
##NTUPLES= NMR FID
##VAR_NAME=  TIME,          FID/REAL,        FID/IMAG
##SYMBOL=    X,             R,               I
##VAR_TYPE=  INDEPENDENT,   DEPENDENT,       DEPENDENT
##VAR_FORM=  AFFN,          ASDF,            ASDF
##VAR_DIM=   8192,          8192,            8192
##UNITS=     SECONDS,       ARBITRARY UNITS, ARBITRARY UNITS
##FACTOR=    0.0002496,     1,               1
##FIRST=     0,             0,               0
##LAST=      2.0444736,     0,               0
##MIN=       0,             -499923,         0
##MAX=       2.0444736,     303634,          0
$$ Real data points
##PAGE= N=1
##DATA TABLE= (X++(R..R)), XYDATA
0@%%%%%%%%%%qJ6j6J6k0K8l3M1n6O6p6R2j12J34j58J84k13K47k86L29l77M32m91
33b61N58o32P12p98Q96j002J117j247J388j541J707j890K091k308K546k808L090
50A618l405L754m134M560n037N570o175O867p667Q607r722J1078j2768J4939j7854
65i769K1990k8375L9653o5516K37820M8272l77347n0899J10897K21332M0853j09637
77G9274k10822j17789j2467R9216J07248R2790K4254j9375n7166k4546K4086Q0842
89F5545Q2080N2860j5800p1499j09828q9344k6781N5262P4167J0544r9448j45901
101b18143q4772M0679J14120R1334J5326k3883j0913J3712Q783K209L6474R7799
113H2725J01054J860j34056j75552o8132R8035J66962P3064j01313k05527j53870
$$ plain form
0 0 0 0 0 0 0 0 0 0 0 0 -8 8 -8 8 -12 16 -17 24 -32 34 -42 50 -62 72 -86 98 -115 132 -154 175 -202 230 -261
33 -261 297 -335 377 -421 475 -527 590 -657 731 -810 897 -993 1098 -1210 1336 -1472 1618
50 1618 -1787 1967 -2167 2393 -2644 2926 -3249 3618 -4049 4558 -5164 5914 -6854 8085 -9769
65 -9769 12221 -16154 23499 -42017 195803 244075 -133272 -184171 -73274 148058 188911 79274
77 79274 -131548 -249337 -261804 -162588 -55340 37450 61704 42329 -14837 -39383 -15297 65545
89 65545 147625 200485 184685 113186 3358 -85986 -112767 -57505 16662 27206 -72242 -218143
101 -218143 -302915 -262236 -148116 -56782 -41456 -65339 -76252 -62540 -53757 -51548 -15074 82725
113 82725 183779 185639 51583 -123969 -192101 -94066 72896 145960 44647 -160880 -314750
124c14750Q015J54284J80301P8833o7464j44298q8981N4255J68946J61836M1895
135B32872q3289j14332m8922L1848N6448K5038j2131k4305l2537n6698p2992l8681
147a37681M1733J00480P3121k0891q9454o2761L1806J05349R6191K9081k8438
158A38536l8987k2780j0261n547M267J8914J8076j4745o2155q4562n9451L316
170a15379O5678Q4387M0068m5150j05962q0764L3540J48986J58379L7717j14955
181A06545j63745o3252Q9024J50217P1440o7127j40792j01559q401N1729M9689
192b6232J4450j4182k7433l2255k7026P02M5006P0968N4037L896l9956m4588j1934
205c4547K8378M8206L5829m467m8136o6791m3795M762L9473L0824q884l3917k2982
$$ plain form
124 -314750 -306735 -152451 27850 106683 39219 -105079 -194060 -139805 29141 190977 232872
135 232872 149583 35251 -13671 18177 74625 99663 87532 63227 30690 -26008 -99000 -137681
147 -137681 -95948 4532 77653 56762 -32692 -95453 -63647 41702 137893 166974 138536
158 138536 99549 76769 66508 60961 65228 84142 102218 87473 25318 -59244 -118695 -115379
170 -115379 -49701 34686 74754 29604 -76358 -157122 -123582 25404 183783 221500 106545
181 106545 -57200 -120452 -31428 118789 190229 123102 -17690 -119249 -127650 -75921 -26232
192 -26232 -11782 -25964 -53397 -85652 -112678 -111976 -66970 3998 58035 61931 21975 -22613 -34547
205 -34547 -6169 42037 77866 73399 25263 -41528 -85323 -80561 -41088 -10264 -19148 -53065 -76047
218g6047M309J3059K317N171L7106O5474M1653l0344q1815n0495M5269J12718
230H8375P7330l5981j24939j10030r803Q3984R4620K2977o2628r5543n5518K1704
242a05452P8404P8458K8539l1728n5482k6140K5430N2693L9230M021k0402k3131
254D4440k0456k2954j8371M512K8308K3658j7050n6770m9266N475N3850N0658
266B6034N150l0553k2570J2465K9749J5089p041o639J3968K2365o59l6297m7207
279b6146j9749K3027M3752K0979k7989o3220n1976K334O0598P4907K8866m2310
291B3073p4698l6023M1914Q8645N8822j7587o9139n4990K156M2211L3456l513
303C4327k7499k5092j3553q472n724N566K1969K2495J476k1164k1566L647L0376
$$ plain form
218 -76047 -71738 -58679 -56362 -51191 -14085 51389 93042 62698 -19117 -69612 -24343 88375
230 88375 165705 129724 4785 -105245 -115048 -31064 63556 86533 23905 -71638 -127156 -105452
242 -105452 -27048 51410 79949 48221 -7261 -33401 -7971 44722 83952 87973 67571 44440
254 44440 23984 1030 -17341 -12829 15479 39137 22087 -34683 -83949 -78474 -24624 26034
266 26034 31184 631 -21939 -9474 20275 35364 28323 21684 35652 58017 57358 21061 -26146
279 -26146 -45895 -22868 20884 41863 13874 -49346 -101322 -98988 -38390 36517 65383 23073
291 23073 -51625 -87648 -45734 42911 101733 84146 15007 -39983 -37827 4384 37840 34327
303 34327 6828 -18264 -31817 -40289 -46013 -40447 -18478 4017 5493 -15671 -37237 -33590 -3214
316c214L3894J3132j0792j9619j0812L567J2038P044n552j5482j4854l402N644
329h408J099j2967j7880j060K5405L2323N850l0855l6044K654N0189N7016J0076
342G7398m6219n7560j4520L9111N2309J4228l5652n2059k7711J0195L0496K2730
354A2746o83j9181k1281q364J1741K3871J9456M988q115r760j294N388N366L355
368A8233K579n38q832j6923j4054J990J4862J0069r990k3225j1701J4448K7752
381D670J2334j4889k2782p22K7278L0580L985k6738k8967j506K6050K6198j97
394C5294k8713l3141j1099J6301K7360J3403j3476k9038j9006R589L1355K6674
406B5503O15k3632j9964L809K4023J9893j426j7052j4327r29O054K639m200m727
$$ plain form
316 -3214 30680 43812 33020 13401 2589 6156 18194 25238 19686 4204 -10650 -14052 -8408
329 -8408 -7309 -20276 -38156 -39216 -13811 18512 24362 -6493 -42537 -39883 10306 67322 77398
342 77398 31179 -26381 -40901 -1790 50519 64747 29095 -22964 -50675 -40480 -9984 12746
354 12746 12063 -7118 -28399 -36763 -25022 -1151 18305 23293 15178 5418 4124 9512 14878 18233
368 18233 20812 20274 11442 -5481 -19535 -17545 -2683 7386 -2604 -25829 -37530 -23082 4670
381 4670 17004 2115 -20667 -21389 5889 36469 40454 13716 -15251 -16757 9293 35491 35294
394 35294 6581 -26560 -37659 -21358 6002 19405 5929 -23109 -42115 -32526 -1171 25503
406 25503 26118 2486 -17478 -13669 10354 30247 28821 11769 -2558 -3487 2567 5206 1006 -3721
420c721j170j773o485o923J935J2750J2269p46j2974j0246O854K0993J6720j495
434B5988j8449j7007k19J6322J7510J207j8300k4834j1545J0982K3083J3405j0619
447G524k6205j6669J0102K9307K1180n293k3409j4713R376K3193J4030p402j8700
460B321j0664M447J0880M682o618j1412o944P10N248N208J203k516m477k159K973
475g118P510Q719L707l453p331n265J194P428Q416K511p029j5251j3050n06J4598
490d920J7565L182j7201k4378q031J7917K8975J4152j2352k5270j3068J0775K3717
503A1063J5510m741j8109j5284k52J0407R924L99q445j0305l147M193O850J881
517e6m094l915J573P454O139J97n440m658J995P198O237k13o163o848l796l13
$$ plain form
420 -3721 -4891 -6664 -13149 -20072 -18137 -5387 6882 6136 -6838 -17084 -10230 10763 27483 25988
434 25988 7539 -9468 -9687 6635 24145 25352 7052 -17782 -29327 -18345 4738 18143 7524
447 7524 -18681 -35350 -25248 4059 25239 19946 -3463 -18176 -8800 14393 28423 21021 2321
460 2321 -8343 -3896 6984 11666 5048 -6364 -13308 -12598 -7350 -2142 -939 -3455 -7932 -10091 -7118
475 -7118 392 9111 12818 9365 2034 -3231 -2037 5391 13807 16318 9289 -5962 -19012 -19518 -4920
490 -4920 12645 15827 -1374 -25752 -33783 -15866 13109 27261 14909 -10361 -23429 -12654 11063
503 11063 26573 21832 3723 -11561 -11813 -1406 8518 8917 472 -9833 -12980 -8787 -1937 -56
517 -56 -4150 -8065 -6492 962 7101 7298 1858 -2800 -805 6393 12630 12417 6254 -594 -4390 -4703
533d703K767L795M015n18p595j1165n264Q052J7614J2210m052j7632j5554J856
547a6174J9309K0469N091j4323k1759j1576P201J9280J3850l151j8383j8019l526
560b1711J2462J5950N878p747j2195n304N428R324N006j102l946r84J828J259
574D146k137k916j614K046K515jk916m401l219p47K154L866M866J592l486o729
590f981m549L511R935R591K325q204j2544p592M103J3773J2290m37j4196j7915
604a6890o883J0403J9072J1599n802j7714j3931J939J5480J6165L985q891j2845
617d313n844M926R819O750q73n909o766k069J384L050J602k42j317j323K45N34
633c46j62n58O22K250L600J782j143l642l373n71L336M605L423j639o976q708
$$ plain form
533 -4703 -1936 1859 5874 5356 -2239 -13404 -18668 -10616 6998 19208 15156 -2476 -18030 -16174
547 -16174 3135 23604 28695 14372 -7387 -18963 -11762 7518 21368 18217 -166 -18185 -21711
560 -21711 -9249 6701 12579 4832 -7363 -12667 -7239 2085 7091 5989 2043 1059 2887 4146
574 4146 2009 -907 -2521 -475 2040 2039 -877 -5278 -8497 -9244 -7090 -3224 1642 3234 -252 -6981
590 -6981 -11530 -8019 1916 11507 13832 5628 -6916 -14508 -10405 3368 15658 15221 1025 -16890
604 -16890 -23773 -13370 5702 17301 11499 -6215 -20146 -18207 -2727 13438 17423 8532 -4313
617 -4313 -10157 -5231 4588 11338 10465 4556 -2210 -4279 -2895 155 1757 1515 198 -1125 -880 -346
633 -346 -508 -1066 -444 1806 5406 7188 6045 2403 -970 -1541 1795 6400 9823 8184 1208 -7500
649g500l202N276J0986O562l732j1827j1214K96J1677J4138N357q115j4357q548
663a4203L854J3553J1460p2j0736j2797n042N962J0706O099k676q747p752p42
677a1133N394O501L109k330l858k453J217K441J953M29p07o19Q0l01Mj185j707
694c165j148J460K835J944j518m266m261L49N691P028L087l916p706n493K614
709f465Q815Q598R59p859j0851m276N163J0826O580j952r998r298j541P732J0390
724F823M267m398r042n183J930P411O889N70m420n544k424J647M325K418l22l669
740A278l318l90K304J926K61j965j934L3K224K358Q6k231k741q3K720M147J258
757E933l095n574l265K254N661M203p74o266o638j468M816P271M067l789p022
$$ plain form
649 -7500 -10702 -5426 5560 12122 8390 -3437 -14651 -14355 -2678 11460 16817 8702 -5655 -14203
663 -14203 -10349 3204 14664 14592 3856 -8941 -13983 -8021 2685 8784 6108 -2639 -10391 -11133
677 -11133 -5739 762 3871 1541 -2317 -4770 -3553 -1112 841 1270 563 -56 24 -277 -273 -1458 -3165
694 -3165 -4313 -2853 -18 1926 408 -3858 -8119 -7770 -2079 4949 8036 4120 -3586 -9079 -6465
709 -6465 2350 10948 11907 4048 -6803 -11079 -5916 4910 11490 9538 -460 -9758 -11299 -3567 6823
724 6823 11090 6692 -2350 -7533 -5603 1808 8697 9267 4847 -697 -3121 -1474 2851 5269 4947 1278
740 1278 -2040 -2430 -126 1800 2061 96 -1838 -1805 419 2777 2863 632 -2109 -2192 528 4675 5933
757 5933 2838 -2736 -6001 -3747 1914 6117 5343 -923 -7561 -9029 -4213 3058 7125 3336 -3686
772c686n346J016P307P103P30m852p209k726K971O252M347j068n548n327p84L472
788c348N421J468k415m367k640J656L834L035j04k367k909j98K822L110P06k166
804A538l395q70K105L066J152k009l729j955J390L364L564k43l926l940m40L657
820f71N104J767k362m674l571J935M692M110l03m353n064j159L131M497K517k435
836C161m848k826R33M079L829J23l083l785j526K494M144J912j318l822k887N67
852b853L236K772J51l118k985j241J933L401J837j392l715k313P99L629L073o2
868C152l090l174n98K053L614J454j330m077k189Q47L675K516q67k675l224j98
884d111K517L533J016j828l253j670J636L508K080l81l289k739J30K485L039Q70
$$ plain form
772 -3686 -9032 -8016 -709 6394 7124 2272 -4937 -7663 -4692 1560 5907 4839 -709 -6036 -6820 -3348
788 -3348 2073 3541 1126 -3241 -5881 -4225 -391 2644 2540 173 -2736 -2934 -112 2998 3704 1538
804 1538 -1857 -2727 -622 2444 3596 1587 -2142 -4097 -2707 657 4221 3978 52 -3888 -4328 -671
820 -671 4433 6200 3838 -836 -4407 -2472 2220 6330 6027 1674 -3390 -4549 -1418 3079 5596 3161
836 3161 -1687 -4513 -3580 499 4328 4451 1368 -2417 -3943 -1449 2695 4607 3289 -533 -3420 -2853
852 -2853 383 3155 3306 188 -2797 -4038 -2105 1296 3133 1741 -1974 -4287 -3488 141 3214 3152
868 3152 62 -3112 -3710 -1657 1957 3411 2081 -1996 -4185 -3338 337 2853 1986 -689 -3913 -4111
884 -4111 -1594 1939 2955 1127 -2126 -3796 -2160 1348 3428 3047 -242 -2981 -2851 -366 2673 3543
900C543k532l223j349J361L235K417p68l008l217J71K838L397J570k338l712j383
916b998P90L451K560k89k626l443o96J963L101J406j095l245j968Q37K926J863
932B537j45k098k336n2J754K390N93j484k368q10P47K546J143q98k425j508M30
949a984K067K020O7k471j964l43J316K765J677j657k759j852R30K329K499L39
965B979k430k538j563J561L110K013q55k795k764k59K663L052Q32j538l033j370
981b935P47K828J936n8k205k170o09J953K066M74j304j838q58P74J983Q78q49
998H13j719p78O56J593J135l68j474j562K01J787J394J71r64j797j202R20J806
1015F12J728m35k053j890l20J248K640P85p48k515j545L82K041K208L97j267k851
$$ plain form
900 3543 1011 -2212 -3561 -2200 1035 3452 2684 -324 -3541 -3370 -532 2865 4435 2097 -1615 -2998
916 -2998 -2208 1243 3803 3514 888 -2555 -3251 -1288 1813 3219 2124 -1121 -3089 -2252 674 2537
932 2537 2392 294 -2042 -2094 -340 2050 2643 1159 -1209 -2019 -1272 1274 2417 1519 -906 -2414 -1984
949 -1984 83 2103 2170 -301 -2265 -2608 -1292 1473 3150 1493 -1266 -3118 -2188 141 2640 2979
965 2979 549 -1989 -3552 -1991 1119 3132 2277 -518 -3282 -3541 -878 2174 3006 1468 -1565 -2935
981 -2935 -2188 640 2576 2518 313 -1857 -2466 -513 1553 2027 723 -1115 -1973 -1199 784 1662 813
998 813 -906 -1684 -1028 565 1700 1332 -142 -1704 -1503 284 1678 1849 885 -912 -2114 -1194 612
1015 612 2340 1905 -148 -2038 -2358 -1110 1530 2315 1567 -948 -2493 -2111 -70 2138 2535 1268 -1583
1032a583r81J184K598J266o27k319j702J8K000J766K50j634j536o90J321J996
1048A327M65j001j609q32R39J238J106o04j267j288N67R28J127K36j188j218m14
1065a488Q12J368O15m75j115j002K4J062J396O61p28j581j335L40J669J792j78
1082A837j524j845n78J299J734R57q92j925r79N90J542J514J1j746j597K02J194
1099b06J805pj704j061l27J215J259N59q16j373o83M39J290J101j67j431q17l18
1117a242R39N46P96j88r35r16L8N56R34P44m34r91j028L63Q46P61M85j170j349
1136a245K7N40J267P98o65j285p85N86J309R63p44j131j113L48J506J285p12j275
1154c26j313K76J513J477l77j248j243m31J143J380M92l79j324o12k81J113P74
$$ plain form
1032 -1583 -2564 -1380 1218 2484 1857 -462 -2164 -2146 -146 1620 1870 236 -1300 -1990 -669 1327
1048 1327 1792 791 -818 -1650 -711 527 1633 1029 -238 -1526 -959 -31 1096 1332 144 -1074 -1488
1065 -1488 -676 692 1307 832 -283 -1285 -1261 -199 1197 1858 1130 -451 -1786 -1446 223 2015 1837
1082 1837 313 -1532 -2110 -811 923 1880 988 -937 -1916 -1326 216 1730 1741 -5 -1602 -1400 -206
1099 -206 1599 1592 -112 -1173 -1500 -285 974 1533 717 -656 -1339 -900 390 1491 1324 -107 -924 -1242
1117 -1242 -303 243 1039 851 -84 -1000 -962 -406 528 1272 838 -153 -1181 -818 28 789 1274 104 -1245
1136 -1245 -1218 -678 589 1387 722 -563 -1348 -762 547 1510 766 -365 -1478 -1130 376 1661 949 -326
1154 -326 -1639 -1363 150 1627 1250 2 -1241 -1672 -529 851 1343 964 -360 -972 -1253 -140 634
1171F34N42n47j005n66K1O74Q69L89k39j011q93jJ127R50M23q23j233n86N86R47
1191B58O17j78r14q74L11J036N24o18m20n69M65O99Q72q56j298l89P03J389O55
1210A413n39j199j232L85J225J496k53q65j585n20J113J113N85j97j224o56N1
1227h89Q2O43J180J26n79q91q00K40R29J191R8o44j407r45Q16J342P29k02j299
1246b80q78J60O33Q41J2k77l94k25P49K5l36q61M8P14J254l31p53j174m33J292
1266b14J039Q39j073j182j158L14J572J227K00j010j221o87M40P13J139K83m43
1283G78o76j066m06P50J250P54j93j300j298K9P60J495Q56l14j904j166K48J331
1301g2J001J71p20j171p0O23M53K58m97j05O71L1k42j066n30K09J473R22k93r96
$$ plain form
1171 634 1176 629 -376 -942 -921 -247 622 1011 772 -239 -1132 -1133 -6 944 1367 544 -689 -1275 -689 258
1191 258 875 697 -217 -1091 -780 256 780 162 -258 -827 -362 337 1209 353 -945 -1334 -631 758 1413
1210 1413 874 -325 -1557 -1172 53 1549 1296 431 -1154 -1674 -561 552 1137 940 -284 -940 -889
1227 -889 -807 -164 1016 1142 563 -328 -1128 -888 41 1232 1330 686 -721 -1666 -850 492 1221 1019 -280
1246 -280 -1158 -998 -365 476 488 211 -183 -408 341 366 30 -831 -783 -69 1185 854 101 -1073 -1506 -214
1266 -214 825 1664 591 -591 -1749 -1435 137 1364 1564 554 -667 -1354 -914 -201 938 1221 778
1283 778 102 -964 -1370 -620 630 1384 1191 -109 -1407 -1378 -618 877 1733 1419 -485 -1651 -1403 -72
1301 -72 929 1100 380 -791 -861 -238 215 473 -24 -129 542 573 331 -735 -1265 -1056 417 1339 1046 50
1321E0j305l76J339J483L47l52j501j157K46Q39J476J54l37r87q01m19O53Q91
1339B43R75m2m54j522o55J76J050J690L46j288j654q84Q41J756J110k88j432j197
1357a229j02R67J016P9k37q17Q7K4J94l08j07K74O76L31k43j456o16O14J498J040
1377A685k28j180j455n98J178J519N12k01j141j070pL46P93O03N1Q2j229p11k56
1396a307Q28J201Q73k88j662j439j44J646J577P34j043j840p11J06J516J283O2
1413A392r04j130k53N35O41O2M7k86K78J1o22m01l98O09J351N85r86j271r61K48
1433a453J643J299J39j280j449m88P30J186N51J5l11q99o92O9L55R27O45L48j021
1452C14j288p72O74J606J386j53j605j826m65J039K041J099o67j700j352M08J162
$$ plain form
1321 50 -1255 -1631 -292 1191 1538 1186 -315 -1472 -1226 -387 1089 1243 906 -81 -882 -1301 -648 243
1339 243 1218 1176 722 -800 -1455 -1279 -229 1461 1807 519 -1135 -2019 -1178 578 1688 1400 -32 -1229
1357 -1229 -1331 -364 652 731 494 -323 -236 -212 -18 -326 -433 -159 517 848 605 -851 -1467 -853 645 1685
1377 1685 1457 277 -1178 -1776 -598 921 1433 1232 91 -979 -986 -640 153 756 807 889 -340 -1051 -1307
1396 -1307 -479 722 1595 1307 -355 -1794 -1938 -292 1285 2019 976 -864 -1575 -1469 47 1330 1392
1413 1392 488 -642 -895 -360 281 343 390 104 382 393 -229 -630 -1028 -419 932 1517 531 -740 -1701 -1453
1433 -1453 190 1489 1628 348 -1101 -1589 -859 327 878 893 582 -317 -1009 -940 -585 342 987 1335 314
1452 314 -974 -1746 -1072 534 1920 1767 162 -1664 -2129 -1090 951 2050 1383 -317 -1669 -1261 -99
1469i9J008M58j046n86k04K89j41L7J10M27N32J03r26j110N1P98J473M10n81j412
1489d09q94k32J469J212L37p31j184q85M42P90P29L32l10j36p50p12k57R77J360
1508A148L27m75j572j352L20J163K066K71j237j887p60Q29J577J119k31j563r50
1525a207L64O29P60J0l72k01K6J04l90j96p0M19R57L63o27j480n44O47J124J277
1545A593l62j526r61Q7R65R55J56j70q18l43j7r9J94N97M28K55p38q90o76O12
1565g58J095J384j85j678j646K49R98J814O91j326j407p74O96J175P21k24n05
1582C20o47r5K33K60n0j87N70J3J41o80q36J36N56J238M52o76j277n92J74J150
1602B03P65p6o65m81p71P07P59M8J85m97J77n40m96n3K86J108M26l46j051j309
$$ plain form
1469 -99 909 1367 321 -265 -469 -180 -321 -284 -174 253 785 888 -38 -1148 -1097 -299 1174 1584 1003 -409
1489 -409 -1303 -1535 -66 1146 1483 752 -432 -1317 -875 -85 644 976 666 530 -220 -932 -1189 -212 1148
1508 1148 1475 1000 -572 -1924 -1604 -441 1625 1896 659 -1228 -1988 -1159 418 1537 1306 -257 -1207
1525 -1207 -843 -214 546 556 184 -17 9 113 -277 -473 -543 -124 833 1196 569 -911 -1455 -808 316 1593
1545 1593 1231 -295 -1256 -1169 -204 751 907 737 -81 -424 -441 -540 -346 251 679 934 196 -694 -1370 -758
1565 -758 337 1721 1536 -142 -1788 -1539 -541 1273 1964 638 -769 -1543 -847 328 1049 825 320
1582 320 -327 -422 -189 71 21 -166 404 417 558 -122 -958 -822 -266 972 1424 748 -529 -1121 -947 203
1602 203 968 892 227 -254 -1025 -318 441 489 674 177 354 -186 -682 -735 -449 659 1085 739 -312 -1621
1622a621M46J322J212J38j301j031q24P49J569Q14p53r58p61K63P92M97n7n87
1640i1k76N86k07K6m09k65N56N79L84n33p64p53R80P80M92m48r00o75K60P62M74
1661E58P2n14l95k05K59O0p8K16K99J83j28p28p12M45Q54Q66O9j161j124Q8Q43
1682b33J093O76q28j491l14N28J058M72l59q36m45J93Q08J56m64m17J28L94L52
1701D71j98p25j19J16J098K58o25o11m56L69N65M45l16l16m08k1P90J6l85k32
1721b84L17J46J42l12j54l07N67L31J63m03j013j06R76Q34M24j078q75j98O36
1740a94P63L27n10r20j70K43N41N10n06m96R0L18K63K89n10k80J59M8N91p5o15
1761a34j95J45L33M43m67m17j95K65M69J57l64k25k05M25O6j00m41K02O5N86K41
$$ plain form
1622 -1621 -1175 147 1359 1497 196 -835 -1659 -910 659 1473 720 -238 -999 -736 56 553 496 -91
1640 -91 -367 219 12 38 -371 -636 -80 499 883 350 -414 -1167 -187 593 1085 637 -263 -938 -678 84 558
1661 558 630 116 -279 -484 -225 -165 -243 -27 272 455 327 -401 -1113 -668 186 1052 1121 -40 -1164 -1076 -233
1682 -233 860 1536 708 -783 -1097 -569 489 961 602 -234 -679 -486 322 478 14 -403 -275 119 471
1701 471 273 -452 -571 -455 643 901 276 -335 -791 -422 143 588 272 -44 -452 -473 317 333 -52 -284
1721 -284 33 179 321 9 -145 -452 115 446 609 206 -807 -913 63 897 1321 243 -632 -830 -194
1740 -194 569 896 386 -534 -704 -461 80 590 84 -412 -322 -4 259 548 38 -242 -83 -35 556 481 -134
1761 -134 -329 -184 149 592 125 -292 -487 -222 247 404 40 -185 -390 35 101 1 -440 -238 -173 413 654
1782F54n03o19J13L79N00J24o02n59k70M44P11L76j55j288J49L95N52K72m68n01
1802b96j80K76P00K8k99p01k51O89M54J74m54n52j9N18R3m7j71l41M24L48k77
1823A16k82k23L23L51l48O08n04m91K74L61K38k33m58j87Q4M84M08k23l04m24
1843d30J36N09K36l18o73J41N16L77%n94l62q8L31P08K20l71j002j17P19N78j05
1864D11j87n00qj7L90J11m1k56PR1lj91l0Q0J61M16k68m36j79M1Q43J97j2p64
1888a44o28K90P70L65R3r42l75Q9L70N71j00n38j54J73M61l1k99k57m5K21L52
1909B42J42n48n63L9P13O27j33m72k76k20oN84N26j35m84m73j23P58k30J45k38
1930a25N9K27j79l45M0L83N43ql54l75m75L30O12L02k11m72n44j08M01P57q4k12
$$ plain form
1782 654 151 -468 -355 24 524 648 46 -513 -783 -339 372 748 593 -695 -546 -151 401 673 205 -296
1802 -296 -476 -200 500 528 229 -472 -723 -34 420 594 140 -412 -431 87 180 133 -38 -379 45 393 116
1823 116 -166 -389 -66 285 -63 545 41 -450 -176 185 423 190 -268 -455 -371 113 521 298 -6 -430
1843 -430 -294 215 451 133 -540 -399 117 494 494 -100 -462 -550 -219 489 709 338 -664 -781 -62 516 411
1864 411 224 -276 -284 -301 89 200 159 -97 -90 1 -2 -193 -223 -143 18 434 166 -270 -449 -408 435 632 620 -144
1888 -144 -772 -482 288 653 746 -196 -571 -482 -112 459 359 -179 -333 -160 301 270 -29 -286 -331 -110 242
1909 242 384 -164 -727 -688 25 652 519 47 -229 -449 -455 129 655 520 36 -437 -560 198 -32 113 -125
1930 -125 -66 161 -18 -363 -323 60 603 595 241 -134 -609 -279 333 635 424 -48 -592 -700 -299 458 374 162
1952A62j96kq2L06q1k29J0J08K77K10m71m88j14O15O34q8j11j137j16M59O81J80
1974E27j85m84l78O0J12O65J88j38o52J73k00M2J43K69L79p1m13j13l47P1Q00
1995D48K08j2n91o26k17Q07O12L9j62p59n11M35M80K82m39L9N5k17q0l7o2RL09
2018A0M42J6n19m93k29N26Q49J47n25l82k83J11L63O91j5o00n66q8J71K38L75
2039B39P8l18J33j84k26l0N37K44K60m05k55o90n4P27L73M77m95p98l56N57L70
2060A84K97j66m86pJ38j01K54J41n8j48K68j62k16m47L3L56K62N26m48m74l90
2081f44K83N92Q28n84n65m96K61M37L2L53j38l84o7l42J53J88L21J12L69p72l11
2102c74n53O47M72K48K66m84n49l92L75N90K29J27p85l38J1N88K73O7j54n97L43
$$ plain form
1952 162 -34 -36 -118 188 107 -122 -112 -4 273 483 12 -476 -590 25 659 571 460 -677 -793 -334 347 527
1974 527 342 -142 -520 -460 -348 317 505 367 -285 -112 -312 -270 -127 142 521 450 37 -76 -423 -352 448
1995 448 656 644 53 -573 -790 17 629 668 506 -253 -764 -329 151 433 -6 33 88 -129 -209 -246 -308 -299 10
2018 10 452 468 -51 -544 -773 -247 602 749 224 -158 -441 -330 33 724 709 109 -457 -545 -374 -136 239
2039 239 317 -1 132 -52 -278 -308 229 473 733 328 73 -617 -671 56 429 906 411 -387 -743 -186 184
2060 184 481 315 -171 -178 -40 -141 113 254 196 48 316 154 -62 -509 -476 -120 142 668 220 -254 -644
2081 -644 -361 231 1059 475 -90 -586 -325 112 144 497 359 -25 -92 -434 -281 -93 228 340 709 -63 -374
2102 -374 -927 -280 192 440 706 222 -327 -719 -344 246 475 602 -183 -521 -510 78 351 418 264 -333 10
2123A0k03K91k88j40K99L42k05j29l68l92N83P21o9j49l30m08M50k25M73O8p6
2144B55n36k40L14Q7L59K03k60o6l35j15K52L8J65M13j14o44l61l6R11J4M86p48
2166D2n82L5L75L65J19N5l61j09l56K69J62p9K74k22K08l88L6l19L01Q7K73J03
2188B88J28o36k24K69K24K89R1m58n61J40K20L41J15j77j42J03j80k21L29L97
2208C35K64l99k93j17k08K95N88K18l74j55k10l71P0N53J0P8n55K72n09K22M37
2229A51N1M0j87j21p7Q9L05k14M6k00J05O8o46L70J44K56K83k66l11J0o5N6K50
2252A37m7J99l73q5jj38L62K45k30m4o4o5P3J68O7M0k25j19j20k1J45L87J46l76
2276F1k26K5J09K08Q7k90l18L20j36K53k25K64k67P1J36k88J28j93L27l1L8N2
$$ plain form
2123 10 -193 98 -190 -330 -31 311 106 -23 -391 -783 -200 521 452 303 -27 -435 15 -210 263 331 255
2144 255 -281 -521 -207 -120 239 442 182 116 -219 -334 -82 -44 121 534 420 -224 -585 -621 290 304 790 42
2166 42 -540 -505 -130 235 354 409 48 -61 -417 -148 14 -65 209 -13 195 -193 -157 -476 -175 -88 185 288
2188 288 416 -220 -444 -175 49 338 429 -29 -590 -450 -230 111 226 49 -93 10 -170 -391 -62 335
2208 335 599 200 -93 -210 -418 -123 465 683 309 154 -56 -427 -357 196 206 284 -271 1 -508 -286 151
2229 151 202 242 55 -66 -143 -54 251 37 83 -117 -12 56 -590 -220 -76 180 463 197 -114 -104 -169 -113 137
2252 137 90 289 -84 -169 -170 -308 54 299 69 25 -39 -104 -31 137 204 244 19 -100 -220 -241 -96 291 437 61
2276 61 -165 -140 -31 177 264 -26 -344 -24 -160 93 -132 132 -135 -64 72 -216 -88 -281 46 15 53 105
2298A05k74J25k66Q3J51L51J3n42k42K90K48n2L59k34j23j8m4L9j13J94l8J67
2320A79o9j57oL8k1J83n3j80k27J46M39k56k6k69L43j70j53J91K73j07rk06j5
2343a32K75k51J08N4k82K90j40o2r2m4K87K69k2j73J24n03L6M82r6R8j79j40K56
2366A63k47L25k21P7J01n28L69k71K94O4p3P7%l7j42j23j7M1L00j14j13j38J8
2389a95J07p1K03k73M5M47j89l5l65L16k04M17k03Or3q1J65j06J49j4K5k8p8L1
2413b4J23r2J71l22L8K11j17K24k42J6n4J22J80k62k5J38j79K68k8J07l04m4k10
2436c05L07k88K90j47L38l82L94l18J61Q4j12r7K04k94R5K78k35J53k36Q7j86
2457b09KJ15J90n1r7j61j02K37K46j51J21l01K67j94K35k35K5J75n4j66K59k25
$$ plain form
2298 105 -169 -44 -310 -227 -76 275 288 -254 -496 -206 42 -10 349 115 -8 -26 -70 -31 -144 50 12 179
2320 179 110 -47 -53 -15 -36 147 94 -86 -313 -167 272 16 -10 -279 64 -106 -259 -68 205 98 89 -117 -132
2343 -132 143 -108 0 54 -228 62 -78 -140 -232 -276 11 280 258 85 209 -294 -258 224 128 226 47 -93 163
2366 163 -84 241 20 97 198 -330 39 -232 62 126 53 130 130 93 -49 -172 -189 -148 152 38 -75 -213 -195
2389 -195 -88 -159 44 -229 -184 263 74 39 -326 -10 -214 203 0 6 -87 -168 -3 -109 40 26 51 23 -55 -24
2413 -24 99 7 178 -144 -106 105 -12 212 -30 -14 -68 54 234 -28 -53 85 -94 174 146 253 -51 -95 -305
2436 -305 2 -286 4 -143 195 -187 207 -111 50 134 22 -75 129 -165 -70 208 -27 126 -110 -23 -209
2457 -209 -207 -92 98 47 -50 -211 -313 -76 170 19 140 -161 106 -88 147 -88 -63 112 58 -108 151 -74
2479g4J16J26l75k34M30Q7K23l13J02j75L37l00L4l73L34M3Kj77J05K5K26j29
2501D0k24J64k41J85J62N0k9j71J21J63qj30k08J6J23K1R0O5j34j86K2K00K85
2524C76O1l69j18j48l7K09K01r8k04k27K3J65J2J45Q9j97J40l48L05L07l07l4
2546e4l19L72j7j87L56J0k79J60m9j08N17k24l70K78k22O8J70K31m60J76k95P5
2568a71L11j2p2r5JJ15k29L18Q9k63j22m9M8j7J18J76k9K5k48L86k10J7j1nk57
2593a86jJ73K24j01k75l9nJ58L61q9j55l40L99l45L93q7j58M57m59k6l8J45J93
2616A99j88P1o0k64K68L15m09J78K08n56K67m8M0k29O0L3K12j78K50O2l92r4J51
2639a04K70k56J02n8k97N1K27L17k18j9J74o14K26N59l57k06L05j94O0o9O7K19
$$ plain form
2479 -74 42 168 -207 -441 -11 76 299 -14 88 -87 250 -50 -16 -389 -55 -12 -10 -187 -82 -57 169 40
2501 40 -184 -20 -261 -76 86 136 107 -64 57 220 212 82 -126 -110 13 34 124 189 55 -131 -109 91 376
2524 376 437 68 -50 -198 -235 -26 175 77 -127 -354 -331 -166 -154 -9 80 -117 23 -325 -20 287 -20 -54
2546 -54 -373 -1 -18 -205 151 161 -118 42 -7 -115 402 178 -192 86 -136 -68 102 333 -127 49 -246 -171
2568 -171 140 128 56 -39 -38 77 -152 166 255 -8 -130 -179 -131 -148 -30 146 117 142 -106 280 70 87 76 71 -186
2593 -186 -187 -14 210 109 -166 -205 -210 -52 309 220 65 -275 124 -221 172 85 -73 384 -75 -101 -139 6 199
2616 199 11 82 22 -242 26 341 -68 110 318 -238 29 -19 21 -208 -148 -115 97 -81 169 231 -161 -255 -104
2639 -104 166 -90 12 -46 -343 -292 -65 252 34 15 189 -425 -199 360 3 -203 102 -92 -32 -101 -34 185
2661A85j0q5k31q9K10K30P7j24k51j22J78R1j41l4N20m37q3j77N11j63o0N6j55
2684a04O4N0n5j8m8L40j27J2j55j52N01m66m6K39K48k64j39K26l07M87p0pK7j81
2708E5m55J60K03l5J54J4m85P7J88K75J08J81n45k72J11j47K38N43k81p6k39J93
2730c5J33j02J37k88K17l90K28l3j24L60L9k52J64m1j30J66p4r6k24L93k37j01
2752b90L23k5J92l04L31k1k08j96j09K81N8K08Q2m11J8j82J01K93J87P3l64o2
2774b5q6J53K50J25l20J64o06M47j62L96o3l66O3q4J54m2K90k91l5o0k5J58K4
2797E9J51oR6p0j80p6P7k21J73m1J46l33Q8K27r6r4NJ58M2J39m09L13l48m3L94
2822A51K12k35m84N5n8L35N40k13j38m72K19J3J51J49r6j65j87j9Q0L08K36k20
$$ plain form
2661 185 175 90 -141 -230 -20 210 287 163 -88 -210 -32 59 -82 -116 404 -33 -116 -293 218 55 -5 51 -104
2684 -104 -40 10 -45 -63 -111 229 102 114 -41 -193 308 -158 -204 35 283 19 -120 106 -201 286 216 209 236 55
2708 55 -400 -240 -37 -72 82 96 -389 -312 -124 151 259 440 -105 -377 -266 -413 -175 368 87 11 -228 -35
2730 -35 98 -4 133 -155 62 -328 -100 -133 -257 103 142 -110 54 13 -117 49 -25 -121 -345 48 -189 -290
2752 -290 33 8 200 -104 227 206 -2 -198 -307 -26 32 240 322 -89 -71 -253 -152 141 328 401 37 -25
2774 -25 -111 42 292 417 97 261 -345 102 -60 336 273 -93 -30 -114 40 -2 288 -3 -38 -98 -123 35 59
2797 59 210 204 300 230 50 -26 51 -170 3 -38 108 -225 -137 90 -6 -100 -95 63 105 244 -165 148 -200 -243 151
2822 151 363 128 -356 -301 -359 -24 516 303 165 -307 -88 -75 76 225 129 -36 -223 -242 -162 146 382 162
2844A62j21m3k37j08L42P8R5j96O5m71L12P6J22j9J10l96R6P4J59n8l26L92j11
2867cJ70J42k10l68M4K98o5K02m82p2P5J07L51K36j86j59j09l38M03J18q1M7l4
2890H6l07j6L59l3l05L00r2j54pM3J30M73k64k01O8k37k47O84J06l25J27m17J85
2913d4O5J77j07J34k42M94l37k3m27K02r0M00k15J95m01R4p2K1L88J52m15J16
2935F5m35J0O39K34n6k97l59j41K67O9J85j04J2o7l41J31K21J68J92l74l9k59
2957b79J37R6K29m0m9J1l47QL70j43J68k10j88J93j96N92k60l08K82k03L11j03
2979G1m5k89J42J29Q3R9p9l68K05K0Q8L4o7j59j53L07K55j76K53k89k38K93k73
3002a57lO10q9m31J66k13J18j03J77K53J6k68k12J33r9M42j98k36J30M0j83L22
$$ plain form
2844 162 41 -2 -239 -347 -5 73 168 -28 37 -434 -122 -46 76 57 167 -229 -133 -59 100 42 -284 108 -3
2867 -3 167 309 99 -269 -225 73 8 210 -272 -344 -269 -162 189 425 239 80 -29 -367 36 154 73 120 86
2890 86 -221 -237 122 89 -216 84 -8 -162 -169 -126 4 477 213 12 80 -157 -404 280 386 61 188 -229 -44
2913 -44 21 198 91 225 -17 477 140 117 -310 -108 -198 202 -13 182 -219 -125 -197 -176 212 364 -51 65
2935 65 -370 -360 279 513 457 160 -199 -340 -73 -4 181 77 89 22 -319 -188 33 201 393 19 -20 -279
2957 -279 -142 -46 183 143 94 105 -242 -234 136 -7 161 -49 -237 -44 -240 352 92 -216 66 -137 174 71
2979 71 26 -263 -121 8 91 190 111 -257 -52 -32 56 90 23 -136 -289 18 273 97 350 61 -177 116 -157
3002 -157 -160 450 361 -70 96 -117 1 -102 75 328 344 76 -136 -3 -102 340 142 -94 36 76 -107 215
3024B15k4j24K6k0k19J42P6p3j36p1JM46k42q9j16K2L13Q9j22q6k94J59J89j2
3048E0J24j72k07l0K53N4R2j8qk40J23k92M7J73N0R0J13k17K6q7K51R4j75J31
3072B25k19j84N5K78P5m09K67k47Q1K66p9j15K07k12k31M62k01p2R2p1Q9J31J51
3095C39l87j74L3K45K4r8j57J47j37J0J90J2j83K57j76J6K17j97P6P5r5n1J15
3118A01j9l16jK47N7J2l06o2K69N36m93k5M1r8O8J72j01J5j82n1k12M34K11k04
3142I3l44J55Q7K45j0n31M39m67K43L4K35k51m0k42L37j31K17K00k92P0k36L52
3164A63M8m8j92Q8J3oN9k47L56J45l24l25L34k2m02M32K12o9l09q6j60O38j12
3187A86M0m03N5l7L67q0n8j51k28K76K97K01n68j63J61M1Q4J69l15Q4m1K94M0
$$ plain form
3024 215 191 67 93 73 -146 -4 72 -1 -137 -208 -207 239 -3 -92 -208 -186 127 216 94 8 -286 -127 62 50
3048 50 174 2 -205 -235 18 72 164 146 138 -102 21 -271 -224 -51 -1 89 202 -15 11 -76 175 269 94 225
3072 225 6 -178 -123 155 230 -179 88 -159 -78 188 109 -6 201 -11 -242 220 19 -53 39 -32 57 188 339
3095 339 -48 -222 -189 56 80 -18 -175 -28 -165 -155 35 47 -136 121 -55 -39 178 -19 57 132 37 -14 101
3118 101 82 -234 -235 12 69 81 -225 -287 -18 518 25 0 41 -57 11 183 82 97 -85 -136 -348 86 297 93
3142 93 -251 -96 -9 236 226 -305 134 -333 -90 -56 179 -72 -112 -354 -17 -148 69 269 -23 47 -189 163
3164 163 211 163 -29 59 72 66 125 -122 234 379 55 -270 64 42 -360 72 284 215 -94 -180 -340 298 186
3187 186 226 -177 -122 -159 208 128 70 -81 -309 -33 264 465 -103 -266 -105 -64 20 189 -126 -42 -83 211 251
3210B51j40p8J65j80j21J38j39K40l24J31P3o4k33K92m69M17L22j73m4j27j43
3231b06K96Q0j16j75K19k2o4k4j29j26L95q7M1K41k51l17J68K73q7mo9jl27L95
3255A03K02q9j6km51L57j94L64j35K1K5K2J48m18J31j14R6NL4q7k38J22J82p2
3279dK9J33k57j9j17J50L04l74j94J39K36J6Q3o3k28J8N4J38l4j21j50J12K84
3302A35p6Q2p1k95P5K46j13o2p4n0l5N68l03K41m54n2j36J14L03Q3k32J66J14
3325A74l83K43j93J44q2J26J40j68l86R0M24l04K86l05m8L02j08M4j8P1K54k09
3347I4O7l7j26j16KR2j10L42j56L1k13j41M01Pj01p8k04j5K70l8O8J55n14M64
3371A44j28q0J36Q2p8J32j77j33J13N2j86L78j35O0m31OJ24L02k50o7L9O4Q5J27
$$ plain form
3210 251 111 33 198 18 -103 35 -104 136 -188 -57 16 -48 -281 11 -458 -41 281 108 64 -63 -206
3231 -206 90 170 54 -121 98 76 12 -12 -141 -267 128 41 82 323 72 -245 -77 196 109 105 36 35 -292 103
3255 103 305 216 200 198 -253 104 -90 274 139 160 185 207 355 -63 68 -46 50 55 89 2 -236 -114 68 -4
3279 -4 25 158 -99 -118 -235 -85 219 -155 -349 -210 26 42 125 62 -166 -148 -94 44 10 -111 -261 -149 135
3302 135 59 141 70 -225 -150 96 -17 -79 -153 -203 -238 330 27 268 -186 -238 -374 -260 43 126 -106 60 174
3325 174 -209 34 -159 -15 -97 29 169 1 -385 -295 129 -175 111 -194 -242 60 -48 -4 -22 49 303 94
3347 94 161 124 -2 -118 -116 -24 -134 208 52 83 -130 -271 130 137 36 -42 -246 -261 9 -29 39 194 -320 144
3371 144 16 -64 72 154 76 208 31 -102 11 63 -123 255 120 180 -251 -245 -121 181 -69 -136 -97 -33 52 179
3395A79R6l12J90o1j80L86m55K06j34p2K86j3r6m6l78K07M94p0l4l53k50L99j44
3418a55L61j44K21k58k83J8J80K21j73j51J35K4l49K74J11K10l54J90j65j40L10
3439H3M5q9m3M7k2k5l22L18j5K8j36l3K72l56K58P9k75J57K80k46J60j38j23j2
3463a08J48l4j3j55j70K47J27Q4N2j99O2k74K18J66j1m6k16J72l5l16M59l82M90
3486B66k34kL6l71L10P0J5R0j13l00K54N1n8L66j86k79k64j0K51J31L7k72J62
3509e0j51K44M9m8j99L36k98K08K68k97l73K44k29N45k1k69k40L23J3O2j06L47
3531C58l47q0J65k98L31j12J7O3J29l00r4L44r7m5q5M2J09k59J37K26k60KJ95
3554A41l01J93l9O2L22l61k00J49j88L58K17l57k9j20l8L38l15K21k01J60J27
$$ plain form
3395 179 275 -37 153 92 -88 298 -157 49 -85 -157 129 116 20 -26 -404 -197 297 227 193 -160 -410 -11 -155
3418 -155 206 62 283 25 -258 -240 -60 161 -12 -163 -28 -4 -353 -79 32 242 -112 78 -87 -227 83
3439 83 128 39 -4 43 21 -4 -326 -8 -23 5 -131 -164 108 -248 10 89 -186 -29 251 5 165 27 -96 -108
3463 -108 40 6 -7 -162 -332 -85 42 126 178 -21 41 -233 -15 151 140 94 -122 50 15 -301 158 -224 266
3486 266 32 30 66 -305 5 75 90 180 67 -233 21 72 14 380 194 -85 -349 -359 -108 23 60 -212 -50
3509 -50 -201 43 92 44 -155 181 -117 91 359 62 -311 -67 -296 249 228 -41 -281 42 55 117 11 358
3531 358 11 -69 96 -202 129 17 34 97 226 -74 -168 176 79 34 -51 -9 100 -159 -22 204 -56 -54 141
3554 141 -160 33 -6 56 378 17 -183 -34 -222 136 353 -4 -33 -153 -191 147 -168 53 -148 12 139
3575A39p3K9R8k42J11k32L16J0M8k56P0Q1j30J36j59L50l15j12K10m4Q1M3l75
3598b16M30l87K1J69j8J5K65m14M5J24k66K39K57k55O5K8n13L20j4L21m17K54
3620E3p1j47n8L45k36M0P3J07j60K0j41K06J54m0J75k83j69l5J0L10j02K51k20
3643H2l1q0j3r0J64j20L7j10K85j71K58P5l84M59k56k72P5K19l24K50k03j7L52
3666A85m23J57K11Q0j76q7j33o2L98j24Nj68K93m50K0L82j02J26k4j19M35k49
3688A75p13M24K42mR8k20O9j62k3L29k11J01k3n7j19j25K44j07M78k54k63J9j27
3711b29L42l7r9J41k23J7L05m16J52M5L46l36j51L44k97Q8J75j16l3k0K66j76
3733H8L0K5m56J05M28J22l65j93J82K6J0J48J79k40o7j03j05J92p6LJ57Km7J1
$$ plain form
3575 139 66 95 193 -49 62 -170 146 156 204 -52 18 99 -31 105 -54 296 -19 -131 79 35 116 159 -216
3598 -216 214 -173 -152 17 -1 14 279 -135 -90 34 -232 7 264 9 74 102 -411 -91 -105 216 -201 53
3620 53 -18 -165 -223 122 -114 -74 -1 106 -54 -34 -175 31 185 145 320 37 -132 -167 -157 153 51 302 82
3643 82 51 -29 -42 -132 32 -88 -51 -161 124 -47 211 286 -98 361 105 -167 -92 127 -197 53 -150 -167 185
3666 185 -238 -81 130 210 34 -53 -186 -248 150 26 31 -137 156 -294 -274 108 6 132 108 -11 424 175
3688 175 -538 -114 128 124 222 2 71 -91 -114 215 4 105 82 25 -94 -219 25 -82 396 142 -121 -102 -229
3711 -229 113 76 -23 118 -105 -88 217 -199 -47 -2 344 8 -143 201 -96 -8 167 51 18 -2 264 88
3733 88 118 143 -313 -208 220 342 -23 -216 -34 -8 2 150 329 89 22 -81 -186 6 -70 -67 90 92 45 56
3757E6j03J90k51J3J47k53J10O9J69J5L7k35o1p5L91j80q1O4n1M6k27L93j25k86
3781b28K41k54j2L33J30k58q1lm2M7M30l92JK42k47J25L18l89j69K4J0K56n8n9
3805c5R4m4k5J40m09K60K10j98j05r9N4L52j81N8O8k94K29l6R2j82J42p2m6k0
3829d7j09J97J78n61N10k69L38k60j40K61r9j24P6m6L33j17l20P0N2L1r3L96p6
3852A81j67l4K04j33p0j07N6L0Q7k37K25J48l38M4K42j64J66l1k66K12k44J55
3874d1K2K8MN9m1J23k73J19l1J91j44j19K18N0k79P7J13K61k04j53K38j97P0j03
3898a2L2j23J85M9p0k4o3K1o6K91j77j06l4k7%P5j48K34o5M3o6K90j25J6J8k57
3924a09K65j31p7J08M8L8l50P4K99J4k96K20r9N6k23K04K2J12k9j15qj39Q6J98
$$ plain form
3757 56 -47 143 -108 -95 52 -201 -91 -22 147 162 199 -36 -97 -172 219 39 -42 22 -29 17 -210 183 58 -228
3781 -228 13 -241 -253 80 210 -48 -129 -132 -174 -127 303 -89 -88 154 -93 32 350 -39 -208 -184 -174 82 24 -35
3805 -35 59 15 -10 130 -279 -19 191 -7 -112 -211 -157 195 14 72 140 -154 75 39 131 -51 91 19 -27 -47
3829 -47 -156 41 219 -342 168 -101 237 -23 -163 98 -1 -125 -49 -95 238 121 -199 -129 -77 -46 -139 257 181
3852 181 14 -20 184 51 -19 -126 -70 -40 47 -190 35 183 -155 -111 131 -33 133 102 -164 48 -196 -41
3874 -41 -19 9 13 72 31 154 -119 0 -31 160 16 -103 115 165 -114 -37 76 337 133 -20 218 21 91 -12
3898 -12 20 -103 82 131 61 37 -26 -5 -71 220 43 -63 -97 -124 -124 -49 -197 37 -28 15 -51 239 114 130 148 -109
3924 -109 156 25 -52 56 104 142 -208 -134 165 179 -117 103 4 60 -163 41 63 175 146 31 23 -116 -30 168
3948A68j53j18k30J87K37k16q7L32L8l50r4K10Q8k29J64J21j08j51L05q0j3J36
3970A57l59L60N%j92J13j9L0q0K05l00j91J39J10J85j28K19k14m1k42R9K1Jj26
3994b48L01J09k62q1J28K29o5L2l79L62j50L9J76j3l32K52p5o5j9j04K11j04p
4017f5J48N8k20J73k03L51o25M39j48k9lL30j03J9K1Kj18J0k42L09O6l41o1L03
4041G1j8q9J36J27l12q3O3K43q1k11J62K8n1J40l0l03M13j77R2k74J32J25p5r0
4065f2l9M7O4l0J01k05J32L3o1j25K46Q3n4l92J65r9L56k88K04M9j03j69P6K41
4089A70k46K53k24j72K74K3J21k7o4L1l20O4K7K56j3j6M9l04R8J01j98j43K05
4112e5N3J37Q9k79K08l32Q7p0L16j3j7L3j48J11l46L48p0j3Q3j85o3m5L35l04
$$ plain form
3948 168 15 -103 -333 -146 91 -125 -212 120 158 -192 -286 -76 12 -217 -53 68 -40 -191 114 34 21 157
3970 157 -202 158 163 163 -29 84 65 95 15 220 -80 -271 -132 -22 163 35 254 40 -1 -243 -144 -123 -122 -248
3994 -248 53 162 -100 -181 -53 176 111 143 -236 126 -24 15 191 178 -154 98 23 -42 -61 -165 46 -58 -65
4017 -65 83 141 -79 94 -109 242 -383 56 -92 -121 -124 206 103 122 143 145 27 37 -205 104 170 -171 -232 71
4041 71 53 -36 100 227 -85 -168 -105 138 57 -154 8 36 -15 125 95 -208 205 28 120 -154 -22 103 28 -62
4065 -62 -101 -54 10 -20 81 -124 8 41 -20 -145 101 184 130 -262 -97 -196 160 -128 76 125 22 -147 -71 170
4089 170 -76 177 -47 -219 55 78 199 172 108 139 -181 -117 -90 166 153 137 186 -118 -20 81 -117 -260 -55
4112 -55 -2 135 224 -55 153 -179 -92 -162 154 141 124 157 9 120 -226 122 52 39 122 -63 -126 -171 164 -140
4136a40J70J75k98J36j02J57k36M2k18N5K67n6j68L34j91n1k3K63o4J04q6m2J21
4159A49j53R1o1j52N7lq6K67j6j11m3O6L0k6k21K32j1j28n8J4L10n12M75n7J82
4184B35l74J59j53J87J19l2n2r0L5P5o9l43N36n16J76J55q4j6J8J48k6P8j28j57
4208a19q9k3K31L2P1J24k6l03NQ7qj05O5J26j60k41L20L7J96l27q2J45l0P8P5
4233G9K9r8PJ14l55Q7J86l6r9pJ73p9P8n9n7l9K20P3j06k68M17k72k29K39r9K86
4259A85n07L89j19p5K58L0J26n03L3K03K0k03J23L5J47n4m05K97L1K21N4j42j30
4282A4k91J72K25L7m7l66M01n5k54l9J49J79J51j26O2L3j97j15P1l3L5M3k43L44
4306A50j40J01o8O1p4j27j3O2rO9n9J54K0J31m05K86J43j34j38n1q9l4J77k6L0
$$ plain form
4136 -140 30 205 -93 43 -59 98 -138 -96 -314 -259 8 -48 -216 118 -73 -124 -147 116 52 156 70 28 149
4159 149 -4 87 26 -126 -69 -72 -158 109 93 -18 -61 5 35 9 -212 20 9 -119 -177 -163 147 -365 110 53 235
4184 235 -139 20 -133 54 173 141 89 -1 34 109 40 -303 233 -283 -107 48 -36 -52 -34 114 88 166 38 -119
4208 -119 -208 -231 0 32 103 227 201 -102 -97 -10 -18 -123 -58 68 -92 -333 -13 24 220 -107 -189 -44 -74 4 79
4233 79 108 10 17 131 -224 -137 49 13 -86 -93 80 1 79 20 -37 -76 144 217 111 -157 260 -12 -241 -2 -101 185
4259 185 -322 67 -52 -127 131 161 287 -216 -183 20 40 -163 -40 -5 142 88 -317 -20 11 232 286 144 14
4282 14 -277 -105 120 157 110 -256 145 90 -164 -203 -54 125 276 150 212 245 48 -67 4 -29 6 49 -194 150
4306 150 10 111 43 104 30 -97 -110 -48 -57 12 -47 107 127 258 -147 139 282 148 10 -41 -130 -164 13 -13 17
4331A7J3J37l24J66j67R5K04M3k49r5K48J87j52J49k09j98K04j45k40L79k50K24
4353C7k62L53j58nK15k25J24R3l09p3J82J78m46M23r3o6j18K69j68Q1J7p8L44
4376C15k60Ok17k57M53K55q7K28n67N2n1K3L06j06N5j79k22K81q4K10K1j89L2
4399A8K30j10l18p9rJ28R6O3K26k64J86k03L27j78l3j16j7j23k9J79m4O4k00O1
4423a45n6L6J52lJ51k05J54m73K83J19j82L68K0m05J4N3K18J10m3o3j41J71j43
4446a0J13N8j2l0j28O4j50Qj99L35j20O4J98j42m5l22K04J45l92M87k73L74j59
4469F8Q3j04J47m95K46J11j23K61m42K78j97qJ10P5j51Q9j05M24l20m4Q7k6J22
4492H6q4O8Q2l61Q8J87J17k97K26J6n77O40j06L7q1j06N3k41L04K1qk61M24k38
$$ plain form
4331 17 30 167 -157 9 -158 -63 141 184 -65 -160 88 275 123 272 63 -135 69 -76 -316 63 -187 37
4353 37 -225 128 -30 -35 180 -45 79 172 -137 -210 -28 150 -296 127 34 -32 -150 119 -49 32 49 -29 315
4376 315 55 61 -156 -413 40 295 208 436 -131 -79 -130 -107 199 93 148 -31 -253 28 -56 154 175 -14 18
4399 18 248 138 -180 -259 -268 -140 -44 19 245 -19 167 -36 291 113 80 -36 -53 -176 -205 -26 -70 -6 -206 -145
4423 -145 -201 -165 -13 -16 135 -70 84 -389 -106 13 -169 199 219 -186 -172 -119 99 209 166 103 -38 133 -10
4446 -10 103 161 149 119 -9 55 -95 -87 -286 49 -71 -7 191 49 4 -318 -114 31 -361 126 -147 227 68
4469 68 151 47 194 -301 -55 56 -67 194 -248 30 -167 -175 -65 10 -141 -52 -157 267 -53 -97 -10 -36 86
4492 86 2 70 152 -209 -121 66 183 -114 112 128 -449 191 85 122 41 -65 -12 -253 51 72 64 -197 227 -11
4516a1K99J26l49k35N3j8J97m4J23j49K12l09mk1L58j21j7k55K40J78l05P9K6
4539E3J39j75L8k86L07l16L97j88k69K91j04J08Q1j10j45L01k23M57j80j55J16
4560A37j27L4n8n3J67l00j34K68K17o2j34p5j43K64J15J08l27L9O8j54J40K23
4582B13k85m5M23q8K09l28j82J13K08j29N1oj11j13K66k16Oj28R7k03L83j58M
4605a9K7k34K48J09J3jk28L71j94k30M83m81J11q3J14K10q3j20J17k58J11J27
4627A10o8P9l11J72O1j04j11J52R4l44K79K51j33k91K29J69k50l7K4q2j95L3L67
4650I4K6k13K2J27n4J44j32j43p2k11O70l34J8j12Q6K67J64j76o5k38P3J55MK08
4674C08k40l71J02K49J23J7K4k51l18M69o4N4k34R4J87j44K9k47L7N4J13M3j38
$$ plain form
4516 -11 288 414 65 -170 -117 -135 62 18 141 -8 204 -105 -109 -130 228 107 90 -165 75 253 -52 27 53
4539 53 192 17 55 -231 76 -240 157 -31 -300 -9 -113 -5 76 -34 -179 122 -101 356 176 21 137
4560 137 10 44 -14 -67 100 -200 -334 -66 151 89 -45 -120 -263 1 116 224 -103 -64 4 -150 -10 213
4582 213 -72 -117 306 218 427 99 -83 30 238 109 160 154 43 -70 196 -20 -14 -142 -45 -248 135 -23 -19
4605 -19 8 -226 22 131 144 143 -85 286 92 -138 345 -136 -25 -108 6 216 133 13 130 -128 -17 110
4627 110 42 121 -190 -18 43 -61 -172 -20 74 -270 9 260 127 -164 65 234 -16 -53 -29 -111 -306 -273 94
4650 94 120 -93 -71 56 2 146 14 -129 -201 -412 258 -76 -58 -170 -84 183 347 171 106 -132 -59 96 100 308
4674 308 68 -303 -201 48 171 188 212 -39 -357 112 48 102 -132 -38 149 5 34 -213 -176 -122 -9 34 -104
4697a04m9K18j32K30OM7k58j3j17q7R9P6M4j29J46L8Q5j27J1J30j61k36M64k1
4721A60l78M65l84L14m56J87L1j84L45J08P6k68q9L0oK13J4k09Q5j72R5K24l09
4744a08K92l61n8L25j49J25l81K12J62J29O6l52O4j44K72Q5q7J75m50K51j76Q
4766a00J83j19roK79k22j75K50j05J32rM8j34k34M3L64k61K63j89q6J00M4nO2
4790A14j3j19j62l2K78j02J51k16R6K1Rm16M62J28j25l11J23J31R4l52j2M48j87
4813HJ4j76l57N09L55k19j46M1j54l2J67R6K36j70J02m8j78j95K87m0n4jJ67o6
4837A46l57j2L18J10n03Q5J73k5j88M21J53l01l10L98j51N4j04k9J97Q0k07J46
4859I4Ol29P3K76r8J89k98r4j24L52R8k0l4j61k5N5J92J5j17j55q6q0K73j00Q6
$$ plain form
4697 -104 -153 65 -67 163 169 216 -42 -55 -172 -259 -160 -84 -40 -169 -23 15 100 -27 -16 114 -47 -283 181 160
4721 160 -218 247 -137 177 -279 -92 -61 -245 100 208 284 16 -73 -43 -49 164 178 -31 54 -118 -23 201 -108
4744 -108 184 -177 -235 90 -59 66 -315 -103 59 188 254 -98 -34 -178 94 179 92 267 -183 68 -108 -100
4766 -100 83 -36 -45 -51 228 6 -169 81 -24 108 99 147 13 -221 -178 186 -75 188 -1 -87 13 57 52 114
4790 114 101 -18 -180 -212 66 -36 115 -101 -5 16 25 -391 71 199 74 -237 -114 17 111 -241 -253 195 8
4813 8 22 -154 -511 -2 353 134 -12 29 -125 -157 10 106 342 172 274 226 48 -147 140 100 46 45 212 146
4837 146 -211 -223 95 205 -298 -213 -40 -65 -253 168 321 20 -290 108 -43 11 -93 -122 75 155 -52 94
4859 94 100 -229 -156 120 22 211 -87 -181 -305 47 145 125 91 -70 -95 -40 152 167 50 -105 -191 -271 2 -98 -12
4884a2K97j59R3j07Nk20K18k55R4K72k25k29K95k7Q5M5q0K39o04k5L64j10J5o7
4908i8M05j70k57J9m6m9K68J89n1k48l67L79K9J51j08k35J34p1N8P3L22k34N1
4931A44l77J0M08j73K71o95O46j27j16m5l34N71l44K42r2J46k86N1o6J17O4j27
4953a12j13R9P3M6N1j79J59o0L27j44k7j46N2k37J31R8J65Rj08j64L21k2k23M
4977@j26K03k1j49L19m21q8N0J92L37l41J2Q4J07m1k9j92K35j92R3l64K39L3J15
5001E5J8j59L37k66j03j10K64j00r5K15j6m8O0P0J57l75Q8K22n2lj45Q2k26K28
5025I8j98K82k86r9j5K16J92l5r7oj87J28J55j13r0j48Q0R7K26l03J7j4J69J15
5049A84k95L5j14K96R5n2J6j17J9j09J40l1r1R7j46J95K1j62L61q6j77j10L0J17
$$ plain form
4884 -12 285 126 219 112 117 -103 115 -140 -46 226 1 -228 67 40 125 170 90 329 -275 -300 64 -46 -31 -98
4908 -98 307 137 -120 -101 -147 -196 72 261 210 -38 -405 -26 3 154 46 -189 -55 -126 -68 5 327 93 144
4931 144 -233 -223 185 12 283 -412 234 107 -9 -54 -388 183 -161 81 -11 135 -151 -100 -166 -49 15 -112
4953 -112 -225 -126 -53 -7 44 -135 24 -36 291 147 120 -26 26 -211 -80 18 183 192 84 -80 241 219 -4 0
4977 0 -126 77 56 -93 226 -195 -283 -233 -41 296 -45 -33 51 158 117 88 -104 131 -61 32 -332 -93 -60 55
5001 55 73 -86 251 -15 -118 -228 36 -64 -159 56 40 -8 52 122 279 -96 -8 214 162 159 14 96 -130 98
5025 98 -100 182 -104 -203 -218 -2 190 155 58 52 -135 -7 148 35 -55 -203 -123 -26 200 -103 -86 -100 69 184
5049 184 -111 -76 -190 106 201 149 165 48 67 -42 98 67 -24 73 -73 122 143 -19 342 256 79 -31 -1 116
5073A16q4k42J15K87r2k25K2N0o0K19p8J60k66j00L4J40J59k56K11p9j05N0K74
5096B50k78o8J59J9k08J6O3k5J49K7O5o0l2M9j69J16L3p5j03L9J12m33O66j98
5120A14l8O6k14p3K27n9J48m1r3j08nJ18M5m5O1P1Q4q7l58J23L38k33J19j49k55
5145b44K09N7Q3N5l82L59k58j83L28Q3N9j03j64kM0R3j0k5J32j65K71l1j80j34
5169a12K15J21k45K43m54J71k31L0L25K39l25J62k51K11n6J25K1l62K71R2l94
5190b04o1K05m7L65j97l30K68r0r3K91k11L1J15k14K82j09K89j98r7R1r3q2K09
5213A20l53O0L03r9J62k57K75J31k62l47N1j09K36J7r5K11Q2J7r4Q0j21k34J36
5236i0K40j41rm4N6J24n0j02k24L06r7J6J50p7O9j84J45k00J4J18pk9K83j10m03
$$ plain form
5073 116 32 -210 -95 192 100 -125 -103 -53 -113 106 28 188 -78 -178 -144 -4 155 -101 110 31 -74 -24 250
5096 250 -28 -96 63 82 -126 -110 -47 -72 77 104 169 109 77 126 -43 73 106 31 -72 -33 79 -354 312 114
5120 114 76 142 -72 -145 82 23 171 130 37 -71 -76 42 87 42 103 174 258 171 -187 -64 274 41 160 11 -244
5145 -244 -35 22 105 160 -222 137 -121 -304 24 107 166 63 -101 -103 -63 30 20 -5 127 -38 233 202 22 -112
5169 -112 103 224 -21 222 -232 -61 -292 -262 63 302 -23 139 -112 99 43 168 189 -173 98 190 -204
5190 -204 -265 -60 -107 258 61 -269 -1 -91 -184 107 -104 -73 42 -172 110 1 290 92 -5 86 -7 -89 120
5213 120 -233 -173 130 31 193 -64 211 342 80 -267 -216 -325 -89 -72 -167 44 126 143 49 129 8 -226 -90
5236 -90 150 9 0 -44 12 136 86 -16 -240 66 -31 -15 135 58 127 -57 88 -112 -98 20 13 -16 267 157 -246
5261b46L32O9l37J81j18J16k10J05J99P4k23K5j27L2J39M3k54L57k57l5J27J98
5283A90o8k16L0L33n15N4K17P3L79m32j41Q6J57l63J94m5K04m64K99RO5k53J28
5306g9J03J57k22j38M4J14j03J65J55k79L21l61J05o0N0Q1q6J90l16Mq3L7J19
5329h2J34k53L17j30Qj55M19p6r9M8j46j65M59m66L41K4o8j38O%O4j18K2q0j90
5354c24K83p9J92N0k30M7J13j98L79l50J4KJ21K6J8k5J57m13K05q7J47Q7l97J26
5378a36K71J49m11J00k12N26l96K33j6j75J68k01L34l9l56L8L22j64J90j22j72
5399f9Pp9R4O8k2P2j27L00j06l33N8K17k85O9kL00l7J45j39j34n7J18J58m9j69
5424bM7J63q1l07K55N4Q2k91P0l9J5j42J65P3q7N9n2J39K42k53k44L63p0j85k2
$$ plain form
5261 -246 86 155 -182 -1 -119 -3 -213 -108 91 165 -58 -33 -160 -128 11 54 -200 157 -100 -135 -8 190
5283 190 122 -94 -64 269 -246 -192 25 98 477 45 -96 -10 147 -216 -22 -67 137 -327 -28 -19 46 -207 -79
5306 -79 24 181 -41 -179 -135 -21 -124 41 196 -83 238 -123 -18 -78 -28 53 -33 157 -159 -155 -238 -201 -82
5329 -82 52 -201 116 -14 -6 -161 258 182 83 131 -15 -180 279 -187 154 178 110 -28 -22 -22 42 -76 -54 -134 -324
5354 -324 -41 -120 72 122 -108 -61 52 -146 233 -117 -103 -101 20 46 64 39 196 -217 -12 -99 48 135 -262 -136
5378 -136 135 284 -127 -27 -239 287 -109 124 108 -67 101 -100 234 195 -161 -123 199 35 225 103 -69
5399 -69 -62 -141 -47 21 -1 71 -56 244 138 -195 -137 80 -205 -136 -138 162 125 270 131 -3 -60 58 216 167 -2
5424 -2 45 208 127 -180 75 129 211 -80 -10 -49 -34 -176 -11 62 -25 34 -18 121 363 110 -134 229 159 -26 -48
5449d8K6J49J08k45M3l0K1k0k48k1K13j5K67j45j27j96L36q5m09P70l82m9J43
5472E6j80K95k0q4j84J95p0Q5m59M29j40j14J51J13n6m6PJj11K84J28l94P6R3
5496E5K24l29J43j37m7l6j3L8K32j3j18o3P0K3K3k4K2r7P4M5k27N23l52N8l35
5521b61L77q7j39J11L9pJ53n9j06J6j18j35J00q3K02p1J21N2j53J01N6l27J77
5544d1L84o66K03K78l84k4K66R5l4j06K7R6j47j63K88k48L98l04J2R8K4j12J24
5567F4j17K53m18L69Jl55K48O2k77K48j84J45J16m7r7J27l1Nn1O4n5K65k97k16
5591a78M99j86k24J74K9m19K59K75J01k39n4k97M20l22J30K15m79K59j01J54L0
5612D6OL8k13J39r2L4J47o0q3P0k8r9P5J14nJ57k90J82k03J47k9p8k1J36M0j28
$$ plain form
5449 -48 -22 127 235 -10 33 3 24 4 -244 -265 -52 -67 200 55 -72 -268 68 -17 -426 344 -38 -87 56
5472 56 -124 171 151 67 -117 78 8 93 -366 63 -77 -191 -40 73 17 -29 -22 -21 -132 152 280 -114 -38 55
5496 55 279 -50 93 -44 -91 -127 -140 -102 130 117 -1 -64 6 29 52 28 50 -47 27 72 -155 368 16 74 -261
5521 -261 116 29 -110 1 40 33 186 127 21 37 -81 -216 -116 -199 3 -68 53 105 -48 53 109 -218 -41
5544 -41 343 -323 -120 158 -226 -250 16 111 77 -29 -2 94 -53 -216 72 -176 222 -82 -70 28 52 -60 64
5567 64 -53 200 -218 151 152 -203 45 107 -170 78 -106 39 155 108 11 138 107 112 61 125 70 335 38 -178
5591 -178 321 135 -89 85 114 -305 -46 229 330 91 37 -260 160 -162 -32 183 -296 -37 -138 16 46
5612 46 52 90 -123 16 -76 -42 105 45 -38 32 4 -95 -20 94 89 246 -44 138 -65 82 53 -25 -46 90 130 2
5638Bn0k5K65j09j57J6K02m67M04J3p1j90L37j73q3K43l3j90p0L7M07j67j97K46
5662A90j05j92Q8J55j41o2j9N6J81k69J63j07K6k91L13j20Q4K02j77L9J43Q2K
5685B41j88r9Lk09K1L67l25L34m62M94j78N2J42l08K47j46N3Q9m28L60r9O0J45
5708A66m31R1J88j21m4J61k25K53k95K66j19J37r7Jr5J75K32l16K79j31K0r1J19
5731A23j01n2Q5K8p1Q9l70L17p7K9j48J86k43L33j82Q1j19j51J22R1J10l72K25
5754f7k77L50K04J23l42RO0r3q6K1M9K42k54J66j31k0q6j6Q5J31j91L65k89p8
5778a25L5J54Q7j44J7j62J85J1M9j01k49M50k78J59j05l8rQ6M4k60J68j32M1K26
5802A09o8N3o1K8K8j86lJ30p0P6l0m0J46j7j07k42J95l28M24O3j91O0M4J14j83
$$ plain form
5638 2 -48 -73 192 83 -74 -58 144 -323 81 94 23 -167 170 -3 -86 157 124 -66 -136 -99 308 141 -56 190
5662 190 85 -107 -19 136 -5 -67 -86 -30 151 -118 45 -62 -36 -327 -14 -134 -50 152 -25 14 157 239 241
5685 241 53 -46 -43 -252 -231 136 -189 145 -317 177 -1 51 193 -115 132 -14 39 128 -300 60 -39 21 166
5708 166 -265 -174 14 -107 -151 10 -215 38 -257 9 -110 27 -70 -69 -164 11 243 -73 206 75 95 4 123
5731 123 22 -30 55 83 12 101 -269 48 -29 0 -148 38 -205 128 -54 27 -92 -243 -121 -30 80 -292 -67
5754 -67 -344 6 210 333 -9 0 60 -33 -119 -98 -49 193 -61 105 -26 -46 -132 -148 -63 68 -123 242 -47 -125
5778 -125 -90 64 151 7 24 -138 47 58 107 6 -243 207 -71 88 -17 -55 -64 22 66 -194 -26 -158 -117 109
5802 109 41 94 33 61 89 -97 -100 30 -40 36 6 -34 112 95 -12 -254 -59 -387 37 100 -91 -31 13 127 -56
5827e6K24j47Q7l37J62O4K3J73k13nK04j45p0mJ6J21r4J70P4k12j29K2K22l0j47
5852b7R9m42L13M7K8l15M07k78K27j00j63L39j80J6OM7k2l35K20K43K8P3k39j51
5876a59K62o7j6M9j09J51Q2k87K7K9n2j73K14J60j2j96J86l5j45K44k48J31J16
5899A52l47J92M5m2J93k01J85j05j20M1k24J73J11l1j55j6K70k13j36M9j03K09
5921g3L13k36J13j48K16j85J36j84R2p1K67l67J17j33O0J55j83j54L97O0J68l61
5943aR2k73K08j00J35l9n0n9L35J5j90j96L54j11q8L07n44N40k83J27l88J81m3
5966g1L00k30j45l8M29p3m44K61o5N2j13J74j99K92j91l6O5j66L43Qm2l03K73
5989H1j2k53J83K4n1J17o9K94k80p0Pj44R3K32p7j1k93K10K45j68l3p7q9J12k12
$$ plain form
5827 -56 168 21 108 -229 -67 -3 20 193 -20 -25 179 34 -36 -40 -24 97 3 173 247 35 -94 -72 150 120 -27
5852 -27 72 -370 -57 -10 18 -297 110 -168 59 -41 -204 135 -45 -29 -23 24 2 -333 -113 130 158 231 -8 -159
5876 -159 103 36 20 69 -40 111 193 -94 -67 -38 -90 -263 -49 111 99 -97 89 54 -91 153 -95 36 152
5899 152 -195 -3 42 0 193 -8 177 72 -48 -7 -231 -58 53 22 -133 -149 121 -92 -228 -179 -282 -73
5921 -73 240 4 117 -31 185 0 136 -48 44 -27 240 -127 -10 -143 -83 72 -111 -265 132 192 360 -1
5943 -1 91 -182 26 -74 61 22 -28 -87 248 263 73 -123 231 120 32 339 -205 335 52 179 -209 -28 -71
5966 -71 229 -1 -146 -184 245 172 -272 -11 -76 -24 -137 37 -162 130 -61 -97 -32 -198 145 153 111 -192 81
5989 81 69 -184 -1 23 -28 89 20 314 34 -36 -29 -173 -80 152 75 64 -229 -19 226 58 25 -52 -141 -29 -241
6014b41O57m66P1m8n0j17K95O2k79L28k19O7l61L28j9p8K32k09J32k93K04J2j28
6037a20J35j1P5j21j53K56n3j68L7K11j53j71M80l58J90n0k19K44K14k78j34K07
6059F0j51j01J40J73o3o8l29K58L04o3k31J93k45N9Q1J36l41M01k21j14R3j95
6081b24L48k1k53J86j58J06K86j60M9j54k64K34k34K52L16o20L78j01M8k50M03
6102A67n9o3j64L6J99p9M0j13jK18k59j0J4kl7K07j03K53l22j98L24Qq5J91j26
6127C6k7j49K62j49p7J46j76R4J49J4P1q6Q5j08k24J26qK0p9K52l33J31k4O8R0
6152A04j70K03r9j02Q0l69L53J04j48M10l88J78j99R0k00j77K90kO3j88k1L96
6174B08l58K65k19M7J40j09K56l32JJ17O8j98O1j09L09j42J05j55J72q8k05L24
$$ plain form
6014 -241 416 -50 21 -27 -77 -194 101 163 -116 212 -7 60 -301 27 8 -70 162 -47 85 -208 -4 8 -120
6037 -120 15 4 79 -42 -195 61 8 -160 -123 88 -65 -236 244 -114 76 26 -193 51 265 -13 -147 60
6059 60 -91 -192 -52 121 58 -10 -339 -81 223 160 -71 122 -123 -64 17 153 -188 213 -8 -122 -29 -224
6081 -224 124 103 -150 36 -122 -16 270 110 159 5 -259 -25 -259 -7 309 -311 67 -34 14 -236 167
6102 167 108 45 -119 -83 116 37 77 -36 -37 181 -78 -88 -74 -76 -113 94 -9 244 -78 -276 48 56 -29 162 36
6127 36 9 -140 122 -27 -104 42 -134 -40 109 123 194 108 193 85 -139 -13 -21 -1 -80 172 -161 -30 -54 14 104
6152 104 -66 137 38 -64 16 -353 0 104 -44 366 -22 156 -43 47 -153 -330 -40 -42 21 -167 -188 208
6174 208 -150 115 -104 -57 83 -26 230 -102 -101 16 84 -114 -53 -162 147 5 110 -45 127 39 -166 158
6196A58P4l83K22RP0l67J08M8R6K98j75l75K68j68R3J9J50k25J73l0R2j47l22
6219c14L20n7J26k21J51j52N4K76J8k99J82j96j48L47k5j13K8q3K00o9p4o4j21
6242b34j39M19J11l67k0L18J95l07kL2k71K06j42J03Q7n2J47k68k03L82l1J76
6264A40j14j42j06J84qK62l49J39k28K36n2J3k12O5L82o6j91J26k66K62N2l50
6286b23K15M7M4k81L39j87L8k8k97J10J09m0J03j73K06Rk22K2P4L6j78K80J07
6309A10p8j61k3K04k5K01l82J23r2K6Q1JP9J8l74J18K08k32L56k91k8L18m12L00
6333D5k55j3J1L61j4l04L51m2j09J94k83K9L97l42j07N4K6O1j89K06n4j06l6O5
6357e4L4K2KL8k74L22j85q8J05J90j04K5rk51K03j94N07k41L5q6j72J05J18m4
$$ plain form
6196 158 232 -151 71 80 150 -217 -109 -61 35 333 158 -217 51 -117 -24 -5 145 -80 93 63 155 8 -314
6219 -314 6 -51 75 -146 5 -147 -93 183 201 -98 84 -112 -260 87 62 -51 -23 -106 94 25 -49 -113 -234
6242 -234 -373 46 157 -210 -230 88 283 -24 -26 6 -265 -59 -201 -98 -11 -63 84 -184 -387 -5 -36 140
6264 140 26 -116 -222 -38 -46 216 -133 6 -222 14 -38 -25 -237 -172 210 144 -47 79 -187 75 127 -223
6286 -223 -8 39 83 -198 141 -46 -8 -36 -333 -223 -114 -154 -51 -224 -18 -9 -231 -209 -135 -99 -277 3 110
6309 110 32 -129 -152 52 27 228 -154 -31 -123 -97 -16 -15 64 82 -292 -174 34 -198 158 -133 -161 157 -255 45
6333 45 -210 -223 -212 149 135 -169 182 140 31 225 -58 -29 368 26 -81 -27 -1 60 -129 77 23 -83 -119 -54
6357 -54 -20 2 4 42 -232 90 -95 -183 -78 112 8 33 24 -227 -24 -218 289 48 83 -3 -175 -70 48 4
6381DJ10l50J61n3J98j72qJ8K45J28l67R2j53L84l05K26q1k25K6L6L4R5J74l04
6405h7j03L26p5o6K51k20m02O49k43l0K2j52K70k12Q9o4%j71K35k11L5K83j65
6428d1j62J17J02M6l82M30j5j71P4M3k55n1J17P2P3k07J85jJ40N8l87M38k58k0
6452e5J58j02J68O5k19j03J36j44O68n07N5j82Q8j74K88j85k86N34j49k57L06
6473A03r4l6k36K45q5N6k19K67kL3j00L54m48J7oK73Q6j33J85m48O9J44j64r3
6497b32J43L20J7k31J04l82J91R2j72K41l25K05k20M22r0j06K75k26j00K3J12
6518F1J7q1N8J8rn5K27n72L35m8O3P1q2P5k87K10j66L02J10k54j6J61k05RK4p2
6544a06l1K59k55K01m14K39J99j52k6J51r6J21j42J53M0j24m4J1J87P3r5j3k36
$$ plain form
6381 4 114 -236 -75 -128 70 -102 -110 -92 153 281 -86 6 -147 237 -68 158 77 -148 -122 -86 -52 43 217 -87
6405 -87 -190 136 61 -5 246 26 -376 273 30 0 22 -130 140 -72 17 -47 -47 -218 17 -194 -159 124 -41
6428 -41 -203 -86 16 62 -320 110 95 -76 -2 41 -214 -265 -148 -76 -3 -210 -25 -26 114 172 -215 223 -35 -55
6452 -55 103 1 169 234 15 -88 48 -96 572 65 120 -62 26 -148 140 -45 -331 203 54 -203 103
6473 103 9 -27 -263 -18 -103 -47 -266 1 -1 32 -68 286 -162 -145 -151 122 208 75 260 -188 -119 25 -139 -232
6497 -232 -89 231 248 17 121 -261 -70 22 -150 91 -234 -29 -249 173 83 -23 252 26 -74 -51 61
6518 61 78 -3 55 73 64 9 236 -336 -1 -49 14 85 3 78 -209 1 -165 137 247 -7 -23 138 -67 -58 -34 -106
6544 -106 -137 122 -133 68 -346 -107 92 -60 -86 65 -31 90 -52 101 141 17 -27 -16 171 244 149 136 -100
6567a00M9K27j11M9k23L64j88j2O8q0k7j17K28k43j34J83J2j34J79l3j02K72q3
6590D4j18K22j9q8M8k46k20P86k87p0k92j2K29r1M24l09J54l12K5O5L87j65O2
6613B17l06J20k99N23j60q2l8J82q3K26k06k6k00q1L32j62k07K33q7J35J37j46
6635B2K48m72M66m6l09M1K52m36lL86k39K76l15K10%m9P5j76m8K59j42M7k6k5
6659dJ39j46N8j95J73R3l87K25R8L48l32l1j39K12Q6m8j6k05K82k42N8M3l30M9
6683b11K70l71K05J0R0R6q3L5Q4j66L25m04p4J6L59k77o0R0K96p3j84P8j70L45
6707B26j58l37J49K31k66J49l9K59q8r9m3j34L00k56J17J88j47l03L79K00l32
6728dP3j26j47M47r2q3j68m8K23m9r5r5N8K70j63J52R2j89j24J2Lr7L6JM7J65
$$ plain form
6567 -100 -51 176 65 114 -109 255 67 55 123 43 16 -101 127 -116 -250 -67 -55 -189 -10 -43 -145 127 44
6590 44 -74 148 129 41 89 -157 -377 409 122 52 -240 -252 -23 -114 310 1 155 -157 -132 -67 320 155 217
6613 217 -89 31 -268 255 95 13 -25 157 74 300 94 68 -132 -213 119 -43 -250 -17 -104 31 168 22
6635 22 270 -202 264 218 -91 -50 202 -234 -237 149 -90 186 -129 81 81 32 107 -69 -117 142 0 47 21 -4
6659 -4 135 -11 47 -148 25 118 -269 -44 54 402 70 39 -100 112 198 150 134 -71 211 -31 27 70 -260 -211
6683 -211 59 -312 -107 -97 -7 89 6 41 125 -41 284 -120 -194 -178 181 -96 -156 -66 230 157 -27 51 -119 226
6707 226 68 -269 -120 111 -155 -6 -45 214 126 27 -16 -150 150 -106 11 199 52 -251 128 328 -4
6728 -4 69 -57 -204 243 151 68 -100 -148 75 26 -69 -164 -106 164 1 153 245 56 -68 -56 -53 -150 -114 -113 -66 99
6754I9J14k65q2MJ81K33k08l9j25Q4J19p0L59l44K1l99N22Ql29M02l17J78l67
6777b21J23L2J01j78J03J95k46O3j30J13K05k35L26o2l70K4qL70k40J49m6j76
6799a08R2k75K29J13k9ql1j97J74j52K57k18O1lo5L8J5K60j04n2q8J82l64K03
6823g0J66j13O2N0j96O9j8j1m4J82n3l85L36m7J27mk74M50r4L1j35J15%j70J28
6848A02j67J62r4p8j97L43K43k97RLJ1L39m17K3j00K74O6M7m62J47Q2j83J37K
6872e%J42q4O8o2o6j43j88K81q0K01j11J4J10k60J66J31j28R8P7m2l80K27N0M3
6897E9J36k29j10K15j72R8Q5j57M7K17k20j0Q3o6OJ66j33r2r2J21M9Q2q5l4K26
6922A90J48l97J93k7m3k4J56l44K0R6nq0J42K05l59K32Mj09pP7j72RJ79k47J9
$$ plain form
6754 99 213 -52 -134 -130 51 284 76 37 -88 -4 115 45 404 60 81 -318 204 212 -117 285 -32 146 -221
6777 -221 -98 -66 35 -143 -40 155 -91 -28 -158 -45 160 -75 251 189 -181 -157 -165 205 -35 114 68 -108
6799 -108 -16 -291 -62 51 22 14 -17 -214 -40 -192 65 -153 -92 -95 -160 -122 -107 153 49 -3 -91 91 -273 -70
6823 -70 96 -17 45 95 -101 -32 -50 -61 -105 77 24 -361 -25 -72 55 51 -223 227 133 164 29 144 144 -26 102
6848 102 -65 97 3 -75 -272 71 314 17 26 29 40 379 -38 -15 -115 159 225 272 -190 -43 39 -144 -7 -5
6872 -5 -5 137 53 121 59 -7 -150 -338 -57 -137 64 -47 -33 77 -183 -17 114 -14 84 161 119 -261 -34 16 59
6897 59 195 -34 -144 71 -101 -3 82 -75 -28 189 -31 -41 42 -24 -18 148 15 -77 -169 -48 1 83 -2 -36 190
6922 190 338 -59 134 107 64 40 196 -148 -128 -32 -37 -117 25 230 -129 103 107 -2 -9 68 -104 -95 84 -163 -144
6947a44pK22l1k35L48k90J82J49k73L68n17K30j61L91j4j02m2m6J42k44J91p4
6969D3m0n4L37l00LR4k48R5J01K04m41J40k0j3j4L0K16Or9l2j42K87o1J09K2m04
6995a81R1J5l3K57p8k00J93k19M7Q4m4P4L25k19j94Q0J20r3K9N0q0j70L33n2m82
7020c47K16O9L17j57K0j54j9k1j24L14q8l5K7J7j02j4J42P4m6k12K02M7j26J07
7044A07K1j5k27j87K44K6J32j48M9L4RL6j40k5K02j33k5n2K42P4l22L15q3q2l9
7069A3R7M9l00J07L00j33L4k25k9J59j08L3o4K16j09r0JL0Q2K6%N6J03J9m13J06
7095d0j39M4J41m6n2K39k5l03L90j01j12L4K4j4k61L61p6J51m64K65j49j40J62
7118a11K8K44j7k63j9K21j00J00j19r9L96m98J68J19J7mP2R6m35L00M6k9j96J92
$$ plain form
6947 -144 -151 71 40 -195 153 -137 45 194 -79 289 -228 2 -159 232 218 116 74 28 170 -74 117 43
6969 43 3 -51 286 -14 -11 83 -165 -70 31 235 -206 -66 -86 -99 -113 -83 133 139 40 8 -134 153 92 201 223 -181
6995 -181 -90 -75 -108 149 71 -129 64 -155 -108 -24 -68 6 331 112 -82 -2 118 25 54 104 24 -146 187 135 -347
7020 -347 -131 -62 255 98 118 -36 -55 -76 -200 114 26 -9 18 35 -67 -81 61 135 89 -123 79 126 0 107
7044 107 128 113 -114 -301 -57 -31 101 -47 2 36 45 81 -59 -84 118 -15 -40 -92 150 224 -98 217 134 52 13
7069 13 110 159 -141 -34 266 133 167 -58 -87 72 -36 -3 -67 149 40 -50 -49 -19 63 89 89 145 248 267 -146 -40
7095 -40 -179 -135 6 -40 -92 147 122 -181 209 108 -4 30 54 40 -221 140 64 215 -249 16 -133 -273 -111
7118 -111 -83 161 144 -119 -138 83 -17 83 -36 -135 261 -237 -69 50 67 63 135 231 -204 96 142 113 -83 109
7142A09O4j22l89K34K01j6j82Jj2N3K44k0k06L2J31o7j82K6J20OJ6j54O4m1P2
7167a8J01Ok90L64j53N3k4q9j6J51k91K16q9k49M51o5n8k35M1J65m0qK1J47k52
7192a61L2K8K32o7L39k87l4k14m2Q3k53K10K90j53R0r1n9j01OP1n6jJ00k12L87
7217A37l40K73k38K95R9k56J29k34L82m36L46m70K95j05K78j37j16L0Q6m9r7O
7239a22K72k16K57n9m5J19l47K68k45M6Q3j18R6j4J47j19j23J26J8k04K36J0n8
7262HJ56j90J86m2m3j16J58k10P8P7n4R5Q1Op1j44k9J19k62J77q7J16J84j43k29
7287a79J81j99J69j72J66j44L1K71j74J24j25L4J48j36K6K43l40J3l7o3p2k7J71
7310i1J56O1l00K78j83M25l57m0q9K09l3j79J44q6M8P8l6J03n1J17j31k56K99
$$ plain form
7142 109 173 51 -338 -104 97 81 -101 -100 -112 -59 185 165 -41 -9 122 55 -127 -101 19 25 41 -113 -49 -90 -18
7167 -18 83 89 -201 163 10 63 39 -50 -66 85 -206 10 -79 -328 123 58 0 -235 -194 -29 -69 -77 -56 91 -161
7192 -161 -129 -101 131 64 403 116 82 -132 -174 -91 -344 -134 156 3 93 2 -57 -158 -152 -81 -137 -138 -38 -250 137
7217 137 -203 70 -168 127 226 -30 99 -135 247 -189 157 -313 -18 -123 155 18 -98 -68 18 -31 -128 -122
7239 -122 150 -66 191 132 87 206 -141 127 -118 -72 11 -107 -11 -25 122 3 -120 6 24 -180 56 66 8
7262 8 164 -26 160 118 75 -41 117 -93 -15 62 8 103 184 190 119 -25 -54 65 -197 -20 -107 9 193 50 -179
7287 -179 2 -197 -28 -200 -34 -178 -147 124 -50 74 -51 -17 131 -5 21 264 -76 -63 -100 -163 -235 -262 -91
7310 -91 65 126 -174 104 -79 346 -11 -51 -140 69 36 -143 1 -85 -37 41 5 108 57 174 43 -213 86
7333H6j71Q1L2N7n1j27K25o4O9k77K05P0k25L7J28j00J99k80N0K29m00N7K82j74
7357f2J20j81L07p4l01m4NJ44m2L89m24K40O0j09j16J84J42k89L49m03K08j74
7379g1J16j04j3M2P2J13m34L56j82k80L08qO7J92k03O1k00J39k0l2K27n5l67M77
7403B01o6j94J94j20j2k51K99J56l28P0o0J18K7j6J00j49P8J44M2j82j5J19j71
7426a6P4K81n5k47k43J80M5K29k34p1j10L29k49J1q0K54N9j29mj21K32K1%j73
7450a7k11J74J37m6j07j75M66k9l02K09n6M7k5k3k73k2J69K10j63o1J42Q9k0K4
7474A37j94j06J87j61K06j47l7k32N30n8j34j84J01L9q6M66m65J37j89J24R4m8
7496b0Q1J28j13P7J6l83M13l72K29P2j86J10j17j0R3M2l6K26K0k16l7Q0P0k87
$$ plain form
7333 86 -85 -4 28 85 34 -93 132 68 137 -140 65 135 -90 -53 75 -25 174 -106 -56 173 -227 -170 112 -62
7357 -62 58 -123 184 110 -191 -235 -230 -86 -128 261 -163 77 137 28 -88 96 238 -51 298 -105 103 -71
7379 -71 45 -59 -72 -30 42 155 -279 77 -105 -385 -77 -85 -18 174 -29 32 -168 -29 -49 -81 146 91 -276 201
7403 201 135 -59 135 15 3 -248 51 207 -121 -51 -111 7 34 18 118 -31 47 191 233 51 36 155 -16
7426 -16 58 339 284 37 -206 -26 19 248 14 -57 -167 162 -87 -76 -156 98 157 28 24 -97 135 156 156 -17
7450 -17 -228 -54 83 37 -70 -245 221 192 -110 99 43 90 65 42 -231 -253 -84 126 -37 -98 44 133 113 137
7474 137 -57 -163 24 -137 69 -78 -115 -347 183 125 -9 -193 -92 -53 -139 327 -138 -1 -190 -66 28 -20
7496 -20 61 189 76 153 169 -214 199 -173 56 128 -58 52 -65 -75 18 60 24 250 270 54 17 97 167 -120
7520a20J64l82L54j20j6J36J36j38r2J85oL9j78J01k62L37k72M10j89JJ76k90
7542b6o2j83K36k19N53l33k48J03K39m5m6J45P2n8k46L51j8k38p5K71n6J02k33
7565a4mK70k83N7K37j10j12j4n3qk04M24j43P7j11J59j78J01j46J94k20p7J66
7588Hj06J17p9J58j39J55k80o7j64N47J3m6j85M0J23J48j83j17j28m1L27j25J50
7611A26r7K04l10R8JL57k58n6n4R8j85m1J56J55k47k05K91J75l4j07k12R6R0L0
7635G1j79K88k35J04r9J21j67j68K35j10K48l03K58j84K92k30J93j05j87j73L52
7656B2l0j0J21l26N5J34Q5k21K20J15K0j79l6r9m3K29n8j15J97j7m0R7j02l0J06
7681I5k67O2J16M0j66J01J77k80L66k53k3M2L3J1L5J50m19M4K73j57L26j28j95
$$ plain form
7520 -120 44 -338 16 -104 -120 16 152 14 -78 107 101 140 -38 63 -199 138 -134 276 87 88 264 -26
7542 -26 -88 -271 -35 -254 299 -34 -282 -179 60 15 -31 114 186 128 -118 233 215 -23 -98 173 117 219 -14
7565 -14 -18 252 -31 26 263 153 41 27 -26 -34 -238 186 43 120 9 168 -10 91 -55 139 -81 -158 8
7588 8 -98 19 -60 98 -41 114 -166 -233 -397 150 163 117 -68 -28 95 243 60 -57 -185 -226 101 -24 126
7611 126 29 233 -77 21 22 379 121 65 11 109 -76 -117 39 194 -53 -258 33 208 174 67 -145 -49 41 71
7635 71 -108 180 -55 49 -50 71 -96 -264 -29 -139 109 -194 64 -120 172 -58 135 30 -157 -330 22
7656 22 -8 -18 103 -223 -168 -34 51 -170 50 165 185 6 -30 -129 -172 57 -1 -116 81 64 24 121 19 -11 95
7681 95 -172 -110 6 46 -120 -19 158 -122 244 -9 -32 10 43 54 89 239 -180 -136 137 -20 306 178 -17
7704a7J33j24J16m32J27L16n3p1J44k7k08N6OO3j89J70j68J28j2L5J28n1K77l46
7728Ak8l02K06J79k20J25r1K73j43J01M4k24L68m92K67j05J7l08K05K36l6Q8p5
7751H6k01L08k11J01M7L6j23m1L5q1KQ2M0k53rL41l51M50j53j03j31R0J81j62
7775b0k38J06n0J48j08K56l89J22K97k67O4l1j70L41k26J22p3J1j4K33k43K15
7797H6k04J76L5j08K62l07J28L7l15L26o0R0j17p3K41n9o9O1J31n55M27j03j7
7820A3l26J82K41N9j74n6L63n53L75k18K16j90M2L2R2j62K51k76K74k14J85k34
7842g8j14J14j40M44j78J88l17J05j89N23k21l97J99k27K29J23k26L39J24m97
7862a96J93qK4j0k2J49k36j24P6K15J0j1J47p2m43J46O0K12j53n0j1J5P6l3O9
$$ plain form
7704 -17 116 -8 108 -324 -197 119 66 -5 139 112 -96 -40 -34 29 -160 10 -158 -30 -42 -7 121 70 347 1
7728 1 -27 -329 -123 56 -164 -39 -130 143 0 101 145 -79 289 -203 64 -41 -24 -332 -127 109 73 161 86
7751 86 -115 193 -18 83 130 166 43 2 37 -44 -42 40 80 -173 -182 159 -192 258 105 2 -129 -39 142 -20
7775 -20 -258 -152 -202 -54 -162 94 -295 -173 124 -143 -79 -110 -280 61 -165 -43 -116 -105 -119 114 -129 86
7797 86 -118 58 93 -15 247 -60 68 105 -210 116 56 146 29 -44 197 138 69 130 261 -294 133 30 13
7820 13 -313 -131 110 169 -5 -61 302 -251 124 -94 122 -68 -26 6 98 -64 187 -89 185 -29 156 -78
7842 -78 -192 -78 -218 226 48 236 -81 24 -165 358 137 -260 -61 -288 -59 64 -162 177 301 -196
7862 -196 -3 -11 13 3 -19 130 -106 -230 -154 61 71 60 207 135 -308 -162 -102 110 -43 -93 -104 -89 -13 -46 23
7887B3J77qk84K27l02K98k22L25k61J82K65n11L43m28L04M0l31P0J75J35j30M3
7909A30p7J81o0l57K28m2j1J58L14j98m29J31l1l1J82J01k97K49j90O0n2k39N01
7932B21l43k78M14J42m02K02K35l98L1jJ94j11J11k79P7J21K93k79R2j7M5K2o8
7955B4q3j3J65j47J55k45k72N63k94K53j16M1o0R4J16m6k99K38k72O3M45k15R
7978A04k42nM3k5J42j03R9j16K81j55J40M7j24p2J27j79KL2J1j05k8R3J61O1m13
8003b24M23k59L4J34l53K72K91k01m12L55j01N8p1j02L21j07Kr1R2j27m7M6pq4
8027a58N0J84k6r4p3K07j61L28k61n7L7n6J54R3l01J62N4k42q7J55p2J93j58l
8051a32J93k39J30r6K82j69M9j69J18k87O15j59J2k13K1j00r7L80N3j06k96K80
$$ plain form
7887 23 200 192 -92 135 -167 131 -91 234 -27 155 420 -91 252 -176 128 168 -163 -93 82 217 87 130
7909 130 53 234 174 -183 45 3 -8 150 464 266 -163 -32 -63 -94 88 189 -108 141 -49 11 -41 -280 221
7932 221 -122 -400 14 156 -246 -44 191 -207 -176 -177 17 -94 17 -262 -185 -64 229 -50 42 25 70 92 24
7955 24 -59 -72 93 -54 101 -144 -416 147 -147 106 -10 31 -29 65 181 135 -164 74 -198 -135 310 95 104
7978 104 -138 -143 -100 -125 17 -86 13 -103 178 23 163 210 86 14 141 -38 -36 -4 7 -98 -126 -33 128 189 -224
8003 -224 199 -60 -26 108 -245 27 318 117 -295 60 -41 17 -54 -156 165 58 60 -31 61 -66 -113 -67 -74 -158
8027 -158 -108 76 50 -44 -117 90 -71 257 -4 -61 -24 -80 74 167 -134 28 82 -160 -247 -92 -164 29 -129 -132
8051 -132 61 -178 -48 -144 138 -31 18 -151 -33 -320 295 136 148 -65 -44 -144 -241 139 192 86 -210 70
8073G0J55l60L88m81K73k88K21O8l26M18o6J20j40l80L81k16K20q4Qj41K73j17
8095dp7L09l54M17j24o9q1j20K07j03J70m7jj2o5J30Kj32J15l28k11M84o3l7k72
8120b66K90M2oj73L47l10J99q9J26k37K06M7Mr4K5j29j89L19l06M22j50j38j7
8143g7p1J83N3k0KJ6L7j06q5nj9K96l43O0M9J01j31k3K9p6J02Rk36K77r8J2o6
8170a30j35L28m9KO2j37k0L2M5o3N22o73K58o2j44K20j84L1J19j44K73
$$ plain form
8073 70 225 -135 253 -228 45 -243 -22 46 -280 138 72 192 52 -328 53 -163 57 -27 -19 -160 113 -4
8095 -4 -81 228 -126 291 167 98 17 -103 104 1 171 124 123 111 46 176 178 46 161 -167 -378 106 43 6 -266
8120 -266 24 66 60 -113 234 -76 123 34 160 -77 129 176 180 86 111 -18 -207 112 -194 228 78 -60 -77
8143 -77 -148 35 88 68 70 86 123 17 -68 -73 -92 204 -139 -79 -30 71 -60 -83 -54 -130 -28 -19 -255 22 -76 -64 -130
8170 -130 -265 63 14 16 78 -59 -79 -47 -2 -65 457 -216 42 -20 -164 56 -128 -97 22 -122 151
8191A51
$$ Imaginary data points
##PAGE= N=2
##DATA TABLE= (X++(I..I)), XYDATA
0@%%%%%%%%%%%%Qj6J6j6K4l2L2m0N2o0P2q8J03j19J38j60J84k11K42k74L13l54
34a86L99m52N08n69O35p08P88q76R72j077J192j318J456j605J766j947K148k365
52a239K606k877L177l516L902m344M859n462O182p067Q178r620J1582j4422J8923
67A0862k7194M7445j94190l36846J31936K34703J98279m6295j71577j60459P819
78c05517J29138J74518J07920L1095m5041o5955n7980j314M4745O3064K2485l4972
90F2186r0764j05623q3966k0812M7884R1855O0444k4680r8232p7990K9213J38197
102g2288J48350O2866l2594n5982j7006J9733J6323M979K1930M5632J0283q7298
114F4928j60351j14012L7026J61379J37091j7691j60375j62717k0156J50191K12875
$$ plain form
0 0 0 0 0 0 0 0 0 0 0 0 0 0 8 -8 8 -8 16 -16 16 -24 28 -32 40 -48 55 -64 74 -86 98 -113 129 -145 168 -186
34 -186 213 -239 269 -300 335 -373 415 -461 511 -566 626 -692 764 -841 925 -1022 1126 -1239
52 -1239 1367 -1510 1667 -1849 2053 -2291 2568 -2894 3288 -3779 4399 -5221 6361 -8061 10862
67 10862 -16332 31113 -163077 -499923 -367987 -133284 64995 18700 -152877 -313336 -305517
78 -305517 -176379 -1861 106059 137154 92113 26158 -31822 -33136 11609 74673 97158 62186
90 62186 -28578 -134201 -218167 -238979 -191095 -99240 -38796 -63476 -161708 -239698 -210485 -72288
102 -72288 76062 138928 106334 50352 33346 53079 69402 74381 96311 141943 152226 64928
114 64928 -95423 -209435 -172409 -11030 126061 108370 -52005 -214722 -234878 -84687 128188
125A28188J29790k7987j41257j30442p749J26664J61267O5160q3486j64362j18950
136f3164n506O9344N6949m731m5975m3797k8452k5112j4871L0780Q7070R4991
148A07526K6228o4430q8392j8505P6436J03830M1176m8023q7382o3162k0014R87
160c3725K704L209N853n625l4199n6381m1145J0805O8588R1119N9087j1385p5576
173a6671q0302p295R7640J43426P0575p6528j75323j31105K0778J41748J21029
184A07972j5498j37099j38220l2560P4713J01131N2061o034l0482k3536o763J2146
196d2169L6613N7153N0592P158m4111o3162l6137J0975M0254L2509k486m1859
208E330o1137m4877J541M5944N6156K4019j9751l0919m059K6570L0058J3533R716
$$ plain form
125 128188 257978 229991 88734 -41708 -49457 77207 238474 303634 220148 55786 -63164
136 -63164 -68670 674 57623 52892 6917 -36880 -65332 -90444 -105315 -74535 12535 107526
148 107526 133754 69324 -19068 -37573 38863 142693 183869 135846 48464 -14698 -34712 -33725
160 -33725 -31021 -27812 -21959 -27584 -61783 -118164 -159309 -148504 -79916 11203 70290 58905 -16671
173 -16671 -96973 -104268 -6628 136798 207373 130845 -44478 -175583 -154805 -13057 107972
184 107972 92474 -44625 -182845 -215405 -140692 -39561 12500 6466 -24016 -47552 -54315 -42169
196 -42169 -5556 51597 102189 109347 65236 2074 -34063 -23088 17166 49675 47189 5330
208 5330 -55807 -100684 -99143 -53199 2957 26976 7225 -23694 -27753 -1183 28875 42408 52124
221E2124K7432L1886p360o4181p4431j1594P1566Q7653P277r9370j28159n0071
233a57228O7014J18377O8440l1459r2160p0710P953P8762R2226M4919k5611o6959
245C3564n4590j596M4627M6046O745l4196m5433l0127j2294m829L015J9350K7250
258b468Q584k7691m4005j2173M3898O7458L4235k1598m4232j7027K1562K8396
270C4939K488k1082j4967M446O283j7533l9820k8886R749M2383L7403j694m2934
283b9225m6782p954M8518P5625M8678j7239o8968o0221O001P0283P3725Q326o6592
296C4175q1913l0243L5255N4324K0128k5075l7464j7501N290J2518J2222J7082
308a202K1851J2529j0569k2582j0232J7073L2068J8411j0738l0311k4471n860
$$ plain form
221 52124 79556 111442 104082 39901 -34530 -46124 25442 113095 120372 21002 -107157 -157228
233 -157228 -90214 28163 96603 65144 -27016 -97726 -89773 -11011 81215 126134 100523 33564
245 33564 -21026 -22622 22005 68051 74796 40600 -4833 -34960 -47254 -52083 -49068 -29718 -2468
258 -2468 6116 -21575 -65580 -77753 -33855 33603 67838 46240 2008 -15019 6543 34939
270 34939 37427 16345 1378 5824 12107 -5426 -45246 -74132 -64383 -22000 15403 13709 -29225
283 -29225 -76007 -83961 -35443 40182 88860 71621 2653 -57568 -51567 18716 92441 100767 34175
296 34175 -47738 -77981 -42726 11598 31726 6651 -30813 -48314 -43024 -30506 -18284 -1202
308 -1202 20649 33178 22609 27 -10205 6868 38936 57347 46609 16298 -8173 -14033
320a4033R577J0402m39j2434j5527p388O036J2119M277o875n197J2851K8138K0109
334D1616j0655l4354k0674K2307M9715K8623k7475o4265m3490J4599N4137L7320
346D7404j6083n3868m2837K825L7591L8921J2575j4509k3542j1860Q639K3503
358H759K2325P465j0898j8336j1383P15O207K772k354m722o358j0388j1260j959
372b9415J2016J7435N879j2586j6065K237K4024K4962J107k2695j8293Q595K7656
385B4857J6081j6006l4996k0386J2424K9153J4218j7138l4020k0392J0574L0713
397d918K5206j30k2260k3746j187K5039L2314J2370j7793k9459j3186J3936K4659
410B0845Q250j5377k3983j1147O031J0723K146m884l810J204J635j334L20P778
$$ plain form
320 -14033 -4456 5946 5507 -6927 -22454 -29842 -23806 -11687 -7410 -14285 -19482 -6631 21507 41616
334 41616 30961 -3393 -24067 -1760 47955 76578 49103 -15162 -58652 -44053 10084 47404
346 47404 31321 -22547 -65384 -62559 -24968 13953 26528 12019 -11523 -23383 -14744 8759
358 8759 31084 38549 27651 9315 -2068 -1353 4854 7626 5272 550 -5808 -16196 -27456 -29415
372 -29415 -17399 36 5915 -6671 -22736 -20499 3525 28487 29594 6899 -11394 -2799 24857
385 24857 40938 24932 -10064 -30450 -18026 11127 25345 8207 -25813 -46205 -35631 -4918
397 -4918 20288 20158 -2102 -25848 -27035 -1996 30318 42688 24895 -4564 -17750 -3814 20845
410 20845 29095 13718 -10265 -21412 -15381 -4658 -2512 -7396 -11206 -10002 -8367 -9701 -9381 -1603
424a603J2969O701o569j3718l814J2031J7379M745j5014k2694j0595R452J8471
437G741Q404j0313k2680j5877M680K2331K1619K868j9190k1537j837K3682K7946
450B7837P011j9621k5737o272J7868K0985J591j8461k0438m227J0995J2081k24
463C388r932r153l25P768Q784M392j041l302k932J225N606P017L218l124q162
478C427p910j918M291P032L014m548j1074j1762k878J0296J7730J0616o836k0525
492a1045j4452P849K6294K2716j674k4258k3394j432K0936K1596K684j7440k1678
505a3298p993Q705J4746O754m839j1097o547L089R365P263r0m669k385L830O790
520I624K480m501o647k912L717O150J647n685q530n149P70M032M222L237N02l582
$$ plain form
424 -1603 11366 18067 11498 -2220 -6034 5997 23376 28121 13107 -9587 -20182 -10730 7741
437 7741 16145 5832 -16848 -32725 -28045 -5714 15905 18773 -417 -21954 -23791 -109 27837
450 27837 34848 15227 -10510 -16782 1086 22071 23662 5201 -15237 -19464 -8469 3612 3388
463 3388 -6544 -15697 -16022 -8254 530 4922 3881 579 -2353 -1128 4478 11495 14713 11589 3427
478 3427 -4483 -6401 -2110 4922 7936 3388 -7686 -19448 -22326 -12030 5700 16316 9480 -11045
492 -11045 -25497 -17648 8646 31362 29688 5430 -17964 -19396 1540 23136 25820 8380 -13298
505 -13298 -21291 -12586 2160 8914 4075 -7022 -13569 -10480 -1115 6148 6058 1389 -996 2834 9624
520 9624 12104 7603 956 -1956 1761 7911 9558 3873 -4657 -9806 -9036 -5004 -782 2455 2957 -625
536f25o915m777L184J3118J4327K068j3394j7989o486J2179K0146J0722r451k2050
550e943j7420N58J7483J8331L869j3800j9277r268Q614J9456J3029k732j3432
563e32j0865J254J0202R147P54n856n485j558J940Q60k472k726K55K728K050j453
579a757l375k672P47L058M024M189J769j331m758m942N96O682Q678L551n613j2379
595c533r489N90J0669J3111L956r428j5959j0608N066J7884J6696J256j4878j7481
609a2148m684J1897J8657R172o565j5130j1293O35R953R594J519o447q462m572
623g874J606M571L600J000j426j781p25R28J128M24J38O96J829J675j187l586
639A016l811j461J637L738K921n16n022o924l775K803R034Q683N60q709j1861
$$ plain form
536 -625 -7540 -12317 -9133 3985 18312 20380 6986 -11003 -17489 -5310 14836 25558 16107 -5943
550 -5943 -23363 -22805 -5322 13009 16878 3078 -16199 -25467 -16853 2603 15632 12900 -532
563 -532 -11397 -10143 59 9206 9960 4104 -1381 -2939 -999 -139 -2611 -5337 -5082 -2354 -304 -1757
579 -1757 -5132 -7804 -7057 -3999 25 4214 5983 4652 -106 -5048 -4452 2230 10908 14459 8846 -3533
595 -3533 -13022 -12432 -1763 11348 15304 5876 -10083 -20691 -15625 2259 18955 20211 5333 -12148
609 -12148 -16832 -4935 13722 22894 16329 1199 -10094 -9459 494 10088 11607 5160 -3302 -7874
623 -7874 -6268 -1697 1903 2903 1477 -304 -1029 -101 1027 1451 1589 2285 4114 5789 4602 1016
639 1016 -2795 -4256 -2619 1119 4040 3524 -1498 -8422 -12197 -9394 -360 8323 8883 174 -11687
654a1687l703Q387J3964R031m333j4003j2006r95J1502J3515M264q358j4168q479
668a7069L346J1482R898P46p755r116l497N017Q628N296q14n097m036l04K643
683f32K918J204r95k031n93l04L9P1p92q85J74K255K158L82k460l294r05L677
701a3N851M043j704o709o420q46O801P940L658n414j0933p050K108R738R126J183
717A1359q146j0387m041N121J0699P359j567q983q203q41O487P749L035l912o840
732a111m791P12M207M197M73l440l786j701J820L090J299m17k481r28J367K507
748A017R20j215k551j351J178L357J953j328m292m401J12M339N427J321m314o394
764f222l228L189P182N825m67o580o773j271N726P773L453l430p444n294J354
$$ plain form
654 -11687 -15390 -7003 6961 15992 11659 -2344 -14350 -15345 -3843 9672 13936 5578 -8590 -17069
668 -17069 -13723 -2241 7657 8403 648 -8468 -11965 -6948 1680 6976 6162 1065 -2971 -3275 -632
683 -632 2286 3490 2495 464 -129 -433 -394 -323 -1115 -2000 -1826 429 2587 2969 509 -2785 -3690 -13
701 -13 5838 9881 8177 1468 -4952 -5798 1003 8943 12601 7187 -3746 -10796 -8688 1050 10176 11359
717 11359 3213 -7174 -11215 -6094 4605 11964 10397 1414 -6789 -7630 -1143 6606 9641 5729 -1111
732 -1111 -5902 -5190 -983 3214 3687 247 -3539 -5240 -3420 -330 969 552 -1929 -2857 -1490 1017
748 1017 1937 722 -1829 -3180 -2002 1355 3308 1980 -2312 -6713 -6601 -2262 3165 4486 172 -6222
764 -6222 -9450 -6261 921 6746 6279 -301 -7074 -8345 -2619 5154 8607 5177 -2267 -7561 -6207
779f207N774N868R94m586o199k459K320O164L567j113m132l523l18L815M328Q56
795E149j992l447j726J433L170J554r63l615k101M76K852K781n81l480k559k29
811c278L233L924J099k435m118k358K146N162K847j248m991m180k40L885M269
826C717J493k977n345k887J541N174L670k55m494m263p22L772M516J930k212m089
842a431k925J074L623L367l38l389l779o96K240L790J382j969l292k170J152L198
858a63L139l88k756l283j75K670L564J540k550l316j965J193L469K566p96l404
874f55k771o23L064L082J290k307l247j431J898L542K085p63l150k576K99K574
890C11L266J52k462l170j037J337L346J634j175l164k359M45L046L010K91k092
$$ plain form
779 -6207 -433 5435 6429 1843 -4356 -6815 -4495 1669 5236 4123 -9 -3532 -3850 -35 4293 5149
795 5149 3157 -290 -2016 -583 2587 4141 3178 -437 -2538 -2062 790 3571 2990 -490 -3049 -3278
811 -3278 -45 3879 4978 2543 -1575 -3933 -1787 3375 6222 4974 -17 -4197 -4437 -552 3717
826 3717 5210 2233 -3112 -5999 -4458 716 4386 4131 -363 -4626 -5348 -1576 2940 4870 2658 -1431
842 -1431 -4356 -3282 341 3708 3370 -19 -3798 -4494 -2254 1536 2918 949 -2343 -4513 -3361 -163
858 -163 2976 2588 -168 -3451 -3626 -956 2608 4148 1598 -1718 -3683 -2490 979 3545 2749 -655
874 -655 -3426 -4049 -985 2097 3387 1080 -2167 -3598 -1700 1842 3927 3164 14 -2562 -2263 311
890 311 3577 3729 1267 -1903 -2940 -1603 1743 3377 2202 -962 -3321 -2876 170 3180 3471 1379
906A379l366j023J631L540K211j093l448k710j19K789L053R31k170l765j651J173
922b638L091K644m83k954k649j84K134L168R59j623k755j559J131K661J561q84
938A620k009j933N1K027K045J51k182k165l20J778K554M20r20k440j505R92K553
955G17K266p61k162k490k23J768L004R74j476l059j981N25K908K760j43j753l160
972b286j185J583L208J992p75k697k419j61K714K258O58j594k824j095J304K141
988H22J534j167j810j264l28K095J474M63j670j783l2J573J670K81j588j468m40
1005a638J070J374J293r18k012q63L9J637J717L75j644j770j397J298K049J974
1021B584n31j734k049q49J926K264J003o76k541k048J99K597K106L31k119k309
$$ plain form
906 1379 -1987 -3010 -1379 2161 4372 3279 -169 -2879 -2998 -209 2844 3775 1605 -2160 -3811 -2638
922 -2638 453 3097 2614 -340 -2989 -3173 -1039 2129 3088 1465 -1290 -2849 -1718 943 2504 1620
938 1620 -389 -2322 -2271 -244 1801 1952 -230 -2395 -2715 -937 1617 2037 1117 -1323 -2828 -1836 717
955 717 2983 2222 60 -2430 -2653 -885 2119 3093 1617 -1442 -3423 -2898 10 2770 2627 874 -2286
972 -2286 -3471 -1888 1320 3312 2537 -160 -2579 -2740 -26 2232 2890 1296 -1528 -2623 -1319 822
988 822 2356 1189 -621 -1885 -2213 -118 1356 1819 149 -1634 -1666 -93 1577 1858 270 -1198 -1638
1005 -1638 -568 806 2099 1181 -831 -1694 -1655 -18 1699 2074 430 -1340 -2737 -1439 610 2584
1021 2584 2053 319 -1730 -2579 -653 1611 2614 1938 -603 -2651 -2452 145 2251 2582 463 -1846
1037a846o85J350K516O67p76k338o24J08K023J486n91j216j447N6J285J349j38
1054A179r21j279k32M47J847N36r46j411o74J0J346J466k8j044j139n30R43J265
1072H35N82j10j370j327j50J064J564P12j158j924n33K32J793J495j06j578j898
1089a877k80J831J687P23j129k135o59J049J740Q35q18j706n48J08J421J202j43
1106A301j422j340J1J194J081N75q88j247p40P36Q68Q79n7p20q99m34M58J159
1124E15N61k89q57j070q1Q45R99O09o04j173q81M78J395O87P0j361q76L0N94J601
1144A192J14j229j085n73J037J462M12r86j350m72R47J724N27p24j726q98Q20
1161h08J230Q96K46j242j380q2M61J106P40k25j002o77m67M57J159M34k0o05r99
$$ plain form
1037 -1846 -2531 -1181 1335 2002 1226 -1112 -1736 -1628 395 1881 1290 74 -1373 -1317 -32 1317 1179
1054 1179 258 -1021 -1253 -806 1041 1577 631 -780 -1454 -1444 -98 1368 1340 296 -843 -1373 -430 835
1072 835 1417 1307 -63 -1390 -1540 -476 1088 1800 642 -1282 -1815 -1583 210 1705 1599 21 -1877
1089 -1877 -2157 -326 1361 2084 955 -1180 -1839 -790 950 1785 967 -739 -1287 -1179 242 1444 1301
1106 1301 -121 -1461 -1450 -256 825 1400 512 -735 -1475 -739 129 1008 951 231 -668 -1102 -644 515
1124 515 1076 787 -70 -1140 -1221 -376 623 1232 628 -545 -1426 -948 447 1134 1204 -157 -1033 -1003 -409 1192
1144 1192 1306 77 -1008 -1581 -544 918 1330 344 -1006 -1478 -531 1193 1720 996 -730 -1628 -808
1161 -808 422 1318 1564 322 -1058 -1140 -679 427 1167 942 -60 -737 -1204 -747 412 846 826 221 -778
1180g78l36N29J139M31%q69j238J74Q36R99L93j024p81j35K92J130L26j315m18
1199f45M7O35M86L69r00j010J23J086J036O4j185j180r5P13J509N33p77j616q58
1218a665O56R62J439j69r77r01o41P61Q20O20L83o16j012o25j88N31J157O69k89
1237I15j310j006N9J132J146J51q52j177l06Q32O75M81j79j041m5K78O68j01m62
1256a42m13L26M87N57l22j005q01K29J552J215m95j286j275k83J286J139Q28p26
1274H71j204j108K05P34J480L98l92j203r06L6M76Q65J209n21o16j220q08P63
1292i41J537Q20r5r43j609k90J053J195O76p04j060m81J86M08Q98m08l51m1N45
1311C95k27l48n86J90L81J223M3o77j324p55P32J401J498p88j319j557K10J013
$$ plain form
1180 -778 -1114 -585 554 985 985 116 -1122 -948 -112 887 1280 256 -525 -660 -368 762 1088 -227 -645
1199 -645 -598 37 523 892 -8 -1018 -895 191 1227 1291 106 -1074 -1169 -456 1053 1586 809 -807 -1665
1218 -1665 -1009 -47 1392 1223 246 -655 -1296 -535 285 905 1288 672 -340 -965 -1153 -622 535 1204 915
1237 915 -395 -1401 -1342 -210 936 1087 235 -942 -1248 -416 259 740 561 -480 -525 -247 421 320 -142
1256 -142 -555 -229 258 815 493 -512 -1313 -1084 468 1683 1188 -98 -1373 -1656 -370 769 1597 871
1274 871 -333 -1441 -1236 -502 978 1376 984 -219 -1125 -1089 -613 252 1461 940 324 -896 -1704 -941
1292 -941 596 1416 1321 378 -1231 -1521 -468 727 1403 699 -361 -842 -656 -248 650 242 -109 -150 395
1311 395 168 -180 -766 -576 -195 1028 1071 394 -930 -1685 -953 448 1946 1158 -161 -1718 -1508 -495
1329d95J163O64l34q22j302j86N34Q11J095r2j63j409p82J14P24J568O92n10j761
1348d91j336J58J836J220K96r73j550p37Q26J033P42l60q11m38n3Q59pk8m45P52
1368D93N15m78q54m42j38Q41J265O10j120j510q80O77J451J131m8j207j215k97
1386a206N37J125O31m7n64p69n92l44N63J162R30n5j331j313o72R59J730J182
1404A926l44j793j879K32J154J801O63q77j490p19K90J107O99o6m68j53L7j10
1422A0l41l48L36R45L82j14o95j533L4J048J407N37p63j446j355O39J359J241
1440A343n8o41j361k62MO27O01Q14j46n59o74j253M39J167J122N99p46j948r64
1459a896L71K087J292j35j460j568l57J076J237Q30o27j120l39j55Q34j76M90
$$ plain form
1329 -495 668 1332 998 176 -1126 -1312 -778 33 1128 1036 873 -536 -1318 -1204 -480 1088 1780 1270 -491
1348 -491 -1827 -1669 167 1387 1683 710 -840 -1577 -751 282 1024 664 -147 -585 -638 221 214 186 -259 493
1368 493 1008 530 -324 -766 -904 -63 1202 1812 692 -818 -1698 -1021 430 1561 1513 306 -909 -1206
1386 -1206 -669 456 1087 1040 476 -293 -885 -1229 -666 496 1426 1371 40 -1273 -1945 -986 744 1926
1404 1926 1582 -211 -2090 -1858 -704 1097 1760 883 -607 -1326 -1036 71 770 704 236 83 120 10
1422 10 -331 -679 -343 602 984 870 175 -1358 -1324 -276 1131 1668 905 -541 -1896 -1257 102 1343
1440 1343 1285 644 -717 -979 -975 -348 253 1067 921 362 -312 -1565 -1126 41 1163 1762 1016 -932 -1896
1459 -1896 -1525 562 1854 1719 259 -1309 -1666 -590 647 1477 850 -270 -609 -764 70 -106 384
1476C84m37M74J87k56r96l90J93J308J005k45j237j268m89J349J506M91n47j572
1494e40r79M99N86Q81J59j0m21o10n17J56O06N98O69J01j256j116m52Q82J707
1513I43J170r26j534j441L3J775J320L80j318j331m81O58J146M01l48k99l02l5
1531a89Rp2RJ52O98K93o66q57o01L20Q79J501j41r40j456k77O81J194P01m17q69
1552d8m58k16L36K75L35M04l9m25o17n26j10J112J215L25r21j402r48P05J687
1571F84J022j26j792j188k18J305J289Q6n26j195j08L83P18k64K24n15K87J77
1589B43r0o14k66j85J290O89k17j102r20J78J055O74M99o52j136m44M43N14P76
1608G35k54k42k61J66m73k93L05O42L81J69r13j021l84Q57J359P03o77j363o31
$$ plain form
1476 384 -53 421 608 352 -644 -1034 -841 467 1472 1227 -10 -1278 -1767 -418 1088 1579 1032 -540
1494 -540 -1519 -1020 -434 447 606 596 175 -435 -952 -796 -190 408 1077 1178 -78 -1194 -1646 -764 943
1513 943 2113 1187 -347 -1788 -1755 20 1340 1720 402 -929 -1410 -752 394 795 447 148 -154 -189
1531 -189 -180 -252 -243 -91 607 900 234 -623 -1224 -904 -25 1476 1335 395 -1061 -1338 -657 537 1238 821 -48
1552 -48 -506 -722 -386 -111 224 628 589 164 -453 -979 -1089 23 1238 1563 642 -760 -1708 -1003 684
1571 684 1706 1580 -212 -1400 -1618 -313 976 1062 536 -659 -767 -384 334 70 294 -221 66 243
1589 243 153 -461 -727 -912 378 1067 850 -252 -1172 -994 61 735 1234 582 -554 -998 -555 -41 735
1608 735 481 239 -22 144 -329 -622 -317 325 706 875 -38 -1059 -1443 -586 773 1476 799 -564 -1195
1627a195N6J363J106n9j262q31m69R12P03K38P0q68j85L88Q7j26j78J19M17M80
1647G66n07m67p09k3J206P34j51r34o93k92P77P46L76m81o52r4L14K44j69J04
1667I5M2J76N9k09o84k34O16R23J57o49r15o39L58J605R11p02j257r18M65N62
1687b38R68M6q37p44K13L35Q10M0m26l05M0L89J10n80o47L13P39L02P6q26l36
1708e58Q6L96Q30k56n49l73K81N2M54K3m50L0Q0K23k4n66k16K31Q46j67J36q40
1730c31l70L05P09P31l81j165o65K85J241M36M8q81p07N2P77M41p2m31p01J40
1750e39P16M82n92j96l46K36N55P2m14l23R8J69M32K9n94l9Q7r9O86n6k75n20
1772d31K94K60M08m74l13KJ51N72k1n83l55K87K78O35k90o48l50Q8P16K00M5n99
$$ plain form
1627 -1195 -1139 224 1330 1271 9 -822 -1291 -379 324 562 632 -236 -421 -33 54 -72 -250 -131 286 766
1647 766 259 -208 -917 -940 266 1000 849 -85 -778 -1070 -293 453 829 348 -304 -398 -84 160 -9 95
1667 95 137 313 372 163 -521 -755 -139 784 941 292 -623 -1262 -904 701 1612 910 -347 -1265 -800 -238
1687 -238 730 776 -61 -805 -592 -257 553 593 167 -138 -98 291 401 -179 -826 -513 226 528 604 -222 -558
1708 -558 -472 -76 754 498 -51 -424 -143 -91 363 386 -64 -34 46 269 245 -321 -537 -306 540 373 509 -331
1730 -331 -701 -396 313 1044 663 -502 -1167 -882 359 795 843 -38 -745 -693 84 525 453 22 -679 -539
1750 -539 177 659 67 -129 -475 -239 316 388 -26 -349 -251 -82 350 379 -215 -254 -167 -266 420 364 89 -431
1772 -431 -137 123 531 57 -256 -254 -103 469 448 -135 -490 -203 75 710 420 -228 -578 -490 226 426 471 -128
1794a28n09o2J141K17p6m45p34K53M22M98j50p01l27J38M48O99l06o81j54N58
1814A01K05N0l76j38j02K19L04j13n22J97J72M51j21l92l65K55J67J94N09m98
1834A97n55M6J24M83M53l94p90R6M89J60L7m86l99K72K70N57k37m39j52k72O91
1855A51N78m63m83n20M85L29O30p3j001M5M9J49O64j88m63k0J20m1K2J39k92J31
1877e2J13J61m37m6j84K09P11P8m09l56k62J87O51M41n08o57j88P5P19J39j01
1898B84l72l52N14L9K18n51m63P09K90N2k88m87l22J91P64K16j8p08o5l22L66
1919c05R76N7m95o06R3L84P3J80J50n77n8J76j55j32j31M03L56m5k63n09q1J90
1941c19R16p8k46o53r7j64Q78K44n6m09m23J0J69P05m54Q2m0j7K22k49l29m3J01
$$ plain form
1794 -128 -637 -699 442 659 583 138 -596 -343 79 577 427 -274 -601 -463 -15 684 378 -303 -457 101
1814 101 306 356 -20 -158 -260 -41 263 150 -372 -175 -3 448 327 -65 -430 -175 -8 186 695 197
1834 197 -358 -312 -188 295 748 354 -436 -340 149 309 346 -140 -539 -267 3 560 323 -116 -268 -540 151
1855 151 729 266 -217 -737 -252 77 707 634 -367 -322 -273 -124 540 352 -111 -131 -11 -52 -30 109 -183 -52
1877 -52 61 222 -215 -261 -445 -236 475 553 144 -212 -474 -287 364 805 297 -360 -548 -473 246 385 284
1898 284 -88 -440 74 113 331 -220 -683 26 316 368 80 -407 -729 -538 226 442 424 -284 -349 -671 -305
1919 -305 671 728 233 -373 -280 104 177 357 507 -70 -128 48 -107 -239 -370 33 389 344 81 -428 -509 -319
1941 -319 597 519 273 -380 -477 -641 237 481 425 16 -407 -397 -228 477 23 105 65 48 270 21 -308 -351 -250
1964b50M94L50q6q94l43J76Q45N65j17o99q61J96O80L16R1l13j51k52qK32j49
1985a78L71j78J48o5l37k92J34K86O15ok84q38j04J83Q12M61l00k35o43j56M52
2006a54L87K03n17j49N5N8K34j59j45kL02K58l26k63m38M71P24K0j84l70m44k21
2028f60O58M93J48j05o87m70n1Q93J17q5j22Q1l20l02j39N73K36R3L30n61p24
2049f04NN34N48J47k98p78k70K19L93O52l09j30k36k17n1M01K86q8j40P0j64R8
2071F8k08l2lN69K48m08l69n15p5Q77K15L48n94m74l66N05L48K62j95l01j10k15
2093d25L6ON31R0K53k34m63q1K21J14N04N8o76q7n98L98M17O71j27m12r04J02
2115f06M69M94K82n14k85j31J57L87k11j38J4k2K65q4j47l57R3N84k0Km93q0J0
$$ plain form
1964 -250 244 594 508 -386 -729 -553 292 857 740 41 -820 -624 56 372 463 150 -1 -253 -261 -29 -178
1985 -178 193 15 163 98 -239 -531 -397 -111 504 498 214 -624 -728 -545 267 728 428 193 -450 -606 -154
2006 -154 233 436 -81 -230 -175 -117 117 -42 -187 -189 113 371 45 -218 -656 -185 539 559 375 5 -439 -660
2028 -660 -2 491 639 534 -153 -623 -674 219 336 251 129 210 -110 -412 -551 22 258 351 681 120 -604
2049 -604 -599 -65 483 630 332 -446 -716 -497 -104 548 239 109 -127 -344 -395 6 292 204 64 134 -30 68
2071 68 -140 -172 -175 394 642 234 -135 -650 -725 152 367 715 121 -353 -719 -214 134 396 201 -100 -210 -425
2093 -425 -389 -383 148 238 491 257 -206 -287 -66 48 552 610 -66 -153 -751 -353 64 735 608 196 -708 -606
2115 -606 -137 357 639 125 -160 -291 -134 253 42 -96 -82 -104 161 77 -70 -427 -334 250 230 232 -261 -341 -331
2138c31K79L99R2r3m46j58%K47K65J5J5Q7n76l7j48L47N7J72K20k90n90J72J03
2161a99P06J28r4n95o17J51N24L97k3m37l01K91o9J29q0J95O0K6j36Mk18j7J77
2184BP9J94j16k6j85l36L66K30J44k70l50oj26O26K47l15O3n79J28k10N26K8P7
2207A91J25m21p7l04K70J97M38k30j85k13k96L59O29j39k42J88n45mM5J58N06
2228D50m46k54J72j43M06j70j95K09J81j66j97J96l13K00L19o0L13m79n15l0O04
2249H2K32L5l10R7m40M14q2j63L77k28j46j13k46M68o8K40j89K8l15K43l73N12
2271E5L15J69n91n0j78N8L76RM1m11J38k01K86q8K57k04k02K85n0l32M49j33M6
2294D4J7k66K46n3p0N0J38M2K82j72o34J9K84J20J31k78J6j23J42m8P2K16J01
$$ plain form
2138 -331 -52 347 439 346 -100 -258 -258 -11 254 269 284 371 -205 -242 -390 -43 14 186 406 116 -474 -302 -199
2161 -199 507 635 541 -54 -671 -520 4 401 378 -59 -360 -69 -138 -9 -89 106 166 192 56 60 -158 -175 2
2184 2 81 275 159 133 -52 -388 -22 208 352 82 -268 -274 -400 226 473 158 221 -358 -230 -440 86 114 191
2207 191 316 -105 -182 -486 -216 -19 419 189 4 -209 -505 -146 483 344 102 290 -255 -259 -214 -56 450
2228 450 4 -250 -78 -221 185 15 -180 29 210 44 -153 43 -270 -70 249 189 502 23 -492 -522 82
2249 82 314 349 39 136 -304 110 28 -135 242 14 -132 -245 -491 -23 -91 149 -40 -12 -327 -84 -457 55
2271 55 370 539 -52 -102 -280 -222 154 163 204 -207 -69 -270 16 -72 185 -19 -221 64 14 -318 131 -2 44
2294 44 61 -205 41 -12 -82 -32 106 148 430 258 -376 -357 -73 47 178 -100 -84 -207 -65 -113 -41 175 276
2317B76j62n8K2j80k57R6M28j91k23p6J36Q4K26K8j75j88K19Q1k76J6LJ65n6l7
2341i9L2J79j19L32k77k09L33r4P7k70K08n7K9K31m43r2R9K9J66J02l17K25Mr0
2365b1k47K72j8qr9J42l2k99N99r1j89j24o7M94j55k33qJ12M4J83j61n1k8N5N0
2390A20j27k0l1J70J33m09k10J56M43r0k33j42M61l31J09j32J26J21j10K4P0R1
2412A89j49N0j4j5o5OK76l18K85j76k47J14K92Q4k25k85j12K30J91q8J47l7j58
2435b5m6j15K44J49j04j00j0L3k35M06n8J50k01l7j55l7L20Q7m97J65j72K33l0
2458c5j7L47k32j35J62J20O1k11j07L0k9n8J6R4j66o5L5J56J61k47l0L17j78j3
2482b4o8L24r5j04j94L25J1j26J14nj32p0P0RJ9K37l28K3P9n1N0M9j13j80p9j06
$$ plain form
2317 276 114 56 78 -102 -359 -263 165 -26 -249 -325 -189 -105 121 149 -26 -214 5 86 -190 -174 -171 -6 -62 -99
2341 -99 -67 112 -7 325 48 -161 172 78 155 -115 93 36 65 296 -147 -239 -140 -111 55 157 -160 65 69 -21
2365 -21 -268 4 -14 -22 -121 21 -11 -310 289 198 9 -115 -182 312 157 -76 -84 28 72 255 94 43 15 70 120
2390 120 -7 -27 -58 112 245 -164 -374 -218 225 135 -98 -240 221 -110 -1 -133 -7 114 4 28 98 189
2412 189 40 90 76 61 -4 2 278 -40 245 69 -178 -64 228 312 87 -198 -310 -80 111 23 170 133 -25
2435 -25 -71 -186 58 207 103 3 -7 26 -209 197 139 289 88 51 -104 -141 179 266 -231 -66 -238 -5 -35
2458 -35 -52 295 63 -72 90 210 271 60 -47 -17 -46 -104 -88 6 -160 -225 -190 -34 127 -120 -150 167 -11 -24
2482 -24 -92 232 137 33 -161 164 175 49 163 158 26 -44 26 35 54 291 -37 -14 65 14 64 113 0 -180 -259 -365
2508c65L62L2j08j3k85M78J36l00K58J24o77L85q1J48J20K9m31J30l9N9K13n2
2530A23K11l41j40J89No5K51k58m2Q6k30P8K95k03k59L49l46K17m3K50o4P0k66
2553a33n8K30q1J51K7k88J92L2Q2j49j76J39l06L25J17r4K34k02j71j37N61n0
2575B45k70nj4J6J75m6J56j73k96Q0j21M55l11K11k31J31k1J64o2O0J9l89P7j2
2599a62K78K02j98j36l0J35j40K40J55m22J40l43L62l5q7M31m24j82J27J50M50
2620E11l74k81Q6J36p6K29j73J05l79K96M9k66K93j99P1j52j3l5K54k37J47j87
2642a95J47J0K9K40q2l13j16J2K13J52K11k42k58J49j96M08J01j82k08R3j22O
2664a43K99J89j82m76K17k2J05MK45l35P0R6k01J05k6O3L9L0k28K28nj74L2k38
$$ plain form
2508 -365 -3 29 -79 -92 -377 101 237 -63 195 319 -358 27 -54 94 214 243 -188 -58 -97 -38 175 123
2530 123 334 -7 -147 42 47 -18 233 -25 -67 19 -211 -133 162 -41 -300 49 -297 -80 -123 127 63 133 -133
2553 -133 -191 39 -42 109 136 -152 40 72 154 5 -171 -32 -338 -13 104 10 244 42 -129 -266 295 245
2575 245 -25 -30 -44 -28 147 101 257 84 -212 -132 -253 202 -109 102 -129 2 -19 145 83 143 162 -227 -150 -162
2599 -162 116 318 120 -16 -46 89 -51 189 344 -78 62 -281 81 46 -41 390 -34 -216 -89 61 511
2620 511 137 -144 -58 78 2 231 58 163 -216 80 129 -137 156 -43 28 -124 -137 -172 82 -155 -8 -195
2642 -195 -48 -38 -9 231 149 -164 -280 -268 -55 97 308 66 -192 -43 -239 169 270 88 -120 -27 -149 -143
2664 -143 156 345 163 -313 -96 -118 -13 -9 236 -99 -29 67 -134 -29 -55 8 47 77 -151 77 72 -102 -70 -308
2688c08N50k15j7J08m0k26k08L88j4K87k38N2j02k6k40M47j58m2j83J4K36J22
2710A87k14K36k60m17M72J18J58Qj88k48k48K35P7K37o3K08o55K44k9N8L29j77
2732F8j63J62Q3l86J19K37o5k07M0p0K56j12j56K15J61m03L78N3m06q9J94J47
2754E6L4J52k29J46k20N6j83O22l10k19k3J45m42N12p0L19m62J89m82K67L46P5
2776B79O8m02Q8m01M58k11M67l24q4k15L52j63K4o3M82m14j76J71p4L04o6L0p8
2799E2K13m24k57L82J38J10m7j16j09L7K09k39k70N08o6r1J72l20l92M34j34N76
2821C66j57j48m69Q1L99K40ok95k48j36K96K17k26M03J21p83L06k66L46j00J85
2842A26R2j67p0k25J65J63L5M8j42k30K12k20M02k36LJ93l04M50j23j14j12R1
$$ plain form
2688 -308 242 27 10 118 78 -148 -356 32 18 305 67 119 17 -9 -249 198 40 -2 -185 -171 65 187
2710 187 -27 209 -51 -468 4 122 280 288 100 -148 -396 -161 -84 153 90 298 -357 -113 -142 -84 245 68
2732 68 -95 67 150 -236 -117 120 55 -152 -112 -182 74 -38 -194 21 182 -221 157 210 -196 -285 -91 56
2754 56 90 242 13 159 -61 -5 -188 434 124 -95 -118 27 -415 97 27 346 -116 73 -409 -142 204 279
2776 279 347 -55 33 -368 90 -121 346 22 -62 -277 75 -88 -64 -127 355 -59 -235 -64 -138 166 100 130 52
2799 52 265 -159 -416 -34 104 214 167 51 -58 -21 188 -51 -321 187 121 30 202 -118 -510 -76 -210 366
2821 366 209 61 -408 -327 72 312 306 11 -237 -373 -77 140 -86 317 438 -345 -39 -305 41 -59 126
2842 126 218 51 -19 -244 -79 84 119 167 25 -205 7 -213 189 -47 -44 149 -155 295 172 58 -54 37
2864C7j1k07l1K57M5p2M5j19K52j11l61k8n8N33J31J86k18n68n8K06K03K55j67
2887A41j63j42j5J88J61j04L6M0k21j44J34M4L93k32J42o76J13L08L6L2k38Q3
2909h4k48J98p7K17J34j34N4j1k0j95L28j79J99j24J64k30K4j24R9j08K72J30
2931B85j90Jm05J00M06j9K73k38j32l03j20P48k08k2n31J55r5K82n6J75J82q4
2953B04kk72n3J03J81k15J19k15l9j05N45k6j45J59m01j39L07K14o7p8j90P3K59
2976B17O9l42j57MJ23J62J00l0q1k30j59P37j14j28J39o93K58L11R6k84J0k02
2998a94K66l11K34J2K06k27K4l50P3J23J71m8J69O6j31k78K41j76J93J30j14j39
3020f0j96L15n2J97O2l68j71K03K58J25m83N0J12J2J69j18j89J24j05J49K43j08
$$ plain form
2864 37 26 -181 -212 45 90 18 63 -56 196 85 -276 -304 -362 171 302 488 270 -298 -356 -150 53 308 141
2887 141 -22 -164 -179 9 170 66 102 142 -79 -223 -89 -45 348 116 258 -418 -305 3 39 71 -167 -84
2909 -84 -332 -134 -211 6 140 6 60 49 29 -166 162 -17 182 58 222 -8 16 -108 -9 -117 155 285
2931 285 95 96 -309 -209 197 178 451 213 81 -222 -342 406 198 176 -355 -200 -295 -13 -69 106 288 204
2953 204 202 -70 -123 -20 161 -54 65 -150 -189 -294 251 225 80 239 -162 -301 6 220 153 75 -115 -42 217
2976 217 286 -56 -213 -209 -86 76 176 146 65 -165 -324 413 299 171 310 -383 -125 186 282 -2 8 -194
2998 -194 72 -239 -5 7 213 -14 10 -340 -267 -144 27 -21 148 214 83 -195 46 -130 63 193 79 -60
3020 -60 -256 59 7 204 266 -102 -273 -70 188 313 -170 -120 -8 4 173 55 -134 -10 -115 34 277 169
3042A69k36P7j69J99J93j92o3j81p3L10N9m4m3N8j77j81M01j33R0K6J02o2l02
3065a72N9r4O0L02R6k88j41k58L35L37L49n97o5k02K56K74K55n11m39L53J0Q5
3087DL52m83m7K0L21R6l07j54O4J17M8O3K4m1j17k6j44K48J19l2k02k23L48J1
3111E9k45K08R6M9j34r0l31L99K41k16k0Q0k41K48k5Oq8m1j9j27J33K35J07n14
3135b30N7J27k43L33q0K1q0J4Q1K91k61k29O0N8J46L33m67j65L08j73j32K30J13
3158A12j17m4j73J25J79P5q0k84L56n8j6O4l75J90R0O8m11L23j17O3K73k45j02
3181a04p3J36K74j57j17K47j32o4pK95J5l95J45q1R2J44j23j11k97J74K08j08
$$ plain form
3042 169 -67 10 -159 40 233 41 -22 -203 -276 34 93 49 6 64 -113 -294 107 -26 64 90 192 130 -172
3065 -172 -113 -207 -147 155 251 -37 -178 -436 -101 236 585 -12 -77 -279 -23 251 506 -5 -444 -91 -81 4
3087 4 356 -127 -174 -154 167 263 -44 -198 -134 -17 31 94 118 77 -40 -66 -210 38 157 125 -77 -300 48 59
3111 59 -186 22 118 167 33 -57 -388 11 252 36 16 96 -145 103 78 84 -4 -45 -64 -191 -58 177 284 -230
3135 -230 -173 -46 -289 44 -36 -15 -95 -81 0 291 30 -199 -139 -81 65 398 -69 -234 74 -99 -231 -1 112
3158 112 -5 -49 -222 -97 82 157 77 -207 149 91 75 139 -236 -46 44 112 -299 24 -93 -30 243 -2 -104
3181 -104 -177 -41 233 76 -41 206 74 10 3 298 313 -82 63 -18 74 218 95 -16 -313 -139 69 -39
$$ [...]
8191A22
##END NTUPLES=NMR FID
##END=
