##TITLE=1H_CA-8564
 CDCl3, 8 sc, 
 8.2.2019
##JCAMPDX= 6.0         $$ Bruker NMR JCAMP-DX V2.0
##DATA TYPE= NMR FID
##DATA CLASS= NTUPLES
##ORIGIN= UXNMR, Bruker Analytische Messtechnik GmbH
##OWNER= root
$$ XWIN-NMR		Version 3.5
$$ Fri Feb  8 14:09:05 2019 Russian Standard Time (UT+4h)  she@DPX200
##.OBSERVE FREQUENCY= 200.1313
##.OBSERVE NUCLEUS= ^1H
##.DELAY= (6, 6)
##.ACQUISITION MODE= SIMULTANEOUS
##.ACQUISITION SCHEME= undefined
##.AVERAGES= 8
##.DIGITISER RES= 18
##SPECTROMETER/DATA SYSTEM= spect
##.PULSE SEQUENCE= zg30
##.SOLVENT NAME= CDCl3
##.SHIFT REFERENCE= (INTERNAL, CDCl3, 0, 15.7039)
##AUDIT TRAIL= $$ (NUMBER, WHEN, WHO, WHERE, WHAT)
$$ ##TITLE= Audit trail, XWIN-NMR		Version 3.5
$$ ##JCAMPDX= 5.01
$$ ##ORIGIN= Bruker BioSpin GmbH
$$ ##OWNER= she
$$ F:/spectra/data/she/nmr/H-F/1/audita.txt
$$ ##AUDIT TRAIL=  $$ (NUMBER, WHEN, WHO, WHERE, WHAT)
(   1,<2019-02-08 14:08:15.20 +0400>,<she>,<DPX200>,
      <created by zg, POWCHK disabled, PULCHK disabled
       configuration hash MD5:
       00 E9 B6 7A A2 85 ED C7 34 08 36 98 17 FE 4E 26
       data hash MD5: 16K
       36 5C E7 9F 7E E2 F2 A6 D2 B7 EF 8C 27 0C DD 42>)
$$ ##END=
$$ 
$$ hash MD5
$$ E4 B0 BD 49 BC 20 70 81 E8 6F 24 7A BC 02 18 B7
##$RELAX= 
##$RELAX= 
##$RELAX= 
##$RELAX= 
##$RELAX= 
##$RELAX= 
$$ Bruker specific parameters
$$ --------------------------
##$DU= <F:/spectra>
##$EXPNO= 1
##$NAME= <H-F>
##$PROCNO= 1
##$TYPE= <nmr>
##$USER= <she>
##$AMP= (0..31)
100 100 100 100 100 100 100 100 100 100 100 100 100 100 100 100 100 100 
100 100 100 100 100 100 100 100 100 100 100 100 100 100 
##$AQSEQ= 0
##$AQ_mod= 1
##$AUNM= <au_zg>
##$AUTOPOS= <>
##$BF1= 200.13
##$BF2= 200.13
##$BF3= 200.13
##$BF4= 200.13
##$BF5= 200.13
##$BF6= 200.13
##$BF7= 200.13
##$BF8= 200.13
##$BYTORDA= 1
##$CFDGTYP= 0
##$CFRGTYP= 5
##$CHEMSTR= <none>
##$CNST= (0..31)
1 1 145 1 1 1 1 1 1 1 1 1 1 1 1 1 1 1 1 1 1 1 1 1 1 1 1 1 1 1 1 1 
##$CPDPRG= <>
##$CPDPRG1= <>
##$CPDPRG2= <>
##$CPDPRG3= <>
##$CPDPRG4= <mlev>
##$CPDPRG5= <mlev>
##$CPDPRG6= <mlev>
##$CPDPRG7= <mlev>
##$CPDPRG8= <mlev>
##$CPDPRGB= <>
##$CPDPRGT= <>
##$D= (0..31)
0 1.2 0 0 0 0 0 0 0 0 0 0.03 0 0 0 0 0 0 0 0 0 0 0 0 0 0 0 0 0 0 0 0 
##$DATE= 1549620494
##$DBL= (0..7)
120 120 120 120 120 120 120 120 
##$DBP= (0..7)
150 150 150 150 150 150 150 150 
##$DBP07= 0
##$DBPNAM0= <>
##$DBPNAM1= <>
##$DBPNAM2= <>
##$DBPNAM3= <>
##$DBPNAM4= <>
##$DBPNAM5= <>
##$DBPNAM6= <>
##$DBPNAM7= <>
##$DBPOAL= (0..7)
0.5 0.5 0.5 0.5 0.5 0.5 0.5 0.5 
##$DBPOFFS= (0..7)
0 0 0 0 0 0 0 0 
##$DE= 6
##$DECBNUC= <off>
##$DECIM= 32
##$DECNUC= <off>
##$DECSTAT= 4
##$DIGMOD= 1
##$DIGTYP= 9
##$DL= (0..7)
0 120 120 120 120 120 120 120 
##$DP= (0..7)
150 150 150 150 150 150 150 150 
##$DP07= 0
##$DPNAME0= <>
##$DPNAME1= <>
##$DPNAME2= <>
##$DPNAME3= <>
##$DPNAME4= <>
##$DPNAME5= <>
##$DPNAME6= <>
##$DPNAME7= <>
##$DPOAL= (0..7)
0.5 0.5 0.5 0.5 0.5 0.5 0.5 0.5 
##$DPOFFS= (0..7)
0 0 0 0 0 0 0 0 
##$DQDMODE= 0
##$DR= 18
##$DS= 0
##$DSLIST= <SSSSSSSSSSSSSSS>
##$DSPFIRM= 0
$$ [...]
##$SUBNAM2= <"">
##$SUBNAM3= <"">
##$SUBNAM4= <"">
##$SUBNAM5= <"">
##$SUBNAM6= <"">
##$SUBNAM7= <"">
##$SUBNAM8= <"">
##$SUBNAM9= <"">
##$SW= 20.0189088683792
##$SWIBOX= (0..15)
0 0 2 0 0 0 0 0 0 0 0 0 0 0 0 0 
##$SW_h= 4006.41025641026
##$TD= 16384
##$TD0= 1
##$TE= 0
##$TE2= 300
##$TE3= 300
##$TEG= 300
##$TL= (0..7)
0 120 120 120 120 120 120 120 
##$TP= (0..7)
150 150 150 150 150 150 150 150 
##$TP07= 0
##$TPNAME0= <>
##$TPNAME1= <>
##$TPNAME2= <>
##$TPNAME3= <>
##$TPNAME4= <>
##$TPNAME5= <>
##$TPNAME6= <>
##$TPNAME7= <>
##$TPOAL= (0..7)
0.5 0.5 0.5 0.5 0.5 0.5 0.5 0.5 
##$TPOFFS= (0..7)
0 0 0 0 0 0 0 0 
##$TUNHIN= 0
##$TUNHOUT= 0
##$TUNXOUT= 0
##$USERA1= <user>
##$USERA2= <user>
##$USERA3= <user>
##$USERA4= <user>
##$USERA5= <user>
##$V9= 5
##$VALIST= <valist>
##$VCLIST= <CCCCCCCCCCCCCCC>
##$VD= 0
##$VDLIST= <DDDDDDDDDDDDDDD>
##$VPLIST= <PPPPPPPPPPPPPPP>
##$VTLIST= <TTTTTTTTTTTTTTT>
##$WBST= 1024
##$WBSW= 4
##$XGAIN= (0..3)
0 0 0 0 
##$XL= 0
##$YL= 0
##$YMAX_a= 140544
##$YMIN_a= -111409
##$ZGOPTNS= <>
##$ZL1= 120
##$ZL2= 120
##$ZL3= 120
##$ZL4= 120
##$ABSF1= 10
##$ABSF2= 0
##$ABSG= 5
##$ABSL= 3
##$ALPHA= 0
##$AQORDER= 0
##$ASSFAC= 0
##$ASSFACI= 0
##$ASSFACX= 0
##$ASSWID= 0
##$AUNMP= <proc_1d>
##$AZFE= 0.1
##$AZFW= 0.1
##$BCFW= 1
##$BC_mod= 2
##$BYTORDP= 1
##$COROFFS= 0
##$CY= 11.3945322036743
##$DATMOD= 1
##$DC= 2
##$DFILT= <>
##$DTYPP= 0
##$F1P= 18.9103706918063
##$F2P= -1.10871071338519
##$FCOR= 0.5
##$FTSIZE= 0
##$FT_mod= 4
##$GAMMA= 1
##$GB= 0.15
##$INTBC= 1
##$INTSCL= 1
##$ISEN= 128
##$LB= 0.24
##$LEV0= 0
##$LPBIN= 0
##$MAXI= 10000
##$MC2= 0
##$MEAN= 0
##$ME_mod= 0
##$MI= 1.114404
##$NCOEF= 0
##$NC_proc= 0
##$NLEV= 6
##$NOISF1= 3.799351
##$NOISF2= 2.8
##$NSP= 1
##$NTH_PI= 0
##$NZP= 0
##$OFFSET= 15.70392
##$PC= 1
##$PHC0= -8680.204
##$PHC1= 16.80019
##$PH_mod= 1
##$PKNL= yes
##$PPARMOD= 0
##$PSCAL= 0
##$PSIGN= 0
##$REVERSE= no
##$SF= 200.130013532006
##$SI= 16384
##$SIGF1= 3
##$SIGF2= 2
##$SINO= 400
##$SIOLD= 16384
##$SREGLST= <1H.CDCl3>
##$SSB= 0
##$STSI= 0
##$STSR= 0
##$SW_p= 3612.71676300578
##$SYMM= 0
##$S_DEV= 0
##$TDeff= 0
##$TDoff= 0
##$TI= <>
##$TILT= no
##$TM1= 0
##$TM2= 0
##$TOPLEV= 0
##$USERP1= <user>
##$USERP2= <user>
##$USERP3= <user>
##$USERP4= <user>
##$USERP5= <user>
##$WDW= 1
##$XDIM= 8192
##$YMAX_p= 0
##$YMIN_p= 0
$$ End of Bruker specific parameters
$$ ---------------------------------
##NTUPLES= NMR FID
##VAR_NAME=  TIME,          FID/REAL,        FID/IMAG
##SYMBOL=    X,             R,               I
##VAR_TYPE=  INDEPENDENT,   DEPENDENT,       DEPENDENT
##VAR_FORM=  AFFN,          ASDF,            ASDF
##VAR_DIM=   8192,          8192,            8192
##UNITS=     SECONDS,       ARBITRARY UNITS, ARBITRARY UNITS
##FACTOR=    0.0002496,     1,               1
##FIRST=     0,             0,               0
##LAST=      2.0444736,     0,               0
##MIN=       0,             -111409,         0
##MAX=       2.0444736,     140544,          0
$$ Real data points
##PAGE= N=1
##DATA TABLE= (X++(R..R)), XYDATA
0 0 0 0 0 0 0 0 0 0 0 0 0 0 0 0 -8 8 -8 8 -8 9 -16 16 -22 24 -26 32 -40 44 -49 57 -65 76 -88 97 -111 125
36 125 -140 157 -175 195 -216 240 -268 297 -329 361 -400 441 -486 536 -590 651 -717 790 -875
55 -875 967 -1076 1197 -1340 1509 -1711 1960 -2273 2683 -3244 4066 -5390 7885 -14291 71117
70 71117 118669 33111 3508 -28157 -7207 20553 37578 10747 -33077 -90978 -111409 -88625
82 -88625 -29470 37208 87769 79580 32999 -20320 -58282 -62968 -18943 32217 61269 59175 24570
95 24570 -24273 -43135 -28710 7632 53142 74345 45271 -10477 -65659 -100415 -88722 -35697
107 -35697 20129 56832 56333 18549 -22014 -37839 -27171 13656 64602 79600 52143 7356
119 7356 -42676 -73283 -56764 -11441 29532 48475 29101 -18469 -59814 -75001 -53675 3554
131 3554 58023 77598 66521 28923 -20520 -42356 -24477 6297 35471 44046 13858 -34821
143 -34821 -70295 -79163 -49868 8739 56644 72945 56982 11150 -37091 -52586 -36879 -2402
155 -2402 35221 45902 23221 -9651 -37563 -43416 -9748 38216 65385 65124 31998 -28595 -78248
168 -78248 -89398 -67052 -21405 25944 44136 32932 7410 -16942 -14647 18544 52979 71964
180 71964 65592 21379 -40449 -78840 -84178 -58887 -9134 32933 41919 25284 -6144 -32974 -29510
193 -29510 -208 32676 56746 52368 13952 -29763 -54358 -53493 -21548 24799 51934 49887 23651
206 23651 -19478 -49214 -44479 -19276 13519 40054 34940 991 -32464 -50842 -44474 -7262 35518
219 35518 57875 54587 23099 -18671 -39243 -32444 -7889 27330 47569 30892 -5316 -40072
231 -40072 -62413 -54033 -15525 22846 44538 42130 13363 -19281 -31068 -21339 7389 41962 51959
244 51959 31139 -3030 -40193 -60689 -46099 -9597 24749 45171 39118 7280 -21584 -32577
256 -32577 -25256 3604 33082 37045 18571 -12469 -45619 -55522 -33316 2948 38001 56035 41906
269 41906 9140 -19126 -33859 -25037 5562 28755 29993 14016 -17427 -47332 -49845 -25525 9160
282 9160 41778 52942 32962 372 -27584 -40408 -24941 5684 25545 28814 13855 -18197
294 -18197 -41187 -37060 -14304 19789 49582 52340 29485 -1875 -31220 -41056 -23524 2081 18837
307 18837 22177 3324 -26630 -42109 -35082 -10671 25462 51532 49525 27949 -3720 -31523 -35118
320 -35118 -15895 6805 24298 25165 2174 -24785 -36786 -30870 -6335 27098 44444 37729 13832
333 13832 -19835 -42621 -38278 -16602 9814 30897 30074 7644 -14061 -25081 -20300 4325 31695
346 31695 40190 29544 2260 -31336 -47381 -39238 -16541 12579 32074 26574 5653 -13773 -25419
359 -25419 -17763 8331 30504 37661 28163 281 -28384 -38260 -29842 -7721 19188 30314 18106
372 18106 -3010 -23946 -34391 -20739 6770 29571 39616 29486 1971 -21961 -29724 -22606
384 -22606 -901 22167 25487 11165 -10209 -31306 -36216 -17312 10207 32323 40539 25379 -2975
397 -2975 -24735 -32758 -23197 2316 22857 25085 15262 -4661 -23267 -22850 -5135 15762 32085
410 32085 31601 8338 -20469 -40857 -46404 -29398 1119 22817 30227 24230 5156 -10023 -7616
423 -7616 5522 22599 33616 25468 80 -26459 -45264 -45312 -22637 6140 25115 30197 17995
436 17995 -6270 -21154 -19210 -6384 13397 26345 19822 2004 -17191 -29173 -21380 3483 26654
449 26654 39894 36070 11955 -16979 -33059 -33859 -19911 2310 14776 10470 -2815 -19059 -26781
462 -26781 -14923 7505 27555 38700 31707 7593 -15048 -25672 -22521 -2999 18803 26163 18685
475 18685 255 -23229 -33939 -25146 -7881 11521 23123 15744 -2728 -16511 -21210 -10727 12421
488 12421 31271 34774 23301 -1347 -26089 -34202 -25703 -7029 14608 24771 15524 -828 -14759
501 -14759 -21107 -10220 10015 22790 23734 10646 -13156 -30734 -31287 -17381 6785 29989 35320
514 35320 23206 4101 -15928 -24672 -15540 -673 10446 12503 941 -17492 -26472 -21878 -5338
527 -5338 20130 38120 36870 21078 -2321 -24240 -30296 -18674 -2267 11952 15770 3625 -11887
540 -11887 -19708 -17325 -1688 19548 30035 24603 8230 -15347 -31669 -28532 -11900 9051 26023
553 26023 27332 12705 -4458 -16675 -17768 -4412 12063 18180 13084 -2462 -22807 -31282 -23404
566 -23404 -5439 16493 30802 26742 10275 -6881 -20198 -18776 -2467 13538 21415 18374 2567
579 2567 -16387 -23688 -18762 -4624 13453 20897 12952 -2952 -20022 -28350 -18718 1792 19899
592 19899 30883 26725 8470 -9828 -18087 -15764 -2628 12881 16323 7883 -7170 -23204 -27114
605 -27114 -14806 4082 20902 28920 19126 -1137 -17504 -24842 -19319 -1098 15429 20457 15308
618 15308 1232 -13687 -15871 -5993 7971 20676 22843 8657 -11200 -26048 -31060 -20314 286
631 286 16639 22774 17563 1229 -12231 -13926 -6361 6792 19556 19203 5705 -9767 -22446 -24150
645 -24150 -10455 8178 21834 24279 13780 -5637 -18964 -20874 -12982 3759 16494 15622 5422
658 5422 -8398 -19603 -18388 -3647 12347 23087 23188 9060 -9226 -20507 -20694 -10041 8040
671 8040 18625 17529 7150 -8677 -19659 -16852 -4725 9352 19484 17959 3689 -11022 -19493
684 -19493 -18687 -5335 11562 19704 17029 5607 -11254 -20498 -16806 -4544 10886 20906 17352
697 17352 4252 -9216 -18211 -15451 -1240 12595 18027 14369 250 -16273 -22807 -17022 -3843
710 -3843 12440 21004 15932 3293 -10074 -18295 -12818 1460 13345 19044 14136 -985 -14916
723 -14916 -19407 -14251 -393 14743 19631 12511 171 -14545 -20752 -13447 -61 11760 17817
736 17817 11931 -2697 -14022 -17455 -10846 3969 17295 20033 13166 -280 -14705 -18498 -10653
749 -10653 1025 12978 17005 8322 -5769 -15952 -18850 -10826 5230 16283 18527 11330 -3236
762 -3236 -15777 -16909 -9456 3365 15591 16946 7372 -4493 -14467 -16531 -6470 7945 17016 17623
776 17623 8453 -7546 -18218 -18349 -10441 3204 14563 14811 6304 -4826 -14376 -14260 -3432 8815
790 8815 16806 16760 5445 -8838 -16641 -16034 -6972 7911 17377 15818 6581 -6224 -15974 -14990 -5572
805 -5572 5525 13495 12196 1165 -10461 -16169 -13450 -1744 12206 18814 16048 5934 -8623
818 -8623 -17012 -14045 -4333 7519 15787 12462 1573 -8737 -14675 -12094 -722 10591 14472 10711
832 10711 -203 -13566 -18270 -13150 -2260 11168 18348 13920 3944 -6763 -13989 -10840 -16
845 -16 9287 12702 8887 -2275 -12924 -15371 -9806 1396 13596 17141 10559 -375 -12523 -18469
859 -18469 -12734 -1238 8997 14328 10726 -49 -8413 -10420 -5893 5093 14342 14615 6952 -4619
873 -4619 -16281 -19205 -11121 945 11657 16649 10364 -865 -9409 -12656 -8027 2810 10404 10470
887 10470 4918 -5575 -14297 -13013 -4644 6640 15904 17431 8618 -3225 -12773 -15814 -9500 1237
901 1237 8862 10772 5650 -4844 -11535 -9657 -3224 6382 14130 12154 2975 -7311 -15611 -15354 -5635
916 -5635 6407 14315 16039 8601 -2660 -9861 -10185 -5092 4168 9855 6955 -1063 -9860 -16047 -12126
931 -12126 -1080 9376 16503 15644 5561 -5829 -12463 -12807 -5177 5235 10698 9046 2878 -5897
945 -5897 -10857 -7103 958 9178 13720 9301 -1573 -10734 -16236 -13983 -3604 7959 13248 11765
959 11765 4692 -5456 -9727 -6909 -389 7091 11193 6215 -2545 -10469 -13359 -8709 2630 11563
973 11563 14611 11383 939 -9515 -13190 -10824 -3043 6317 9683 5844 -1236 -7731 -10201 -4187
987 -4187 4861 11733 13273 7715 -3137 -11682 -13745 -9316 587 9917 12243 8186 803 -7901 -10781
1002 -10781 -5642 1621 7619 9135 3517 -5577 -11421 -11522 -5411 5031 12936 13301 8154 -1344 -10047
1017 -10047 -11701 -6433 1181 8003 9926 4466 -3265 -7903 -8767 -2792 6701 10702 9742 2976 -7464
1032 -7464 -14091 -13055 -6561 2815 11168 11786 6405 -890 -6718 -7446 -1378 5703 9154 8078 1391
1047 1391 -7958 -12624 -10761 -3847 5641 11796 10160 3815 -4306 -10602 -10080 -3356 3960 8311 8832
1062 8832 2207 -5413 -8204 -6302 124 8248 11789 8435 1368 -7275 -12680 -10328 -3294 4494 9457
1077 9457 8304 1590 -5454 -8544 -7335 -257 7096 9431 6979 107 -7909 -10617 -6659 473 7828
1092 7828 11875 8511 401 -6023 -10226 -8315 -886 5694 7794 6229 -884 -7559 -9230 -5392 865
1107 865 8134 10592 5979 -990 -7357 -10384 -6917 1089 7401 10043 7202 -294 -6722 -8356 -5483
1122 -5483 926 7072 7819 3770 -2596 -9023 -10063 -4863 2376 8157 10264 6220 -1484 -7360 -8775
1137 -8775 -5445 1917 7740 7855 4003 -2152 -8036 -8319 -3219 3344 8619 9248 4186 -3559 -8629 -9745
1153 -9745 -5389 2128 6852 7199 3945 -2702 -7848 -6933 -2372 3714 8925 8610 2846 -3297 -8120 -8459
1169 -8459 -3423 3632 7282 7501 3155 -3900 -8065 -7409 -2733 3522 8003 6956 1824 -3805 -8362
1184 -8362 -7572 -1448 4620 8060 7728 2650 -3885 -7001 -5961 -1536 5034 8233 5953 865 -4871
1199 -4871 -9068 -7256 -1349 4039 7669 6993 1063 -4615 -7164 -5952 -813 5404 7665 5637 741
1214 741 -5070 -7675 -5436 -237 4940 7987 5850 -49 -5044 -7737 -6152 -483 4563 6520 5278
1229 5278 -109 -5770 -7325 -4766 127 5538 7644 4792 -506 -5115 -7311 -4551 1243 5741 7646
1244 7646 5570 -289 -5878 -6692 -4730 -133 4998 6024 2709 -1857 -6026 -7463 -3824 1940 6116
1259 6116 7437 4645 -1198 -5762 -6491 -3904 1065 5904 6572 3892 -711 -5050 -5928 -2729 1631 5180
1275 5180 5650 1980 -3386 -6995 -7238 -3692 2570 6203 6736 4504 -735 -4926 -5011 -2216 2027 5398
1291 5398 5304 1195 -3081 -6046 -6228 -2092 3367 6464 6379 2524 -3018 -6706 -6161 -3020 1449 5217
1307 5217 5034 1742 -1654 -4558 -3978 97 4169 6350 5555 1296 -3981 -6707 -5754 -2757 2270 5203
1323 5203 4526 1693 -2403 -5115 -4525 -785 2892 5156 4496 289 -3617 -5309 -4390 -218 4600 6548
1339 6548 4788 1395 -3400 -6043 -4881 -1448 1958 5016 3870 125 -3028 -4663 -3480 511 4351
1354 4351 5249 3535 -389 -4587 -6241 -4318 -493 3852 6028 4246 473 -2429 -4471 -3171 445
1369 445 3157 4234 2202 -1349 -4470 -5049 -2807 831 4860 5802 3297 -478 -3837 -5799 -3952 -74
1385 -74 2775 4026 2787 -617 -2739 -3120 -1549 2206 4941 4715 1933 -1755 -5216 -5905 -3302 173
1401 173 3505 4628 2524 -692 -3041 -3815 -1894 1664 3801 3121 1164 -2123 -4478 -3984 -1112 2454
1417 2454 5256 5358 2639 -1132 -3579 -4568 -2648 809 2710 2934 865 -1931 -3985 -3157 -690 2492
1433 2492 4799 4141 1358 -1961 -4089 -4000 -1186 1882 4053 3599 1583 -1830 -3238 -2909 -1590 1402
1449 1402 2863 1762 -513 -2542 -4374 -3095 -53 3042 4673 4253 1275 -1942 -3417 -3222 -1026
1464 -1026 1884 2945 2036 411 -2229 -3380 -1919 460 2844 3995 2788 -647 -2762 -4099 -3268
1479 -3268 -481 2607 3630 3054 1009 -1775 -2872 -1702 113 2248 3227 1459 -1222 -3058 -3668 -2378
1495 -2378 300 3027 3689 2530 -37 -2745 -3321 -2232 -290 2092 3047 1486 -755 -2183 -2749 -1092
1511 -1092 1370 3305 3695 1921 -1038 -3569 -3352 -2203 307 2722 3231 1690 -808 -2735 -2819 -858
1527 -858 1021 2408 2875 973 -1517 -3161 -2935 -1117 1379 3520 3317 1504 -749 -2655 -2887 -869
1543 -869 779 2303 2537 644 -1259 -2632 -2862 -864 1518 3040 2437 821 -1678 -3059 -2726 -920
1559 -920 1243 3202 2963 978 -1121 -2232 -2389 -505 1696 2504 1942 323 -2139 -3458 -2368 -635
1575 -635 1594 3113 2268 446 -1306 -3077 -1798 -238 1482 2706 2476 307 -1936 -2504 -1572 -195
1591 -195 2065 3055 1674 -168 -2184 -3132 -2358 -35 1476 2312 1910 -252 -1719 -2308 -1731 180 2295
1608 2295 2566 1816 125 -1937 -2598 -1418 111 2103 2757 1505 -593 -1822 -2369 -1640 457 1911
1624 1911 2010 1194 -568 -2154 -2303 -1207 570 2125 2871 1419 -252 -1807 -2108 -1453 735 1987 2297
1641 2297 1146 -792 -2405 -2439 -1390 417 1964 2016 1062 -459 -2272 -2494 -916 794 1990 2282 817
1658 817 -1011 -1983 -1820 -848 664 2167 2064 825 -877 -2505 -2027 -712 777 1713 1865 627 -1415
1675 -1415 -2134 -2094 -776 953 2112 1954 784 -873 -2080 -1615 -541 1088 2355 1775 438 -867
1691 -867 -1898 -2100 -830 556 1855 1462 321 -1338 -2360 -1653 -427 935 2179 1889 354 -1029
1707 -1029 -2033 -1624 -280 1182 1950 1888 651 -682 -1681 -1356 -315 902 1915 1148 -67 -1613 -2300
1724 -2300 -1662 -218 1147 1884 1688 529 -1011 -1645 -1554 -92 1147 1703 1006 -400 -1240 -1890 -1187 62
1742 62 1365 2006 1414 18 -1319 -1906 -1348 -215 1240 1745 983 152 -1153 -1562 -879 319 1161 1848
1760 1848 1053 39 -1462 -2052 -1292 121 1064 1805 1375 16 -1406 -1587 -1311 -205 791 1238 706 -320
1778 -320 -1049 -1495 -677 559 1731 1839 1313 -88 -1385 -1391 -1101 80 1350 1402 833 78 -1336 -1441 -715
1797 -715 213 1146 1467 876 -358 -1220 -1572 -697 462 1382 1385 905 -16 -898 -1484 -813 186 974 1289 461
1817 461 -377 -989 -1198 -401 497 1059 1226 739 -398 -1578 -1599 -483 96 1176 1299 619 -174 -1164 -865
1836 -865 -215 380 952 949 326 -772 -1250 -1428 -668 252 1119 1180 525 -255 -1033 -954 -426 431 1135 783 403
1857 403 -421 -988 -1058 -396 601 1063 1158 381 -300 -979 -1235 -833 119 985 944 316 -302 -1172 -890 -225 572
1878 572 771 704 405 -560 -1189 -1103 -237 265 1529 777 312 -550 -748 -869 -369 230 900 862 211 -707 -947
1899 -947 -451 -157 795 1050 983 322 -398 -1181 -920 -392 239 1151 1265 453 -401 -766 -695 -229 350 840 489
1920 489 163 -659 -1055 -692 53 442 944 982 224 -274 -978 -803 -308 332 841 648 165 -463 -1065 -391
1940 -391 -81 245 806 652 -154 -416 -883 -722 -281 513 840 769 206 22 -715 -503 -26 419 750 593
1960 593 -69 -258 -722 -742 -123 583 853 815 196 -513 -799 -1024 -300 160 836 364 44 -349 -536 -730 -55
1981 -55 541 1014 666 75 -717 -913 -772 -216 512 320 513 298 -341 -977 -357 150 431 552 316 -107
2001 -107 -448 -574 -521 166 442 652 767 136 -607 -844 -424 -217 360 953 452 41 -552 -873 -441 77
2021 77 371 522 863 353 -357 -870 -686 100 477 861 466 149 -173 -740 -307 -124 390 580 417 53
2041 53 -810 -666 -500 176 511 481 574 168 -500 -436 -196 93 354 581 631 320 -601 -554 -376 88 755 534
2063 534 213 -195 -776 -643 -604 175 694 766 626 -145 -284 -741 -152 -140 564 561 508 -3 -442 -615 -248 76
2085 76 632 870 191 -32 -585 -607 -446 424 443 680 329 -224 -573 -559 -548 161 895 758 519 88 -549 -682
2107 -682 -125 45 707 366 135 -43 -794 -577 -515 -17 776 567 463 -248 -693 -582 -83 -246 748 738 395
2128 395 -83 -899 -811 -400 384 673 754 506 -346 -789 -557 -403 207 532 718 136 -326 -857 -752 -229 197
2149 197 643 809 355 -280 -729 -739 -235 534 444 857 297 -298 -611 -835 -321 325 598 433 178 -295 -563
2170 -563 -606 -31 402 776 384 239 -391 -820 -640 -154 263 814 767 -14 -236 -554 -900 -247 425 649 593
2191 593 -112 -319 -499 -412 -399 660 854 672 219 -118 -830 -763 -87 503 718 406 181 -618 -703 -753 -317
2212 -317 629 652 504 -2 -650 -539 -686 -134 392 700 639 14 -298 -710 -491 143 783 486 405 -57 -571
2233 -571 -938 -573 -57 674 634 382 28 -846 -659 -672 -144 476 823 614 -105 -578 -586 -371 149 884 851 462
2255 462 -106 -851 -719 -481 56 495 791 524 29 -354 -597 -363 203 625 577 200 -12 -459 -829 -494
2275 -494 280 540 1120 659 -126 -849 -653 -589 220 737 621 344 -148 -758 -902 -141 433 642 867 371
2295 371 -220 -632 -881 -224 341 751 1068 428 -266 -816 -781 -455 77 546 670 164 -401 -660 -782 -230
2315 -230 401 822 651 514 -498 -1019 -613 -337 484 749 633 77 -398 -611 -556 -62 465 661 726 107
2335 107 -581 -897 -883 -112 557 784 789 473 -448 -647 -586 97 197 687 705 -62 -350 -1011 -652 36 463 977
2357 977 558 161 -519 -1051 -789 -257 493 763 347 -79 -565 -688 -188 -106 755 1239 636 45 -845 -741
2377 -741 -465 -26 532 713 733 -57 -751 -814 -431 56 1050 769 539 -190 -471 -844 -343 87 895 1204 566
2398 566 70 -672 -633 -552 172 900 987 534 -315 -702 -658 -585 380 745 792 262 -396 -1017 -803 -317 186 856
2420 856 1077 609 -266 -708 -873 -168 450 1078 657 229 -352 -1029 -903 -236 78 739 1057 265 -359 -719
2440 -719 -845 -262 257 848 837 615 -560 -787 -655 -79 390 739 780 29 -167 -666 -754 -342 374 745 600
2461 600 218 -614 -923 -773 -162 682 956 1035 -173 -564 -866 -725 -75 706 909 512 26 -506 -909 -885
2481 -885 -105 736 524 583 93 -739 -1143 -522 24 385 1019 885 -89 -575 -714 -823 172 653 724 699 -130
2502 -130 -699 -1002 -363 -69 692 679 266 -75 -809 -876 -469 170 696 896 750 -246 -778 -753 -659 84 806
2523 806 915 816 64 -723 -869 -569 -50 665 709 557 -341 -733 -663 -325 26 763 769 150 -286 -874 -1194 -182
2545 -182 235 893 977 517 -300 -746 -575 -378 316 834 811 252 -324 -937 -914 -401 143 523 901 485 -467
2566 -467 -794 -568 -185 475 881 766 390 -372 -555 -538 317 441 1039 676 -90 -639 -886 -998 -224 488
2586 488 1048 716 165 -695 -1006 -643 -134 616 713 895 87 -844 -921 -574 98 891 765 735 149 -634 -763
2607 -763 -798 -331 653 776 620 -138 -871 -922 -485 301 660 1024 637 -72 -565 -898 -681 295 690 816 411
2628 411 256 -824 -1072 -435 13 661 820 469 -224 -905 -944 -715 416 669 559 514 93 -722 -924 -576
2648 -576 263 900 616 243 -212 -628 -635 -398 267 824 803 202 -557 -945 -800 -225 331 457 663 437 -291
2669 -291 -365 -379 -217 329 729 697 346 -281 -769 -743 -303 543 754 564 77 -523 -721 -599 -197 273 609
2690 609 733 161 -370 -584 -488 49 515 889 629 68 -333 -863 -480 -229 273 836 663 -54 -701 -613 -500
2711 -500 -80 322 713 655 -134 -851 -525 -492 83 522 1008 619 142 -558 -830 -737 6 468 559 277 -89
2732 -89 -565 -697 -498 79 585 908 309 -62 -498 -960 -609 190 771 803 756 -318 -643 -329 -236 307 792
2753 792 345 120 -88 -789 -912 -694 382 610 680 412 -309 -684 -781 -307 66 723 823 234 -136 -748
2773 -748 -573 -16 209 787 608 18 -462 -783 -916 -171 330 738 614 308 -289 -609 -645 -235 231 756
2793 756 807 -26 -547 -681 -532 -90 398 814 787 268 -378 -713 -589 -205 498 628 367 284 -493 -803 -679
2814 -679 0 773 764 658 -75 -451 -511 -421 -132 607 756 466 2 -539 -673 -419 212 568 660 554 22 -556
2836 -556 -777 -804 222 616 1005 542 -53 -623 -514 -214 93 617 650 622 -310 -863 -851 -191 387 685 461
2857 461 534 -267 -839 -693 -651 91 783 526 423 -41 -537 -720 -132 315 422 846 587 -430 -589 -556 -237
2878 -237 118 663 684 -64 -301 -634 -798 -319 203 633 495 148 -477 -645 -510 -234 631 1006 418 135
2898 135 -327 -577 -566 -23 443 884 555 14 -751 -898 -507 -98 424 723 381 106 -354 -505 -426 209 596
2919 596 716 428 27 -524 -341 -260 128 478 399 500 14 -558 -660 -557 94 576 569 496 -91 -530 -389 -320
2941 -320 31 648 753 317 -155 -469 -468 -293 258 448 768 440 -372 -202 -1083 -412 31 652 612 515 -261
2962 -261 -770 -629 -299 103 1026 731 421 78 -627 -488 -140 280 544 669 381 -254 -649 -587 -470 297
2982 297 752 596 106 -397 -903 -937 -151 118 337 803 211 -407 -808 -493 -39 450 486 685 394 -231 -669
3003 -669 -607 -4 260 502 418 130 -382 -584 -810 -259 528 535 308 138 -704 -528 -639 116 394 749 388
3024 388 -284 -471 -862 -602 -17 365 538 654 35 -399 -450 -448 -22 467 856 415 3 -789 -686 -478 -65
3045 -65 445 721 777 -203 -108 -453 -231 30 681 567 118 35 -691 -484 -393 103 381 809 273 -408 -637 -699
3067 -699 -288 307 559 789 503 -100 -314 -455 -129 187 340 525 151 -335 -490 -722 -137 80 659 649
3087 649 160 -516 -619 -477 -344 397 446 529 148 -253 -680 -482 -146 481 623 382 216 -483 -860 -759 -622
3108 -622 148 684 690 131 -225 -648 -269 -159 318 721 188 58 -469 -491 -980 -18 421 511 556 82 -238 -353
3130 -353 -746 -74 251 552 425 -24 -373 -622 -413 75 613 759 663 222 -251 -329 -414 -130 514 361 186
3151 186 -193 -437 -784 -567 199 614 488 274 -278 -585 -450 -214 104 466 843 193 110 -503 -592 -405 209
3172 209 322 644 459 -84 -426 -468 -225 138 716 396 557 -121 -428 -510 -261 387 307 508 286 -111 -408
3193 -408 -565 44 233 652 692 416 -495 -812 -580 -461 175 561 597 84 -339 -436 -761 -140 301 550 411
3214 411 409 -312 -687 -444 6 166 458 543 -77 -102 -324 -544 -158 354 567 489 195 -246 -710 -312 68 451
3236 451 658 521 176 -335 -335 -866 9 392 351 478 -157 -440 -373 -270 -156 652 673 287 -108 -321 -642 -517
3258 -517 19 255 436 193 -191 -202 -296 -389 126 499 716 162 -314 -385 -556 -242 121 545 543 -110 -364 -612
3280 -612 -737 -265 -153 375 561 185 -22 -534 -431 -104 202 350 765 183 -254 -424 -590 -333 348 487
3300 487 413 70 -358 -484 -553 -108 305 633 275 239 -344 -309 -617 -138 305 542 432 128 -463 -502 -363 58
3322 58 554 847 325 303 -343 -319 -626 -187 155 335 588 -103 -306 -623 -461 -130 600 506 509 209 -574 -414
3344 -414 -212 51 273 374 551 -59 -202 -477 -283 -80 397 842 330 0 -645 -744 -429 30 375 786
3364 786 -11 -203 -548 -484 -275 109 317 245 494 84 -369 -716 -279 -8 419 214 -52 -66 -365 -690 -236
3385 -236 25 495 141 171 -164 -599 -439 -148 420 571 472 125 -252 -559 -361 -231 343 450 373 306 -331
3406 -331 -771 -711 -111 120 722 347 7 -320 -466 -447 155 353 254 660 78 -248 -550 -180 -86 362 455 400
3428 400 133 -287 -759 -406 -81 190 758 304 129 -464 -542 -266 -302 462 375 458 114 -525 -440 -437 -137 170
3450 170 504 283 66 -455 -430 -533 39 391 630 370 -287 -540 -604 -131 -278 158 559 337 100 -334 -455
3471 -455 -178 -22 350 492 155 -85 -299 -307 -393 178 356 264 199 -95 -505 -549 -273 -50 519 526 532 -338 -275 -429
3495 -429 36 -25 323 289 -82 -83 -583 -265 -291 24 375 326 213 -175 -390 -495 -62 258 845 721 261 -233
3517 -233 -459 -389 -300 366 539 497 59 90 -608 -526 -285 143 443 388 245 -189 -211 -527 -189 461 581 692
3539 692 89 -210 -688 -360 59 264 295 394 137 -378 -696 -333 -41 187 857 268 188 -357 -598 -284 117
3560 117 465 592 307 -53 -295 -407 -467 -379 382 514 278 -134 -435 -400 43 61 469 540 378 -86 -366 -499
3582 -499 -461 125 318 392 -17 11 -313 -501 -89 108 347 262 41 -86 -311 -359 -103 -190 555 677 196 -155
3604 -155 -560 -408 -204 315 321 290 25 -316 -534 -337 -67 402 405 901 165 -417 -261 -222 -18 255 267 353 -60
3627 -60 -368 -648 -296 -29 271 485 533 88 -11 -710 -355 -260 286 610 452 97 45 -344 -108 26 33 483
3649 483 387 143 -224 -583 -382 -73 260 361 209 -2 -132 -382 -162 -189 227 432 504 -134 -21 -579 -213
3670 -213 74 69 557 53 93 -144 -515 -205 9 375 550 314 -27 -410 -271 -119 78 377 507 273 -143
3691 -143 -379 -441 -50 133 408 378 271 -162 -328 -297 -230 46 145 484 292 -122 -238 -125 -87 147 174 268 279
3714 279 -103 -570 -380 -372 77 523 495 321 -268 -206 -749 -386 109 125 -47 38 -316 -262 -349 -419 243 432 129
3737 129 -43 -162 -486 -220 -121 95 232 421 55 -374 -381 -217 67 223 591 4 -68 -307 -490 -410 -148 195
3759 195 334 231 80 -214 -131 -328 147 282 237 177 152 -355 -228 -206 193 129 293 233 53 -506 -436 -186 25
3782 25 435 193 175 -49 -184 -325 -374 -16 133 333 270 -31 -334 -423 -265 23 121 572 229 -120 -343 -330
3804 -330 -436 -103 295 494 242 32 -104 -462 -200 94 177 239 334 -206 -208 -260 -70 -83 23 553 114 -46
3826 -46 -227 -256 -115 23 372 316 40 -291 -146 -73 -188 -67 171 260 40 -232 -424 -301 -180 618 289 316
3848 316 119 -143 -347 -196 -127 -185 379 378 64 -300 -331 -92 40 207 221 215 -62 -47 -145 -357 81 66 432 364
3872 364 -57 -410 -252 -136 220 209 10 211 296 -145 -371 -136 43 230 303 85 -58 -117 -89 -67 62 180
3894 180 475 195 -10 -423 -351 -163 -425 207 155 129 -176 -203 -117 90 -20 270 120 223 -210 -402 -378 -53
3916 -53 226 122 289 208 -295 -385 -375 -193 280 258 415 277 -302 -258 -149 -286 -160 253 288 66 1 -518 -289
3939 -289 -148 158 298 227 16 -76 37 -196 -178 149 465 365 38 -332 -15 -198 -18 229 108 431 31
3960 31 -181 -393 -291 -126 66 545 340 162 -96 -252 -265 146 180 125 295 259 -84 -90 -161 259 347 237 69
3983 69 94 -112 -346 -245 246 338 347 283 116 -668 -276 -248 202 520 21 238 -229 -123 -398 -170 -56 333
4005 333 321 -53 180 -5 -235 89 -95 236 583 93 169 -253 -303 -384 -214 354 85 113 -279 -137 -197 6
4027 6 160 159 172 208 104 -107 -446 265 154 197 634 -29 -329 -125 -387 33 -35 239 140 33 -108 -61 -124 38
4051 38 289 145 190 -122 -317 -349 -236 -207 175 300 -26 176 14 -308 -210 238 176 365 329 69 -115 -190 -464
4074 -464 -45 251 213 394 -47 -52 -382 -304 119 -92 66 149 223 -297 125 -103 -96 41 403 308 -1 125 -206
4097 -206 -122 19 69 214 -124 -50 -451 -304 -19 -80 388 -32 204 -302 -354 -153 46 -6 -100 289 -198 -192 -107
4120 -107 -114 -251 82 191 368 -13 24 -301 -234 54 -34 229 368 -208 -299 -207 -52 -166 203 250 390 76 -139
4143 -139 -209 -348 111 19 250 114 239 -72 -182 -65 -221 -4 280 -124 124 -34 -90 -333 -202 381 173
4164 173 228 280 133 -424 -198 -219 207 250 214 17 1 -80 -158 -27 -201 175 277 124 -348 -21 -72 -266 242
4187 242 231 348 208 209 -46 -121 -131 155 122 312 42 -275 -153 -113 -192 208 151 173 161 -158 -246 69 6 281
4211 281 199 11 -128 -38 -161 -69 148 116 367 30 -96 -224 -86 80 -164 268 50 132 103 -439 -138 23
4233 23 -75 107 -54 -214 -123 -77 -156 -167 239 157 184 -149 -162 -266 -108 68 69 321 387 90 15 -205 -311 -343 -150
4258 -150 178 215 58 88 -97 -329 134 79 68 155 33 -37 -27 -192 15 273 342 266 165 -135 -107 -70 101 159
4282 159 324 144 61 -270 -179 -9 -92 534 279 55 -2 -233 -24 80 -109 -13 55 -55 -87 -352 15 -196
4304 -196 38 106 280 43 -34 -189 -171 -48 -17 43 370 10 -59 114 -117 -413 -44 -111 77 142 106 -5 -39
4327 -39 -131 177 127 370 55 79 -203 -345 127 121 257 51 30 -3 -110 -86 -25 54 -70 98 -71 -248 -18 -226
4351 -226 -301 -284 282 128 246 -79 22 -241 -102 94 36 4 -135 74 59 -508 -39 90 231 185 409 305
4373 305 -91 -169 -128 -2 -65 77 -25 272 -36 -217 -329 144 378 -213 -17 -433 -62 185 -127 132 86
4394 86 81 -32 94 -34 -134 144 462 312 247 118 229 -100 -39 97 94 110 27 -268 284 15 -101 -170 -43
4417 -43 223 458 -85 42 -38 -147 -59 195 216 225 -54 -195 47 -236 34 348 -50 79 43 -67 -138 -18 112
4440 112 -50 265 38 -59 -63 -31 140 96 97 159 -36 -66 -324 -202 72 11 131 92 276 129 -24 117 -59 47
4464 47 29 198 260 -229 46 -101 -158 169 -43 165 -61 40 -164 -318 42 187 180 209 248 -144 -20 -191 51
4487 51 252 347 -46 15 -168 -95 -57 -38 -23 61 -32 -148 -239 -231 -304 85 104 212 -117 65 -7 73 28 -222 -257 133
4513 133 88 175 264 -116 12 -154 155 5 -41 152 -98 -18 -32 -75 211 43 -150 202 -28 -189 -121 -76 97
4536 97 55 159 -44 -79 -210 -41 -75 129 94 25 134 -120 -173 -259 143 60 117 38 -152 -69 -119 -409 -208 -41
4560 -41 -233 33 -55 -159 58 158 -181 -77 199 400 -7 192 -106 -197 99 106 55 65 -55 -243 63 137 -188
4583 -188 107 158 -23 136 -244 66 199 138 -91 -103 145 36 161 17 1 128 51 109 2 -38 60 -87 155
4606 155 256 265 44 30 -140 -178 -64 -91 15 -5 85 -113 -42 -399 13 33 -180 171 201 -91 -62 102 -125 -6
4630 -6 -190 96 141 -58 -98 -123 -24 -121 -120 4 -13 -88 20 -11 -98 -6 271 -157 -23 -80 -172 -50 -152 -76 -25 239
4656 239 183 84 -301 -58 -23 79 62 7 -126 -124 48 14 -53 155 299 157 37 274 -87 -130 -112 -72 29 4
4680 4 271 141 72 162 -155 -83 -123 65 6 -38 30 -112 -87 77 90 240 -156 -19 -110 164 75 215 47 -99
4704 -99 -19 -207 -41 -214 -14 -32 187 59 -15 170 -9 163 47 -161 1 68 206 27 -165 -9 -70 4
4726 4 229 57 79 -1 115 101 -111 114 26 158 31 -297 -59 13 125 10 33 72 168 -63 158 113 58 -18
4750 -18 -86 157 -312 103 -122 21 96 -39 149 -87 -185 89 -66 84 336 118 -180 49 30 24 114 -272 -72
4773 -72 -247 108 -129 -26 82 125 35 -124 -66 164 -234 -70 -34 -151 -89 -85 48 -21 24 310 179 -71 -63 -83
4797 -83 265 237 11 -65 245 -142 12 -232 6 115 -126 -59 -40 -93 72 49 242 -59 -42 -228 -49 226 -135
4820 -135 122 -26 -191 -29 -332 -87 151 -211 28 279 -168 -213 -75 2 50 38 87 22 -15 -1 205 -313 -206
4843 -206 -68 151 -141 21 105 17 140 260 -161 177 -140 -37 138 27 -118 57 57 -175 128 96 103 -121
4865 -121 -69 -86 198 -201 -255 85 -68 22 16 60 80 16 148 -169 87 204 311 -206 -63 -50 206 -213 -111
4888 -111 -38 -147 -89 -56 7 -48 -16 -177 58 -31 207 234 -46 -343 156 -16 134 -163 95 -113 6 333 -184
4911 -184 54 -7 -25 71 73 157 122 135 -109 81 109 -3 -26 -50 -286 -500 -64 -242 42 23 -217 1 98 89 160
4936 160 259 141 74 81 -233 -73 -93 -6 -179 2 101 9 175 -161 -70 -81 82 61 57 195 158 206 -64 198 185
4961 185 169 -99 -8 6 -2 -121 -49 -2 51 -47 95 50 -116 4 -252 -87 191 -17 -240 246 97 51 79 -62
4985 -62 23 161 233 -42 -62 59 92 240 155 -71 -61 -15 -216 33 2 10 -96 -43 119 -229 287 -55 40 49 26
5010 26 -87 309 -104 -152 -180 -80 170 48 201 77 -168 -315 -55 394 -464 57 -81 -175 -5 -65 -135 -29
5032 -29 -8 -4 41 -295 122 -126 83 79 30 146 35 281 76 163 183 -13 280 -76 -50 11 -126 -96 -165 7 -87
5057 -87 183 100 -26 -265 -5 -19 79 69 -2 -61 37 -205 -95 196 -24 125 -11 120 94 123 -156 -38 183
5080 183 -178 -134 -64 14 69 -235 150 -42 -137 -115 178 54 -191 90 20 -36 58 253 29 -194 -209 -21 -56 -47
5104 -47 124 71 -111 -215 -202 261 121 -164 289 161 -14 -173 167 -331 350 119 -96 101 295 -175 -54
5125 -54 -92 31 -41 -159 -13 65 -67 -185 70 44 10 194 -4 45 -64 107 10 134 -174 149 -146 5 88
5148 88 -84 -28 -1 128 24 4 -91 71 -67 389 -49 86 105 -79 -48 -21 -57 -193 136 89 54 -113 -132 124
5172 124 -95 -12 276 -66 57 -105 -213 44 -48 42 -146 -28 -8 -54 127 -162 154 -69 -135 -173 195 -160
5194 -160 38 -89 -253 118 63 -93 29 -72 43 280 -106 58 159 -25 98 -259 -145 -65 53 112 -265
5215 -265 256 98 -25 -28 65 186 32 -277 90 73 -18 -178 107 363 -44 182 -139 -45 306 -167 17 -72
5237 -72 -63 129 -50 -277 -99 -39 -159 124 -216 -224 -156 -155 -253 -84 77 -274 157 5 36 172 80 -88 -113 -18 27
5262 27 114 -151 32 -274 -157 -154 -24 -266 30 126 -12 3 -202 88 -143 88 114 -18 124 -72 277 28
5284 28 -193 33 21 -116 80 136 -31 17 157 43 -93 -66 -121 -114 -205 -98 22 -68 119 44 -12 -83 105 -32
5308 -32 113 86 -16 -365 -166 -185 -242 -21 56 -63 -38 30 65 77 110 62 137 137 -215 -18 310 99 58 55 183 34
5334 34 -31 20 -132 -22 240 200 -41 54 -41 39 -78 -96 -197 -70 51 196 290 148 -327 16 80 220 94
5357 94 239 -23 -25 -268 41 -97 48 51 -68 -198 -89 -218 -146 272 5 -78 -68 11 85 172 106 55 -245 224
5381 224 28 67 -160 -97 -38 103 -40 177 225 -56 136 -388 -282 -49 148 343 396 -4 -84 -46 176 -243
5403 -243 39 57 20 155 28 -54 -79 139 -42 165 -221 -226 -167 107 -26 -112 51 228 63 156 -51 -212 -226
5426 -226 -35 273 20 75 197 99 110 69 -75 235 -7 -11 19 -110 71 -122 159 -92 31 145 -77 37
5448 37 201 -17 30 77 -29 -112 66 -105 -5 -11 -37 -61 128 -130 20 279 -76 -285 74 36 33 117 -256 152
5472 152 94 -32 120 -86 -44 271 139 71 40 -110 109 -137 -53 253 51 -84 158 121 -8 184 -287 49
5494 49 107 59 -119 17 -162 -73 169 -150 51 -73 -40 -118 -179 6 69 -217 13 220 -156 179 63 -115 -132
5517 -132 0 80 -188 33 84 -30 -56 228 247 -39 -63 -70 -57 -83 265 2 -71 51 54 -180 -18 86 56 -57
5541 -57 66 173 135 -36 67 35 98 -64 -315 30 -232 -70 112 -169 138 -60 202 147 -83 -34 205 -90
5563 -90 -32 -129 157 46 -142 203 -36 -272 311 -126 30 -54 -56 -128 -118 -225 -126 -59 0 -23 138 -184 69 -83
5587 -83 229 22 139 -348 -101 8 -110 329 -50 -35 -191 -97 90 41 45 -266 13 -229 -294 -74 -52 26 173
5610 173 -67 -209 -157 98 -96 -281 179 30 70 69 -35 50 212 84 -145 -164 45 23 33 -85 -54 -122 -16
5633 -16 355 -130 225 117 86 -101 -18 -316 -218 259 172 -182 -118 -33 -178 171 -131 144 -123 182 74 234
5655 234 -51 -14 177 -134 95 -178 95 -69 -15 -93 156 1 372 -235 50 -56 226 135 -8 61 -52 -48
5677 -48 -154 -128 -76 90 227 88 196 81 -168 -132 -259 -58 -153 -19 293 -221 -109 -42 120 -80 -32 215
5699 215 -63 -12 64 -56 9 66 108 -172 129 -137 -113 169 36 -26 5 17 -17 258 46 -318 -65 -45 -59 -83
5723 -83 301 -168 -144 -68 -58 137 -172 82 41 -179 58 -107 40 13 119 118 301 -112 148 -153 -181 77 104
5746 104 184 146 20 12 -16 -111 -113 -102 99 8 224 -206 173 29 1 -51 56 -79 57 -108 -135 91 71 51 89
5771 89 -96 -36 -260 -101 -22 154 -142 82 58 87 -123 -232 100 127 137 -439 -159 360 94 85 -24 93 35
5794 35 -313 121 -177 -150 -25 143 140 96 -136 129 51 -222 -132 -155 29 -206 233 -102 197 -98 -189 103 -20
5817 -20 -60 -61 -122 106 153 16 460 163 38 -25 -14 -40 244 306 -149 -37 72 72 -34 -232 -46 -22 -8 93 -44
5842 -44 -30 178 161 -101 111 -56 -190 6 132 -154 -247 -157 -173 -69 230 -59 147 9 118 120 -6 -29 -35 14
5866 14 155 -210 112 -7 90 196 7 142 -138 -12 -13 51 7 -45 -11 69 -221 -16 -256 60 86 -218 -45
5889 -45 282 -21 77 134 37 71 -126 -227 -199 118 15 -79 269 -178 -30 150 96 -153 129 118 -82 -85 -105 101
5913 101 137 203 -47 234 -238 203 112 -182 -184 -58 -259 -137 -323 -92 92 65 143 24 -13 -10 74 -37 241 167
5937 167 194 -90 12 -306 104 97 -20 117 18 -68 -15 170 80 58 21 -44 -72 108 18 91 -245 -74 185 87 63
5962 63 200 -2 85 88 338 11 30 -43 3 64 92 -35 236 15 -170 -112 -85 -8 -279 -72 101 144 116 41 28
5987 28 -74 -130 -75 -100 -85 -88 318 175 -126 142 79 25 1 3 143 18 -124 -108 89 72 -28 -41 8 -47 58 -107
6013 -107 -93 108 130 148 68 142 110 176 -26 -462 -51 -89 103 252 -9 46 128 -42 22 -124 -174 -111 -64 4 32
6038 32 51 -69 127 -307 9 132 -95 -66 -185 -198 -248 -1 -35 88 -122 -70 -42 -129 122 81 50 77 196 -396
6062 -396 -108 -156 148 -147 76 74 13 60 9 21 112 180 115 -80 -249 24 113 -22 -187 57 -185 249 86 -114
6086 -114 -34 39 -31 120 118 -123 -152 118 114 27 38 -75 43 -142 -162 7 -169 -132 -96 94 -85 -27 67 83 18 -158
6112 -158 -15 -130 63 -166 -316 -61 152 -14 -191 0 -13 -165 -157 -172 -114 88 -47 234 -116 53 144 -42
6134 -42 -97 76 168 178 37 105 -99 -49 86 -112 123 -51 -6 -235 -14 -187 -26 -472 168 -119 -19 52 7
6157 7 35 235 -235 -78 112 139 -25 -313 106 106 -193 -41 123 -228 203 35 27 199 50 -122 257 31 242
6180 242 -69 28 121 -114 -102 168 53 -22 -48 109 -43 88 -146 -96 -100 67 29 -20 -149 158 11 -122 5
6203 5 -231 -194 -22 83 -308 -150 111 94 -103 -209 -172 223 131 -214 -158 142 -91 96 2 -76 -147 -33 113
6226 113 -67 -150 -230 165 -54 97 127 -68 -259 73 -168 -48 -373 -153 -154 131 31 213 -36 -245 -78 90
6248 90 -197 92 41 -128 33 123 -153 -51 75 -189 62 -128 8 125 -168 -20 -158 -50 177 225 179 139
6270 139 -98 165 -188 98 -214 -176 163 -140 -4 -67 96 -91 278 4 -35 -164 18 366 129 164 -117
6291 -117 -226 -202 -200 46 302 -167 144 -33 81 -25 160 -217 -10 55 36 -90 -258 -23 43 54 33 -42 25
6314 25 37 131 7 196 -88 -39 224 96 138 54 -215 -170 -233 187 86 -177 54 -96 4 -217 -85 144 191
6337 191 -87 134 -15 -110 -109 140 19 99 -23 17 -46 -4 35 -30 -45 303 102 -127 -96 -85 -235 102 -211 -148
6361 -148 185 -158 20 -70 157 -102 108 119 173 -87 60 -457 -99 317 -58 404 9 352 194 -17 65
6382 65 27 137 148 214 -44 69 -52 -389 124 -47 6 -278 115 146 -361 -76 166 353 136 52 121 -179 -39
6405 -39 -146 97 118 -133 55 -65 -7 77 66 -45 -34 -4 -90 18 64 6 200 16 14 90 -146 -35 -220 50
6429 50 -46 -42 69 26 70 69 -3 -166 128 291 55 81 -266 -34 -170 129 25 83 62 100 51 -7 248 -87 85
6454 85 -103 -77 110 -15 -45 17 167 229 105 135 -143 25 -23 49 29 120 -160 112 -74 -142 -142 -296 -128 27
6478 27 91 62 60 -105 -113 -77 18 -172 110 251 85 11 -242 -177 16 15 81 182 136 -152 -9 -60 50 196 -62
6503 -62 15 119 -47 -82 -100 119 14 315 151 51 104 -30 -93 45 121 -61 -7 -32 -92 153 -223 -119 33
6526 33 149 259 -73 -209 -30 -187 -203 -37 219 -103 62 -256 206 -213 -221 -120 309 123 -208 -87 152
6547 152 -107 117 22 -154 -206 -188 -10 -156 -143 -69 218 23 82 -108 -8 -110 -99 155 -121 -117 -6 65 41 -85
6571 -85 98 68 -63 62 279 27 -69 -121 69 -14 342 -203 -77 171 -31 168 157 233 -125 -228 -107 -291
6593 -291 135 272 49 252 57 283 184 -228 87 -6 -12 -35 -148 215 173 176 146 -79 -278 97 393 104 -183
6616 -183 -23 -321 174 -200 -16 42 58 59 -277 -116 -6 -262 14 161 -53 108 -341 -40 104 166 -113 79
6638 79 6 130 66 42 -39 -41 113 -17 56 -183 -57 -217 -251 -318 16 311 35 96 98 -48 -7 -32 14 223 -13
6663 -13 103 -224 52 -226 -203 -69 -39 -224 51 -99 -83 -190 40 91 -51 29 -8 39 -31 -207 -213 93 6 -100
6687 -100 -109 10 -270 -25 110 93 425 -24 7 -195 -449 -137 78 -48 287 -32 -71 -39 71 35 -61 74 68
6710 68 156 -100 26 -30 -56 223 166 -70 -59 -167 132 225 -31 48 310 -54 140 -159 -13 324 201 19 94
6733 94 94 -149 -181 -288 -15 -122 118 54 406 -5 44 -9 283 -53 164 33 55 155 -223 -89 -204 279 94
6756 94 31 133 16 120 105 120 3 151 -93 120 109 -21 -248 -247 -37 201 -5 -153 -127 -42 18 -65 13 -39
6780 -39 11 -122 45 -156 2 186 -46 -76 183 -40 63 -10 -274 -253 144 5 -81 155 39 113 -23 -68 203
6803 203 -15 280 426 -156 -25 100 -39 -133 -214 201 98 -148 -27 38 160 -90 -78 76 279 -193 -32
6824 -32 -1 -156 -176 240 -28 -173 -189 -24 -100 19 -70 111 110 -2 -86 -261 159 -5 24 -67 140 42 32 -487
6848 -487 -77 -98 197 165 226 5 -2 -3 -169 188 1 -82 -114 -1 -30 -59 53 -505 196 22 -82 89 -294 -187
6872 -187 70 64 9 40 -26 100 116 -235 95 -6 86 365 -197 137 107 92 -276 94 158 221 20 -93 -314 -60
6896 -60 -20 -59 61 -61 285 -89 -167 -121 172 129 -29 167 56 -179 -43 30 -94 -168 233 211 98 60 -73
6919 -73 186 208 173 249 81 114 -84 -19 -178 -191 503 -21 -83 -155 59 -123 -364 -43 43 48 138 51 -59 -201 49
6944 49 73 -173 15 -163 210 204 131 -245 -362 -21 249 -79 77 -160 63 -227 -57 110 208 141 200 -150 -31
6967 -31 -160 -220 -49 100 30 14 -8 -108 94 61 100 6 42 -27 -129 -11 -185 127 109 -242 -273 -26 -28 -269 -2
6992 -2 125 -181 151 140 -132 -250 -132 -177 32 114 68 -4 -207 -15 8 -4 287 -193 14 -286 121 -158 -103
7015 -103 -245 146 244 75 75 -130 -61 -175 159 30 71 62 160 -293 -37 -210 -12 265 95 -51 110 -15 -13
7038 -13 264 -46 78 -44 135 -20 -153 -44 68 1 139 -24 130 -204 232 -274 -37 -136 7 -62 34 -47
7060 -47 -62 -35 -180 -53 -20 -7 293 60 -233 6 -99 229 77 196 70 -132 -39 44 15 268 -34 448 -6
7083 -6 -93 -194 -323 -20 -167 25 -9 -120 -308 -11 -293 250 55 -14 42 58 25 -143 -52 115 264 -132 37
7106 37 180 146 18 -11 -24 -99 164 50 -27 -43 -14 -2 70 118 123 166 95 -118 -324 -191 99 52 199 -49 -41 21
7132 21 -88 -114 -347 -73 166 -46 92 -174 -11 -233 -111 -167 -121 311 -80 23 40 -6 95 126 -64 210
7154 210 -31 83 -350 58 -249 157 51 -29 271 -426 -64 197 -242 100 226 206 235 240 157 -45 240 53
7176 53 138 -28 226 -250 -198 100 -302 -55 273 273 175 95 11 48 -204 -216 93 78 140 -137 -92 -217 -93 275
7200 275 3 -44 -120 -28 14 -256 -41 67 112 113 -49 -157 -166 -151 -42 308 -24 -113 -106 95 -220 -40 177 -31
7224 -31 138 144 -229 -107 -212 52 -84 414 -17 53 -61 -147 -214 -110 40 -4 43 165 -170 -34 -90 -51 144
7247 144 13 154 122 36 59 -53 -42 348 -165 -12 -104 -152 -264 -175 -85 -30 88 111 -188 -6 -144 -178 -72 -146
7271 -146 384 -4 223 76 30 -87 -52 254 138 190 -201 -36 237 -213 241 215 50 -31 156 -257 -281 -227
7293 -227 -230 -82 -245 220 0 -212 0 -94 -107 38 126 20 -125 -165 -274 -65 -93 -23 279 199 96 222 -73
7316 -73 284 -105 157 -4 164 194 -44 223 -39 -115 -40 85 195 25 -195 125 70 -213 -328 186 -141 -85
7338 -85 -172 -287 -137 216 198 -65 -115 29 22 -143 -18 16 13 -188 206 8 -126 -33 -255 45 5 221 155 -119
7362 -119 -243 -394 -112 49 95 73 -423 -351 11 -188 263 19 46 -165 -242 -143 -182 -118 120 31 86 -217 -108
7385 -108 28 -55 -16 85 274 15 199 -134 30 -124 11 14 -159 95 11 325 42 -25 110 -5 93 -142
7407 -142 -67 -134 -81 -161 87 -102 108 191 32 -302 -182 -36 -232 401 246 61 136 -34 -54 -253 -286 82 174
7430 174 -136 60 -83 -39 -20 -64 127 -52 222 23 -415 -348 -171 -180 304 136 56 4 83 -183 -50 114 65
7453 65 -16 117 125 71 -91 37 -28 71 24 86 93 141 -314 -117 224 130 101 94 29 72 -107 -473 187 73 -72 -11
7479 -11 152 103 -81 231 79 234 146 5 122 -52 -321 33 238 -56 126 21 -252 28 -56 -93 147 178
7501 178 314 114 23 -98 -151 5 43 -12 -153 101 -68 96 137 81 -305 151 -7 20 51 32 -85 -115 42
7524 42 136 158 3 152 311 -27 -17 45 -5 79 -67 45 198 -270 0 326 143 -74 5 -152 106 155 -64
7547 -64 175 223 41 205 -231 -146 0 95 -1 22 -34 159 127 136 -171 -288 136 207 67 49 -253 -206 20 -24 2
7572 2 172 14 -31 -45 -195 -34 -119 201 96 97 159 -147 116 -150 85 83 -131 -86 -403 -115 -186 -128 68 -165
7596 -165 182 -37 74 -74 -105 -145 44 -24 37 262 4 -84 21 -250 -179 -87 72 -79 91 126 151 -394 -44
7619 -44 -115 -108 103 -84 54 -228 58 62 -14 205 296 -90 -129 -194 -299 119 1 -80 169 205 136 49 15 -169 -152
7644 -152 -25 73 -199 -25 -89 -111 9 129 220 -58 84 -223 49 -53 46 86 193 112 -75 -1 27 -106 185
7667 185 137 -91 5 -110 -288 -19 -102 -46 -104 8 7 -98 -485 -186 -86 -188 136 17 109 -93 -141 -16 25
7690 25 84 -1 -86 5 -80 -170 -222 82 96 97 -32 -120 84 -102 -148 129 -36 7 224 19 -152 8 -254 194 -204
7715 -204 85 -18 -5 -38 -154 -95 37 -132 183 -25 -132 84 -5 -79 -147 -68 349 -46 -71 32 -125 60 -112
7738 -112 -74 -13 -156 9 -17 135 -137 -55 48 3 67 -234 234 -171 -49 299 -153 330 -113 0 -69 -143 13
7761 13 -6 85 206 50 -136 -86 -194 -18 -141 74 75 65 91 -136 -160 -140 -17 -54 185 284 -107 62 -115 -27
7785 -27 103 -56 -33 -146 51 -25 0 -240 76 57 -31 -90 21 -91 66 88 260 -23 125 12 307 150 44
7808 44 86 111 -129 -106 -36 -39 -240 19 -15 43 -216 62 -21 -105 -63 -82 64 401 116 320 159 -202 55 51 -29
7833 -29 -45 -34 143 -82 -205 -173 -129 137 -130 240 -60 148 -318 2 -11 -61 -2 26 222 44 -366 -60 -211
7856 -211 -16 -36 88 116 -34 -53 -418 -30 -180 -121 8 236 -46 -61 -182 -140 45 -140 174 -16 -59 -75 41
7879 41 -87 -129 -116 25 -321 -73 -171 51 -183 -119 73 39 -120 -12 -64 -97 58 -13 73 -27 185 83 -20
7902 -20 -198 9 180 -133 247 -147 -19 -11 -86 47 -99 186 -61 -7 -12 14 -293 1 -92 20 53 98 -91 -41
7926 -41 -36 -276 203 97 126 363 -256 1 -63 -145 -180 -78 14 71 6 107 -103 -120 110 53 21 37 10 -219 158
7951 158 282 -68 -176 83 -112 -69 160 53 -72 -26 -48 82 186 -130 84 -81 -117 27 -52 -170 255 -23
7973 -23 -98 -79 118 -109 352 104 -5 -144 -166 269 70 -68 -146 106 -70 -76 -278 13 -15 71 -30 278 -85
7996 -85 -27 -38 -61 205 103 109 132 -139 120 -113 -279 180 -306 -115 -417 80 -15 -77 -41 -265 155 166 12 -215
8020 -215 -205 -417 -30 185 227 16 -61 12 -2 -165 16 194 335 427 28 20 -41 196 -89 -236 -217 -143 100 -30
8044 -30 -15 -102 227 -296 -64 -158 -30 29 -158 -12 -12 -119 -186 141 314 103 -102 -53 -136 39 23 -102 -136 213
8068 213 75 -177 -92 4 -27 68 280 130 -81 126 -145 -181 -169 -5 -18 39 47 -22 44 237 87 95 -102 -19 22
8093 22 -46 -108 269 271 -157 118 233 -21 -8 -269 260 102 105 106 -308 15 -62 -87 119 89 -160 64 60 28 -326
8118 -326 82 -105 152 103 -9 142 -158 -92 -37 183 -107 -150 111 115 -95 -60 169 22 -124 -268 3 -78 -110
8141 -110 -142 162 98 58 184 158 -146 -225 -64 -6 83 -133 28 34 -156 -373 32 104 79 -19 -36 157 -61 -49 -5
8166 -5 -204 -93 -35 -159 -35 -105 -76 -103 46 54 103 135 -48 30 81 41 133 -88 174 72 -93 -115 191 200 -135
8191a35
$$ Imaginary data points
##PAGE= N=2
##DATA TABLE= (X++(I..I)), XYDATA
0 0 0 0 0 0 0 0 0 0 0 0 0 0 0 0 0 0 0 -8 8 -8 8 -8 8 -16 16 -16 24 -24 29 -32 39 -40 48 -56 62 -70 78 -86 97
39 97 -107 120 -133 147 -163 181 -200 222 -242 268 -296 325 -359 396 -438 482 -533 595 -662 741
59 741 -836 948 -1086 1262 -1495 1816 -2289 3063 -4542 8443 -43316 -96989 -39001 21786
73 21786 95904 140544 135746 73650 3249 -55801 -69737 -41873 1544 28078 29836 -8110 -54699
86 -54699 -70919 -52057 -11029 44474 73874 53474 3659 -49394 -83964 -67717 -13179 43437
98 43437 82128 84492 40660 -11303 -37880 -35422 -4998 36492 49331 24958 -22025 -73863 -95113
111 -95113 -68593 -17206 37642 75216 64915 15979 -26697 -45010 -35352 9670 60009 75123
123 75123 54300 6709 -46061 -70343 -56568 -19218 23624 43422 19374 -22220 -52982 -64327
135 -64327 -36632 23644 72829 88359 69738 19005 -35121 -57222 -47259 -14916 24598 37107
147 37107 14352 -19543 -49425 -56911 -25187 24800 59476 67138 38490 -16723 -60431 -71690
159 -71690 -51551 -1587 48846 63787 47923 18266 -16709 -29534 -6653 24670 42733 36708
171 36708 -2618 -55553 -89823 -91449 -55204 7339 56248 71388 60206 24650 -13024 -19834
183 -19834 1154 26056 44081 37515 -2423 -48009 -74258 -71966 -35323 17279 51148 56313 34317
196 34317 -9419 -41184 -38942 -15487 18451 45711 41920 10605 -22733 -45552 -42174 -5832 34316
209 34316 53569 49938 17743 -29144 -55301 -50283 -24284 13251 39399 32419 4000 -28661 -49073
222 -49073 -37386 802 36491 58774 55686 19781 -21438 -38916 -34683 -9652 24900 39626
234 39626 23457 -8943 -43990 -62052 -45308 -7398 30378 55236 48401 14380 -17468 -32572
246 -32572 -28237 170 30762 37875 22099 -8553 -42389 -52920 -31907 2779 38435 57615
258 57615 42450 6250 -24711 -42600 -35907 -5604 21623 28491 16529 -12995 -40129 -41877 -20128
271 -20128 13825 48722 59696 37103 2469 -29315 -46245 -33002 -1246 22926 30648 17069
283 17069 -13133 -36382 -36285 -16528 17451 47453 48670 24916 -7239 -39357 -50697 -30402 0
296 0 22986 32512 16829 -11886 -28742 -26464 -6017 28063 50672 46367 22676 -12008 -43478
309 -43478 -49069 -28809 -2657 20101 26057 7876 -16296 -29334 -26393 -2209 31095 47679 41808
322 41808 18472 -17114 -43332 -41124 -19848 7634 30657 31613 10258 -13247 -28690 -26247 -1999
335 -1999 24692 34951 27923 2689 -31207 -47054 -37368 -13278 18571 40982 37259 15857 -7684
348 -7684 -24531 -20583 1991 21583 29434 21051 -6700 -35618 -44289 -34019 -8907 22802 38328
361 38328 29858 9460 -14340 -28117 -18258 5117 25059 34639 24347 -4228 -28892 -36758 -28857
374 -28857 -4896 21197 29111 18932 -1925 -25003 -31100 -14687 9805 31825 41337 25711 -3544
387 -3544 -26062 -35806 -27532 -1599 20398 25123 15268 -5834 -25987 -26907 -10786 11321 31951
400 31951 34622 14159 -12616 -32453 -38373 -22033 7584 29248 35499 26410 2724 -16724 -19160
413 -19160 -9783 7133 21238 15692 -5744 -28141 -43909 -41880 -16683 15250 37580 45190 31643
426 31643 5913 -12092 -16227 -7894 9808 21590 13941 -3908 -23805 -38140 -31819 -7088 18307
439 18307 34210 33022 11434 -15452 -31495 -32275 -16347 9332 24200 22378 11101 -7497 -18484
452 -18484 -9750 9648 27110 35986 25806 -1047 -26573 -40564 -38183 -17363 8066 20562 19281
465 19281 5132 -15035 -23560 -14228 3269 22890 33708 24544 3814 -14522 -24549 -18045 3362
478 3362 21649 26156 17899 -5276 -29685 -37128 -27828 -8279 15711 27517 20259 4896 -10777
491 -10777 -18892 -8836 10249 23741 26109 13865 -11248 -30687 -33147 -21098 2282 26162 32816
504 32816 21886 2560 -17674 -26491 -16883 -432 12718 17966 7580 -11247 -21711 -19809 -5623
517 -5623 18387 35703 33987 18096 -6221 -29776 -35529 -24055 -6286 11306 19044 8985 -5374
530 -5374 -13205 -12385 1599 21872 31833 26566 9145 -16435 -34321 -33008 -18112 3363 22601
543 22601 25434 12012 -3963 -16819 -19174 -5757 11797 19333 16222 1163 -19007 -28072 -20947
556 -20947 -3396 19249 34129 29627 12528 -7766 -24001 -25029 -10542 5728 14641 13951 -648
569 -648 -18038 -23536 -17422 -1227 19580 29019 21653 6172 -12468 -24354 -18282 -1260 15877
582 15877 26122 21512 3028 -15302 -24476 -22656 -7485 10021 15549 10328 -2514 -18114 -22698
595 -22698 -11000 7599 25000 33284 23541 2938 -15402 -25685 -21851 -4307 11653 17655 12783
608 12783 -1624 -17151 -19965 -10327 4462 19500 23265 10617 -8007 -22578 -27929 -17014 3970
621 3970 20731 27475 21688 4075 -11321 -15950 -10315 2562 14447 14831 3117 -12190 -25152
634 -25152 -26297 -11867 7694 22263 27469 17237 -2203 -16239 -19754 -12497 3171 16706 16999
647 16999 7705 -6470 -18579 -18101 -4861 10736 22403 23130 8577 -10573 -22712 -24763 -13582
660 -13582 5345 18146 17941 9224 -6067 -18001 -16259 -4191 10071 21198 19494 4919 -10491
673 -10491 -20590 -20235 -6612 10640 20077 19073 7437 -10113 -19786 -17114 -6325 9163 20196
686 20196 16622 3427 -9832 -19267 -17493 -3914 11010 18187 16315 2848 -13135 -19995 -15918
699 -15918 -3488 13964 22643 17440 5507 -9588 -19390 -15805 -2083 10390 16837 13293 -1632
712 -1632 -15721 -20602 -15485 -972 15158 21078 15470 2676 -12540 -19349 -13058 17 12749
725 12749 19200 13736 -1012 -12765 -17960 -12987 1950 15263 18068 11875 -1571 -16286 -20614
738 -20614 -13255 -703 12833 18101 10766 -2025 -12596 -17001 -9519 5635 16485 19457 12696
751 12696 -2583 -16190 -18438 -11319 1183 14210 16838 8148 -4469 -15033 -17636 -8247 5973
764 5973 15938 17919 9358 -6314 -16983 -17629 -10138 4390 16557 17253 9127 -2852 -13945 -14771
778 -14771 -4974 7174 15552 16037 5230 -9771 -18583 -18189 -9034 6089 16370 15882 7690 -5197
792 -5197 -15036 -14256 -4735 6139 15559 15342 3575 -8297 -15146 -14024 -3324 10895 18128 15954
806 15954 5439 -9386 -18421 -16180 -7319 5325 14601 12832 2392 -7665 -14217 -12027 -408
819 -408 11728 16670 13882 2484 -11613 -17240 -13643 -2845 10622 17973 13742 3460 -8125 -15710
833 -15710 -13195 -2446 7223 12407 9476 -1850 -12420 -14995 -10458 807 14433 18495 12917 2255
847 2255 -10214 -17047 -12237 -1504 8648 14168 10661 -187 -9292 -12473 -8638 2380 12119 13314
861 13314 7286 -3961 -15845 -18771 -10851 1128 12704 18371 12764 1424 -7604 -12192 -8124 2774
875 2774 10387 11081 5362 -5715 -14824 -14700 -7086 4516 15357 17410 8695 -2963 -12789 -16747 -10519
890 -10519 1008 9202 12124 7287 -2821 -9882 -9170 -3296 6917 14897 13462 4669 -6563 -15694
904 -15694 -16557 -7363 4085 12539 15045 7890 -3424 -10794 -11678 -6401 3648 10341 8639 1657 -7198
919 -7198 -13889 -10858 -581 9943 17538 16790 6388 -5925 -13170 -14629 -7779 3168 8950 8158
933 8158 2564 -6626 -11674 -7592 154 9030 14769 11202 725 -9555 -14970 -13383 -3254 7829
947 7829 13818 13038 5716 -5025 -10102 -8094 -2057 5994 10015 5724 -2720 -10612 -14384 -10038 1257
962 1257 10893 15089 12289 2252 -8285 -12623 -10979 -3406 6426 10532 6801 309 -7228 -10104 -4940
977 -4940 4023 10887 13239 8024 -3574 -12657 -15182 -11321 -1061 9259 12098 8727 1352 -7130
991 -7130 -10121 -5324 1906 8362 10575 4602 -4588 -10283 -11755 -6483 4585 12575 13558 8531 -1302
1006 -1302 -10392 -12876 -8039 -448 7121 9100 4237 -2963 -8111 -9200 -2950 6050 11276 10913 5065
1021 5065 -5182 -12606 -12072 -6446 2969 11539 12666 6702 -667 -7575 -9601 -3671 3389 7468 6792
1036 6792 518 -8248 -12578 -10439 -3739 6955 13687 12618 6386 -2054 -9366 -9655 -3112 3447 8210
1051 8210 8356 2051 -5741 -9532 -8135 -1849 6753 10903 8484 1707 -7137 -12630 -10372 -3448 4740
1066 4740 10801 10277 3459 -3338 -7149 -6905 -454 6737 9289 6588 -242 -8225 -11897 -8500 -1451
1081 -1451 6647 11451 8832 1350 -5913 -10262 -8271 -792 6177 8733 7050 303 -6959 -8204 -5349
1096 -5349 1148 8360 11001 6902 -597 -7558 -11519 -7939 -351 6056 9129 7021 -460 -6746 -8495
1111 -8495 -6345 445 7140 8811 4969 -1193 -7878 -9687 -4864 2389 8492 10837 6993 -1124 -7351
1126 -7351 -9409 -6791 505 6498 7679 4356 -1979 -8087 -8573 -3671 2419 8428 9915 4544 -2761
1141 -2761 -8006 -9671 -5542 2561 7532 8658 5251 -1861 -7280 -7288 -3373 2853 8350 7913 2602 -3890
1157 -3890 -8842 -9656 -4465 2827 7253 8394 3939 -3014 -7287 -6999 -2843 3823 8559 7631 2871 -3337
1173 -3337 -8146 -7612 -2305 3798 7741 7818 2329 -4253 -7961 -7770 -2875 4124 7592 6125 1855 -4359
1189 -4359 -8474 -6754 -1418 4589 8585 7552 2011 -3943 -7186 -6626 -1265 4889 7161 5825 1035
1204 1035 -5201 -8515 -6201 -1383 4464 8257 6348 558 -4640 -7668 -6755 -827 4760 7057 5880
1219 5880 983 -4961 -6713 -4716 -57 5666 7911 4984 -71 -5284 -8088 -5639 -183 4717 6892
1234 6892 5287 -635 -5486 -7169 -5078 234 5523 6888 4282 -406 -5319 -6934 -3669 1486 6138
1249 6138 8001 4918 -1273 -5910 -7522 -5360 318 5115 5890 3165 -1209 -5843 -6530 -3006 1503
1264 1503 5484 6864 3218 -1936 -5721 -6472 -3448 2672 6601 6931 4691 -766 -5560 -6252 -3653 659
1280 659 4429 4950 1191 -3196 -5945 -6041 -2051 3486 6961 7121 3887 -1871 -5716 -5689 -3292 1688 5290
1297 5290 5346 2060 -2019 -5205 -4996 -964 3381 5530 5034 998 -4826 -7133 -6376 -2767 2950 6192
1313 6192 5580 2931 -1361 -4485 -4124 -760 3047 5332 4302 334 -3975 -5843 -5068 -1277 3663 6206
1329 6206 4817 1553 -3448 -6094 -4940 -1664 2269 5240 4323 750 -2434 -4407 -3501 471 4498
1344 4498 5558 3830 -199 -4894 -6414 -4560 -1099 3120 5824 4274 950 -2567 -5017 -3839 198
1359 198 3022 4048 2876 -1227 -4660 -5313 -3222 822 5023 6245 4107 331 -3533 -5275 -3631
1374 -3631 -417 2774 4437 3282 -619 -3256 -3846 -2293 1369 4328 4410 1988 -1534 -5308 -5862 -3417
1390 -3417 512 4061 5618 3666 209 -2676 -3262 -2230 1090 3640 3313 1045 -2034 -4880 -4652 -2021
1406 -2021 1248 4605 5146 2324 -1493 -3868 -4758 -3119 940 2887 3212 2029 -1414 -3355 -2507 -121
1422 -121 2736 4916 4467 1074 -1851 -4745 -4680 -2525 1078 3249 3344 1679 -1599 -3551 -3088 -1024 1995
1439 1995 3994 2991 951 -1973 -3852 -2952 -172 2825 4585 4052 954 -2259 -4050 -3905 -1794 1124
1455 1124 2854 2130 378 -2058 -3476 -1889 435 3257 4247 3355 -2 -2488 -3937 -3550 -415 2394
1471 2394 3404 2939 672 -2059 -3296 -2129 -540 1925 2974 1788 -819 -2837 -3826 -2404 740
1486 740 3325 4572 3372 564 -2482 -3316 -2375 -465 2135 2901 1457 -507 -2690 -2989 -1510 1174
1502 1174 3094 3500 1934 -1116 -3464 -3850 -2420 62 3006 3283 2005 87 -2007 -2452 -889 1110
1518 1110 2583 3098 1086 -1546 -3244 -3045 -1794 1283 3334 3090 1840 -824 -2899 -2755 -1469 707
1534 707 2414 2764 621 -1435 -2529 -2616 -703 1730 3446 3106 1322 -1198 -3073 -2489 -1139 844
1550 844 2675 2759 838 -1329 -2688 -2706 -649 977 2602 2154 387 -1841 -2817 -2135 -542 2135 3792
1567 3792 2952 1097 -1409 -2664 -2361 -256 1311 2350 2199 98 -1737 -2541 -2134 -597 1611 2626
1583 2626 2135 214 -1645 -2795 -2260 -207 1836 2758 2408 282 -1486 -2379 -2037 7 1860 2349 1435
1600 1435 -19 -2385 -3156 -1952 -334 1685 2834 1770 82 -1820 -2644 -1547 226 1968 2464 1776
1616 1776 -131 -1961 -2653 -1268 214 2168 2588 1361 -375 -1920 -2576 -1742 229 1822 2203 1204
1632 1204 -688 -2303 -2230 -1434 460 2264 2317 1252 -308 -1838 -2379 -1192 766 2046 2184 1128 -854
1649 -854 -2157 -1998 -1175 885 1993 1682 1098 -684 -2181 -2287 -1142 512 2217 2215 1150 -619 -1682
1666 -1682 -1697 -407 1054 2121 2227 747 -867 -2446 -2234 -914 767 2234 2133 440 -964 -1816
1682 -1816 -1826 -487 925 1686 1921 680 -1154 -2057 -1332 -234 1412 2312 1693 502 -1232 -1990 -1822
1699 -1822 -553 652 1767 1415 574 -1254 -1981 -1508 -407 1308 1971 1706 257 -1224 -1989 -1677 -218
1716 -218 1186 1709 1854 408 -1141 -1648 -1900 -235 1275 1895 1025 83 -1386 -2029 -942 140 1306
1733 1306 1943 1801 -6 -1142 -1752 -1452 -132 1005 1743 1557 275 -1380 -1412 -1212 35 1416 1608
1750 1608 882 -248 -1359 -1887 -1757 -110 1005 1571 1545 374 -1093 -1431 -1063 38 1164 1610 1125
1767 1125 -162 -1109 -1742 -1061 519 1429 1632 1338 -310 -1380 -1867 -1251 -230 1161 1195 749 162 -1115
1785 -1115 -1559 -595 540 1004 1737 532 -187 -1474 -1624 -1034 283 1120 1321 986 98 -1119 -1399 -921
1803 -921 10 958 1045 659 -595 -1136 -1397 -336 732 1361 1648 779 -196 -1265 -1351 -559 41 1219 1301
1822 1301 670 -126 -1132 -1212 -652 548 783 998 479 -694 -1307 -1327 -586 666 1468 1576 738 -260 -1088
1841 -1088 -1060 -437 74 881 981 218 -564 -1144 -1219 -412 408 1225 1072 396 -329 -1337 -1194 -368 138 1345
1861 1345 1174 424 -296 -667 -665 -473 343 1078 959 340 -480 -1164 -1124 -584 377 959 1073 329 -324 -688 -895
1882 -895 -482 334 589 944 238 -631 -696 -661 -20 772 1107 971 356 -340 -1203 -1097 -491 307 753 722 19
1903 19 -708 -868 -546 -283 541 899 731 99 -490 -1003 -824 -129 398 905 890 127 -481 -842 -812 -401 428
1924 428 711 561 369 -706 -668 -687 -315 607 1133 670 86 -294 -886 -644 -32 479 922 808 251 -382
1944 -382 -814 -679 -212 502 672 400 -28 -526 -1046 -602 52 441 1007 862 241 -381 -517 -395 -19 433
1964 433 930 471 179 -265 -654 -427 -61 503 899 499 28 -826 -727 -952 -240 446 844 709 276 -486
1984 -486 -620 -415 220 513 841 575 40 -457 -964 -612 71 570 692 573 -213 -812 -833 -257 7 608
2004 608 673 506 103 -394 -620 -372 165 495 640 472 -69 -377 -767 -530 -378 448 666 430 158 -569
2024 -569 -863 -508 -73 426 741 683 235 -443 -718 -669 194 676 626 724 -97 -415 -871 -440 1 289 594
2045 594 453 -90 -254 -691 -809 -51 734 888 753 143 -657 -304 -450 -42 547 760 576 14 -488 -733
2065 -733 -495 30 644 736 339 -160 -698 -660 -400 -46 663 804 508 -190 -574 -874 -598 85 608 1221 511
2086 511 -140 -461 -563 -307 -4 717 774 284 -3 -690 -625 -190 265 368 869 279 -244 -635 -560 -411 390
2107 390 789 507 600 -273 -666 -305 -378 -229 363 567 259 -231 -376 -840 -730 349 404 534 357 -306 -723
2128 -723 -477 -170 43 852 799 407 -92 -556 -644 -380 138 494 494 200 -231 -816 -989 -451 161 669 676 382
2150 382 -266 -714 -480 -405 411 607 785 141 -271 -317 -600 -182 489 636 639 127 -445 -1052 -1028 -630 -1 424
2172 424 804 183 -244 -451 -792 -155 319 580 532 634 -321 -604 -477 -237 393 854 942 307 -361 -656 -800
2193 -800 -488 293 516 835 179 -447 -631 -573 -3 631 926 702 153 -570 -869 -385 7 360 696 695 -37
2214 -37 -425 -637 -571 -265 416 420 538 -131 -683 -754 -141 -58 413 941 757 5 -436 -931 -492 1 549 617
2236 617 451 191 -446 -913 -385 -29 449 992 346 -198 -1009 -793 -616 86 403 1023 745 100 -679 -697
2256 -697 -522 213 708 559 515 -397 -732 -1005 -310 360 777 640 579 -360 -857 -953 -757 87 782 450 120
2277 120 -205 -482 -892 -347 445 701 948 391 -355 -705 -979 -679 104 655 545 563 -181 -809 -1081 -71
2297 -71 -21 412 797 195 -528 -836 -836 -150 466 765 733 353 -402 -1026 -1060 -356 422 767 831 22 -302 -920
2319 -920 -845 -125 766 865 895 -9 -649 -806 -903 -413 506 1067 900 518 46 -809 -626 -117 299 841 819 -256
2341 -256 -729 -976 -579 -179 488 912 631 177 -572 -803 -808 -105 430 756 388 393 -455 -869 -666 286 1011
2362 1011 936 569 57 -708 -897 -785 64 529 673 628 -245 -460 -1089 -513 29 592 757 637 246 -768
2382 -768 -783 -592 77 592 746 466 -237 -731 -895 -909 56 697 845 712 -122 -576 -973 -275 52 839 817
2403 817 623 -265 -719 -819 -510 225 820 603 289 -358 -972 -720 -305 13 690 670 338 -624 -886 -844 -443
2424 -443 139 1279 971 548 29 -549 -721 -302 159 784 761 192 -288 -848 -683 -282 210 771 649 395
2444 395 -620 -1132 -818 -185 506 781 1074 431 -492 -554 -686 -177 503 845 674 274 -541 -1011 -805 -213
2464 -213 516 843 943 -80 -692 -1131 -619 -353 489 888 796 71 -566 -715 -377 154 523 1027 497 56
2484 56 -557 -766 -477 -80 706 881 396 -6 -797 -637 -708 -39 528 1013 413 -146 -629 -777 -332 5 849
2505 849 896 791 128 -677 -854 -482 131 345 1009 469 -315 -874 -1166 -634 242 609 899 733 99 -452
2525 -452 -827 -488 185 1059 1177 576 -178 -551 -687 -542 311 694 934 267 -362 -775 -955 -513 303 733
2545 733 737 456 -486 -688 -799 -543 368 717 912 354 -240 -664 -749 -342 425 860 808 244 -238 -899 -791
2566 -791 -50 488 589 973 189 -513 -587 -749 -166 876 925 873 401 -572 -684 -736 -307 488 741 621 -140
2587 -140 -629 -1234 -813 45 843 699 747 0 -751 -911 -1029 -264 770 667 627 247 -421 -943 -460 123
2607 123 679 812 784 118 -515 -890 -618 -146 561 830 520 149 -564 -818 -494 155 566 819 565 -145
2627 -145 -930 -562 -552 202 701 763 462 -77 -683 -814 -868 97 572 435 188 -323 -458 -819 -249 284 930
2648 930 652 528 -551 -817 -762 -281 247 887 768 379 -209 -853 -906 -153 479 688 439 133 -555 -725
2668 -725 -923 -484 163 1153 553 134 -75 -647 -862 -190 274 590 811 46 -245 -470 -720 -44 386 755
2688 755 258 -137 -795 -954 -741 -399 414 725 748 0 -371 -652 -421 162 625 710 330 29 -388 -707 -574
2709 -574 -212 293 654 413 59 -484 -915 -688 -275 418 561 556 -381 -445 -860 -270 262 627 894 581 227
2730 227 -435 -902 -472 271 574 816 402 -288 -688 -804 -503 282 834 750 239 -119 -671 -834 -431 264
2750 264 820 845 394 -475 -528 -663 -396 458 706 238 377 -248 -624 -622 -306 288 759 800 303 -403 -817 -932
2772 -932 -391 211 837 638 258 -236 -683 -406 -205 257 865 738 10 -429 -882 -711 -155 629 608 582 169
2793 169 -645 -774 -523 -131 332 951 485 32 -161 -827 -290 99 398 790 765 89 -667 -824 -729 35 605
2814 605 466 345 246 -559 -789 -466 -295 316 893 557 -311 -672 -732 -573 50 805 449 868 193 -516 -639
2835 -639 -411 -302 449 867 327 -154 -482 -638 -595 186 499 1005 471 -33 -790 -665 -437 232 527 863
2855 863 110 -272 -475 -796 -207 286 777 549 320 -385 -535 -943 -359 427 738 503 325 -142 -728 -261
2875 -261 -242 585 758 528 296 -324 -611 -749 -510 449 706 556 193 -79 -937 -712 -235 245 742 677 30
2896 30 -496 -634 -664 62 395 603 886 205 -508 -607 -640 -205 539 576 380 -154 -198 -677 -742 -30 469 884
2918 884 485 -65 -566 -855 -475 -50 465 766 370 -31 -478 -759 -362 310 703 890 675 -115 -748 -690
2938 -690 -278 -150 730 416 356 -143 -405 -661 -274 108 708 642 614 -44 -541 -504 -505 149 663 798 287 -159
2960 -159 -830 -867 -416 308 608 822 -38 -174 -728 -630 -250 438 647 595 327 -307 -912 -559 -354 90 808
2981 808 794 46 -179 -631 -775 -566 210 575 310 146 -519 -417 -687 -266 430 865 694 71 -367 -964
3001 -964 -669 77 -23 594 664 -95 -417 -561 -722 18 193 513 395 5 -518 -916 -694 -123 560 682
3021 682 717 -101 -383 -480 -574 148 439 743 538 157 -298 -682 -662 -188 396 820 619 -31 -737 -976 -378
3042 -378 -65 398 416 135 258 -382 -494 -139 -39 503 713 613 350 -562 -762 -263 -12 529 530 414 116
3063 116 -697 -666 -360 86 799 821 47 -21 -375 -699 -68 273 762 783 514 -109 -412 -545 -291 188 327
3084 327 683 281 -478 -816 -541 -342 236 529 330 87 -226 -680 -705 -160 333 544 845 289 33 -328
3104 -328 -632 9 65 681 607 88 -575 -784 -842 -310 370 582 338 -53 -133 -740 -364 7 607 507 503 45
3126 45 -392 -494 -446 200 296 667 557 183 -262 -726 -474 -142 393 652 342 -306 -565 -592 -182 10 369
3147 369 646 600 -251 -646 -379 -367 21 388 706 209 -121 -673 -320 -455 104 274 279 386 -369 -428 -744 -417
3169 -417 -114 562 569 513 124 -369 -725 -191 26 357 665 488 -82 -499 -654 -203 380 173 793 502 -350
3190 -350 -509 -692 -361 196 571 635 404 -94 -294 -466 -57 347 513 396 252 -176 -597 -425 -59 280
3210 280 362 451 266 -422 -760 -547 -315 335 575 433 24 -287 -404 -371 -60 348 444 472 -67 -298 -368 -137
3232 -137 166 355 589 509 -237 -516 -537 -497 75 158 687 151 -148 -319 -697 -444 -129 290 632 617 175 -200
3254 -200 -350 -405 28 546 407 294 -250 -352 -777 -407 7 284 520 204 146 -551 -672 -285 255 385 621
3275 621 494 133 -464 -339 -273 188 440 714 251 -251 -490 -665 -410 80 254 469 267 -377 -468 -301 63
3296 63 162 341 340 135 -546 -556 -315 38 226 408 496 -123 -311 -612 -677 -457 284 453 493 365 -394 -236 -582
3319 -582 -153 189 609 544 -61 -240 -307 -565 -287 159 603 755 106 -121 -760 -621 -141 370 534 249 -73
3340 -73 -426 -593 -572 436 323 444 440 -146 -245 -398 -181 81 456 316 258 89 -508 -533 -390 271 79 398
3362 398 267 -98 -427 -687 -427 0 543 698 324 98 -201 -240 -361 235 222 257 444 143 -528 -471 -228
3383 -228 182 569 428 133 -401 -692 -522 -261 134 464 363 -5 -52 -470 -370 -193 88 756 451 241
3403 241 -116 -368 -313 -237 129 383 223 234 -290 -412 -356 -177 233 492 569 348 -280 -791 -446 -413 167 619
3425 619 303 62 -447 -514 -331 114 346 574 589 71 -404 -468 -188 -188 77 566 325 104 -499 -452 -359 158
3447 158 264 342 324 -229 -488 -439 -61 -146 283 318 233 152 -323 -525 -367 -51 348 541 255 -194 -549 -553 -240
3470 -240 259 514 494 435 -16 -290 -528 -54 -53 488 474 104 141 -420 -526 -111 101 547 588 275 -4 -358
3492 -358 -359 -102 234 388 770 265 -105 -491 -491 -277 259 729 517 313 -391 -557 -480 -27 -18 472 121 47 -388
3515 -388 -478 -282 -90 276 434 634 -119 -275 -460 -280 -116 517 640 468 57 -322 -412 -543 -100 149 627
3536 627 484 -35 -342 -439 -244 -222 296 283 488 20 -481 -523 -382 -219 515 310 205 180 -436 -631 -325 4
3558 4 403 686 554 167 -490 -552 -392 -162 178 610 216 -51 -247 -548 -390 277 291 477 395 36 -389 -525
3580 -525 -263 31 583 357 287 -181 -586 -698 -215 60 214 362 335 -560 -218 -557 -638 426 354 582 126
3601 126 -49 -474 -213 -298 299 561 494 231 -163 -565 -437 -214 304 390 551 501 -102 -509 -304 8 -10 536
3623 536 545 384 -415 -388 -413 -115 322 221 488 -277 -412 -453 -642 -95 242 337 233 -162 -36 -472 -244 2
3645 2 277 438 425 -48 -265 -411 -186 -143 217 613 287 60 -338 -336 -64 123 188 519 214 42 -360 -534
3667 -534 -55 105 287 452 327 221 -336 -365 -367 100 190 404 194 171 -436 -223 -476 16 136 352 223 -7
3689 -7 -356 -419 -342 103 329 314 533 46 -441 -442 -302 427 405 291 352 -174 -267 -299 -388 96 375 329 230 225 -446
3714 -446 -337 -128 119 385 302 178 -224 -301 -232 -410 121 260 240 352 -242 -506 -123 -1 246 264 303 173
3736 173 -209 -377 -281 -121 268 430 669 132 -92 -595 -229 -17 177 560 259 97 -1 -510 -219 -95 244
3757 244 284 211 -122 -440 -530 -589 86 144 351 111 65 -93 -563 -128 38 112 263 296 -30 -301 -279 -335 62
3780 62 47 483 335 83 -359 -351 -119 -71 142 391 344 -10 -251 -148 -346 282 275 438 349 -59 -489 -459 -59
3803 -59 -44 365 79 123 -169 -364 -512 -37 -5 380 11 275 -111 -124 -481 -141 76 369 588 82 -190 -414
3825 -414 -366 -6 133 91 253 -24 -37 -538 -49 -96 -58 146 278 -30 -36 -324 -322 -323 174 368 406 239 -327 -592
3849 -592 -140 -286 204 400 296 219 -60 -104 -373 -42 -46 199 190 -28 -120 -70 -283 23 337 315 8 305 8
3872 8 -362 -452 104 318 520 155 -176 -180 -278 -224 67 317 34 310 100 -111 -295 -77 260 228 198 180 72
3895 72 -557 -194 26 82 342 288 251 148 -394 -64 -57 -16 312 417 1 -50 -358 -344 -158 -274 105 505 195
3918 195 -169 -420 -238 -130 -165 110 257 194 274 -222 -194 -204 362 272 103 183 -60 -392 -155 -321 231 156 38
3941 38 19 46 -273 -135 -56 61 363 374 92 -57 -271 -490 36 -84 109 240 144 -366 -275 -457 77 103 300
3964 300 189 -177 -96 -342 -135 -75 237 63 145 -159 113 -413 -216 -323 77 56 187 -77 -130 -343 -247 94
3986 94 218 391 238 -79 -254 -400 -166 175 488 414 -64 117 -70 -173 116 184 244 214 121 -7 -67 -61 -49
4009 -49 -106 168 191 42 111 -262 -112 -586 -207 213 77 37 -108 -228 -187 -322 185 90 277 92 -130 -271
4031 -271 -192 -167 352 187 335 183 179 -94 -406 -11 190 542 296 -9 -204 -52 -284 123 59 356 436 32
4053 32 167 -341 -176 -94 43 233 99 -55 -418 -337 -358 -46 270 328 -44 59 -66 -307 -83 -53 147 84
4075 84 121 175 -107 -234 -241 247 183 273 486 105 -323 -175 -68 -237 232 231 68 47 -166 -62 -246 -60 -113 147
4099 147 131 -95 -239 -253 -24 -158 275 35 146 14 141 -153 -340 -40 -66 185 96 -145 29 -89 -149 -79
4121 -79 9 341 480 -138 -180 -332 -133 23 6 208 126 -15 -190 -127 -140 97 138 122 241 -95 -77 -435 -107
4144 -107 200 151 370 135 -201 -62 -332 12 106 -2 256 -91 -265 -267 -141 -211 133 1 248 -4 -262 -273
4166 -273 -193 -149 92 197 323 142 -272 130 -25 -19 -63 -68 484 267 -116 -106 -121 23 66 268 35 -126 -332
4189 -332 -145 -109 119 179 428 329 185 -155 -45 -281 221 362 16 105 -284 -389 -238 4 -49 273 417 97
4211 97 40 -160 -154 -10 -54 204 279 29 -117 -142 -164 -115 177 18 226 275 -84 -86 -60 -71 184 338 -90 39 -279
4236 -279 -139 -82 -109 -2 161 110 172 -405 -250 -79 -121 64 251 259 23 -101 -227 -632 -142 119 -136 115
4258 115 84 -320 -295 -331 67 388 162 272 -109 49 -228 -128 -110 93 210 49 -40 -271 -70 -242 23 5
4280 5 -13 187 -84 110 -103 -563 -122 40 211 -57 -152 -273 -263 -105 176 80 173 7 76 -238 -34 -399 49
4303 49 331 -86 184 -23 -304 -216 -199 -185 138 402 141 -116 -233 -266 54 89 379 63 162 89 -218 -143 -86
4326 -86 222 102 219 -146 16 71 -198 -78 -40 158 39 -140 -182 -172 -69 67 125 87 429 251 44 159
4348 159 -316 -30 294 46 261 118 59 -321 -282 -308 -244 291 -23 104 -260 -7 -230 -123 -182 245 37 -122
4370 -122 -33 -81 116 -348 -187 40 329 166 -3 -34 -53 -169 193 128 153 134 24 -62 -109 40 12 128 78 -5
4394 -5 -19 -388 -122 -127 153 -34 118 203 -163 -27 -39 186 137 267 260 12 -36 -331 -265 -196 188 303 100 -289
4418 -289 -117 -208 -91 -58 201 -69 -3 -127 -250 -52 116 100 230 322 -275 -33 -120 -412 -58 -266 -205 314
4440 314 222 -171 -43 -361 -73 -156 -30 113 135 112 56 -226 -263 111 -4 224 105 5 -113 -24 141 118 21
4463 21 94 37 -110 -38 122 -122 180 100 150 84 -27 -292 -317 30 -54 231 383 78 127 -190 71 -34 -11 -172
4487 -172 195 0 58 -101 -197 28 -112 79 235 -50 -219 -8 -208 -154 117 -6 44 -111 -55 161 -89 -34
4509 -34 27 141 -208 70 81 -115 72 11 -20 171 209 94 -17 -56 -39 60 -59 228 -242 326 13 -208 -216 175
4533 175 -18 -129 263 -179 -161 -170 -106 289 64 11 2 23 -127 -98 90 -48 183 -53 146 -87 -194 -80 -104
4556 -104 201 222 243 -4 2 -104 -430 -132 -29 125 316 80 201 -123 -212 2 -73 277 72 163 -247 -51
4578 -51 47 181 245 14 136 194 -102 -16 -237 -26 137 109 37 299 -79 -278 -144 22 -38 24 41 -73 74
4601 74 -455 8 51 -157 -78 -195 -10 -112 -42 185 42 -288 59 169 47 301 -130 127 136 -53 -83 225
4623 225 53 -202 247 -99 -137 -91 120 22 -95 89 -224 -306 144 10 -112 12 -245 -204 49 50 -64 -41 211
4646 211 108 -137 -55 -160 -33 62 354 -50 64 5 -188 -200 -67 5 369 24 193 -142 38 -83 145 98
4668 98 91 -24 -9 23 -298 -166 -297 158 -23 -231 284 -240 -47 -87 41 7 -191 329 -18 -170 -79 -120 -240
4691 -240 277 107 -37 171 362 29 -148 80 117 -20 -17 188 221 111 -133 -6 177 54 -47 40 129 219
4713 219 -224 113 227 209 17 -117 70 -263 46 117 152 114 -221 197 -6 -191 -101 41 215 -131 29 83
4735 83 231 -194 -211 29 105 -40 -52 254 -38 -114 39 -221 59 -127 -79 35 44 -419 42 15 -5 -6 16 -269
4759 -269 -186 248 -111 36 217 178 163 81 -94 24 -164 -165 -137 174 47 95 -190 -179 -55 -241 74 -140 -181
4782 -181 11 -59 25 23 -2 -151 111 332 66 -11 -184 -142 365 -24 -53 -201 -55 -18 170 -48 129 -131 -76
4805 -76 -160 -120 -181 -18 -109 195 86 4 -173 -21 109 -151 -48 -211 171 44 25 151 -186 234 -178 -56
4827 -56 -148 -258 133 10 -238 -82 -126 42 85 -129 -121 -103 -129 -64 373 -142 175 -302 58 -150 -250 0 119
4850 119 60 -59 -61 -212 -189 16 -58 -177 167 115 -32 -147 -150 -180 -18 -128 335 17 119 0 -97 3 -4 -71
4874 -71 79 31 224 246 277 -249 -124 5 -182 -88 -92 -190 -146 -115 -185 113 171 63 36 188 -526 -244 9 -39 42
4899 42 206 135 31 144 46 69 261 88 249 93 21 -191 294 -225 -191 197 -92 -172 -6 -135 -25 201
4921 201 -208 202 -28 -63 32 180 -218 -96 -211 89 60 -248 -159 13 -24 -169 86 88 -147 69 191 -104
4943 -104 -54 540 -77 196 268 63 -159 6 -49 10 68 31 42 -128 48 237 -109 120 21 189 -120 -58 -131
4966 -131 15 165 -223 13 90 39 78 -210 270 44 -138 -106 -178 49 212 53 249 84 -125 51 -39 95
4988 95 -2 -10 37 -111 188 -50 30 -173 160 256 -37 47 72 -58 -18 5 174 -128 9 190 -77 -84 7 -152 21
5013 21 0 109 77 116 -209 -8 128 -160 -102 -79 53 59 163 -149 -84 7 -73 135 0 -102 86 -190 97 -172
5037 -172 -79 -135 82 -158 -36 37 -63 146 171 -28 222 46 175 55 -65 -166 84 8 -111 -223 -338 -125
5059 -125 -220 82 -215 -82 283 -1 -214 113 -78 -88 53 -95 67 97 -78 -33 130 -250 113 -100 29
5080 29 32 38 -33 -112 -56 -69 -57 -122 -46 -111 72 -127 205 -249 37 -138 -39 -135 -104 265 46 -168 213 -132 -7
5105 -7 -175 -237 208 -214 255 260 167 -107 -337 -91 15 -43 46 -115 -241 -172 -82 -8 111 231 227 217 -87 73 170
5130 170 70 46 172 -82 -64 47 -74 -113 -35 142 -80 -49 110 82 109 53 -358 -243 180 81 132 -18 -249
5153 -249 -155 -263 180 213 52 237 -97 -119 197 -2 -186 -47 10 -236 103 -328 -103 13 67 -21 -25 -22 -8 17
5177 17 43 82 -179 6 -44 -44 -22 -51 48 -141 175 12 265 -277 -33 -55 -223 232 -101 73 -240 -161 65 115
5201 115 264 -145 177 -28 53 -1 115 223 -200 -109 183 -98 -61 -36 89 17 -178 14 -141 111 106 -33 99
5224 99 -139 135 -210 14 16 24 48 147 115 -49 -67 -77 213 342 -46 -69 -97 -179 314 -92 -189 60 -239 104 -269
5249 -269 68 66 -161 38 233 148 230 27 24 28 15 145 -26 142 -6 221 53 40 14 121 -98 -61 -74 -176
5273 -176 -29 -79 415 -33 -174 73 146 -71 143 50 205 -6 214 172 367 -76 143 -347 58 227 21
5294 21 56 -297 -76 -32 -242 28 52 160 -205 -191 -286 -129 129 -111 31 -266 -65 -145 -241 -27 46 99 59 -37
5318 -37 27 -15 189 56 38 397 19 60 19 -54 -69 -43 19 3 -60 19 260 0 -223 -113 -37 -96 -28 -60 -37 5
5344 5 -192 -132 129 -91 63 86 166 -373 -30 146 17 29 66 -101 -181 388 -84 -176 54 -188 57 -229 -42
5367 -42 -128 188 -102 -240 -33 207 -101 45 -179 -171 117 -78 87 78 -68 -200 118 -239 67 167 0 32
5389 32 64 16 -257 -134 -57 -86 168 46 118 30 -126 -341 -49 336 138 26 -314 72 -97 19 96 184 308
5412 308 204 113 65 83 -74 16 56 187 80 19 -122 143 177 4 146 102 -28 -34 -63 99 -136 -12 43 110
5436 110 -222 -60 -64 -107 178 -30 -28 -54 -26 17 -253 127 162 -133 290 -80 -132 49 42 -21 -153 147 62 51 -142
5461 -142 38 -68 -81 -77 -10 -54 -95 -29 -248 -64 -133 -105 109 388 -31 -46 148 -152 -113 -77 -134 -67 -85 -78 -103 42
5487 42 -194 -86 -102 4 -121 33 6 63 -126 82 -175 -44 -208 -11 -90 66 174 182 107 117 170 -51 156
5510 156 100 296 96 -114 -229 132 231 95 223 70 7 156 -145 -359 28 46 -145 -6 -53 -25 189 132
5532 132 34 4 123 -104 -79 -153 -210 79 -162 187 -190 69 35 55 49 96 -127 126 18 59 53 -160 236 16
5556 16 8 28 -105 -101 6 -21 191 144 -225 28 95 132 -18 -83 139 82 146 -1 -126 -68 18 109 -146 264 167 -12
5582 -12 29 78 -182 160 37 -175 -115 -123 163 -32 80 -335 -167 -268 -144 -90 226 -43 -6 137 131 -143 -168 77
5606 77 132 79 -104 126 -10 230 66 -66 404 -24 -87 -166 -121 78 -53 14 -132 72 4 -168 76 223 328
5629 328 -2 193 -144 152 -56 -68 -23 149 41 -155 66 -79 -144 39 89 53 -363 250 -145 66 -60 -150
5651 -150 -123 -234 129 -40 -37 214 11 111 230 -118 -98 -143 27 11 391 -60 -232 -258 207 -162 -24 75 131
5674 131 -288 -82 -67 -40 -201 50 320 -185 18 106 137 110 62 -412 74 -29 88 76 -122 -68 26 45 160
5697 160 239 157 -93 -115 117 -236 -157 -451 -19 -26 -56 -3 76 -9 174 234 82 -166 15 -101 -91 59 -120 29
5721 29 206 133 -157 125 137 -104 -177 -60 -156 -102 -146 140 89 -92 141 30 -196 264 -25 122 -184 189 -188
5744 -188 131 -63 153 66 -67 -82 33 -212 3 -43 146 153 -196 130 280 47 -52 -84 -97 118 30 -35 -21 121
5768 121 98 -204 -79 -3 76 -65 69 -82 -135 53 9 111 99 -291 81 70 40 -45 219 -47 179 -136 -134 177
5792 177 30 276 135 -6 71 -294 101 1 -169 -25 7 170 -36 111 -26 -153 104 -248 -125 -10 118
5813 118 -279 -38 -56 -212 56 209 78 125 -106 -55 45 23 -25 -222 36 313 163 -159 148 184 171 -118
5835 -118 -166 -316 -237 -133 -10 174 7 -214 90 -6 -52 -210 -105 272 -75 -165 132 -26 -161 -155 -157 -26 -81
5858 -81 -197 -66 25 -119 39 96 -33 -85 76 -80 -145 196 -8 -28 -207 -85 -35 25 -132 -8 -156 -19 -58
5881 -58 51 57 158 -105 201 119 -66 -134 23 -53 -182 -199 39 -142 -179 48 -102 -66 45 -116 110 -120 -123 -46
5905 -46 278 -26 -134 -37 -34 -62 3 209 -42 -96 25 154 226 89 47 -11 255 -12 46 -28 -70 -190 -39 137
5929 137 -102 -46 -228 -163 32 -16 76 -166 -36 -59 -91 14 -18 17 -114 85 237 -133 -182 153 114 147 126 -73
5953 -73 -103 -73 -24 64 -29 -69 208 81 51 175 21 391 -24 180 -149 -192 38 114 265 -48 168 -2 180
5976 180 4 76 113 82 -191 -100 13 -230 -101 52 -130 -233 128 117 35 -159 73 142 -146 -141 45 -111 224
5999 224 -26 -157 -168 38 156 110 144 -86 -27 -21 25 -62 27 -163 -9 -388 -83 40 -32 -166 137 -37 -213
6022 -213 207 40 60 39 -160 9 -65 252 87 16 94 62 92 -106 -47 26 23 20 49 -153 175 -93 -120 -213 280
6047 280 117 17 28 -33 120 -251 100 -272 -13 -167 -186 38 15 -332 41 -101 72 77 94 -120 -13 -164
6069 -164 111 -55 -27 118 199 117 128 116 114 -184 153 -136 363 249 153 127 90 134 283 -141 115 179 79 141
6093 141 -16 259 -56 -3 -17 -62 186 209 -287 -81 25 82 107 45 -193 -66 67 -4 -141 -34 -102 18 -172
6116 -172 25 -70 -13 -2 307 45 303 -153 41 -283 -29 361 67 132 -94 37 -179 17 110 -123 82 170
6138 170 -132 16 -45 21 71 10 -164 -32 -130 108 30 198 -129 90 88 -47 96 -9 -101 -97 -39 36 -26 -365 31
6163 31 97 -94 -158 223 -161 -84 38 46 -56 -198 -193 82 13 13 244 -39 133 -216 -67 -256 -8 107 24 -12
6187 -12 10 -166 -60 69 100 35 -116 140 143 -125 -354 20 141 -81 -87 -162 -126 -86 -128 -16 -23 56 115 -32 -184
6212 -184 73 -49 222 -23 -66 -105 -240 -125 62 35 -32 -125 -248 -207 -105 -141 -84 -219 128 -204 95 -48 -207
6235 -207 177 -187 -287 84 3 -287 -274 74 -156 193 123 137 -93 -132 -8 87 -153 174 -63 -184 47 -71
6257 -71 -67 -131 -8 153 79 -31 61 131 356 -260 -67 -161 -23 48 -230 31 65 -252 96 -72 124 174 -27 -439
6281 -439 15 158 -2 11 -55 154 53 -262 -124 159 99 151 68 231 147 110 -48 -417 -196 137 -15 -157
6303 -157 -190 118 -234 76 -165 129 -203 -47 -202 -172 -84 -153 -29 216 -252 -116 30 105 190 13 -59 -57 -232
6326 -232 319 313 57 258 -166 227 5 54 -90 -72 124 -58 -110 79 139 65 -105 159 59 -170 -343 191
6348 191 -41 -67 182 69 47 1 176 38 -108 107 42 37 88 39 -131 -232 59 -6 -15 68 -74 -246 92 -267
6372 -267 -243 278 -88 86 -195 -69 99 32 324 34 -30 111 -254 -27 -227 39 62 -471 124 135 -6 269
6394 269 -123 -23 0 145 243 -110 246 -145 -66 -13 -92 178 14 9 -215 -151 -268 88 253 -109 427 -281 90
6417 90 47 42 -248 74 -5 -126 76 -54 -15 -100 175 -12 169 64 -146 -24 -100 -109 -145 146 -33 71 -115 -55
6441 -55 -2 100 -165 130 42 -17 203 -173 99 -106 64 -128 -37 -131 97 -61 -256 -157 -230 235 64 -97 12
6464 12 45 63 59 -29 -240 178 -170 -59 155 171 117 107 -12 198 236 147 19 267 22 37 -8 -304 103 -87
6488 -87 -200 76 27 74 207 12 25 -74 235 -211 38 -118 -27 20 -79 -100 -115 -110 60 -124 167 54 61 169 3
6513 3 104 33 274 30 9 135 -137 48 -149 -68 1 218 -194 -209 -25 27 120 -145 -38 -121 112 60 -265 19
6537 19 -186 147 -48 124 1 -80 198 -109 -316 -28 164 -43 6 -107 -72 -194 -48 -141 -79 -32 -57 -202 -52
6560 -52 -107 -4 -54 -128 219 100 2 -193 -182 83 -65 334 -26 -61 91 -18 -74 -51 -40 24 46 -51 -49 -231 -61
6585 -61 22 298 80 293 51 201 51 -143 -74 251 197 307 123 -242 -56 -173 13 -16 248 70 59 6
6607 6 -147 -348 -354 -106 59 138 15 39 4 -188 3 174 150 -39 -57 103 -321 -12 -111 -27 75 327 -25 150
6631 150 -170 -209 -28 14 -188 -61 -233 2 350 13 168 178 -90 36 119 -213 -31 -218 -98 1 278 -130
6653 -130 -185 178 1 -62 -230 132 94 112 80 -289 102 -194 28 -23 128 -23 -263 -63 -118 -139 -87 -142 201
6676 201 251 28 -78 100 68 -114 8 -18 168 -160 -211 -63 -23 -146 20 295 147 156 94 19 -192 97 89 110
6700 110 55 -35 162 62 -29 -36 -83 117 191 -65 -130 -76 234 -22 -154 -223 63 5 76 -24 -128 -54 330 201
6724 201 -78 119 94 27 -21 218 132 329 -176 5 87 -192 -120 -163 143 -203 -246 -25 69 -388 6 -76 -109 -152
6748 -152 98 -145 -126 50 30 -39 228 86 167 159 -69 -51 73 178 145 4 -77 5 -173 196 5 190 251 20
6772 20 91 -172 -243 280 96 40 30 214 216 -39 -84 265 -233 -9 183 -159 291 -116 -13 -7 85 166 -59 238
6796 238 -90 -115 35 160 -188 78 125 254 -80 -31 27 7 -69 134 331 97 -231 -5 -58 -18 -25 -85 25 84
6820 84 -87 -1 -225 -224 145 74 -97 -55 -32 -189 -252 -268 -38 122 -26 -158 183 91 -142 -90 56 231 74 77
6844 77 -45 117 0 -39 157 134 55 -84 -368 104 -143 -114 178 -49 178 -46 -91 21 -150 -130 -19 175
6866 175 114 -154 -171 -57 27 40 -169 -24 109 18 171 -135 105 124 93 190 141 -78 -192 -18 226 164 152 189
6890 189 156 239 -108 90 -188 173 209 257 -2 9 116 -163 -37 -120 73 35 -72 40 -75 33 -259 99
6912 99 58 -6 -284 -29 76 -242 12 30 15 117 15 154 -184 -7 -17 -88 116 99 -53 3 -41 -111 -129 -91
6936 -91 141 -97 194 10 -173 42 -189 -36 280 -155 67 -277 21 -31 75 163 21 43 -229 -36 -126 119
6958 119 73 -156 7 81 40 -367 -14 -55 -54 210 -184 -24 40 -27 -122 -52 -134 -12 232 -36 -118 -195 -188 44 65
6983 65 40 -38 231 -229 3 -38 -88 75 62 -6 235 19 -213 -312 -102 -39 68 201 95 -98 -154 -62 -3 -66
7007 -66 328 403 174 -18 -11 53 -215 -121 240 237 -30 55 -171 139 63 33 -107 206 -100 -2 -259 -53 123 -36
7031 -36 5 171 -109 -40 -95 -134 -53 -141 95 -198 -30 -235 -300 -369 -127 92 -53 138 -123 -107 -148 236 226 320
7055 320 -90 -84 129 1 -37 -132 77 -14 -64 159 62 -71 -190 -227 -111 176 161 71 -248 66 -269 121 34 12
7079 12 -252 192 -311 29 189 85 -231 4 211 -11 -101 -13 -29 -19 48 199 1 -103 234 -336 25 -95
7101 -95 218 33 200 74 -139 -148 12 91 -113 222 -12 -154 -54 6 112 -93 124 -107 -158 -103 -55 -222 -154
7124 -154 68 63 -168 329 71 -154 120 -171 241 142 299 465 -122 -233 -15 -200 -391 334 147 193 82
7145 82 119 -91 -163 71 -8 24 99 13 -136 -223 -155 -21 2 67 94 -57 -10 -165 -15 -31 -119 5 -47 105 38 -85
7171 -85 -244 43 -165 378 272 -114 45 -125 45 169 162 162 118 238 -221 138 168 143 202 160 -100 -111 -295 193
7195 193 -13 -4 266 242 130 68 -50 -101 -61 -34 -338 69 -29 154 -219 28 1 -134 273 -118 -62 83 36 0
7219 0 103 -228 135 -10 -60 -217 -165 -143 -195 -150 228 267 65 185 -205 -149 -134 -8 151 -56 97 -316 -100
7242 -100 -101 1 204 -1 -195 97 -92 0 8 -130 45 123 -67 176 -155 -210 -43 -14 25 107 -23 -61 156 -322
7266 -322 -17 -14 -117 62 -133 -20 -169 -200 46 -33 61 157 216 179 -155 -223 -310 247 -36 -104 -162 -251 -33 -209
7290 -209 160 221 68 337 27 -65 -177 -194 -273 -127 3 298 -157 -34 17 -297 -146 -14 8 -76 185 31
7312 31 220 -292 100 -216 98 180 -91 -106 -19 -100 -76 70 -85 -12 25 -199 -53 -35 145 26 -80 256 -57
7335 -57 44 -178 84 -144 261 -168 226 281 -71 32 -311 -13 -186 69 263 76 -41 -102 -261 -323 92
7356 92 257 153 145 -298 13 49 -136 151 -88 213 116 -22 61 -34 -311 -281 -134 211 210 -142 -152 83 140 112
7380 112 251 -79 17 119 3 -96 -5 116 116 -199 97 -35 73 40 -64 -157 134 0 260 -292 -197 -18 210
7403 210 -138 258 152 48 -125 -235 -111 -134 143 19 106 -76 4 -189 46 -216 -53 224 59 -53 -20
7424 -20 -177 -254 273 -89 423 146 -110 -161 97 -285 9 54 41 -282 -43 47 -261 -152 -144 1 164 -112 -61
7447 -61 7 -223 -39 40 180 -153 -143 5 -47 -96 -94 22 89 254 -5 -62 0 -271 102 -145 -149 302 111 208 -110
7472 -110 -139 125 -24 165 78 -12 11 156 16 -107 77 192 217 -171 -15 123 -91 -8 -61 11 185 124 74
7495 74 -247 -67 -110 107 324 167 -11 -56 -231 -53 -10 201 402 332 -59 -35 -305 -306 -204 270 190 137 156 -208
7519 -208 -108 249 85 -139 230 384 -191 -36 93 132 64 115 125 -24 -147 -192 3 177 -114 110 168 58
7541 58 -4 -176 23 -163 -60 66 228 -223 -234 -73 -248 39 256 74 267 -112 -107 8 -264 343 38 32
7563 32 78 330 -76 -83 -229 -303 -195 227 -215 69 -255 -120 -250 38 127 207 -176 -40 -18 138 155 -52 -51 -74
7587 -74 22 127 123 129 277 26 79 -66 -138 -58 42 -84 -134 -167 74 75 262 -17 42 184 -61 -76 179 73 189
7612 189 53 -48 -134 -141 -26 -116 -90 92 62 126 -270 122 110 106 88 69 219 13 -70 -259 260 55 224 47
7636 47 127 -45 -297 -71 -103 60 187 -256 -27 -41 -103 191 11 231 -13 11 104 -321 -48 105 -136 139
7658 139 127 289 216 -148 -77 -119 161 77 -273 -127 -56 58 -248 -160 -197 -160 331 -97 97 -133 -142 -18 71 247
7682 247 -332 136 -68 -127 -6 69 84 55 91 16 165 55 -144 20 -74 50 114 -135 -204 -88 -194 -41 100
7705 100 53 -24 -1 -96 -26 -265 7 5 22 186 -61 -180 -15 -8 27 157 141 29 76 -221 -248 -123 -235 164 -79
7730 -79 33 78 26 41 91 -27 199 -87 -54 -141 -21 -70 -22 -160 8 342 138 63 43 -114 -163 28 247 -50
7754 -50 83 114 145 -199 117 130 -9 -197 72 -16 5 102 -181 -47 -38 133 42 -57 -85 -37 -78 95 -84 120 -15
7779 -15 -44 -98 -106 147 -4 241 6 99 286 -147 -242 -139 -36 -93 -78 77 -94 -155 -193 -89 -274 -40 175 135
7803 135 -185 -168 -204 197 -79 3 -406 -21 178 -42 -158 37 41 -31 57 -36 135 149 -24 -148 -208 79 -122
7826 -122 -201 43 186 11 -207 -30 -16 217 -343 -86 -292 0 5 -3 127 65 54 -20 128 -159 -283 -166 -1
7849 -1 248 -25 -121 -20 109 -58 59 64 -45 10 -89 -178 -270 18 -264 -192 153 49 -200 -14 -91 -105 -95 -48 -74
7874 -74 -81 4 -162 -166 64 139 -43 146 -95 -97 134 -54 -506 -97 25 -129 -105 -262 -86 -158 -60 25 109 -92 -63
7899 -63 -170 -78 -39 -23 89 -276 -157 -44 -79 -52 -97 -61 208 334 70 108 -139 -35 -55 -20 -30 87 75 -119
7923 -119 -187 41 -16 112 -65 -127 154 -161 -104 128 -72 -99 132 8 -89 -65 -248 -319 -287 139 80 -267 248
7946 248 -76 224 -138 183 12 -36 234 -105 -2 51 94 13 115 198 99 0 38 -81 55 218 -118 8 125
7969 125 162 -44 -154 -15 110 -193 -67 -50 -62 57 -15 -88 10 79 -156 69 18 -296 -54 -135 -101 117 -108
7992 -108 5 -332 178 137 101 203 -59 -152 -6 96 -38 -47 90 117 -93 -117 117 91 -210 -76 -45 -93 -129 -104
8016 -104 -42 151 -131 18 37 67 178 169 -155 93 -132 -111 -268 -22 62 169 145 39 111 34 29 -269 -307 -60
8040 -60 19 82 -316 250 -208 -52 -72 -91 11 -214 -50 285 -162 37 -47 -7 -21 -254 -238 117 -63 -37 -18 133
8064 133 71 112 -140 225 159 112 259 -50 -377 -2 133 -111 -140 -249 -86 67 57 -51 48 -125 -102 -60 -36
8087 -36 23 30 -184 256 30 184 -114 101 282 -211 137 -129 19 -12 165 76 71 107 -247 -121 76 57 85 75
8111 75 26 184 98 -236 205 -164 -2 312 -226 61 22 109 -212 72 -90 -22 -157 129 -76 -10 167 43
8133 43 -109 -50 179 -168 -91 -45 -38 226 19 320 -183 -93 -9 38 59 110 24 -139 -10 152 -406 106 293 245
8157 245 54 63 27 -350 -86 -320 -222 208 -73 -281 54 78 133 -136 161 -310 14 -145 -146 -64 -293 10 31
8180 31 -48 -277 -170 17 -72 84 -78 -348 -106 79 140
8191A40
##END NTUPLES=NMR FID
##END=
