##TITLE=1H_CA-8563
 CDCl3, 8 sc, 
 6.2.2019
##JCAMPDX= 6.0         $$ Bruker NMR JCAMP-DX V2.0
##DATA TYPE= NMR FID
##DATA CLASS= NTUPLES
##ORIGIN= UXNMR, Bruker Analytische Messtechnik GmbH
##OWNER= root
$$ XWIN-NMR		Version 3.5
$$ Wed Feb  6 14:41:33 2019 Russian Standard Time (UT+4h)  she@DPX200
##.OBSERVE FREQUENCY= 200.1313
##.OBSERVE NUCLEUS= ^1H
##.DELAY= (6, 6)
##.ACQUISITION MODE= SIMULTANEOUS
##.ACQUISITION SCHEME= undefined
##.AVERAGES= 8
##.DIGITISER RES= 18
##SPECTROMETER/DATA SYSTEM= spect
##.PULSE SEQUENCE= zg30
##.SOLVENT NAME= CDCl3
##.SHIFT REFERENCE= (INTERNAL, CDCl3, 0, 15.7039)
##AUDIT TRAIL= $$ (NUMBER, WHEN, WHO, WHERE, WHAT)
$$ ##TITLE= Audit trail, XWIN-NMR		Version 3.5
$$ ##JCAMPDX= 5.01
$$ ##ORIGIN= Bruker BioSpin GmbH
$$ ##OWNER= she
$$ F:/spectra/data/she/nmr/H-F/1/audita.txt
$$ ##AUDIT TRAIL=  $$ (NUMBER, WHEN, WHO, WHERE, WHAT)
(   1,<2019-02-06 14:39:50.14 +0400>,<she>,<DPX200>,
      <created by zg, POWCHK disabled, PULCHK disabled
       configuration hash MD5:
       00 E9 B6 7A A2 85 ED C7 34 08 36 98 17 FE 4E 26
       data hash MD5: 16K
       64 38 8B 01 8E 2D 97 E5 4C 40 E8 37 3E E5 32 81>)
$$ ##END=
$$ 
$$ hash MD5
$$ D6 F0 B9 1B 0C AC 87 75 33 42 C5 E9 0A 9E 0A 43
##$RELAX= 
##$RELAX= 
##$RELAX= 
##$RELAX= 
##$RELAX= 
##$RELAX= 
$$ Bruker specific parameters
$$ --------------------------
##$DU= <F:/spectra>
##$EXPNO= 1
##$NAME= <H-F>
##$PROCNO= 1
##$TYPE= <nmr>
##$USER= <she>
##$AMP= (0..31)
100 100 100 100 100 100 100 100 100 100 100 100 100 100 100 100 100 100 
100 100 100 100 100 100 100 100 100 100 100 100 100 100 
##$AQSEQ= 0
##$AQ_mod= 1
##$AUNM= <au_zg>
##$AUTOPOS= <>
##$BF1= 200.13
##$BF2= 200.13
##$BF3= 200.13
##$BF4= 200.13
##$BF5= 200.13
##$BF6= 200.13
##$BF7= 200.13
##$BF8= 200.13
##$BYTORDA= 1
##$CFDGTYP= 0
##$CFRGTYP= 5
##$CHEMSTR= <none>
##$CNST= (0..31)
1 1 145 1 1 1 1 1 1 1 1 1 1 1 1 1 1 1 1 1 1 1 1 1 1 1 1 1 1 1 1 1 
##$CPDPRG= <>
##$CPDPRG1= <>
##$CPDPRG2= <>
##$CPDPRG3= <>
##$CPDPRG4= <mlev>
##$CPDPRG5= <mlev>
##$CPDPRG6= <mlev>
##$CPDPRG7= <mlev>
##$CPDPRG8= <mlev>
##$CPDPRGB= <>
##$CPDPRGT= <>
##$D= (0..31)
0 1.2 0 0 0 0 0 0 0 0 0 0.03 0 0 0 0 0 0 0 0 0 0 0 0 0 0 0 0 0 0 0 0 
##$DATE= 1549449589
##$DBL= (0..7)
120 120 120 120 120 120 120 120 
##$DBP= (0..7)
150 150 150 150 150 150 150 150 
##$DBP07= 0
##$DBPNAM0= <>
##$DBPNAM1= <>
##$DBPNAM2= <>
##$DBPNAM3= <>
##$DBPNAM4= <>
##$DBPNAM5= <>
##$DBPNAM6= <>
##$DBPNAM7= <>
##$DBPOAL= (0..7)
0.5 0.5 0.5 0.5 0.5 0.5 0.5 0.5 
##$DBPOFFS= (0..7)
0 0 0 0 0 0 0 0 
##$DE= 6
##$DECBNUC= <off>
##$DECIM= 32
##$DECNUC= <off>
##$DECSTAT= 4
##$DIGMOD= 1
##$DIGTYP= 9
##$DL= (0..7)
0 120 120 120 120 120 120 120 
##$DP= (0..7)
150 150 150 150 150 150 150 150 
##$DP07= 0
##$DPNAME0= <>
##$DPNAME1= <>
##$DPNAME2= <>
##$DPNAME3= <>
##$DPNAME4= <>
##$DPNAME5= <>
##$DPNAME6= <>
##$DPNAME7= <>
##$DPOAL= (0..7)
0.5 0.5 0.5 0.5 0.5 0.5 0.5 0.5 
##$DPOFFS= (0..7)
0 0 0 0 0 0 0 0 
##$DQDMODE= 0
##$DR= 18
##$DS= 0
##$DSLIST= <SSSSSSSSSSSSSSS>
##$DSPFIRM= 0
$$ [...]
##$SUBNAM2= <"">
##$SUBNAM3= <"">
##$SUBNAM4= <"">
##$SUBNAM5= <"">
##$SUBNAM6= <"">
##$SUBNAM7= <"">
##$SUBNAM8= <"">
##$SUBNAM9= <"">
##$SW= 20.0189088683792
##$SWIBOX= (0..15)
0 0 2 0 0 0 0 0 0 0 0 0 0 0 0 0 
##$SW_h= 4006.41025641026
##$TD= 16384
##$TD0= 1
##$TE= 0
##$TE2= 300
##$TE3= 300
##$TEG= 300
##$TL= (0..7)
0 120 120 120 120 120 120 120 
##$TP= (0..7)
150 150 150 150 150 150 150 150 
##$TP07= 0
##$TPNAME0= <>
##$TPNAME1= <>
##$TPNAME2= <>
##$TPNAME3= <>
##$TPNAME4= <>
##$TPNAME5= <>
##$TPNAME6= <>
##$TPNAME7= <>
##$TPOAL= (0..7)
0.5 0.5 0.5 0.5 0.5 0.5 0.5 0.5 
##$TPOFFS= (0..7)
0 0 0 0 0 0 0 0 
##$TUNHIN= 0
##$TUNHOUT= 0
##$TUNXOUT= 0
##$USERA1= <user>
##$USERA2= <user>
##$USERA3= <user>
##$USERA4= <user>
##$USERA5= <user>
##$V9= 5
##$VALIST= <valist>
##$VCLIST= <CCCCCCCCCCCCCCC>
##$VD= 0
##$VDLIST= <DDDDDDDDDDDDDDD>
##$VPLIST= <PPPPPPPPPPPPPPP>
##$VTLIST= <TTTTTTTTTTTTTTT>
##$WBST= 1024
##$WBSW= 4
##$XGAIN= (0..3)
0 0 0 0 
##$XL= 0
##$YL= 0
##$YMAX_a= 166327
##$YMIN_a= -296794
##$ZGOPTNS= <>
##$ZL1= 120
##$ZL2= 120
##$ZL3= 120
##$ZL4= 120
##$ABSF1= 10
##$ABSF2= 0
##$ABSG= 5
##$ABSL= 3
##$ALPHA= 0
##$AQORDER= 0
##$ASSFAC= 0
##$ASSFACI= 0
##$ASSFACX= 0
##$ASSWID= 0
##$AUNMP= <proc_1d>
##$AZFE= 0.1
##$AZFW= 0.1
##$BCFW= 1
##$BC_mod= 2
##$BYTORDP= 1
##$COROFFS= 0
##$CY= 11.3945322036743
##$DATMOD= 1
##$DC= 2
##$DFILT= <>
##$DTYPP= 0
##$F1P= 18.9103706918063
##$F2P= -1.10871071338519
##$FCOR= 0.5
##$FTSIZE= 0
##$FT_mod= 4
##$GAMMA= 1
##$GB= 0.15
##$INTBC= 1
##$INTSCL= 1
##$ISEN= 128
##$LB= 0.24
##$LEV0= 0
##$LPBIN= 0
##$MAXI= 10000
##$MC2= 0
##$MEAN= 0
##$ME_mod= 0
##$MI= 1.114404
##$NCOEF= 0
##$NC_proc= 0
##$NLEV= 6
##$NOISF1= 3.799351
##$NOISF2= 2.8
##$NSP= 1
##$NTH_PI= 0
##$NZP= 0
##$OFFSET= 15.70392
##$PC= 1
##$PHC0= -9040.28
##$PHC1= 15.80004
##$PH_mod= 1
##$PKNL= yes
##$PPARMOD= 0
##$PSCAL= 0
##$PSIGN= 0
##$REVERSE= no
##$SF= 200.130013532006
##$SI= 16384
##$SIGF1= 3
##$SIGF2= 2
##$SINO= 400
##$SIOLD= 16384
##$SREGLST= <1H.CDCl3>
##$SSB= 0
##$STSI= 0
##$STSR= 0
##$SW_p= 3612.71676300578
##$SYMM= 0
##$S_DEV= 0
##$TDeff= 0
##$TDoff= 0
##$TI= <>
##$TILT= no
##$TM1= 0
##$TM2= 0
##$TOPLEV= 0
##$USERP1= <user>
##$USERP2= <user>
##$USERP3= <user>
##$USERP4= <user>
##$USERP5= <user>
##$WDW= 1
##$XDIM= 8192
##$YMAX_p= 0
##$YMIN_p= 0
$$ End of Bruker specific parameters
$$ ---------------------------------
##NTUPLES= NMR FID
##VAR_NAME=  TIME,          FID/REAL,        FID/IMAG
##SYMBOL=    X,             R,               I
##VAR_TYPE=  INDEPENDENT,   DEPENDENT,       DEPENDENT
##VAR_FORM=  AFFN,          ASDF,            ASDF
##VAR_DIM=   8192,          8192,            8192
##UNITS=     SECONDS,       ARBITRARY UNITS, ARBITRARY UNITS
##FACTOR=    0.0002496,     1,               1
##FIRST=     0,             0,               0
##LAST=      2.0444736,     0,               0
##MIN=       0,             -296794,         0
##MAX=       2.0444736,     166327,          0
$$ Real data points
##PAGE= N=1
##DATA TABLE= (X++(R..R)), XYDATA
0 0 0 0 0 0 0 0 0 0 0 0 0 8 -8 8 -8 16 -16 16 -24 32 -32 40 -48 56 -68 80 -93 107 -124 143 -162 184 -211
33 -211 239 -269 303 -341 381 -428 477 -531 590 -655 725 -802 887 -977 1079 -1189 1311
50 1311 -1443 1590 -1752 1933 -2135 2364 -2622 2920 -3263 3670 -4155 4748 -5492 6457 -7765
65 -7765 9645 -12601 17932 -30604 128860 -11352 -201151 145514 165228 -119886 -162109
76 -162109 77578 55600 -90617 -57370 46533 -4694 -27224 22049 10365 -48482 -14252
87 -14252 -246 -47988 -36083 23374 -4626 -10916 58799 44523 -39798 9348 83714 7634
99 7634 -60673 12230 39642 -30861 -35415 12621 -5818 -3330 57201 24220 -65466 -4219 88016
112 88016 -17857 -119720 10540 97331 -44329 -101180 38485 59389 -48469 -15903 66680
123 66680 4683 -41480 33562 33654 -55865 -30714 57233 22411 -45387 -5881 33423 -3942 -12128
136 -12128 11508 -16835 -17445 40075 3495 -82443 -14888 82138 -3305 -75993 36047 86750
148 86750 -30886 -52759 51086 36092 -54008 -9250 59045 -13874 -68843 16195 53556 -32251
160 -32251 -44309 39465 35575 -32988 -23591 11121 -3690 -2872 12186 -11332 -13559 26672 15352
173 15352 -28871 -5472 34727 9371 -17605 2218 3070 -21019 -4744 17052 -12826 -22477 26145
186 26145 25491 -33444 -19641 37834 10916 -27375 15587 27321 -28660 -13487 41192 -2946
198 -2946 -49144 20099 57593 -26451 -59035 22432 42568 -33347 -39300 28181 23081 -28378 -13092
211 -13092 17495 -6099 -9317 24002 12028 -17681 2765 18962 -5373 -10883 6425 4292 2122
224 2122 9582 -6025 -22037 4689 24663 -6846 -25171 9839 25225 -14784 -28056 7991
236 7991 14198 -9700 -760 11928 -10664 -11481 16792 6442 -19560 1236 24538 4202 -14330
249 -14330 -4980 2805 6744 9695 -3365 -15147 3289 19379 -8647 -34758 -2468 31682 2720
262 2720 -29788 -5622 18848 4440 -6914 -3175 1660 17794 20373 -14663 -22449 20482 26520
275 26520 -18583 -19373 22386 13746 -27317 -15626 16743 -1894 -25377 5514 24408 -16134 -29958
288 -29958 15153 26687 -13685 -17936 16903 23789 -829 -16963 -7428 17019 20414 -9541 -20871
301 -20871 9121 20017 -10692 -24254 617 15523 1279 -9318 -4815 -3227 -228 8436 -317
314 -317 -13827 5754 24111 -4216 -23800 6352 18678 -7114 -5258 13764 -3546 -14651 11015
327 11015 10764 -22044 -12013 27538 12671 -29116 -15926 21529 8372 -19796 -4622 13687
339 13687 1391 -3018 1923 -9010 -4285 20606 9908 -18371 -1777 21045 -1517 -17365 5207
352 5207 11269 -6552 -1834 9276 -8856 -19655 7038 16726 -13554 -18693 14530 15372 -16121
365 -16121 -13009 10700 8531 2370 5667 -3904 -6080 13951 9491 -16935 -6922 20374 7062
378 7062 -17889 -7089 6196 -4007 -5575 6672 -3008 -13879 7894 15507 -17295 -19137 24599
391 24599 22371 -19672 -10036 22559 3603 -17016 6627 11524 -11473 -1434 17839 -7815 -25825
404 -25825 7184 21518 -12737 -20227 13451 12752 -17346 -7990 13534 -1778 -8375 16402 8253
417 8253 -20593 -2321 24682 -343 -20404 6997 19129 -4695 -11843 1025 994 -1543 5449
430 5449 -43 -11889 -389 13001 -5515 -18950 4849 17071 -5468 -9657 7154 152 -7449
443 -7449 10084 8226 -14008 381 23337 -1602 -24834 3268 21565 -4240 -15012 6238
455 6238 6348 -10799 -2651 7143 -9643 -8485 18318 7565 -25056 -6089 25396 1328 -21157
468 -21157 7597 20545 -7198 -9547 10600 1437 -11228 7245 13211 -10445 -13892 9848 7753
481 7753 -14621 -7946 10756 3004 -6571 1630 -2008 -9233 8385 14052 -11429 -10956 19413 12826
495 12826 -18624 -9738 17399 8483 -10172 -3120 4366 -2791 -2945 2528 -4847 -7039 8223 8515
509 8515 -12053 -10142 10109 5266 -8169 2319 8269 -5208 -780 10667 -3884 -12358 10085
522 10085 16523 -9663 -14303 8186 9114 -9938 -7799 6260 2069 -4289 2140 -1469 -11241 2087
536 2087 14789 -4522 -14255 8577 13750 -9305 -10066 9759 6565 -4094 2097 3747 -6784 -2796
550 -2796 8646 1035 -11449 -307 11693 -1531 -13823 -1945 7274 -419 -2395 1041 -3238
563 -3238 -313 8017 -925 -10641 4181 15426 -447 -10796 1229 8071 -966 -4438 661 1106
577 1106 -838 1516 -1273 -8921 -3417 8647 2342 -9640 -2318 7352 434 -4338 928 1821 1943
592 1943 6490 1413 -7944 -350 9511 2058 -7482 -1260 6569 1036 -6371 -4073 363 437 1427 1356
608 1356 -5480 -4188 6679 3993 -9007 -3256 10225 4957 -5013 -2807 2569 2308 2506 1003 -2371
623 -2371 -474 4264 1778 -6654 -5860 4330 6022 -3940 -6903 704 3226 -1365 -2622 -1429 1016
638 1016 5157 2577 -4891 -3014 4489 4539 -190 -2177 -176 3876 2814 -3968 -5391 1565 5720 478
654 478 -5980 -3882 2471 2162 -3528 -4078 1777 3263 1398 -1380 -3914 104 6753 3044 -4528 -625
670 -625 5580 1639 -3464 -2255 299 2125 2447 -1231 -5256 -2618 3069 1920 -5174 -4446 4234 5258
686 5258 -3755 -5854 1259 4463 2558 -330 -2460 1199 5731 721 -6151 -1009 5742 2133 -3003
701 -3003 -3080 -1056 286 1208 -1320 -3690 -424 4264 1119 -5912 -3833 5504 4868 -2678 -1787 2680
717 2680 628 536 1790 -2898 -2404 6414 4581 -7507 -6157 5440 3989 -5759 -4509 3606 3022 -3169
733 -3169 -2591 -287 -1196 1877 5347 -1454 -5281 3849 6939 -3305 -4794 4709 4635 -1293 -1301 -616 -2541
750 -2541 1073 3530 -2473 -5503 1998 5546 -3166 -7726 764 5758 -355 -3125 450 438 497 3545
766 3545 -503 -4506 3646 7723 -2603 -7154 2445 4979 -1975 -2490 937 -778 -1225 1392 -1459
781 -1459 -5310 345 7409 199 -8127 330 7504 -1214 -5008 3137 4076 -1292 1415 2010 -4805 -1407
797 -1407 7330 1438 -7516 -1443 6646 -275 -7414 -1310 4269 46 -1896 1324 -1751 -3203 3980
812 3980 4142 -5302 -2587 8507 3743 -7003 -1704 5157 1083 -1641 961 -836 -2322 1782 1291
827 1291 -5050 -3584 5254 3497 -6014 -4393 4150 2124 -3332 322 2400 -1079 1768 3891 -3857
842 -3857 -4000 6525 5658 -4967 -3544 4122 2011 -3958 -1897 1589 -413 38 1964 -2826 -5415
857 -5415 2639 5744 -3989 -5457 5262 5185 -4489 -2480 3734 502 -738 3311 568 -4410 990
872 990 5294 -2051 -5926 2235 5530 -2328 -5806 310 2264 -1396 -193 1211 -2420 -181 4839
887 4839 -516 -6355 2189 7630 -216 -5013 1508 3391 -778 -857 269 -1177 260 2432 -838 -5317
903 -5317 -841 4938 35 -5504 101 4242 -944 -2506 1006 186 -315 3664 1907 -4218 -563 5401
919 5401 1042 -4800 -63 4689 730 -3252 -1350 208 -255 251 836 -2682 -2488 3962 1916 -5253
935 -5253 -1684 5242 2413 -2523 -478 1500 -52 1009 1647 -1451 -1215 3501 2031 -3998 -3636 2807
951 2807 2910 -2960 -3129 1785 815 -1729 -585 -426 -1204 2615 3065 -2832 -3104 3271 3478 -1829 -2016
968 -2016 1639 2225 -200 -1889 -1288 -137 887 1209 -1836 -3097 1216 2721 -1731 -3393 1613 2467
984 2467 -269 -883 -376 -539 1597 2448 -976 -1865 2286 2843 -1141 -2956 173 2591 285 -1953 -1271
1001 -1271 93 151 -32 -1297 -2361 656 3348 -812 -3592 145 3070 701 -1115 -313 957 1607
1017 1607 576 -1542 -1214 1203 2321 -92 -2408 -1167 1921 729 -2624 -1588 1497 902 -395
1032 -395 -1145 -1063 657 2346 466 -1674 60 2080 1363 -1089 -1705 788 2265 316 -2094 -904
1048 -904 847 707 -502 -1463 -722 1463 1015 -1792 -1954 552 1379 569 -960 -892 1455 2008 -580 -1430
1066 -1430 625 1798 1323 -525 -1727 -433 2010 229 -2375 -964 1376 1107 -916 -2332 -513
1081 -513 1699 921 -1057 -1140 632 1795 633 -1392 -1058 1989 2403 -1078 -1816 309 838 -12 -588
1098 -588 -976 -173 1209 447 -2283 -1741 1018 1584 -426 -1878 11 1686 279 -740 -115 744 869
1115 869 1653 -760 -2063 919 2810 -616 -2685 504 1928 -307 -2061 -1159 209 454 378 -902
1131 -902 -1327 107 2080 227 -1931 -64 2990 922 -1764 -347 672 485 525 -234 -1118 44 1318
1148 1318 -187 -2630 -564 2050 763 -1977 -1193 923 968 -406 -268 -69 175 2049 727 -1971
1164 -1971 -878 2470 1349 -1710 -242 1568 318 -779 -492 -843 -169 1209 472 -1881 -1579 1416
1180 1416 1522 -1533 -1643 1637 1724 -837 -720 153 -374 1007 1547 -1015 -1793 1789 1704 -2111 -1782 1320
1198 1320 1254 -1152 -1431 -490 366 21 93 -461 -1302 888 1733 -934 -2357 1130 2821 -582 -1210 918
1216 918 850 -164 165 -312 -989 866 1184 -831 -2542 136 1679 -301 -1864 -82 1235 1 -267
1233 -267 -229 -627 130 2107 337 -2058 293 2383 -216 -1799 128 1297 213 -688 -472 -571 39
1250 39 825 57 -1729 -515 1885 397 -2193 -615 1831 509 -775 163 343 -175 967 513 -1106
1267 -1106 -252 2010 483 -1929 -1019 1252 793 -1164 -1044 230 189 -87 164 -979 -743 1646 1292
1284 1292 -1460 -1215 1577 1270 -1148 -529 826 678 232 -58 -635 -832 602 681 -1121 -1448 687 1084
1302 1084 -980 -1549 700 838 -21 -48 -257 -691 975 1105 -875 -1088 1309 1583 -841 -1339 187 687
1320 687 -69 -829 -486 -237 138 496 -680 -1252 534 1653 -432 -1630 88 1478 -129 -459 158
1337 158 307 448 388 -688 -942 9 1424 -73 -1618 -507 1189 78 -1100 -898 705 371 167
1354 167 -124 -507 -161 1264 310 -1249 365 1594 678 -861 -539 553 376 131 -518 -314 16 403
1372 403 220 -990 -616 1024 374 -1266 -996 390 595 50 -274 -310 358 891 124 -1004 -13 1004
1390 1004 609 -482 -889 215 875 -411 -758 -148 360 452 -10 -911 -248 514 570 -732 -808 944 748
1409 748 172 -545 8 289 766 42 -651 -132 399 677 -469 -852 -82 1195 -228 -1291 -91 475
1427 475 -122 -184 -255 -44 428 656 -367 -378 260 955 495 -806 -473 603 491 -357 -556 274 203 27
1447 27 -358 -800 -236 655 370 -718 -346 230 281 -313 -406 88 564 513 -193 -154 35 712 293 -512 -474 625
1469 625 516 -447 -930 -46 256 222 -120 -430 -286 562 102 -752 -609 356 687 276 -778 18 824 347
1489 347 -341 95 204 35 -105 -283 -773 -77 692 -170 -809 -72 483 -33 -919 -364 362 409 199 -365
1509 -365 -218 -67 592 19 -494 -248 707 481 -661 -491 232 -31 -103 -285 -345 -208 553 -97 -660 -674 370
1530 370 456 -455 -717 153 800 105 -349 -133 -8 102 344 -476 -354 518 438 -437 -581 113 229 173 -493
1551 -493 -235 378 121 -71 -258 -400 401 829 -185 -578 476 620 -103 -784 -26 418 7 -174 -268 -449
1571 -449 146 411 -385 -518 108 720 -91 -919 -493 565 373 33 -33 21 7 417 -41 -647 64 725 311
1592 311 -605 -364 198 239 -285 -324 -137 -147 59 -271 -550 -71 734 216 -678 -286 443 704 -102 -230 44
1613 44 150 399 195 -542 -359 574 -20 -574 -231 265 183 -491 -408 -70 165 92 -19 -203 -516 170 453
1634 453 -113 -497 347 410 -355 -234 130 480 23 -263 -240 -23 171 33 -352 -657 44 601 -110 -575 156
1655 156 413 52 -327 -71 -377 492 501 -193 -641 267 560 164 -462 -92 -15 204 -406 -410 -76 83 3 213
1677 213 -498 -157 328 72 -429 -193 587 95 -180 -80 51 -58 222 -65 -283 101 143 365 -520 -486 227
1698 227 248 -364 54 223 221 -168 -28 -53 229 284 94 -408 -242 392 436 -163 -174 -46 18 -220 -193 -63 -56 288
1722 288 328 -433 -389 168 408 -155 -516 253 470 -5 -161 -11 39 23 30 80 -263 200 204 8 -445 -95 57
1745 57 97 -100 -175 -9 -12 337 -89 -436 124 335 -40 -370 98 292 179 -79 -273 121 17 -138 -238 -316
1767 -316 172 129 -148 -466 -155 -16 246 -106 -81 243 289 2 188 -206 -206 320 401 -265 -40 123 114 -223 -320
1790 -320 152 288 138 -251 -256 -220 -158 301 -158 -86 121 128 -284 -310 59 86 107 11 -171 176 131 94 -402 -302
1814 -302 300 366 -125 -234 -160 231 83 -360 -2 -33 157 -64 -206 -86 95 163 -15 -25 47 435 168 -241
1836 -241 -213 -50 -12 -123 -285 -130 31 145 -93 -367 -233 179 49 -85 -249 18 -7 303 -72 -3 -19 43
1858 43 -307 105 9 183 158 -212 -282 57 259 -95 -198 -92 4 52 91 -52 16 7 322 -64 -94 59 42 -43
1882 -43 -265 -290 98 115 13 95 21 168 165 120 -158 176 230 50 -569 109 265 -7 -165 19 -47 104 375
1905 375 -2 -109 -28 261 122 2 -128 330 369 -273 -66 32 163 117 -10 71 129 -27 210 219 -328 30 281
1928 281 -21 -223 96 317 113 8 -134 30 115 312 -200 -154 -29 39 -161 -372 -53 174 -189 110 246
1949 246 113 108 147 248 -395 -96 461 109 -288 55 223 277 -48 -160 -67 10 21 -242 -102 177 19 215
1971 215 -254 3 145 -109 105 -97 126 5 -82 54 86 -161 341 -58 -163 -73 308 -5 -89 62 -344
1992 -344 115 300 123 -395 92 146 251 -173 -136 28 52 35 -364 69 -56 126 93 120 -316 140 187 -128
2014 -128 -257 82 190 -108 -198 -21 95 95 -122 -384 -25 140 118 -10 -294 -74 300 79 -52 148 37
2035 37 40 14 -81 -325 199 70 126 -249 134 178 73 -149 -154 41 113 -191 69 63 175 152 -62 -465 -105 248
2059 248 -28 -224 -185 237 -164 -168 -19 52 -23 -308 50 74 -41 353 -35 -46 -64 388 378 68 -137 147 128
2082 128 -2 -68 -291 -271 204 26 7 -25 174 127 69 -383 104 101 166 -74 -35 -12 20 48 -210 -38 -68 221 -240
2107 -240 -253 72 402 -51 -409 -194 100 63 331 -203 11 -142 246 -187 -186 -109 159 79 -182 -108 -60 -56 250
2130 250 -39 -243 -97 417 56 -268 -240 179 59 147 -81 211 99 -49 -234 -220 10 8 -35 -317 -125 141
2152 141 75 -335 186 -4 221 -32 -136 -216 25 110 -95 4 -27 98 224 -181 -25 107 100 19 -178 100 80
2175 80 244 271 -96 -34 76 -38 -182 -317 -37 255 69 -204 171 -59 190 52 -194 -44 180 251 -172
2196 -172 -199 416 314 -73 -241 -98 225 -16 -201 -254 11 30 18 -94 -225 45 286 106 -266 110 98 91
2218 91 -216 -191 -27 48 344 -134 -229 120 272 108 -88 -181 139 304 -119 -343 -75 415 186 -207 -167 -6
2240 -6 -41 33 -67 -167 50 283 322 -207 274 327 26 4 26 -24 222 -67 -254 -293 61 118 -16 -156 77 -93
2264 -93 118 -111 -305 -94 410 299 -134 -95 196 222 -320 -386 -121 223 33 -270 -233 -6 143 70 -235 -259
2286 -259 -218 119 -95 -188 -181 -18 154 -229 -301 135 -1 311 -39 182 88 203 -242 -149 -8 168 223 -91 -318
2309 -318 76 -56 -99 -54 -465 169 195 361 -91 -94 264 165 75 -175 35 210 56 -267 -216 167 101 -112 -215
2332 -215 17 40 388 -98 -359 -72 132 -103 19 152 403 199 183 263 -28 138 441 32 -103 80 516
2353 516 -35 -334 -191 -151 138 -76 -203 -290 107 11 -21 -247 155 71 -12 -306 -188 183 186 -82 121 -88 35
2376 35 96 134 -281 -59 298 169 -296 -245 129 -91 30 -268 192 -111 193 -168 -119 -178 195 -24 -106 -180 142
2399 142 272 252 107 -141 -30 141 163 -197 -155 174 7 -345 -138 173 197 -72 -161 -71 34 8 208 311
2421 311 11 177 -34 -181 -116 -9 371 141 -293 -136 153 18 57 101 155 -29 59 -122 -245 -76 173 40
2443 40 -51 -195 215 -32 -338 -175 215 218 -95 -241 -116 -201 288 -99 -225 27 -119 -64 -376 -57 -161 -71
2465 -71 43 -262 -20 49 143 18 33 127 230 13 -191 162 65 183 27 245 -8 -209 284 78 -190 -13
2487 -13 62 -98 -79 11 165 170 -61 -339 -157 71 106 -69 -9 -65 231 307 -182 -234 114 195 61 -132 8 -9
2511 -9 79 -63 -321 32 114 -128 33 -67 48 146 -30 -119 122 -139 391 202 -232 -103 -41 71 35 -43 -123
2534 -123 435 175 -154 194 88 -13 129 78 91 220 123 -298 -173 110 452 202 -16 -252 153 100 -25
2555 -25 -295 61 106 21 -78 -176 42 300 102 44 -373 87 95 -12 -52 -119 -9 327 3 -162 -52 248 34
2578 34 -77 0 -64 198 -135 -350 -371 -120 -180 -43 -191 25 242 221 14 45 62 193 49 125 -77 -16 9 24
2602 24 26 -90 98 300 -256 -205 138 243 -93 -162 44 136 152 -95 -31 -161 71 194 31 -121 201 -103 76
2625 76 -89 -215 112 75 -146 -186 69 229 -16 -459 -392 -89 266 -86 -259 41 -47 213 -25 -107 -24 103
2647 103 -61 -107 179 126 149 253 -75 251 3 -60 108 -317 13 147 -13 71 -202 -7 72 -132 -53 52
2669 52 -127 206 136 43 40 10 -68 -166 -138 325 191 143 10 -201 145 61 -80 -107 -37 -57 393 -48 2 -111 32
2694 32 313 -45 244 -107 284 -20 -207 -53 88 -159 -287 81 193 43 186 -11 26 88 152 210 -185 15
2716 15 288 21 112 13 60 -181 -23 -231 -78 -47 -96 215 -127 1 149 52 -49 -48 -139 -32 -32 -111 69 45 336
2741 336 -273 -74 -6 266 82 -63 -242 -72 367 -222 -54 61 29 86 -56 -54 118 -150 -35 -25 -138 12
2763 12 184 105 -78 -200 120 48 -35 -115 -216 21 22 -2 -137 91 108 -101 73 -76 -49 -324 -24 10 -77 68
2787 68 65 -157 39 -10 55 349 -204 -103 -246 105 -40 -187 -21 53 107 -58 -212 -31 -34 -4 -164 -4 157
2810 157 243 -107 -43 -365 144 112 216 -96 59 -42 -134 137 -102 -239 297 253 -149 88 -200 -88 77 -75
2832 -75 12 218 230 7 -60 49 235 183 -147 139 -128 194 157 -150 -48 63 94 24 -76 122 79 74 165 44
2856 44 32 -182 64 -145 64 -5 47 108 162 -38 324 -29 -76 -248 -107 -13 227 -269 -123 170 132 166 -375
2879 -375 -70 175 24 -39 32 15 -134 61 40 75 -82 168 -164 63 66 37 114 -130 -309 -239 -35 -395 52
2902 52 127 90 -68 179 -209 18 75 -158 -202 -27 13 -8 55 -234 -190 115 114 -232 -97 -161 -55 48 -143 -78
2926 -78 105 -70 128 48 -106 -29 -62 59 53 -8 -29 133 -115 3 142 81 3 -39 -307 17 -31 137 -112 -281
2950 -281 309 74 135 46 83 45 -71 180 35 192 -208 -131 -134 -20 89 -263 -14 -110 -150 -73 66 -14 21 14 -55
2975 -55 39 81 -171 13 62 77 -179 -204 31 86 -176 85 191 -117 71 -120 1 -40 -155 -178 169 -64 22
2998 22 -194 -191 38 202 30 -75 -91 48 -164 176 -20 63 142 144 59 86 -76 22 -18 -216 -193 -39 274 -45
3022 -45 147 -183 -178 217 -124 -195 -302 13 125 -127 -33 -157 121 137 -103 -89 -37 -36 41 139 27 -10 -131 -46 116
3047 116 -89 33 23 -121 61 155 -21 94 78 138 -52 -154 -44 -139 -135 -115 -107 -33 -174 123 -68 -159 197 -5
3071 -5 83 -137 94 -210 66 -184 24 25 -165 -283 231 24 -124 56 112 -51 93 -37 81 215 -123 -2
3093 -2 70 -62 181 15 60 -42 -14 82 -137 -34 282 30 -73 87 34 -170 44 1 187 165 49 -44 281
3116 281 99 -121 -25 108 -59 -2 -17 162 96 -226 -192 108 -59 -391 -51 -203 53 -277 172 -163 198 100
3138 100 71 -79 -57 185 -17 285 61 -113 29 -133 -108 252 -67 -74 11 -45 85 77 200 -205 -201 17 76 46
3162 46 222 57 57 21 -45 24 -61 69 -137 157 -13 -101 67 143 177 89 -128 41 228 -20 -78 -3 -140 72
3186 72 67 -249 233 26 -133 13 -434 49 99 82 133 -34 -88 -131 -179 -275 95 -143 155 160 -376 -114 71 184
3210 184 -172 77 137 247 -239 43 -153 9 118 46 -36 22 61 -111 -68 -142 -95 -90 -76 218 163 33 -243 103
3234 103 -83 5 79 -268 -245 48 7 74 43 -75 48 -22 211 -51 -237 -52 8 -138 41 294 -3 -152 -143
3257 -143 -127 -38 -25 -99 -157 11 183 -165 -134 -36 222 -196 58 158 -12 302 219 -29 -84 -108 -28 208 -383 -49
3281 -49 221 151 258 -199 -97 7 160 -202 -314 103 35 -219 -109 209 -1 32 -116 9 104 -116 200 -274
3303 -274 1 -268 -358 200 -27 25 250 81 226 -196 170 4 -91 -96 -174 -16 44 38 19 124 105 -3 60 47
3327 47 120 180 -277 5 62 -93 117 -94 -58 -122 -104 -174 -3 -27 -71 -176 251 104 -27 -12 241 51 -51 -208
3351 -208 178 -102 231 56 53 -137 -15 -111 26 305 -204 96 18 16 -116 -95 -270 178 -191 191 367 162
3373 162 -191 -60 118 67 41 78 212 -179 36 -33 -103 -111 -11 -185 -134 2 -100 -85 -123 19 -83 -97 -7 -157
3397 -157 291 27 -314 -74 -230 -52 -101 -158 2 4 269 207 -89 -139 32 45 54 -31 -32 -10 -41 202 -157 -78 120
3422 120 202 21 106 -16 -43 180 115 38 -63 264 63 17 -400 -40 -311 204 -355 -64 47 -87 38 33 94
3445 94 -83 29 -89 -65 -204 9 -102 8 157 142 -23 -62 215 81 45 -115 -68 -82 111 -10 -100 -33 100
3468 100 60 289 126 58 -157 343 -111 54 35 118 -34 -234 116 -54 18 -211 81 -48 111 236 107 -161
3490 -161 -79 -326 96 -135 26 7 -130 186 249 -417 -361 -278 77 25 -113 -155 100 -11 183 -104 243 -153
3512 -153 7 -78 -263 -67 60 18 88 -236 -130 361 94 -288 -163 -147 228 18 0 60 23 -69 -89 -48 196
3535 196 340 162 -91 -23 -22 -9 -56 -42 -158 -29 -76 233 -29 -44 121 143 -203 242 -101 94 63 -22 -45 8
3559 8 -97 -167 -389 101 70 -341 -49 -183 -13 123 -355 8 -40 -40 -68 48 -63 -161 70 -46 101 -235 -152
3582 -152 -42 -181 261 -45 20 -252 -2 240 -79 -145 -179 -4 -126 11 9 -66 65 75 123 128 -370 -184 141
3605 141 107 -57 -37 -6 160 108 174 -135 -11 75 128 63 21 207 106 -76 114 70 172 -353 -132 31 11 219
3629 219 -38 -144 110 251 120 93 36 99 -204 222 18 -47 -23 -250 -17 114 -42 39 130 -296 12 -179
3651 -179 165 138 -45 -33 48 81 -71 -282 -106 29 149 -10 -61 -112 445 -165 119 -188 -200 -89 163 -71
3673 -71 65 -5 63 132 -50 68 -51 214 313 -66 158 -104 -107 -109 -146 141 136 134 136 103 53 -41 270 -2 123 -80
3699 -80 -67 108 -31 39 12 -65 -75 -238 -84 -54 192 109 66 -6 97 -61 76 27 240 137 -16 -148 5 262
3723 262 48 121 -330 -2 -178 -103 -228 103 52 114 -13 126 -213 -71 -262 212 -190 122 176 -26 -2 -4 45
3746 45 -7 89 -282 -121 153 92 -189 -153 124 131 -70 -164 -228 24 82 46 -67 294 -106 5 -227 -50 121 -202
3770 -202 208 66 -101 -2 -66 -14 -116 8 -110 -37 -150 -11 196 88 -49 -108 38 281 173 -223 126 -9
3792 -9 74 153 311 73 208 333 -72 56 -249 -18 44 86 13 -6 -146 45 -56 -154 -207 9 114 -85 190
3815 190 113 179 134 -253 141 -103 179 188 -124 0 63 -198 82 -188 -46 -45 -142 238 54 9 -6 2 -33 -103 163
3840 163 -160 -106 -6 -92 -171 101 -226 263 -99 47 -146 -292 118 -276 54 47 -50 149 173 -176 54 261
3862 261 227 33 -192 -5 150 46 125 -192 -163 105 452 -170 255 163 57 -107 54 -188 -85 323 -85
3883 -85 -65 -164 1 178 24 -269 15 -260 23 144 -214 102 16 -72 41 97 -15 167 39 45 -28 41 -11 -98
3907 -98 108 -310 245 -82 -1 150 248 -56 -305 99 -201 228 -175 78 -331 -246 28 -38 -26 50 4 74 176
3930 176 41 -16 -107 10 8 171 196 -58 -155 -230 -65 -18 153 -72 84 -36 -6 124 -128 -48 342 -9 -214
3953 -214 -101 -8 146 94 -33 246 -186 151 -62 40 -82 269 120 4 89 -42 -107 3 144 -121 -198 200
3975 200 -1 301 -29 -99 343 -120 30 68 96 -26 -5 -59 82 13 236 11 -7 -67 -56 244 -119 15 -69
3998 -69 38 218 94 36 -50 -39 211 25 182 122 -60 67 26 198 -49 -93 -174 -128 49 170 -174 177 230
4021 230 -146 60 -152 -309 59 87 -93 -1 -111 -7 -50 138 -40 89 46 -92 2 -143 -103 11 -47 -75 -194
4044 -194 178 4 83 -6 -35 -298 -96 32 192 20 39 -80 -263 -43 251 -46 -113 -168 -240 -100 7 46 68
4067 68 195 -64 194 108 -132 79 -77 -67 117 4 163 -43 -86 -142 98 -114 -48 38 -236 95 -182 -246 -111
4090 -111 12 191 327 -49 -272 243 13 111 267 -54 26 210 -156 110 149 111 161 -77 2 -148 126 -123
4112 -123 -101 -130 376 213 64 165 -26 -114 226 -16 134 -221 101 127 -127 -215 -166 136 -212 -66 -24 -84 40
4135 40 -18 -87 -118 250 -88 -21 -7 -118 44 25 13 -12 -98 48 -31 23 -45 -202 -102 -84 -292 88 22 35 -247
4160 -247 146 77 49 -247 -56 159 -56 133 -11 -132 147 -66 165 -39 -236 76 -95 -179 -2 154 -51
4181 -51 80 -164 -179 17 -62 -50 -29 -95 141 -45 -22 -38 -85 60 -484 57 24 136 -51 13 -140 -82 -74 -233 111
4206 111 -73 297 170 169 -170 28 410 127 -113 -64 24 -214 248 -112 -65 51 63 60 -136 87 36 119 0
4229 0 44 200 68 140 189 -197 290 -70 13 101 -47 -192 43 29 -118 28 3 -77 119 -438 -38 118 102 -66
4253 -66 -79 101 53 22 -106 20 65 -88 -256 57 -79 56 -46 -157 -15 -96 334 -59 -199 -28 -149 -64
4275 -64 86 -87 48 -92 1 -210 102 170 33 -124 14 -194 392 118 202 -94 16 34 -275 -189 -1 228
4297 228 -34 -72 -143 -46 121 -205 23 -37 150 -46 16 96 -52 22 9 -135 -123 125 -300 126 -15 90 167
4320 167 56 43 -155 -39 65 196 -241 -169 -123 137 -149 -170 -195 150 171 26 -173 -152 -20 85 -61 -20 27
4343 27 147 182 -204 -155 -237 118 -38 152 82 -121 -157 23 -105 -99 82 118 -265 -57 -78 61 6 -159 -13 -267
4367 -267 70 -218 -3 79 43 -79 -173 -121 7 32 70 -56 54 184 -198 -63 70 14 112 211 -138 -1 197
4390 197 188 -100 -253 -8 87 -1 -45 -266 13 -17 -51 0 -67 246 249 -86 -89 143 48 224 -77 -151 180 158 49
4415 49 -39 -186 -211 -80 -64 -216 -13 61 -26 97 -99 144 140 55 131 215 216 -148 87 -219 -159 215 128 -75 -200
4440 -200 -98 74 102 -168 106 -117 -149 9 -241 -9 110 135 -117 -50 -70 143 119 248 -189 63 270 -176
4462 -176 -217 60 5 -104 -64 -210 251 -30 11 -251 -10 -141 -291 -67 70 192 -16 -68 -108 -250 101 -167
4484 -167 -105 -105 246 86 -18 82 -34 148 -201 173 -108 149 -64 -11 -49 2 -207 134 -130 40 31 -13 -7 188
4508 188 -29 114 389 53 -7 -438 -67 267 193 62 280 -185 190 -78 135 -109 -146 214 -158 -94 -92 -211
4530 -211 140 -47 -51 -44 -85 89 65 134 168 150 -128 -419 40 -72 442 -158 -69 79 -21 116 -9 -224 75
4553 75 19 -39 -162 206 18 -67 -20 -8 -172 -120 350 -131 134 190 195 167 156 -64 38 176 0 -116 -16 5
4577 5 -395 175 -187 -31 80 245 -28 33 -185 -1 162 -105 -262 8 -21 41 130 -204 123 -3 -109 -68
4599 -68 -157 149 -97 -63 41 27 -33 205 40 234 -103 206 -143 -49 -113 13 -353 -314 -138 241 218 22 85
4622 85 115 126 -219 -332 -139 -11 72 12 -22 -175 61 169 76 -165 191 48 -153 -145 -122 -127 91 -91 -257 -222
4646 -222 -84 116 -135 17 -144 103 -145 80 7 23 -128 -86 -135 -92 -54 176 302 27 210 136 -206 -181 53
4669 53 92 -113 -84 -140 -352 29 -21 -80 89 41 16 119 -246 -84 79 -23 -75 41 -176 83 -78 192 -90
4692 -90 -54 120 -80 -195 27 4 -177 -100 -319 188 370 -102 199 -14 -153 -8 82 14 29 31 54 340 15
4715 15 -238 139 -34 197 -124 -99 115 -209 119 -149 159 -18 184 56 239 -28 -49 23 -67 67 123 124 -17
4738 -17 -232 214 199 78 129 -158 120 284 52 18 -23 -206 70 -114 36 -82 143 -58 -219 53 259 -271
4760 -271 -45 33 -123 132 130 130 44 69 149 -152 -8 46 142 48 224 99 88 -107 -48 -288 -324 -159 -74 211 -43
4785 -43 -38 202 207 -191 -2 21 251 -312 -182 -214 272 8 162 13 69 -28 -230 -195 -97 -157 70 0 84 -166 -128
4810 -128 17 -14 -143 -45 11 -23 -1 -81 45 153 -101 -240 280 -63 2 -16 -93 -57 -146 164 -4 -296 49 -73
4834 -73 52 -19 -213 122 182 -103 22 -14 44 -98 69 -51 -99 253 77 -130 -215 115 -179 124 -56 80
4856 80 19 287 152 -359 92 -16 19 275 146 -97 -28 -95 -64 189 -127 -2 261 24 -25 -64 -192 -53 -122
4879 -122 -35 -137 -65 -185 61 134 152 -216 -22 83 -38 -113 -81 24 20 302 19 182 203 7 178 52 -119
4902 -119 -2 56 -101 -184 90 -42 -111 19 35 -21 3 -46 -122 -30 94 51 -26 -168 -206 -96 262 58 -308 -71
4926 -71 85 123 -222 -82 3 -15 153 -95 -12 300 64 -9 85 116 56 -130 145 18 86 102 61 -56 -161 60
4950 60 94 6 -86 -12 -62 -29 157 -125 1 106 -133 17 -238 336 156 229 -202 156 -88 -132 -80 -399 -121
4973 -121 7 -30 131 -233 -175 62 -148 -217 -81 132 84 -15 16 49 289 137 -115 -17 -117 115 -92 175 -200
4996 -200 151 -4 -135 83 87 -3 -241 -138 -141 -36 171 76 -30 -127 133 325 21 -129 54 32 -92 -88 -47 195
5020 195 -54 -127 -70 -127 -65 47 -188 -135 -145 181 39 -47 -135 -221 62 -155 -86 -87 -77 -28 0 -179 33 -114 72
5045 72 -48 -101 36 -230 137 -193 221 127 -18 -188 -19 162 371 -67 136 -49 -124 -120 -12 146 -224 45
5067 45 148 60 87 28 -57 -17 -82 214 -139 196 38 72 141 168 -82 69 7 -92 -39 -174 -314 -56 30 -5 148
5092 148 211 -60 120 41 130 -255 260 -10 7 -8 -270 108 122 15 -211 -235 193 70 -164 -106 -43 224 -271
5115 -271 -374 -338 164 -47 -167 -126 -59 -152 46 33 -275 -184 -301 104 -187 -356 52 95 -2 -276 -110 128 -25
5138 -25 -260 -311 202 268 43 12 33 101 -24 -201 -137 -19 307 -201 -128 -111 31 282 40 75 26 -60 56 13
5162 13 158 75 300 -21 47 54 94 259 408 -84 -92 -139 8 36 -15 -54 -33 453 1 -153 163 161 0 -99 -28 -150
5188 -150 -123 -8 -65 -46 131 186 112 395 -139 34 -152 -53 29 -38 179 73 4 -163 -74 109 -374 130 25
5211 25 122 -101 14 80 56 276 110 11 -43 -103 70 188 18 95 131 35 189 -70 -136 -14 -58 113 1 -109
5235 -109 117 -139 -33 -107 73 -16 -183 6 -125 172 38 26 -264 153 69 -111 -97 -29 47 327 155 -70
5257 -70 -77 183 -52 62 -44 70 -103 -61 55 37 133 39 -182 18 56 205 -45 66 -159 -118 114 -86 -83 -54
5281 -54 -210 -78 33 -279 -53 181 -54 -52 -66 -104 -27 -191 106 164 -116 -51 -8 14 -66 -69 -135 226 -26 -182 14
5306 14 28 -334 -104 223 60 -81 -200 109 -46 -84 -215 4 -103 132 -37 -50 -88 234 -16 55 13 143
5328 143 267 -89 61 -209 -21 208 -63 -95 227 187 45 -262 -43 12 -18 -16 -256 -86 57 -18 121 -37
5350 -37 -9 -28 -87 54 161 8 -10 88 -247 -203 -40 150 -189 -86 -279 -1 138 -39 -240 27 108 2 114
5373 114 126 85 21 -4 -141 150 -185 -222 185 -87 49 156 -230 -75 150 89 -102 -147 166 74 84 190 77
5396 77 -64 -110 119 86 55 36 -121 -137 54 -100 77 76 -100 -28 39 181 -189 128 283 274 -166 -159 -111 -94 111
5421 111 28 -16 -287 -314 234 264 134 -151 -226 42 45 231 2 69 -37 16 -21 -49 265 -131 -61 -194 -119 -356
5445 -356 159 -115 64 138 -207 -27 -240 -208 -164 -239 95 -2 -43 289 -100 5 -62 -35 160 -190 87 -175 -112
5468 -112 150 -149 -196 117 34 -72 -60 110 36 -93 58 19 -58 150 -100 -163 -122 -54 182 9 -157 -193 16
5491 16 66 5 -95 -204 -67 155 46 55 -197 12 347 -338 -334 60 -203 -8 98 46 115 -39 -80 1 287 123
5515 123 -8 226 -230 6 -4 -359 153 93 303 16 -16 -54 154 227 166 87 83 178 -39 9 -317 -183 -142 63
5539 63 169 -178 -97 -128 -138 -119 -54 26 -43 97 69 -17 -65 -117 -103 42 -145 -10 -111 -19 -137 10 4 -116 -132 28
5565 28 -129 -43 -154 98 -70 23 -203 -423 -212 164 82 -94 118 -14 113 0 190 -170 -97 58 120 214
5587 214 -43 217 100 138 -221 -90 -50 -59 -12 -118 -119 -124 140 -70 -153 -248 240 132 -119 82 -63 -9 -63 -29 300
5612 300 -32 170 -129 -94 65 -89 121 27 244 49 -44 -46 -258 -38 168 197 -47 26 -54 106 -99 264 137
5635 137 -106 342 -21 -146 155 134 87 87 -199 75 -108 -22 52 -48 -106 -35 -107 -218 189 181 -106 -130 110 -22
5659 -22 118 -106 -39 35 -276 -103 32 5 -126 -125 431 55 101 -42 17 -83 -192 180 -122 214 -195 -97 33
5682 33 22 106 288 124 274 155 -29 -107 -10 -24 60 54 -170 -147 -175 50 -212 -108 -114 120 -191 24 -193 -171 -132
5707 -132 -42 -127 -146 -76 132 -160 -142 -201 97 96 -45 -182 33 251 78 178 -16 -150 18 18 127 160 9 123
5731 123 -151 28 -93 63 -300 20 21 -19 102 -150 379 27 -81 115 230 -27 200 110 -64 44 -86
5752 -86 63 67 -52 -157 86 66 -102 108 -245 44 102 45 201 94 5 386 -67 268 215 50 18 89 -26
5775 -26 -245 -117 44 93 102 108 -287 89 -39 -9 33 7 178 180 -339 102 -126 -236 81 39 -220 -418 -173 38
5799 38 267 -85 -42 -34 6 68 -73 -257 8 -192 -471 20 -163 372 -63 88 -3 -172 5 27 -126 -112 -12
5822 -12 128 73 44 -109 207 156 5 19 123 -35 -231 111 -62 143 -49 117 127 11 -194 110 150 214 0
5845 0 154 30 -134 137 -19 84 157 -152 57 28 209 68 -187 261 144 -64 256 -219 -121 18 -73 14
5867 14 124 -50 96 -49 -119 98 -138 88 -69 82 -20 97 177 43 -36 40 36 -83 -108 -56 -2 -9 159 76
5891 76 61 -64 -71 -35 83 225 -173 -71 -250 168 -69 44 207 -95 143 16 61 263 21 -260 126 -6
5913 -6 -92 -260 -25 -143 58 -113 -166 57 232 99 182 182 -26 -29 164 141 -127 212 288 -121 127 102 -209 120
5937 120 -49 57 -35 -63 -35 -128 -68 1 -14 122 31 -175 110 -191 -249 -62 52 65 259 -145 -112 34 105 176
5961 176 149 72 58 -73 -50 196 2 95 -137 188 186 -181 59 -78 -168 5 17 34 34 -132 235 106 -284 91
5985 91 147 -45 32 4 374 179 248 28 48 -14 5 -24 -174 -18 -44 198 210 -175 85 48 -206 36 227 -96
6009 -96 73 -183 154 9 -92 86 -119 -8 -32 -68 69 219 132 -83 328 87 -94 5 101 -75 -224 -155
6031 -155 -219 34 -42 104 -151 -190 -154 -64 143 -187 20 -58 70 -43 119 -61 -212 243 -265 76 -329 -85
6053 -85 -416 -64 116 -156 34 72 -157 226 -54 70 -84 55 115 -239 85 62 -1 -77 -71 210 -70 -155 340
6076 340 -17 135 -258 -27 131 -85 137 -2 321 -7 -64 75 -115 -218 110 -79 -280 93 397 6
6096 6 238 -10 142 -17 137 -109 1 -210 -226 22 5 83 131 3 128 -85 -94 177 156 209 242 -196 -88 45
6120 45 134 -74 -172 118 89 -70 -74 -129 -61 -11 -90 -101 32 102 38 76 -165 73 -204 60 -44 128 -2 169 262
6145 262 -201 -162 -165 153 19 -25 -28 -15 27 152 -167 -197 133 -113 -96 234 244 101 219 6 -142 -25 164 3
6169 3 -122 14 99 95 -71 102 -238 12 101 -7 -165 -183 11 -86 26 64 168 269 161 -78 144 78 28 -212
6193 -212 139 -96 -104 42 33 61 -79 -112 -118 -174 0 -255 -183 161 56 -207 96 237 -44 -56 125 12 -145 16
6217 16 276 91 -202 -120 -101 280 -12 225 189 -70 2 122 -5 -159 167 156 -91 -134 -408 48 182 -49
6239 -49 -203 24 -2 -21 -54 226 261 251 341 -263 63 67 138 -5 126 20 -28 -173 -107 52 -108 174 31 -51
6263 -51 94 104 104 56 -193 16 -110 119 -157 -87 200 -151 214 68 173 -16 -55 160 -130 -119 35 138 136
6286 136 104 -212 258 -198 -83 -53 3 50 29 49 -6 25 -28 41 -74 162 -7 92 -135 -4 37 -113 -72 238
6310 238 41 -12 43 -102 87 -110 -131 -29 -350 -43 62 49 -227 -48 -86 -130 -201 -136 297 -96 -11 -124 -135
6333 -135 16 -127 15 -12 -113 175 36 -161 -74 81 86 -128 59 -62 40 -60 -79 150 217 14 -138 -207
6355 -207 -170 -203 -30 -174 99 449 48 -39 108 -25 169 -189 7 23 -191 -109 -91 -53 195 -219 -107 -186 104
6378 104 240 -89 -183 110 -158 -260 -140 -200 59 0 -56 85 61 247 69 77 -60 -131 85 -81 120 419 -211
6401 -211 -23 -58 119 167 -152 18 158 166 -4 123 -75 65 280 -119 43 176 -164 24 53 113 75 -48
6423 -48 -181 116 -74 -215 240 -91 -44 178 -215 -227 14 247 -258 -272 127 86 -22 108 176 -46 -85 -191
6445 -191 58 152 -65 186 61 -12 196 -28 -107 140 15 -36 96 63 7 9 -48 113 8 321 252 -122 -172 -112
6469 -112 -103 -84 246 -107 -134 -162 33 367 -30 135 311 125 0 37 -145 328 -255 -53 268 -105 212 54
6491 54 80 166 12 186 -55 73 -29 -119 134 -144 1 172 103 -103 -25 -102 100 -158 121 -68 -43 123 -182
6514 -182 2 166 312 32 57 204 92 127 144 16 -50 -34 -66 -163 87 39 252 37 -22 -353 98 179 113 63
6538 63 -115 -53 199 11 -86 140 -341 -51 -293 322 -73 141 393 -353 -39 -113 -65 -20 174 150 -53 -25 167
6561 167 26 -57 -144 -95 52 -100 -68 153 93 -80 158 -416 -67 -47 -193 25 110 -115 17 -134 -62 -120 109
6584 109 -81 74 -14 -129 -321 -29 172 -65 69 57 27 105 -270 -61 -229 -32 75 121 69 84 -149 237
6606 237 96 -142 81 162 -151 95 -191 231 -101 -1 28 -33 127 -48 181 -323 51 392 -42 -197 78
6627 78 233 243 -157 85 59 -30 -77 247 -381 -87 -46 153 45 40 -12 280 150 156 189 -82 -20 -11 89 51 -154
6652 -154 316 57 -82 -18 -317 -223 -36 7 26 -128 49 -199 99 6 -95 185 -31 179 79 -147 -61 53
6674 53 -153 141 132 -94 107 148 -144 -4 45 17 26 -153 244 -279 14 259 363 -96 128 -80 -146 410 -20
6697 -20 86 -124 -103 -141 -100 37 -180 -187 121 -66 -30 -199 -149 -140 263 100 -60 71 -271 -280 73 -53 23 -253
6721 -253 -35 97 95 -156 -223 -188 -165 -65 -234 178 146 17 66 -166 -82 -74 -71 45 -59 92 143 -83 -79 144 191
6746 191 74 -219 27 327 -39 19 256 -120 81 57 -122 -50 62 166 -108 73 181 -42 47 -208 22
6767 22 -123 -30 108 21 -203 -91 29 -263 67 -86 255 168 353 -44 42 -90 -3 25 -76 241 234 113 13
6790 13 104 43 -44 12 -59 111 -172 -202 163 -46 -111 38 286 126 143 262 87 45 28 -56 -98 9 48 -161 1
6815 1 45 -79 -114 106 -75 48 -13 308 -98 178 150 -72 131 -109 -58 -35 -1 235 92 237 -29 -44 68
6838 68 96 56 66 -91 -138 -112 91 -64 64 -78 -260 -130 87 123 -11 212 -30 -121 29 -152 -134 -62 134
6861 134 247 -158 302 129 -27 -41 -40 2 -93 -31 137 -57 144 -252 73 163 -5 165 79 -54 113 -158 93
6884 93 -124 -149 -195 -128 -89 -63 126 -85 295 157 -146 -155 -206 -224 98 -67 -282 58 218 129 -169 84 -93 -222
6908 -222 14 -23 -117 408 -284 -84 -75 116 40 107 56 -265 -273 137 368 -4 218 141 -185 80 60 -341 158 107
6932 107 133 -19 68 94 -155 109 216 18 55 110 -179 36 4 55 -120 180 113 152 -98 -229 -257 -30 -93 -1
6956 -1 -174 -146 -187 -55 -177 101 -152 -42 -29 216 82 -135 -34 184 -150 -203 341 -112 5 -247 25 -29
6978 -29 -148 -11 94 -311 -95 172 7 -99 49 -69 182 75 61 150 -91 127 -108 147 200 -98 -108 -3
7000 -3 -314 -25 -23 126 -127 191 272 192 164 -140 -16 -296 -57 98 64 156 -30 -118 -87 -70 117 -53 42 -61
7024 -61 -178 -79 2 36 -96 127 -33 115 -105 -95 -87 133 37 -75 -119 50 157 101 136 25 112 89 5 -288 140
7049 140 178 -294 52 -36 -5 226 18 167 -173 194 221 -22 93 -177 -201 274 61 141 -120 41 -30 -3 -234
7072 -234 -306 159 -64 154 199 -49 -16 53 0 27 143 -43 -264 -43 126 35 267 -47 -162 59 -206 254
7094 254 138 248 -150 137 196 154 102 -132 -4 -141 -130 159 -194 141 87 -223 -41 -146 -202 -78 -149 -117 -175
7117 -175 158 72 -215 -216 -15 36 300 -93 174 384 -90 250 -30 118 136 -175 27 -25 -124 242 -331 -282 -277
7140 -277 150 138 81 -26 246 123 112 197 39 -245 -353 60 -380 -53 181 -82 -143 24 -179 173 -4 -77
7162 -77 104 -47 -127 94 -10 59 -110 298 -48 -69 -34 126 54 -305 12 -51 78 -48 103 -139 133 317
7184 317 -38 -94 -57 -37 -123 -183 -86 -34 -131 -87 -74 -120 -11 -205 28 158 117 -169 -118 171 96 35 -130 170 198
7209 198 6 90 -4 -283 -141 202 133 225 -84 102 -8 98 171 110 16 -60 -72 -132 -74 -35 190 11 -2 16 -335
7234 -335 -42 8 -103 -87 -101 187 142 -107 -169 10 138 42 -225 42 110 6 -164 -6 -137 60 8 314 113
7257 113 54 125 -132 -64 8 168 153 -42 -200 4 -91 124 -173 6 -24 -169 -148 298 -60 -15 -134 -67 37
7280 37 69 190 -83 -271 -12 165 -46 -49 -133 -197 182 152 152 -120 172 84 -27 113 15 19 -16 -250 93 106 -108
7305 -108 260 -124 214 -101 -163 -115 227 68 112 -148 -160 28 -133 209 -282 -63 -188 -387 -103 85 -323
7326 -323 -202 77 -23 -63 -190 152 223 -21 -15 188 93 99 -158 -68 -166 -155 -202 178 -136 -136 122 -70 301 -73
7350 -73 -12 48 -216 -293 -13 33 174 129 -120 -122 -153 178 165 -190 -72 -3 100 205 12 -30 62 -419 86 48 -7
7375 -7 -4 -83 -113 -194 -14 -31 -203 84 -77 114 -104 -119 104 -82 71 -253 -49 95 -94 -106 -19 -93 -73 -175
7399 -175 -182 182 -22 120 5 37 -48 294 -234 226 302 -14 -129 -116 138 -85 -68 85 8 -8 64 302 127
7422 127 -218 27 84 63 -79 3 31 17 82 -19 66 212 87 -124 -199 -63 -68 -180 -184 -111 -156 -306 28 57 235
7447 235 341 125 83 -111 143 -81 68 7 -38 -293 -59 215 -193 -224 9 118 143 -78 -72 -119 -179 252 -93
7470 -93 278 -249 -142 96 -89 146 -268 103 119 -144 119 34 -161 -121 18 184 44 -47 58 173 109 -111
7492 -111 110 114 37 58 39 -175 125 9 174 277 35 158 -104 -124 30 -139 135 -201 51 -262 -92 -117
7514 -117 267 -14 91 86 -151 19 -143 -42 -190 301 125 -206 -95 -1 255 -7 -116 28 10 -161 100
7535 100 -82 78 204 1 80 -61 11 -153 67 -197 258 119 -276 -27 107 46 154 125 59 -142 111 -60
7557 -60 141 -118 -91 109 153 97 -75 106 156 150 -104 -219 146 49 -80 163 -322 86 -410 76 305 -55 59
7580 59 -182 -95 139 58 -49 301 172 52 128 -54 113 125 270 279 106 44 -63 -8 23 3 187 226 77 119
7604 119 177 7 -71 -232 11 -127 190 -210 -230 -276 -113 -161 -142 -8 -81 165 -160 171 -18 -68 -107 256 101
7627 101 -143 -124 44 -113 83 -228 -127 84 -79 -5 100 -124 -137 -100 -351 -206 -64 -73 -169 -125 44 1 128
7650 128 44 35 -292 132 328 -330 14 20 2 25 192 -44 -58 148 183 -159 -27 -91 -232 -88 -39 134 16 119
7674 119 45 -256 -44 -97 118 4 -213 -49 -200 214 -37 -244 68 132 175 -161 -68 16 -68 191 7 -73 129
7697 129 -11 287 158 -80 128 86 31 -282 -142 187 -30 108 -52 55 -83 86 -89 -39 18 -158 15
7718 15 17 -52 -12 363 -195 -1 -4 -146 207 -130 -173 -225 -87 -21 -89 -47 -165 67 59 -113 163 84 -1 194 72
7743 72 -289 -184 -101 334 120 192 146 -175 -57 188 -156 91 -79 -73 239 -37 -105 -107 24 230 -102 70 112
7766 112 184 92 10 217 -82 -136 -94 61 25 51 -257 52 54 52 -325 122 3 122 176 -60 -83 -113 -44 143 -76
7791 -76 121 175 -254 225 11 121 162 -292 -54 -133 -175 60 -4 73 -74 38 -88 -117 -152 -222 -126 102 -28 -56
7815 -56 183 28 25 -287 11 -238 13 -142 -107 33 -54 -37 -84 11 387 70 171 -136 204 24 -47 271 188
7838 188 -1 -355 30 115 -2 -85 -52 29 207 9 26 -241 -24 1 5 77 200 -77 -6 -147 -278 -225 -1 192
7862 192 -153 131 -169 -231 79 -43 181 70 5 135 -273 -46 -135 -174 -87 63 -235 117 137 58 -121 270
7884 270 -211 83 -69 -102 109 -157 -80 103 200 -66 97 -162 3 122 -56 13 -28 148 26 86 -182 14
7906 14 39 -106 49 -12 -177 151 22 -109 -83 122 19 118 120 -52 -92 122 -140 -52 -442 -112 -145 62 -127
7929 -127 -46 111 95 -163 23 19 -138 -87 176 -136 -146 102 -75 -72 -55 111 -222 79 -226 108 87 152 -136 140
7953 140 -193 -118 86 244 38 88 -93 42 -179 147 -128 75 59 56 47 195 85 -164 -119 95 -131 -71 100
7976 100 -124 -62 137 81 59 88 -168 -178 -15 482 123 -21 74 166 -335 -112 34 -48 230 48 -106 -274 -7
7999 -7 106 34 -181 158 -32 -93 86 29 64 -230 -201 -170 -174 -127 102 -337 71 22 -99 -266 103 -136 98 -53
8023 -53 257 232 -70 19 163 173 -124 -123 -219 419 183 -135 56 33 34 67 281 16 -411 -14 -127 -19 47 -127
8047 -127 34 -166 -90 106 6 -84 -97 -8 -25 -45 59 -320 27 -9 191 -65 -126 -57 164 37 215 -136 38
8070 38 -140 -155 -59 18 -54 -56 -160 -68 248 282 -241 -80 14 51 240 97 18 -2 98 -20 191 182 99 276 -163
8095 -163 120 12 177 -50 -320 19 145 -157 180 -115 -157 82 -148 273 -60 13 153 -50 66 -156 223
8116 223 -31 -3 24 113 -62 -82 43 -81 92 93 104 -200 107 -90 -230 -79 -133 -264 111 0 -382 61 118
8139 118 62 357 185 34 122 -22 -164 -77 -125 -190 218 -296 -70 -56 105 53 -174 87 -160 -9 -126 158
8161 158 -71 -146 102 -85 181 131 25 -213 82 98 113 14 20 49 121 26 -181 80 86 223 -264 92 34 -25 -89
8186 -89 -118 42 -176 41 406
8191D06
$$ Imaginary data points
##PAGE= N=2
##DATA TABLE= (X++(I..I)), XYDATA
0 0 0 0 0 0 0 0 0 0 0 0 0 0 0 -8 8 -8 8 -8 16 -16 20 -24 28 -32 40 -46 52 -60 68 -79 88 -102 116 -131 148
35 148 -164 185 -208 232 -259 285 -317 351 -389 431 -475 523 -576 637 -700 772 -850 938 -1035
54 -1035 1144 -1269 1412 -1576 1772 -2001 2280 -2628 3075 -3671 4508 -5768 7872 -12024 23239
69 23239 -117585 -296794 77283 166327 -121222 -150908 131151 136307 -51186 -32945 87610
80 87610 30239 -38268 1465 538 -62320 -35052 5151 -28803 -23874 41807 26003 -5337 42298
93 42298 37512 -45574 -15182 62694 -2746 -76986 1131 50754 -19966 -32889 31224 25118 974
106 974 37049 15121 -65683 -21797 68525 -14680 -112416 9037 107964 -28460 -101325 42622
118 42622 82613 -43002 -38497 55070 3475 -62790 7116 31113 -48787 -30077 64461 36113
130 36113 -41327 -2244 51470 10855 -15752 13149 -565 -17872 22048 2810 -71310 -17803
142 -17803 78518 3090 -82862 17811 80869 -35647 -71890 41017 45088 -51124 -19941 59888
154 59888 435 -61148 20437 66890 -19945 -46198 37865 38237 -41699 -35628 16815 4418 -11343
167 -11343 5762 -6737 -15381 19149 15838 -26313 -7046 36696 11393 -24054 -1717 11965
179 11965 -9679 -1111 21994 -1650 -18612 19389 22317 -33944 -27657 32271 12082 -37090 -1304
192 -1304 25365 -24313 -20664 37140 9018 -40989 16717 57804 -21126 -57540 25292 51388
204 51388 -28265 -41836 29282 29084 -31942 -21587 20356 1337 -14362 15250 9741 -22673 -5273
217 -5273 19419 -3009 -12655 10258 11616 975 5287 -2625 -15087 6801 24473 -5549 -25745
230 -25745 7031 23169 -14558 -28739 10077 20836 -9728 -9300 8846 -7864 -14540 12182 7339
243 7339 -20150 -2709 23019 965 -19557 -2885 11561 10154 8345 -649 -8885 6624 20101
256 20101 -4047 -26066 4266 33396 746 -34475 -8983 19378 -534 -17960 -7648 998
268 998 7413 7666 -17137 -21160 20068 29107 -14363 -17886 25613 20834 -21501 -12061 23994 8372
282 8372 -20638 2599 21803 -15417 -32318 11259 24423 -18369 -25176 13752 19269 -10196 -19872
295 -19872 -1563 19865 18251 -9111 -17210 12685 23210 -7816 -20335 7643 20981 145
307 145 -14018 -5967 167 -301 3095 -2137 -13368 812 17056 -6436 -25915 5064 22894 -5544
321 -5544 -10558 12271 2046 -13441 8645 14191 -14531 -8990 26714 13196 -28289 -14826 25414
334 25414 11980 -21179 -7374 15521 910 -11164 -2168 -5519 -5338 14501 7074 -20532 -6354
347 -6354 20225 767 -17937 5880 17537 -2736 -4487 9470 -2441 -13501 8707 18837
359 18837 -10655 -19527 11978 14370 -18978 -17983 11446 9071 -6070 -2596 -3631 -6351 9947 10208
373 10208 -12694 -4640 23174 10681 -16954 -5330 13830 2821 -5320 5124 -20 -12546 2040
386 2040 11706 -16174 -20614 18957 19431 -24138 -17848 20913 6809 -19034 3918 17368 -6535
399 -6535 -3573 17341 -1728 -20424 9295 25459 -9313 -21271 12205 15101 -17734 -12780 14071
412 14071 1967 -12532 7491 6675 -20341 -6198 22978 1397 -21598 5235 21209 -5248
424 -5248 -15036 4179 8494 764 3948 1749 -8733 -470 12119 -3013 -17027 4792 17626
437 17626 -6573 -15768 4402 3492 -8797 4046 8157 -12511 -4263 19196 -664 -23345 4490
450 4490 25972 -1375 -16352 6833 12193 -7730 -4183 9573 -3074 -8576 12872 6465 -24346
463 -24346 -9852 24059 2463 -25007 2193 20457 -8073 -15014 9495 6603 -9280 5181
475 5181 14380 -7329 -12323 11889 11996 -11476 -7431 13040 4968 -10440 -2526 742 -7398 3405
489 3405 10620 -11089 -14149 14645 11595 -19443 -10529 19815 11116 -11852 -4163 8534 1511 -2491
503 -2491 3377 57 -4436 6584 6993 -11782 -11199 9937 6458 -10859 -2769 7335 -4557 -5237
517 -5237 8214 -1059 -11052 8489 16090 -9037 -14582 10347 13180 -7634 -7650 9039 5543 -5749
531 -5749 -905 611 -7613 1029 12503 -4320 -16379 5271 13401 -10112 -12624 9789 9039 -6483
545 -6483 -1311 4623 -3542 -2251 8966 3312 -9151 456 12620 -94 -13090 -781 10721
558 10721 160 -6006 -450 -1986 -2608 4296 -1504 -10345 2385 13188 -2628 -13082 1745 10779
572 10779 242 -4112 2557 4193 519 1025 395 -5004 -885 8764 2556 -10275 -4140 7046 -347
587 -347 -7402 -764 2128 -339 1926 -866 -7306 -172 9976 2712 -6977 -183 8318 2294 -5917
602 -5917 -2357 3849 2879 585 -218 -4661 -4130 4931 2892 -9092 -4362 8747 3365 -8492 -4367
617 -4367 3799 2958 756 590 -1275 345 4627 1970 -4660 -2724 6379 6887 -3863 -6908 2022 4195
633 4195 -1971 -3660 -1227 429 2356 -452 -6423 -3886 4601 3925 -1916 -2829 898 3724 2899 -2763
649 -2763 -3055 4200 6999 356 -5207 -2302 3937 2658 -3393 -3676 1851 2836 -1223 -3752 -3949 -118
665 -118 5183 1382 -5786 -2061 5422 1746 -3535 -871 3274 3652 2269 -876 -3455 -242 4450 2075
681 2075 -4472 -4033 3666 3849 -5428 -7040 1219 4809 165 -3234 -2932 632 4355 651 -5245 506
697 506 7245 2664 -3691 -1773 1575 2275 1423 -951 -2554 -181 2902 -369 -6265 -3576 4818 3854
713 3854 -4870 -3925 2329 1102 -1005 836 -966 -1086 5957 4644 -6306 -4705 7223 6148 -4950
728 -4950 -4091 4811 3190 -4220 -3527 311 -34 300 2503 -2650 -6333 1962 6167 -3745 -5793 4874
744 4874 5467 -2441 -2248 1078 385 1925 4073 -789 -4085 2342 5138 -3107 -6836 1426 6349 -1357
760 -1357 -5557 -620 705 -630 961 -816 -3928 2755 6838 -3151 -7393 3467 7191 -1348 -2867
775 -2867 2378 1801 -874 650 26 -3729 495 5938 -929 -8949 -1164 7117 -1600 -7221 1911 4824
791 4824 -2419 -1611 2142 -2562 -974 7176 2606 -6515 -838 7732 958 -6911 -488 5833 329
806 329 -3683 -232 -779 -3136 1893 3194 -5276 -4125 6745 2624 -8027 -2601 6515 2349 -2565
821 -2565 1062 960 -845 2139 2508 -3315 -2247 5638 3523 -6438 -4892 4497 2486 -4894 -1820 2167
837 2167 -1436 -557 2235 -2807 -4133 5659 5439 -5173 -4151 5354 3841 -3882 -1252 3587 1094
852 1094 -525 1189 -1738 -4169 2332 5308 -3921 -6211 3840 4730 -5665 -4476 4073 1462 -2167
867 -2167 1495 861 -3612 1073 5742 -916 -4849 2868 6463 -1949 -5851 1159 3879 -1458 -1732 755
883 755 -2014 -1314 2875 -979 -6303 1143 6946 -1328 -5972 1122 4291 -608 -1320 1285 1169 622
899 622 2232 -162 -3934 177 5158 343 -5798 -485 4484 -1408 -4087 337 878 -976 1483 421
915 421 -4555 -995 5333 1423 -4617 169 5175 1382 -3463 -655 2341 671 280 701 -2071 -2167
931 -2167 2461 1489 -5018 -2487 4595 1491 -4754 -1699 2065 -4 268 1048 -779 -863 3193 2283 -3525
948 -3525 -2366 4133 3944 -2921 -3110 2323 1752 -1801 -1394 105 -1318 1038 1339 -3198 -3549 3006 3251
965 3251 -2474 -2260 2312 2534 -558 -1322 46 992 1746 1381 -1340 -2147 1382 2787 -1423 -3485 1502
982 1502 2649 -1574 -2681 -591 -196 824 1387 -1383 -2082 1854 2927 -1187 -2423 1215 3667 1065
998 1065 -1764 -582 1029 938 182 -617 -1350 794 2385 -1048 -3909 -358 2815 236 -2259 -874
1014 -874 1209 1203 -56 -1230 -578 1819 2264 -184 -2135 -405 2539 1144 -2068 -1097 2009 1069 -1552
1031 -1552 -1656 -1013 434 1482 -380 -2433 -335 1457 524 -1471 -1255 1501 2679 304 -1884 -255
1047 -255 1596 925 -465 -898 501 1284 755 -2093 -1909 633 1543 -208 -1773 -1475 696 871 -1147
1064 -1147 -1519 733 2003 625 -802 -1244 387 2231 900 -1789 -617 1864 1185 -1429 -1881 -108
1080 -108 1939 481 -1707 -1509 241 1117 -372 -1529 -707 1640 2018 -1458 -1920 1331 1861 355 -475
1097 -475 -215 64 1616 543 -1576 -979 1442 1283 -1185 -2077 -164 1517 -412 -1526 -151 688 667
1114 667 501 -704 -1826 1320 2969 -424 -2178 680 2530 -166 -1795 -254 1074 863 189 -902
1130 -902 -1270 34 1402 -234 -2407 -342 2711 350 -2765 -863 1687 847 -27 69 -714 496 1876
1147 1876 64 -2054 198 2658 694 -2243 -1143 1207 673 -1082 -977 18 -21 630 316 -2017 -1091
1164 -1091 2320 1418 -2171 -865 1844 999 -747 -140 178 226 1059 562 -1723 -982 1503 1334 -2078
1181 -2078 -1862 1553 1339 -1423 -1218 314 92 447 977 -829 -1381 1724 1918 -1675 -1430 1991 2002 -1095
1199 -1095 -1530 419 731 122 -17 -375 -783 308 1584 -1394 -2332 1014 2501 -1162 -1934 771 1196
1216 1196 -139 -232 179 -261 1191 1625 -846 -1685 550 1973 -183 -2042 201 1383 -122 -1251
1232 -1251 -277 -365 -139 1075 -153 -2155 -91 2543 48 -1674 519 1938 116 -453 -263 244 161
1249 161 939 -270 -1149 -508 1583 406 -2524 -751 2284 571 -1716 -374 430 -146 402 550 -761
1266 -761 -132 2094 676 -1814 -720 1926 1163 -1084 -1001 1004 548 -450 -207 -240 -507 952 773 -1833
1284 -1833 -1503 1578 1201 -1418 -731 1328 809 -121 -126 -390 133 1025 939 -464 -996 650 1149 -1113 -1767
1303 -1767 714 1175 -771 -917 -352 -361 204 683 -923 -1195 1432 1038 -950 -1125 795 1637 100 -400
1321 -400 -216 317 135 445 -354 -820 170 1422 -752 -1918 175 1480 -543 -1104 -30 237 170 31
1339 31 -204 -600 536 1464 278 -1031 -21 1521 219 -1238 -152 916 70 -446 -598 -616 -249 983
1357 983 -130 -1493 -119 1191 495 -1469 -422 824 948 140 -444 -185 509 441 290 -788 -498 1098
1375 1098 724 -1073 -781 645 529 -428 -543 -74 153 479 -182 -769 -267 1185 464 -620 -499 799
1393 799 1135 -200 -577 -58 490 447 -432 -556 -637 614 850 -862 -918 299 539 -571 -793 -31 461
1412 461 136 -310 -681 277 464 423 -132 -521 483 1133 -131 -1190 -57 712 293 -337 -472 -332 271
1431 271 341 -471 -863 247 684 87 -706 -575 694 797 -545 -376 331 779 177 -260 -534 157 768
1450 768 374 -844 -549 548 218 -620 -785 38 769 136 -615 -473 129 423 515 -211 -230 690 854 -344
1470 -344 -459 613 739 128 -410 -506 20 390 -201 -683 -465 394 365 -287 -628 -240 1048 457 -606 -179
1490 -179 465 556 145 -333 -531 446 1032 -60 -727 -201 584 -83 -640 -359 374 613 -323 -524 -184 175
1510 175 407 57 -777 -141 802 425 -714 -270 544 648 -217 -204 -330 -69 421 -333 -599 -95 513 265
1530 265 -721 -730 340 592 -420 -289 58 319 202 29 -260 -222 867 752 -232 -558 152 567 -222 -219 -7
1551 -7 396 8 -191 -395 -343 273 425 -191 -473 -104 674 -274 -424 77 461 181 284 -113 -115 167 478 48
1573 48 -411 154 535 -142 -754 -2 439 183 -422 49 -93 -203 156 149 -413 27 602 97 -632 -121 677
1594 677 249 -250 -68 -198 222 50 -137 -341 -424 608 142 -644 -294 567 155 -503 -54 190 334 124
1614 124 153 -261 -285 392 651 -404 -228 349 329 -403 -460 318 280 24 31 -245 -399 272 196 -287 -528 299
1636 299 680 -348 -397 122 383 175 -110 -82 -4 -49 209 -167 -583 192 383 -456 -690 53 238 14 -425
1657 -425 3 15 253 43 -19 -496 231 466 -167 -163 -286 421 -119 -66 -86 -113 58 148 179 -381 -63 373 -84
1680 -84 -674 226 57 15 -634 -112 -55 55 176 96 -194 189 331 6 -64 -89 496 320 -311 -428 77 109
1702 109 -109 -125 -297 74 344 381 -254 -97 492 254 -178 -150 109 226 138 -101 87 334 -57 -19 -446 -227
1724 -227 609 354 -336 -489 101 231 -207 -37 64 134 -39 232 -265 -198 262 547 -152 -353 185 -14 -19
1745 -19 -391 -364 227 -67 40 -152 -182 263 354 -379 -571 165 260 6 -87 -76 66 167 79 -226 63 296 4
1768 4 42 -197 -135 436 154 -387 -139 254 127 -136 28 -116 174 174 95 -67 79 433 50 -334 -96 150
1790 150 502 96 -169 -31 140 261 216 -168 -101 36 35 -130 -567 230 203 265 -245 -198 -1 11 125 -2 -118
1813 -118 262 279 113 102 242 390 144 -179 -216 71 82 -174 61 10 195 266 -198 -270 147 -5 -157 -173 179
1836 179 -159 101 -7 -84 -64 -32 316 30 -231 -76 304 386 -475 -224 21 -220 -139 -290 -154 -40 118 -140
1858 -140 -236 50 227 142 258 -181 -217 98 105 20 32 120 131 -314 -319 -273 141 366 -232 19 100 -99 123 -96
1882 -96 -44 283 466 -123 -177 207 -37 9 -275 -90 87 335 -65 -172 140 48 219 -154 -130 -146 108 54 -15
1905 -15 -133 -33 51 -45 106 -173 231 54 -83 -129 -153 -121 -145 -186 -98 -195 -62 -120 170 -143 181 204 137 -276
1929 -276 213 -21 -4 -121 -285 -206 183 11 -141 -115 29 327 25 -121 13 202 -179 -42 -204 0 166
1950 166 133 352 -215 77 447 303 -188 147 324 281 -217 -92 -75 -17 -72 266 -272 -232 204 -20 -331 -68
1972 -68 147 219 -132 -42 -6 -7 72 54 -191 -5 455 -98 -119 -99 406 159 -156 -57 -116 301 -48 50 -182 -157 -186
1997 -186 220 -213 -297 295 284 -72 -130 168 214 103 -79 305 -56 220 267 -161 -11 260 130 -44 -403 -7
2019 -7 111 273 -153 -2 57 152 30 149 -147 116 441 255 -335 158 295 50 -16 164 257 -13 -44 -86 -247
2042 -247 -10 372 12 16 -170 491 98 -223 -185 114 446 119 -27 -303 -19 126 24 -224 -154 64 39 -192
2064 -192 190 -39 -108 31 -216 28 133 63 139 -332 -198 79 224 -47 -12 71 193 82 -75 143 -33 246
2086 246 191 -239 222 216 20 2 -217 93 110 140 -86 36 134 -70 -124 71 -10 179 369 -105 -13 -6 476 290
2110 290 -229 -62 180 9 4 -103 -19 24 84 38 -226 62 331 13 -250 -72 281 55 -47 -220 -290 34
2132 34 340 1 -288 334 356 -214 -162 -207 -201 181 -1 -148 -107 -177 35 80 -155 -305 403 84 9 -30 99 258
2156 258 -272 -131 -98 45 46 76 -174 -105 90 132 -54 -327 126 226 54 -164 278 44 -42 53 -190 -294 216
2179 216 46 1 -38 93 217 45 -68 179 232 233 -55 -72 98 109 69 -233 -313 -257 83 53 -250 -188 199 -160
2203 -160 -3 -170 -17 299 414 -187 -310 84 118 -14 -111 -37 130 231 -119 -176 -353 -141 306 101 -220
2224 -220 92 310 110 -167 -39 9 65 127 98 -26 83 -77 137 -60 -60 -14 136 -397 -464 199 230 -219 -511
2247 -511 283 174 178 -52 -120 104 153 98 -289 -150 2 263 -203 -309 117 -1 -185 -354 -115 127 127 81 -96
2270 -96 177 14 197 -343 -15 242 286 256 -91 47 -101 352 -36 11 -210 73 114 -4 -250 -143 217 206
2292 206 -234 -36 -142 219 75 -114 -176 -78 280 35 -279 -191 142 316 44 -36 135 33 -66 -523 -31 30
2314 30 97 -268 -177 170 88 226 -145 -380 211 40 160 -330 -87 451 141 30 -58 -244 79 407 -35 -337
2336 -337 58 100 -22 -191 -317 -41 -73 -259 -234 -208 102 -27 -264 -232 -138 225 8 3 -33 272 82 -87 -45
2359 -45 169 278 233 -102 -80 127 -25 -15 -132 -21 191 363 -195 0 192 14 1 138 -187 310 423 267
2381 267 -131 -243 117 361 -80 -325 -305 160 47 -161 20 -203 24 -13 -265 -168 2 165 -62 -18 -267
2402 -267 168 176 -209 77 223 102 41 -54 -300 122 139 -140 -36 261 53 -52 260 -181 -159 155 327 -51
2424 -51 -196 231 232 -240 -221 253 352 126 -83 -237 -358 53 -71 -135 -283 115 270 -59 -108 52 129 81 -226
2447 -226 -41 87 91 157 58 -178 37 122 -50 -543 55 175 -35 -50 -53 200 -85 65 -69 -246 193 -23 -145
2470 -145 18 -133 97 222 -164 47 -3 -14 -28 -69 -13 218 10 -132 18 -35 101 120 -288 79 -18 252 -31
2493 -31 -118 -128 -87 -59 70 -71 170 136 160 -238 -299 199 -17 -161 -124 -98 209 217 -51 -169 -131 -90 -7 42 -538
2518 -538 -7 -12 98 -130 34 113 303 83 -193 -91 9 91 -120 -241 -30 221 -334 17 -137 159 -83
2539 -83 227 -161 114 38 -3 139 -270 -49 -170 55 -106 -135 128 226 -30 -187 -425 216 157 73 -174 -97 122
2562 122 187 -145 -485 -99 110 -79 -151 -4 -126 -26 -136 190 -60 160 111 -84 -76 281 87 -60 6 -191
2584 -191 -14 124 -69 -128 -198 -106 -11 84 20 448 -52 71 -294 65 201 -221 112 -303 -279 326 54 -53
2606 -53 -185 3 13 256 -147 -117 -93 181 95 -88 -130 144 72 -271 35 77 417 -32 -64 -3 286 122 -163
2629 -163 -11 -270 182 -14 -351 -3 58 -44 7 59 74 274 156 117 -328 -56 361 -98 -36 -62 79 410
2651 410 114 147 138 143 179 -30 -32 134 -23 112 -137 118 -189 -76 -232 -215 -35 -33 372 -53 45 46 25 1 -300
2676 -300 5 91 -85 31 213 -138 -361 241 -235 167 -155 113 242 -150 -231 178 254 113 62 -4 -91 -24
2698 -24 75 -231 -166 -208 150 -456 -117 110 41 -213 -13 -88 32 -33 -160 -365 -47 72 37 -1 -3 292 128 -17
2722 -17 189 -4 -133 231 -26 -173 21 67 75 -340 -63 115 198 214 16 -23 -163 75 -168 120 178 73 -184
2745 -184 -134 57 -83 195 -42 10 -28 60 54 -147 -117 -173 243 92 -266 155 -165 42 1 -124 -74 -62 61 -203
2769 -203 -120 -10 177 268 250 23 319 -30 50 -388 -61 118 209 80 -8 56 -34 -204 -316 -10 -135 84 -235
2792 -235 -45 55 90 -92 -178 25 -121 375 112 -115 -169 28 269 353 -212 -11 -33 302 -284 -284 -13 44 -49
2815 -49 -12 283 -29 -70 39 -40 -16 372 77 23 -118 103 90 86 229 -229 55 131 -48 -185 308 204 64
2838 64 -224 -268 -387 139 67 215 -3 -225 113 -28 313 -465 95 74 -56 83 -92 39 8 -165 62 -195
2860 -195 191 46 -37 -60 45 256 7 -97 -42 -89 -179 86 -165 393 317 47 -26 -209 -6 23 -338 -233 -234
2883 -234 -110 112 -375 57 -92 -106 63 -90 -12 58 140 139 68 -307 9 -11 -136 -19 -166 213 47 -182 -223
2906 -223 -19 -148 -18 18 -183 89 137 -25 49 -169 69 218 -2 -153 -102 107 -124 -209 -98 248 45 -22
2928 -22 -191 261 162 -203 52 -65 -134 -272 -1 -18 -130 -254 0 253 49 24 56 162 -101 -107 -16 -54 85
2951 85 54 68 16 264 -23 69 -180 -326 93 -149 65 137 -20 25 0 -81 -86 60 -179 -381 -159 209 -54 -15
2975 -15 -229 161 -5 -152 -230 -66 52 216 -392 79 -150 -3 -7 -10 40 -5 123 -91 -21 -143 221 91 66
2998 66 40 229 73 17 26 161 -52 -52 88 -109 192 -244 140 -87 -235 4 -5 -44 -188 140 -91 14 -71 51
3022 51 -55 -63 296 -172 1 2 -173 -88 -6 -88 -224 111 104 0 -212 210 -130 113 119 186 4 -199 71 60 227
3047 227 131 -106 -41 -91 -160 -230 -200 29 42 102 -201 -4 -7 103 53 248 -42 -151 209 166 24 -237 -107 158
3071 158 -109 133 -241 159 -67 122 1 -181 152 27 42 -69 -134 117 10 -139 -66 14 231 27 -354
3092 -354 -126 296 -162 230 -169 148 124 -214 -31 -154 -158 -285 -108 -20 18 186 -228 -118 22 -75 -8 -49 219
3115 219 -62 50 194 31 208 90 147 -158 -88 -9 -161 -44 105 -1 -117 69 140 199 108 -73 -147 -120 -166
3138 -166 -13 -168 223 -5 163 -84 -98 243 -58 151 45 -54 26 43 -56 -234 -96 -121 -133 -42 -320 168 146
3161 146 48 92 23 78 283 159 -197 -82 255 -17 -47 88 55 153 -207 -29 58 19 -45 -3 -36 282 60 179
3185 179 -209 -9 -104 176 -92 -381 173 132 -164 -141 221 -15 -50 129 -83 -77 117 -10 -84 -80 -74 68 -82 -59
3209 -59 -67 67 224 64 2 -32 27 167 -70 27 115 -158 18 59 -275 47 -186 -240 7 -105 336 14 58 162
3233 162 -213 51 -26 158 -33 207 235 -168 -119 51 69 3 -186 13 174 85 174 106 -24 123 125 -103 -57 -216
3257 -216 165 247 -87 -261 -51 -28 50 -43 280 339 -50 -32 -234 84 401 15 -177 -85 -149 105 71 127 -44
3280 -44 75 107 -464 113 -51 112 143 -145 153 30 202 -64 68 316 41 57 140 -183 -55 62 -126 249
3302 249 160 213 -43 -269 -156 -41 30 70 -38 -48 -41 -93 133 151 -148 169 213 209 63 70 -189 -251 -48 -42 67 41
3328 41 132 -37 32 259 170 -104 5 -163 -123 -33 -17 -51 -234 -108 203 -15 167 -171 -78 208 -84 -165 -96 42
3352 42 -82 -27 -62 97 37 45 -99 135 -162 172 39 -548 -123 41 289 -375 1 113 60 -52 29 177 84
3375 84 -97 -273 95 -45 16 -131 -43 -115 58 -106 -197 35 -50 222 228 234 11 193 -4 -296 -49 -47 -26 -56 -84
3400 -84 -151 33 -163 142 13 188 -11 195 1 -229 -218 -50 134 73 -201 -291 -343 213 78 -87 -7 21 58
3423 58 -45 -239 -85 101 -227 6 13 -149 104 50 84 -286 -79 -175 -12 38 -100 2 266 -176 98 83 65
3446 65 -52 -29 26 -65 -186 86 180 -1 53 21 -53 -99 98 -9 -291 -24 150 -88 -113 216 -169 170 -55
3469 -55 102 91 70 -168 135 152 -21 231 82 51 45 -132 215 2 -150 225 135 138 29 280 71 39 -35 21
3493 21 131 211 170 -146 -255 90 140 25 138 -145 29 -85 57 67 -133 -179 -2 -91 -15 -18 -348 94 3 126
3517 126 268 -387 113 106 55 -38 -181 122 54 -5 -45 -154 39 -96 94 -134 16 -167 -276 -8 -89 5 63
3540 63 -43 -38 -90 -78 278 -70 263 29 53 -212 7 -8 -167 212 182 266 5 327 171 160 -217 -245 151 115
3564 115 -185 55 -78 196 29 77 74 240 -142 -5 -4 -68 63 -27 -134 9 -39 198 47 -122 79 -45 -19
3587 -19 -234 -55 -36 214 -55 -236 -265 258 93 -216 -49 208 -115 227 62 -145 78 17 -40 -185 -76 85
3609 85 -173 -148 -66 -50 16 -108 -22 251 171 -52 84 -156 -120 -147 -40 19 101 129 125 123 -52 315 -1 54 -22 -42
3635 -42 -36 -17 182 78 111 28 -219 125 -91 14 149 -286 -32 51 -40 -23 75 -66 -73 -186 -51 -204 110 -37
3659 -37 0 -14 130 -160 -139 -95 -194 -62 -144 -271 -204 138 -77 171 -146 -22 14 -118 19 95 252 121 -99
3682 -99 -79 186 256 -84 -126 -129 -22 68 46 -211 18 233 -227 -129 -149 -91 -39 -37 91 285 -110 -19 85 -112 85
3707 85 -94 90 3 -127 -128 42 -74 -64 -77 100 -76 -49 -4 -47 88 21 -105 -190 120 -56 63 -38 18 53
3731 53 -43 -37 31 -58 61 -44 -49 -71 282 -1 86 -88 -159 82 40 -38 -11 -282 -23 7 -40 334 52 92 -24 -86
3757 -86 -95 -134 -108 153 114 -51 -92 212 -78 -78 -109 109 101 -338 40 71 -254 66 -133 -61 -16 -53 67 -60 -95 -190
3783 -190 -68 5 128 254 -90 152 -163 292 -42 221 -63 100 -22 -64 49 -76 92 22 -174 213 5
3804 5 94 -79 88 -117 406 -238 -245 -166 -221 35 55 230 -44 219 -270 137 200 -343 31 108 150 31 -208 18
3828 18 127 -162 62 -142 -90 144 29 -9 -111 16 -215 -69 45 -69 88 357 142 54 114 66 232 -36
3850 -36 -188 104 251 158 -26 -86 103 -140 -120 -120 84 -174 -36 -71 229 140 -8 -137 -324 40 -124 -175 68
3873 68 -255 -209 222 -142 -69 209 143 102 -113 117 -394 190 -55 180 126 -10 40 -12 -379 21 -13 105 121
3896 121 -187 -123 -265 135 -108 265 92 212 -61 159 1 -133 -165 131 80 174 -78 -40 -84 -126 8 12 174
3919 174 94 -7 186 -67 -299 86 142 330 26 157 -12 72 217 -38 88 268 -9 46 18 -185 -140 -27
3941 -27 58 259 -99 -101 197 181 40 12 270 -59 -17 41 107 -75 26 239 54 250 -65 258 17 -148 -160
3964 -160 -21 -86 -61 -55 -26 -56 -270 -179 107 248 167 -134 -70 -116 305 183 -177 141 -29 63 -317 -120 -71 315
3988 315 22 -111 -128 26 158 -266 41 28 -213 -143 -109 -91 -10 102 -145 206 -195 40 -8 8 -212 -37 262
4011 262 17 -60 -86 -164 158 132 87 -14 -129 -14 -78 -120 51 -274 2 -12 -86 182 53 -180 47 58 -47
4034 -47 -4 -26 -19 -151 -159 160 -131 -141 39 102 24 77 -342 12 118 -182 -54 -59 192 94 -74 48 -346 254 25
4059 25 159 -83 -11 -96 -113 -286 -194 286 -134 -67 -296 -82 57 -85 108 -282 -196 146 -144 83 -31 94
4081 94 210 -96 -13 -153 255 153 -4 -75 -202 88 -143 77 83 83 -113 -400 124 -143 17 -75 227 -185 -203
4104 -203 291 -28 -98 -159 -20 69 -97 -95 20 236 96 14 88 -78 71 46 57 155 39 -126 61 148 104 -6
4128 -6 185 20 -75 -182 -27 -96 -103 126 207 27 181 133 132 0 -61 -57 -145 51 88 144 15 -71 124 -231 -167 15
4154 15 -117 263 137 -10 -67 123 219 -97 -59 -78 253 -97 99 -109 -92 188 -62 63 77 106 18 105 -264
4177 -264 -81 -184 -109 -203 -29 114 -43 -115 45 -125 40 175 -190 -192 222 -139 118 20 -118 261 -36 259
4199 259 195 -279 -5 -6 136 -81 -56 310 60 -16 84 122 4 -51 -164 182 305 207 15 -162 78 140 -37
4222 -37 163 -130 47 25 92 -132 54 300 265 128 -99 -227 -61 -91 34 146 62 95 33 -171 -239 323 83
4245 83 -147 95 -11 87 -49 -90 -149 65 140 -97 151 -105 -90 -160 42 167 -163 -70 -246 -392 -52 -9 -45
4268 -45 -2 58 231 -203 70 -68 112 152 -94 42 149 -84 181 -58 -72 -86 -174 86 -58 -111 -93 16 39
4291 39 55 19 38 -33 114 104 -61 -14 237 -8 23 -37 191 34 53 95 -307 -138 214 107 -142 74 0 400
4315 400 167 5 -79 19 112 54 10 88 100 78 22 -241 42 -40 -97 54 -79 -247 49 -70 -58 33 -18 -20 25 42
4341 42 196 -90 -244 -235 -77 205 74 133 -243 219 149 122 -105 -140 58 -322 7 -57 -128 -37 39 28 -43 11 67
4366 67 -214 -62 36 46 18 273 -217 -96 -39 60 42 1 -110 160 -103 -115 -299 -234 -35 -56 135 -175 185 298
4390 298 -26 131 -11 -2 21 88 145 231 -151 71 3 96 39 195 -91 -157 -123 72 297 -336 -228 62 41 -13
4414 -13 127 -63 28 65 -128 -136 -87 98 303 140 115 -17 133 -221 175 -214 -1 191 0 -13 173 -65 -137
4437 -137 -239 -82 -47 29 55 -96 -237 224 188 34 -176 -292 -173 227 76 90 -59 21 207 -72 -139 0
4459 0 -8 -109 48 -276 24 -44 -451 217 9 -9 74 26 -308 88 -27 -14 -28 -131 364 -54 32 41 9 336 -4
4484 -4 -330 82 177 62 3 98 21 -201 98 283 -352 251 95 -12 -122 -139 154 73 35 135 -75 -164 80
4507 80 -116 -210 -146 152 194 -378 -69 10 123 -40 -325 -48 65 -18 -168 135 -119 33 -180 -182 62 148 -151
4530 -151 20 -42 95 20 104 78 85 -119 47 -27 -157 100 13 313 -132 78 48 -268 80 -221 -88 158 33
4553 33 -95 13 5 153 -8 -380 -49 -18 115 285 36 -73 -182 -95 252 165 -100 59 259 60 -46 -201
4575 -201 75 71 -115 -24 106 -190 -270 -125 -284 2 -47 145 -115 44 -52 196 -91 209 -37 237 -112 249
4597 249 -11 77 -256 -110 -72 -122 -92 6 -105 132 37 71 -211 -12 80 3 -46 -6 -13 72 181 97 7 -224 55
4622 55 162 -31 -237 69 -198 96 -114 117 134 210 106 -65 60 240 -146 -129 -119 134 192 27 84 -46
4644 -46 -10 76 261 -262 55 -56 116 96 -45 8 50 302 77 155 -172 196 68 -67 49 103 86 14 46 62
4668 62 -117 13 -24 -181 74 43 -11 -96 365 15 -186 61 -97 183 -41 -91 177 21 41 -86 -13 20 -91
4691 -91 -266 229 -93 25 -137 67 81 131 -30 114 199 -17 -129 208 67 178 73 58 184 130 372 -20
4713 -20 -2 13 14 234 -120 -175 -55 308 -76 -22 -263 190 198 -28 -5 92 81 241 -155 160 357 21 -124 -227
4737 -227 357 11 183 34 46 150 5 62 -142 -119 238 170 -180 -11 -95 109 317 71 -408 308 249 3
4759 3 -13 -22 -157 -94 47 151 4 -25 121 -105 86 -129 -177 86 48 -98 -217 132 -320 3 -144 -111 -50 -260
4783 -260 -182 11 -201 -235 -71 -73 34 16 -86 -150 163 121 126 79 84 164 4 -73 -206 -57 -228 -226 207 -43 152
4808 152 315 126 24 -52 57 85 116 -159 -415 -139 280 -19 -58 108 -252 220 -162 -41 -447 150 107 -199
4830 -199 -256 198 -46 203 4 21 -225 -94 124 122 -162 155 -176 -206 -40 -1 153 -98 -102 -177 -123 -88 -237 23
4854 23 -30 122 -26 244 224 -260 -43 8 -39 81 92 8 -47 69 -54 -49 57 -354 -96 123 49 -212 -149 20
4878 20 -68 193 -186 124 -10 198 18 -172 -110 80 265 -88 151 -154 -48 326 152 218 -5 67 114 225
4900 225 12 -5 -45 91 8 -32 -134 -262 89 265 262 -38 220 -51 -44 79 -105 34 -57 58 -68 112 121 -223
4924 -223 -82 -84 33 134 -358 -99 17 434 94 -268 -105 -242 -131 31 -63 166 171 -67 161 34 118 253
4946 253 -6 65 272 125 78 -63 4 -8 -267 -142 224 -100 92 -212 -136 -296 131 228 -32 -443 58 152
4968 152 117 122 257 53 88 -11 -124 133 3 -117 28 -222 77 0 -49 -49 -116 16 -239 90 -311 217 -31
4991 -31 85 62 256 75 -32 13 -196 -3 171 -50 59 -58 87 46 -313 -87 -113 143 91 -216 -3 -140
5013 -140 28 56 -80 -6 31 -17 -17 -89 87 -60 -2 -206 158 262 20 -246 335 -232 -335 135 -5 -131 -26
5036 -26 46 -64 -164 49 -9 143 -10 -380 153 -61 28 -91 36 -35 -204 86 -55 -74 90 104 33 72 50
5059 50 -178 174 275 30 -9 -261 -5 347 -53 -51 227 -279 311 -133 41 99 -91 4 -58 -58 -54 -2 117 18
5083 18 115 91 16 -11 53 36 162 15 -3 7 288 97 -16 176 56 101 7 -63 171 105 -107 -114 98 -58 10
5108 10 -159 -382 -79 30 -6 36 -25 -175 5 -144 -11 -234 -86 -123 16 116 -59 42 42 -161 92 125 -107
5131 -107 81 -164 36 214 -54 127 -19 3 25 82 -108 -287 78 -16 -100 -252 83 -34 -32 120 127 26 -66
5154 -66 42 158 16 46 51 131 -1 -63 -47 -151 57 105 -6 16 -80 98 -184 144 131 -61 91 -222 -162 66
5178 66 124 -26 65 -29 -98 195 135 17 468 33 50 132 95 -245 -28 -106 -210 136 -51 67 -177 -358 205
5201 205 -47 66 -79 -108 145 388 -327 -74 -7 83 130 135 -105 100 131 179 -106 -23 -47 -106 -64 -184 43 229
5225 229 -187 -139 -46 83 59 -378 -138 -207 85 7 -162 -231 274 136 -272 -63 268 -55 30 144 -233 126
5247 126 -176 2 -165 -309 9 -166 -131 -271 -115 154 125 -21 -37 -220 156 63 -122 128 257 46 -112
5268 -112 78 123 198 -49 46 -169 32 -26 -150 -37 105 211 -20 209 26 196 -135 95 -73 -284 -272 -54
5290 -54 252 -140 -121 -191 -181 59 121 -69 145 -209 52 -168 52 24 55 -154 -221 140 24 87 53 202 66
5313 66 -75 66 -85 11 -169 -271 -360 -24 -13 -125 9 70 -76 -77 -222 229 -221 -277 35 -56 23 -96 140
5336 140 150 21 27 123 56 -27 1 -19 78 7 -12 89 102 94 123 -82 -11 -234 18 -7 -128 -81 14 67 -93 91 -183
5363 -183 -110 186 40 -150 131 205 -81 -50 38 -189 -6 74 -109 -141 5 -546 -130 -122 19 -58 -147 -201 -189 -217
5387 -217 8 322 20 -31 166 12 34 -135 -255 -230 -55 310 90 -116 -79 -15 144 -46 297 268 67 183
5409 183 156 -276 143 -179 94 209 -161 258 -58 -130 -172 97 46 -46 -10 318 8 -146 -72 80 -91 374
5431 374 -15 -73 46 -26 217 -3 -250 301 99 -266 -158 -145 -130 227 -43 -210 -210 -90 -136 130 -52 -133 24
5454 24 -114 20 -51 -61 250 60 24 190 -114 -38 -118 -253 189 83 -208 70 9 86 -261 117 145 87 64 -109
5478 -109 240 35 -75 37 -222 296 10 -61 -194 -320 2 17 4 -162 -65 53 -27 6 177 -126 133 -27
5500 -27 -191 -161 -106 8 96 175 60 -63 167 51 75 -60 417 67 237 113 146 57 -43 43 -180 -3 -157
5523 -157 -192 -86 -49 30 47 -234 -39 -216 183 -151 186 134 -166 -98 47 93 -241 100 29 -117 34 -21 -116
5546 -116 295 97 -49 -88 -23 -73 -37 -90 11 260 -230 151 122 49 171 -58 54 -65 -10 80 41 114 133 -232
5570 -232 -140 128 -341 -15 109 -85 64 150 -263 -277 -12 -1 334 -143 178 -26 323 -20 -57 33 -119 84
5592 84 -78 -2 199 91 122 150 -77 -198 126 162 68 -159 -59 107 18 200 -34 218 88 157 190 -190 73
5615 73 -336 -18 71 -34 -106 54 133 37 -22 184 -114 131 126 -212 -96 -129 66 -73 163 171 -194 -332 -26 -160
5639 -160 31 244 -50 78 -308 61 153 -56 -21 108 -115 -287 -83 -90 42 -146 11 92 -55 80 200 -232
5661 -232 -144 75 -65 -340 -127 110 412 161 -138 -42 29 94 -76 10 100 -32 175 -91 59 -89 169 -81
5683 -81 -13 190 -72 277 31 -198 -74 4 17 18 -199 -180 115 63 35 -133 -12 51 -4 -154 143 -78 -34 178
5707 178 69 212 147 116 91 48 -199 115 -164 -64 15 -51 39 235 -143 -89 -203 -10 260 -69 129 4 -279
5730 -279 -182 2 202 139 91 -210 7 98 128 -102 -133 107 -70 107 23 -50 452 -91 -125 11 165 195 80
5753 80 93 29 93 1 88 266 125 -37 35 -227 17 130 179 -77 75 -2 -240 -33 -70 85 -260 233 173 146
5777 146 40 -240 244 167 55 15 370 -99 117 -12 205 60 -135 38 124 118 -22 -37 34 464 210 -305
5799 -305 -116 -201 -221 -122 -151 182 -81 75 169 198 -477 17 105 -25 -84 -215 248 97 -130 -206 80 -46 139
5822 139 153 -159 179 138 56 149 26 -11 -33 -166 -29 -276 38 -70 -140 -123 -130 122 -18 95 30 -5 44 -17 -9
5847 -9 -254 -219 186 187 195 43 212 115 103 38 92 -174 -188 -131 -72 -29 -225 -46 -306 53 47 495 60 -26 46 61 112
5874 112 -123 5 60 236 280 67 270 125 218 -24 24 -219 71 -5 97 -316 -130 9 -7 173 -26 89
5896 89 -42 -148 172 88 32 -94 20 -249 158 32 54 -151 115 196 -49 75 42 -371 227 50 149 99 -2
5919 -2 -98 -50 29 -24 -23 -115 22 -192 -49 24 -85 234 142 -45 -102 -108 70 -56 76 -46 -49 81 114 -55 -5 51
5945 51 -26 -97 69 167 -402 -10 -140 8 143 -21 -196 30 141 96 74 -180 52 -79 115 163 44 265
5967 265 80 143 -27 -37 -39 70 -187 -1 158 -71 -101 65 -125 8 -239 -121 9 6 -28 -97 -198 -113 61
5990 61 -29 52 -239 176 26 88 32 -8 21 125 95 290 -120 21 -87 -75 -147 8 129 199 -57 132 -6 -104
6014 -104 4 44 -198 -94 151 65 -64 47 265 331 54 -14 340 -236 -191 -29 163 126 -97 -35 -36 168 268
6037 268 -7 -50 -104 99 84 -51 46 148 -224 -64 -77 36 -119 -166 80 81 -47 112 -105 27 -85 -95 -281
6060 -281 118 -25 -8 -129 -88 190 -101 -108 33 49 39 97 -224 -104 139 -175 -102 -204 161 -190 118 156 61
6083 61 -195 -229 244 212 122 -72 -250 11 3 -129 -72 75 -31 -266 -55 -249 -20 327 65 -144 118 -85
6105 -85 83 -15 -80 111 97 -158 -79 -24 77 29 119 -47 62 -11 -93 -58 -101 -105 -108 -3 -153 59 58 -28 59 114 -150
6132 -150 69 -176 165 -228 -178 -100 58 41 -113 -56 -7 -22 -79 24 -6 -22 20 -36 -149 16 208 13 18 302
6156 302 -21 -154 -139 19 -83 142 -10 465 104 -124 -188 2 56 -184 309 -71 73 78 77 126 65 -160 118
6179 118 14 -154 178 -91 173 -76 -51 -57 -98 -237 123 -7 -262 32 -38 209 -177 -259 93 53 263 28
6201 28 -166 -127 -128 -187 -45 -70 -15 -78 -7 59 -28 -61 -131 -12 -83 -115 -27 40 -1 54 186 82 -103 9 -67 -38 61
6228 61 -47 -10 -61 22 -83 -72 17 112 125 19 153 43 -112 190 70 42 166 125 -249 245 -161 -140 73 92
6252 92 -176 313 -65 -136 1 -102 87 -50 116 -156 166 221 91 302 -253 -49 132 -3 60 -82 -10 -54
6274 -54 -101 -67 114 176 -257 -137 2 -61 -33 -150 -192 -139 -150 34 62 202 107 68 158 67 167 -97 -136 -243 -38
6299 -38 -59 111 -11 89 -22 -169 76 -112 -146 -69 47 233 54 -58 -71 238 -105 -112 -53 -82 233 53 -162
6322 -162 -66 -77 14 27 37 -181 -118 84 -111 175 1 74 -137 109 68 296 -57 -56 146 -12 26 -47 -2 230
6346 230 55 -32 130 -62 -155 187 -106 -93 52 202 116 7 51 -172 -89 98 154 -21 -83 -45 255 -174 39
6369 39 -90 -102 285 -94 -15 -90 58 -176 -116 -122 -210 -119 54 218 -54 223 -30 -150 194 -181 -198 45 -31 -118
6393 -118 -156 174 140 0 -82 -246 105 377 44 116 47 151 -27 202 98 -129 68 224 53 -186 79 -129
6415 -129 125 230 6 -179 -76 -291 172 261 29 62 53 209 184 11 -332 218 183 188 313 -142 103 -74 -95
6438 -95 180 -16 123 223 -2 5 -47 -16 31 23 67 -86 -3 -115 201 54 167 294 -82 -119 -305 7 -9 27
6462 27 157 203 161 268 81 14 148 -224 78 -102 -204 112 83 -24 173 42 76 29 -33 -33 41 7 28 128
6486 128 50 47 88 -198 -286 55 152 276 -79 238 8 9 115 -171 284 215 220 -7 -75 -23 59 -4 -89 -17 156 197
6512 197 0 106 -142 -309 129 -102 29 14 32 190 99 -87 121 -14 23 12 -100 45 -5 264 -142 22
6534 22 27 74 -126 -134 -7 -71 77 19 -190 31 112 -27 -265 -122 -18 105 26 -79 107 -159 -95 -52 135 0
6558 0 66 -191 115 -97 -181 -44 129 -203 -137 40 -341 71 -208 -164 -399 -262 168 19 -89 -1 -50 27 -15
6581 -15 32 101 -23 288 252 -67 -80 -276 -12 -28 -2 43 -122 -134 4 214 -22 -16 -170 -145 -35 101 -100 -164
6605 -164 7 -3 -155 -212 205 173 181 -86 78 281 -101 -191 -144 -99 -58 249 -234 222 71 217 -38 45 227
6628 227 30 -33 -180 -324 59 64 -35 90 159 79 -146 51 205 -175 161 -152 -12 -46 -29 330 248 -132 -12
6651 -12 8 -87 292 166 79 213 -23 -124 227 -24 -259 -121 35 170 102 105 -74 -100 234 -54 -166 228 -35
6674 -35 -63 185 160 -190 -165 -225 -329 -100 368 -108 53 -253 -138 80 126 181 -82 5 -78 239 -84 121 126 -257
6698 -257 123 -65 -316 17 -193 129 194 -193 21 -49 -14 165 -85 112 -32 -209 65 -17 -17 -106 -47 94 44
6721 44 -182 -2 69 -260 146 -235 -232 -48 -216 9 -83 -18 217 85 129 -156 113 -64 -40 -229 -94 -24 75
6744 75 194 -108 -39 -36 -183 0 444 26 -4 -257 -11 221 190 53 142 -40 138 255 -33 195 9 -59 -63
6767 -63 185 97 -225 -44 -96 -123 -154 -402 -13 279 -132 -43 -201 -408 -158 -131 -222 -106 19 73 -167 -204 118
6790 118 181 179 13 -25 -35 65 -111 128 -181 41 -91 -173 116 -11 -193 -246 -107 -93 -137 210 326 55 193
6813 193 104 -122 8 -134 -105 -223 121 -42 -159 -257 -67 -194 -83 -17 82 -40 15 77 -41 -36 -21 -210 6
6836 6 -21 91 -5 189 -137 -24 258 144 97 -48 -102 195 54 94 61 118 -64 -168 405 -18 -17 -37 -18 171
6860 171 128 330 81 10 -50 -114 -194 103 -68 81 -246 -72 137 154 64 -105 68 193 -28 -116 148 103 113
6883 113 52 -85 -16 64 -102 272 89 -135 208 85 -37 -12 -17 99 -85 -47 -72 48 165 13 -239 29 -32
6906 -32 120 -88 79 89 -155 168 76 -98 145 149 191 87 -122 95 -45 -296 -27 -63 109 -192 278 -101
6928 -101 -78 255 118 220 -30 -31 29 32 67 31 125 181 -55 182 -73 -16 -81 -154 -73 -8 -7 -38 83 66 100 82 -63
6955 -63 -153 -104 -199 -83 271 59 122 51 37 -33 -296 50 -154 342 85 154 -39 -41 247 -219 162 -97 -196 240
6979 240 -215 -29 154 -282 -189 -14 -106 -78 51 43 -129 403 -80 189 -36 6 -140 -221 -24 13 -58 40 101 122
7003 122 126 41 107 15 18 227 -28 -128 -315 -130 -104 -24 -41 -269 -126 -57 5 191 218 -46 22 -79 119 -241 -3
7028 -3 -133 -4 78 26 123 -171 27 -219 -79 32 -124 27 -252 -112 -129 -267 145 51 -42 -260 310 -159 -113
7051 -113 54 -58 14 95 230 62 -15 -65 -76 16 98 111 164 80 22 -12 129 381 -172 281 65 -459 254 -29
7075 -29 102 -160 -64 -41 -412 -151 41 -318 -141 42 -66 47 -16 -83 160 -250 77 201 127 -8 -251 12
7097 12 26 67 -247 -176 -158 -292 -188 383 13 -301 147 -69 125 202 201 -58 -69 80 79 145 -51 202 -191 34
7121 34 -49 41 193 -13 18 186 93 98 61 -346 -122 -26 197 70 -178 18 119 -166 79 24 -42 51 -215 55
7145 55 -202 -266 -152 -58 113 -76 22 206 52 -152 -179 185 -396 -66 -89 118 -91 294 182 42 212 68
7167 68 116 -10 -9 -131 -350 -18 -150 222 -122 209 188 -42 -127 117 78 162 197 114 -178 23 -8 -141 -234 185
7191 185 -128 160 -87 -159 85 225 307 -31 338 283 16 -207 -237 77 57 24 -223 25 -41 -51 -112 111 -54
7214 -54 -168 -303 59 271 230 70 -67 -38 161 96 -151 -271 -191 185 43 45 66 -29 -118 -9 -137 -170 -169 -116 -49
7239 -49 44 -7 -45 -130 129 204 65 159 -138 337 32 133 -9 -184 -83 -5 -138 -35 -12 231 53 56 -119 119
7263 119 13 -274 33 63 243 -188 -42 -78 -54 -71 -174 -81 157 -68 -32 -80 69 158 -20 -131 141 165 -102
7286 -102 -52 231 11 -205 -53 -58 -45 -68 -213 52 -130 -103 -190 105 -40 -81 79 23 57 -280 18 -216 -79
7309 -79 -51 211 49 112 31 220 126 166 124 3 -56 -91 126 126 401 -130 161 117 -253 -318 210 31 -119 101
7333 101 141 -88 24 205 144 -117 110 -168 -18 114 183 22 194 -6 184 118 99 -170 48 -105 -130 -93
7355 -93 -105 -70 -87 144 -128 107 -93 -134 -186 388 325 40 52 -211 218 -48 293 180 -390 161 39 -35 116
7378 116 -6 -112 -93 -6 150 -74 -16 225 -134 134 -70 100 122 -63 29 -37 -69 -162 -114 -65 174 -263 322
7401 322 -95 -5 -220 32 -59 52 -163 344 -107 94 367 20 277 -86 -122 -244 -79 62 -72 -15 -78 -125
7423 -125 160 73 70 8 -21 169 -177 -118 -220 -102 -253 64 -114 -423 278 -35 47 -15 122 -20 -76 -213 -185
7446 -185 149 -131 123 8 -102 16 88 54 151 281 -102 107 -153 129 191 -60 134 213 -94 55 -179 -46
7468 -46 -172 -112 -64 -158 40 99 -170 57 123 149 131 54 49 60 49 -50 -55 -338 9 25 -5 164 -196 233 18 18 -142
7495 -142 -53 -18 -106 0 70 -120 -18 61 48 -18 133 174 -190 152 -105 -66 -43 394 -1 -176 -41 -3 -45 31
7519 31 -56 235 146 108 76 234 -224 155 -176 -62 -34 9 52 52 -37 39 34 3 138 124 -160 -227 -46 44 283 -77
7545 -77 -270 30 0 -40 173 -5 43 93 -57 42 -81 -202 -89 -39 147 -154 -167 147 156 227 -43 -77 -89 44
7569 44 -18 -64 -155 180 -12 -283 -217 52 -75 -12 -293 57 170 -105 42 -159 -127 -1 -33 -219 -162 -132 -136 -420
7593 -420 -199 57 10 -49 21 194 -258 88 -75 63 -209 -149 158 -40 -20 155 199 119 225 307 223 43 98
7616 98 118 -87 97 49 -263 -176 -17 17 87 -8 -160 -309 -19 -44 221 54 -196 267 -84 -70 22 -24 -192 260
7640 260 114 110 -38 -66 18 92 97 -82 113 -267 -102 155 -140 -39 -61 6 141 -15 -215 -5 -232 -59 -149
7663 -149 -135 -180 154 -134 112 204 -103 69 142 15 -291 -32 35 81 267 284 50 -174 -47 69 -156 15
7685 15 19 71 97 -70 160 -150 113 47 -75 306 49 -4 9 284 34 -89 -86 167 -58 -173 28 64 -87 -195
7709 -195 -67 22 86 -274 -47 25 -36 -58 82 233 174 168 -96 314 -40 -292 -125 -272 226 -177 86 79 -120
7732 -120 446 181 195 -218 66 -312 3 -202 -1 263 38 -6 272 94 7 -231 -24 127 -156 156 68
7753 68 -90 -91 -11 -91 0 -26 195 -55 -139 73 433 -147 -185 -2 -57 -45 -247 219 -47 318 -50 164 -32 -31
7777 -31 117 32 -354 171 -114 40 240 22 135 -88 -230 101 151 -236 152 100 -163 -56 81 29 297 -84
7799 -84 48 -30 13 55 -192 62 49 -324 -9 -19 -348 15 87 -55 261 -140 -2 -221 54 129 201 55 -69
7822 -69 41 -228 43 -10 61 -165 174 -222 113 60 -95 223 140 113 -53 -166 72 106 -204 85 112 32 43
7845 43 -139 -137 130 -74 -78 -109 331 71 81 82 88 -77 114 19 -86 33 -61 -50 93 167 106 6 -210 -83 -83 -85 13
7872 13 -93 152 -293 -137 180 166 225 -162 -26 -80 -103 80 -167 204 80 23 -2 -177 34 -188 5 -108
7894 -108 83 -136 81 -33 -249 -154 -38 -84 -60 81 254 95 -94 24 49 -52 143 -111 -42 -32 165 2
7916 2 -247 189 -114 340 -50 80 82 126 56 -107 -55 128 -287 55 -27 -182 -73 49 105 -188 -68 -199 46
7939 46 100 100 -88 110 -85 228 -175 44 -278 -313 -141 -58 46 158 -183 38 -7 96 -127 135 53 -108 175
7962 175 -41 67 109 -28 -240 -109 433 42 -93 3 289 94 26 -276 -3 -75 -76 -96 -56 -51 27 165 -24 117
7986 117 230 11 37 -35 -30 -77 188 -266 -13 -74 8 -180 -248 -115 -124 181 36 148 143 -19 73 -72 -35 -64 82
8011 82 -94 -92 155 -159 174 -40 -20 -29 -53 -63 -160 -101 -51 266 12 -104 124 -205 -116 184 -207 187 105 -145
8035 -145 -31 -130 234 -26 18 -162 -64 220 20 81 -65 29 -231 196 180 -57 -45 -15 86 -151 83 158 49
8058 49 -176 83 -102 -78 81 82 13 21 -120 -47 95 24 118 -137 -277 52 69 -293 196 -33 175 -208 57 -17
8082 -17 -7 -206 163 102 -55 160 144 32 -289 -199 178 -81 275 -26 69 107 -26 6 -104 -157 43 -63 19
8105 19 -169 -46 200 -127 -133 -23 88 -11 -85 -86 -8 -167 -193 -155 -76 225 120 59 282 -214 -113 -154 -95 251 189
8130 189 94 -85 207 93 -14 -102 -90 -230 -211 -57 -53 99 -165 -110 -49 -174 -145 -107 36 11 -78 127 -8 193
8154 193 -111 148 44 64 -63 -59 -19 -63 -149 97 -24 172 183 -266 79 -225 -35 99 4 130 -131 132 -9
8177 -9 145 37 -19 -18 -67 -46 -398 123 -25 -34 -272 -96 -17 83
8191H3
##END NTUPLES=NMR FID
##END=
