##TITLE=1H_CA-8563-1
 CDCl3, 8 sc, 
 10.4.2019
##JCAMPDX= 6.0         $$ Bruker NMR JCAMP-DX V2.0
##DATA TYPE= NMR FID
##DATA CLASS= NTUPLES
##ORIGIN= UXNMR, Bruker Analytische Messtechnik GmbH
##OWNER= root
$$ XWIN-NMR		Version 3.5
$$ Wed Apr 10 14:19:41 2019 Russian Standard Time (UT+4h)  she@DPX200
##.OBSERVE FREQUENCY= 200.1315
##.OBSERVE NUCLEUS= ^1H
##.DELAY= (6, 6)
##.ACQUISITION MODE= SIMULTANEOUS
##.ACQUISITION SCHEME= undefined
##.AVERAGES= 8
##.DIGITISER RES= 18
##SPECTROMETER/DATA SYSTEM= spect
##.PULSE SEQUENCE= zg30
##.SOLVENT NAME= CDCl3
##.SHIFT REFERENCE= (INTERNAL, CDCl3, 0, 15.7039)
##AUDIT TRAIL= $$ (NUMBER, WHEN, WHO, WHERE, WHAT)
$$ ##TITLE= Audit trail, XWIN-NMR		Version 3.5
$$ ##JCAMPDX= 5.01
$$ ##ORIGIN= Bruker BioSpin GmbH
$$ ##OWNER= she
$$ F:/spectra/data/she/nmr/H-F/1/audita.txt
$$ ##AUDIT TRAIL=  $$ (NUMBER, WHEN, WHO, WHERE, WHAT)
(   1,<2019-04-10 14:18:37.06 +0400>,<she>,<DPX200>,
      <created by zg, POWCHK disabled, PULCHK disabled
       configuration hash MD5:
       00 E9 B6 7A A2 85 ED C7 34 08 36 98 17 FE 4E 26
       data hash MD5: 16K
       0A BB 59 0C 76 62 7D 0A 1B 73 96 F8 D7 AB 6D 66>)
$$ ##END=
$$ 
$$ hash MD5
$$ C3 F7 DB 24 E5 AF 78 8A EC B5 B7 C1 78 8F 50 25
##$RELAX= 
##$RELAX= 
##$RELAX= 
##$RELAX= 
##$RELAX= 
##$RELAX= 
$$ Bruker specific parameters
$$ --------------------------
##$DU= <F:/spectra>
##$EXPNO= 1
##$NAME= <H-F>
##$PROCNO= 1
##$TYPE= <nmr>
##$USER= <she>
##$AMP= (0..31)
100 100 100 100 100 100 100 100 100 100 100 100 100 100 100 100 100 100 
100 100 100 100 100 100 100 100 100 100 100 100 100 100 
##$AQSEQ= 0
##$AQ_mod= 1
##$AUNM= <au_zg>
##$AUTOPOS= <>
##$BF1= 200.13
##$BF2= 200.13
##$BF3= 200.13
##$BF4= 200.13
##$BF5= 200.13
##$BF6= 200.13
##$BF7= 200.13
##$BF8= 200.13
##$BYTORDA= 1
##$CFDGTYP= 0
##$CFRGTYP= 5
##$CHEMSTR= <none>
##$CNST= (0..31)
1 1 145 1 1 1 1 1 1 1 1 1 1 1 1 1 1 1 1 1 1 1 1 1 1 1 1 1 1 1 1 1 
##$CPDPRG= <>
##$CPDPRG1= <>
##$CPDPRG2= <>
##$CPDPRG3= <>
##$CPDPRG4= <mlev>
##$CPDPRG5= <mlev>
##$CPDPRG6= <mlev>
##$CPDPRG7= <mlev>
##$CPDPRG8= <mlev>
##$CPDPRGB= <>
##$CPDPRGT= <>
##$D= (0..31)
0 1.2 0 0 0 0 0 0 0 0 0 0.03 0 0 0 0 0 0 0 0 0 0 0 0 0 0 0 0 0 0 0 0 
##$DATE= 1554891516
##$DBL= (0..7)
120 120 120 120 120 120 120 120 
##$DBP= (0..7)
150 150 150 150 150 150 150 150 
##$DBP07= 0
##$DBPNAM0= <>
##$DBPNAM1= <>
##$DBPNAM2= <>
##$DBPNAM3= <>
##$DBPNAM4= <>
##$DBPNAM5= <>
##$DBPNAM6= <>
##$DBPNAM7= <>
##$DBPOAL= (0..7)
0.5 0.5 0.5 0.5 0.5 0.5 0.5 0.5 
##$DBPOFFS= (0..7)
0 0 0 0 0 0 0 0 
##$DE= 6
##$DECBNUC= <off>
##$DECIM= 24
##$DECNUC= <off>
##$DECSTAT= 4
##$DIGMOD= 1
##$DIGTYP= 9
##$DL= (0..7)
0 120 120 120 120 120 120 120 
##$DP= (0..7)
150 150 150 150 150 150 150 150 
##$DP07= 0
##$DPNAME0= <>
##$DPNAME1= <>
##$DPNAME2= <>
##$DPNAME3= <>
##$DPNAME4= <>
##$DPNAME5= <>
##$DPNAME6= <>
##$DPNAME7= <>
##$DPOAL= (0..7)
0.5 0.5 0.5 0.5 0.5 0.5 0.5 0.5 
##$DPOFFS= (0..7)
0 0 0 0 0 0 0 0 
##$DQDMODE= 0
##$DR= 18
##$DS= 0
##$DSLIST= <SSSSSSSSSSSSSSS>
##$DSPFIRM= 0
$$ [...]
##$SUBNAM2= <"">
##$SUBNAM3= <"">
##$SUBNAM4= <"">
##$SUBNAM5= <"">
##$SUBNAM6= <"">
##$SUBNAM7= <"">
##$SUBNAM8= <"">
##$SUBNAM9= <"">
##$SW= 24.9337058887773
##$SWIBOX= (0..15)
0 0 2 0 0 0 0 0 0 0 0 0 0 0 0 0 
##$SW_h= 4990.01996007984
##$TD= 16384
##$TD0= 1
##$TE= 0
##$TE2= 300
##$TE3= 300
##$TEG= 300
##$TL= (0..7)
0 120 120 120 120 120 120 120 
##$TP= (0..7)
150 150 150 150 150 150 150 150 
##$TP07= 0
##$TPNAME0= <>
##$TPNAME1= <>
##$TPNAME2= <>
##$TPNAME3= <>
##$TPNAME4= <>
##$TPNAME5= <>
##$TPNAME6= <>
##$TPNAME7= <>
##$TPOAL= (0..7)
0.5 0.5 0.5 0.5 0.5 0.5 0.5 0.5 
##$TPOFFS= (0..7)
0 0 0 0 0 0 0 0 
##$TUNHIN= 0
##$TUNHOUT= 0
##$TUNXOUT= 0
##$USERA1= <user>
##$USERA2= <user>
##$USERA3= <user>
##$USERA4= <user>
##$USERA5= <user>
##$V9= 5
##$VALIST= <valist>
##$VCLIST= <CCCCCCCCCCCCCCC>
##$VD= 0
##$VDLIST= <DDDDDDDDDDDDDDD>
##$VPLIST= <PPPPPPPPPPPPPPP>
##$VTLIST= <TTTTTTTTTTTTTTT>
##$WBST= 1024
##$WBSW= 4
##$XGAIN= (0..3)
0 0 0 0 
##$XL= 0
##$YL= 0
##$YMAX_a= 182550
##$YMIN_a= -305844
##$ZGOPTNS= <>
##$ZL1= 120
##$ZL2= 120
##$ZL3= 120
##$ZL4= 120
##$ABSF1= 10
##$ABSF2= 0
##$ABSG= 5
##$ABSL= 3
##$ALPHA= 0
##$AQORDER= 0
##$ASSFAC= 0
##$ASSFACI= 0
##$ASSFACX= 0
##$ASSWID= 0
##$AUNMP= <proc_1d>
##$AZFE= 0.1
##$AZFW= 0.1
##$BCFW= 1
##$BC_mod= 2
##$BYTORDP= 1
##$COROFFS= 0
##$CY= 11.3945322036743
##$DATMOD= 1
##$DC= 2
##$DFILT= <>
##$DTYPP= 0
##$F1P= 18.9103706918063
##$F2P= -1.10871071338519
##$FCOR= 0.5
##$FTSIZE= 0
##$FT_mod= 4
##$GAMMA= 1
##$GB= 0.15
##$INTBC= 1
##$INTSCL= 1
##$ISEN= 128
##$LB= 0.24
##$LEV0= 0
##$LPBIN= 0
##$MAXI= 10000
##$MC2= 0
##$MEAN= 0
##$ME_mod= 0
##$MI= 1.114404
##$NCOEF= 0
##$NC_proc= 0
##$NLEV= 6
##$NOISF1= 3.799351
##$NOISF2= 2.8
##$NSP= 1
##$NTH_PI= 0
##$NZP= 0
##$OFFSET= 15.70392
##$PC= 1
##$PHC0= -8861.923
##$PHC1= 26.40026
##$PH_mod= 1
##$PKNL= yes
##$PPARMOD= 0
##$PSCAL= 0
##$PSIGN= 0
##$REVERSE= no
##$SF= 200.130013532006
##$SI= 16384
##$SIGF1= 3
##$SIGF2= 2
##$SINO= 400
##$SIOLD= 16384
##$SREGLST= <1H.CDCl3>
##$SSB= 0
##$STSI= 0
##$STSR= 0
##$SW_p= 3612.71676300578
##$SYMM= 0
##$S_DEV= 0
##$TDeff= 0
##$TDoff= 0
##$TI= <>
##$TILT= no
##$TM1= 0
##$TM2= 0
##$TOPLEV= 0
##$USERP1= <user>
##$USERP2= <user>
##$USERP3= <user>
##$USERP4= <user>
##$USERP5= <user>
##$WDW= 1
##$XDIM= 8192
##$YMAX_p= 0
##$YMIN_p= 0
$$ End of Bruker specific parameters
$$ ---------------------------------
##NTUPLES= NMR FID
##VAR_NAME=  TIME,          FID/REAL,        FID/IMAG
##SYMBOL=    X,             R,               I
##VAR_TYPE=  INDEPENDENT,   DEPENDENT,       DEPENDENT
##VAR_FORM=  AFFN,          ASDF,            ASDF
##VAR_DIM=   8192,          8192,            8192
##UNITS=     SECONDS,       ARBITRARY UNITS, ARBITRARY UNITS
##FACTOR=    0.0002004,     1,               1
##FIRST=     0,             0,               0
##LAST=      1.6414764,     0,               0
##MIN=       0,             -305844,         0
##MAX=       1.6414764,     182550,          0
$$ Real data points
##PAGE= N=1
##DATA TABLE= (X++(R..R)), XYDATA
$$ [...]
2762a289R17L011k988j615L916Q0l763K044K145k997l88K774j381j393K363m44
$$ -1289 -372 2639 -349 -1964 1952 2032 -1731 313 2458 -539 -927 1847 466 -927 1436 992
2778I92j873J416P17j977Q18K164k880m35K908p38k952K689J496m066Q94L226
$$ 992 -881 535 1252 -725 93 2257 -623 -1058 1850 1112 -1840 849 2345 -1721 -827 2399
2794B399k104k237L675Jl480J499K237k401p01K758j334j766J768M2j915J778
$$ 2399 295 -1942 1733 1734 -1746 -247 1990 -411 -1112 1646 312 -1454 314 356 -1559 219
2810B19J091k365K11K145j959j186K979n47l115K464J884l657O4L818j974k738
$$ 219 1310 -1055 -844 1301 -658 -1844 1135 588 -2527 -63 1821 -1836 -1772 2046 72 -2666
2826b666L010Q84l301O95K959j991j419K231n20j763K141K49j934J219J015k672
$$ -2666 344 1228 -2073 -1378 1581 -410 -1829 402 -118 -1881 260 509 -1425 -206 809 -1863
2842a863P72K533j901j740L394j61l744J963K958l596p23L466r54l082K432J874
$$ -1863 -1091 1442 -459 -2199 1195 1034 -2710 -747 2211 -1385 -2108 1358 404 -2678 -246 1628
2858A628l103N84K196j532j256K158m27j453J549N73k343J647J220k177k50L321
$$ 1628 -1475 -891 1305 -227 -1483 675 248 -1205 344 917 -1426 221 1441 -736 -986 2335
2874B335k413k229L646N59l815J214L433k974j661L290J49l253K131J700k968
$$ 2335 -78 -2307 1339 1898 -1917 -703 2730 -244 -1905 1385 1534 -1719 412 2112 -856
2889h56k24K437q72j220K009p36j445J926j6j950J691J257k796k53L483j766l041
$$ -856 -1080 1357 485 -735 1274 538 -907 1019 1003 -947 744 2001 -795 -1048 2435 669 -2372
2906b372L533R71l470O96L369k729j891L298N67l447J248K302k333m30K060o55
$$ -2372 1161 2132 -1338 -642 2727 -2 -1893 1405 1972 -1475 -227 2075 -258 -688 1372 717
2922G17j688J732l24j142J350M03k237R68J828k642m12L225r16l155K321K304
$$ 717 -971 761 437 -705 645 1048 -1189 -221 1607 -1035 -1447 1778 862 -2293 28 2332
2938B332m301K62M013k024k645L011Q05l170O12K686k068q32J936n20j521J884
$$ 2332 -1969 -1707 2306 282 -2363 648 1453 -1717 -1105 1581 -487 -1319 617 97 -1424 460
2954D60k65j364J311N76k523J241K146k476j311L495o20l208K375J996l458l80
$$ 460 195 -1169 142 718 -1805 -564 1582 -894 -2205 1290 670 -2538 -163 1833 -1625 -2005
2970b005L943j865k682K460J448k530L31J985j382j333K698r15j280J550j33j675
$$ -2005 1938 73 -2609 -149 1299 -1231 -900 1085 -297 -1630 1068 153 -1127 423 290 -1385
2986a385J208J231k593Q00K624k140j791L433m9l585J830L216l581j283L927j054
$$ -1385 -177 1054 -1539 -739 1885 -255 -2046 1387 1338 -2247 -417 2799 -782 -2065 1862 808
3002H08l084K582J862k993l79K532j239r24J756k31j124J209K9j903J274J767
$$ 808 -2276 306 2168 -825 -1204 1328 89 -835 921 690 -434 775 804 -1099 175 1942
3018A942k549l44K994k117j892L252J014l972J237L337k769k127M056m02l074
$$ 1942 -607 -951 2043 -74 -1966 1286 2300 -1672 -435 2902 133 -1994 2062 1660 -1414
3033a414J661J955k553l54K479j396j030J662l10j461J359N81k263J341J566k612
$$ -1414 247 2202 -351 -705 1774 378 -652 1010 700 -761 598 1179 -1084 257 1823 -789
3049g89l02L265j383k670K914R26l728O16L498k116j982L080N7l171J030K275
$$ -789 -1091 2174 791 -1879 1035 1961 -1767 -1151 2347 231 -1751 1329 1386 -1785 -755 1520
3065A520j919j141K610j111j170J415K08j509J380P62k511R42K002k520m61K396
$$ 1520 -399 -1540 1070 -41 -1211 204 412 -1097 283 1045 -1466 -524 1478 -1042 -1503 893
3081H93l21k842J914K497m134N47L361j667k869K787Q09k606N73K521k366m82
$$ 893 572 -2270 -356 2141 -1993 -1446 1915 248 -2621 166 975 -1631 -1058 1463 -903 -1385
3097a385J912p17j308J831J16k195J702N64j836L92K872k480j488L019p7l061
$$ -1385 527 -190 -1498 333 449 -1746 -44 520 -1316 -924 1948 -532 -2020 999 922 -2139
3113b139J747K519l014q23L320j275k656K798Q52k509N65J859j367j142K174n83
$$ -2139 -392 2127 -887 -1710 1610 335 -2321 477 1329 -1180 -615 1244 -123 -1265 909 326
3129C26j845J769N63k154J199J723k346j07K511j448j989L193K88l038R45L112
$$ 326 -1519 250 813 -1341 -142 1581 -765 -872 1639 191 -1798 1395 1683 -1355 -410 2702
3145B702k844j537L358l80k630J820J136k379J77K341j412j181K072o18j580J716
$$ 2702 -142 -1679 1679 1299 -1331 489 1625 -754 -577 1764 352 -829 1243 625 -955 761
3161G61L05k112J683J177k252m33K539j147k170K589J366l716N85K777k047j280
$$ 761 1066 -1046 637 1814 -438 -871 1668 521 -1649 940 2306 -1410 -825 1952 -95 -1375
3177a375K899k2k810J256J343j877k0J791j108r41J579m29j638J886J098k921
$$ -1375 1524 1502 -1308 -52 1291 -586 -606 1185 77 -864 715 286 -1352 534 1632 -1289
3193a289R36K024k341p84K934q78k788K360J475l207K15L112j815j812K459L28
$$ -1289 -353 1671 -670 -1454 1480 602 -2186 174 1649 -1558 -1343 1769 -46 -1858 601 929
3209I29k506J108J896k294l03K108j120j248J745R8k260J651J187k406N70K570
$$ 929 -1577 -469 1427 -867 -1170 938 -182 -1430 315 413 -1847 -196 991 -1415 -845 1725
3225A725k177j173K528m82k384J566K090k662l71K546j179j983K282P21k349O85
$$ 1725 -452 -1625 903 421 -1963 -397 1693 -969 -1340 1206 27 -1956 326 1047 -1302 -617
3241f17J923k093k40K037j041j371K284k6k136J177J236k187K01K309j360k219
$$ -617 1306 -787 -1027 1010 -31 -1402 882 856 -1280 -103 1133 -1054 -853 1456 96 -2123
3257b123L028N08k881J286K358k640r08K765o65k099J995R14k490O64J501j342
$$ -2123 905 1413 -1468 -182 2176 -464 -1372 1393 728 -1371 624 1538 -952 -288 1213 -129
3273a29n33J889p57j471K035K71k540J317J972k397m41K490j260j941K379R69
$$ -129 -662 1227 470 -1001 1034 1305 -1235 82 2054 -343 -784 1706 446 -1495 884 1853
3289A853k735N19K239j712j400K397k7j947R96J028j871M45J645j461m36J838
$$ 1853 -882 -363 1876 164 -1236 1161 1134 -813 183 1211 -660 -215 1430 -31 -467 1371
3305A371j202j199J807N90k489J078J768j996r09K752p20k121J576J479k981N24
$$ 1371 169 -1030 777 1367 -1122 -44 1724 -272 -1181 1571 851 -1270 306 1785 -1196 -672
3321f72K153j305j484J901Pj750Q14J506j556j1J570j762n36J681l56j632J718
$$ -672 1481 176 -1308 593 600 -1150 -336 1170 -386 -397 1173 -589 -1125 556 200 -1432 286
3338B86O59k619J034K495k258j127K396m9k652J338K051k384o62K399r03j726
$$ 286 945 -1674 -640 1855 -403 -1530 866 817 -1835 -497 1554 -830 -1492 907 4 -1722
3354a722J563Q93j865Q25J048j575J9J586j045p72J825l64j860J329J053k131
$$ -1722 -159 734 -1131 -306 742 -833 -814 772 -273 -1045 780 416 -1444 -115 938 -1193
3370a193N25J983j477j921K433Q69k901Q06K411k073p95K289m87j721J711O55
$$ -1193 -668 1315 -162 -2083 350 1219 -1682 -876 1535 -538 -1333 956 469 -1252 459 1114
3386A114k144N08J557j481L2J488j264o71J807n6k335J757J610k815j33K642j153
$$ 1114 -1030 -522 1035 -446 -414 1074 -190 -861 946 890 -1445 312 1922 -893 -1026 1616 463
3403D63j790K071R88k918P74K493j945j146K654l98k228J049J268j850J70J538
$$ 463 -1327 744 1732 -1186 -412 2081 136 -1010 1644 1246 -982 67 1335 -515 -345 1193
3419A193j042o74J854j201r86K068n9k112J261J441k412m33K605m66k373J865
$$ 1193 151 -523 1331 130 -856 1212 1153 -959 302 1743 -669 -1102 1503 1037 -1336 529
3435E29J397k811J92K187j233j395K123j73j793J239P87j570L32Q30q90n52J923
$$ 529 1926 -885 -693 1494 261 -1134 989 816 -977 262 1049 -521 -189 641 -249 -801 1122
3452A122r58j412J632M03j917P67K088k318j182L091n61k613J636J713k291l97
$$ 1122 164 -1248 384 787 -1130 -363 1725 -593 -1775 1316 755 -1858 -222 1491 -800 -1197
3468a197K256p74j625J249Q11j719Q72P02r85k81J297r70m97J612m75j792J425
$$ -1197 1059 285 -1340 -91 720 -999 -127 575 -410 -691 606 -364 -861 751 276 -1516 -91
3485i1J083k671Q02K158j378j558K187M92k632J283J635k457k47K320n69j670
$$ -91 992 -1679 -877 1281 -97 -1655 532 1024 -1608 -325 1310 -1147 -1394 926 357 -1313
3501a313J462O90j614P06N88j234J74J733j303j118K143o66j868J695J277k139
$$ -1313 149 839 -775 -69 519 -715 -541 1192 -111 -1229 914 248 -1620 75 1352 -787
3517g87K6K306j366j974K305P59k311N72J902j794q56K142n9j680J218P93j964
$$ -787 -761 1545 179 -1795 510 1269 -1042 -470 1432 -362 -1218 924 865 -815 403 1196 -768
3534g68P46R78j102J17J087j082r84K048l02j802J422J423k364l53K468r34k011
$$ -768 -22 956 -146 -29 1058 -24 -1008 1040 738 -1064 358 1781 -583 -936 1532 598 -1413
3551a413K101Q69k514L51K297j695j043J751L89k066J131J215j821K94J360j358
$$ -1413 688 1557 -957 -606 1691 -4 -1047 704 1093 -973 158 1373 -448 -154 1206 -152
3567a52n04J592r40p81J527K94k237J198J707k207m64K149l59k196J359J199k019
$$ -152 -656 936 -4 -785 742 1036 -1201 -3 1704 -503 -967 1182 823 -1373 -14 1185 -834
3584h34J83J774j217j142J634J6j444O86J211j621k1J882j537o67J825m57j274
$$ -834 -651 1123 -94 -1236 398 414 -1030 -344 867 -754 -775 1107 -430 -1097 728 271 -1003
3601a003J254O13k187N53J720j247j096K138j8k221J034J694j936o47J998n37
$$ -1003 251 864 -1323 -770 950 -297 -1393 745 727 -1494 -460 1234 -702 -1349 649 112
3617A12j735J812K13j484R01P34j152k17J517j141n92J579n22j396J252R65j504
$$ 112 -1623 189 402 -1082 -181 553 -599 -816 701 -440 -1032 547 25 -1371 -119 846 -658
3634f58l58K320j388j298J874O49k226R33J571k034l96J764o01j229J245Q97j893
$$ -658 -1016 1304 -84 -1382 492 1141 -1085 -152 1419 -615 -1011 753 152 -1077 168 1065 -828
3651h28P82Q37j218l7J687j145q39J586j82j490J290Q35k076k8K101r94j577J845
$$ -828 -46 791 -427 -464 1223 78 -761 825 643 -847 443 1278 -798 -826 1275 281 -1296 549
3669E49O99k013K92J878j652m73J518l2j359Q14P41j566M83J350j377l40J310
$$ 549 1248 -765 -473 1405 -247 -720 798 766 -593 221 962 -604 -121 1229 -148 -488 822
3686H22p70j152J806L79k041J162J389j968p83K551p78j576J227J155k090N3K084
$$ 822 52 -1100 706 1085 -956 206 1595 -373 -1156 1395 617 -959 268 1423 -667 -614 1470
3703A470j511q01J657l18j422J003P86j472M93Q76j339k67J588n39j355J378P94
$$ 1470 -41 -842 815 497 -925 78 864 -608 -115 761 -578 -845 743 204 -1151 227 1021
3720A021k295P30J700j546j022K348m36k000J270J169j484j92J206k67j401J582
$$ 1021 -1274 -544 1156 -390 -1412 936 500 -1500 -230 939 -545 -737 469 202 -1199 383
3736C83k06j166R46N32j258K42J289j178n26J557o01j632J850Q74k272L75J809
$$ 383 177 -989 -43 489 -769 -527 762 -416 -942 615 14 -1618 232 1106 -1166 -791 1018
3753A018j059j502J821L51j768R45J172j756o5J656p85r50J099N84j461P62Q09
$$ 1018 -41 -1543 278 629 -1139 -194 978 -778 -843 813 28 -922 177 761 -700 62 871
3770H71j480n2J735j252q12J874k81j816J295J337k170k78K205p96j462J720P31
$$ 871 -609 -661 1074 -178 -990 884 603 -1213 82 1419 -751 -1029 1176 380 -1082 638 1369
3787A369k013N79J190j514m07J716l43j242J248L20j452N52Q58r33Q4R59j091
$$ 1369 -644 -65 1125 -389 -796 920 577 -665 583 903 -549 3 861 -72 12 971 -120
3804a20q08J851j64j973J239J475j804n20K114q61j677J807O15k104O26J279r47
$$ -120 -928 923 759 -1214 25 1500 -304 -824 1290 429 -1248 559 1174 -930 -304 975 28
3821B8n70J348m47j048R39N36j491O65Q61j294m48J957q10j064J542Q4j933P56
$$ 28 -542 806 359 -689 250 786 -705 -40 821 -473 -921 1036 226 -838 704 788 -1145 -389
3839c89J533j303q31J825l6k210J342Q97j698j49J844p23q64J145n02p96P82L87
$$ -389 1144 -159 -990 835 799 -1411 -69 828 -870 -1019 825 102 -762 383 -119 -915 -133 254
3857B54j135P30P29j174k77J633q55j275J294R25j850l4J942j302j166K068j73
$$ 254 -881 -151 578 -596 -873 760 -95 -1370 -76 849 -1001 -1035 907 -395 -1561 507 334
3874C34j525P39J208j081j97J054o23p57J143j52j055J070L31j360M06J488j310
$$ 334 -1191 -452 756 -325 -522 532 -91 -848 295 143 -912 158 489 -871 -465 1023 -287
3891b87q74J689j48j778J492R71j923K27J586p90j351J734L07j713Q16J158j364
$$ -287 -1161 528 380 -1398 94 1065 -858 -631 955 165 -1186 548 855 -858 -42 1116 -248
3908b48m69J559m92o73O42L61j103O94M26j350N60J306j228r47K003j95j866J316
$$ -248 -717 842 350 -323 319 680 -423 271 697 -653 -93 1213 -15 -962 1041 846 -1020 296
3926B96J126j880l31K021p23j599J468O99j754K89J673j097n31J302o90q82J055
$$ 296 1422 -458 -789 1232 509 -1090 378 1077 -677 -388 1285 188 -343 959 269 -613 442
3943D42k20n34Q65O97j459l24J853j300j324K190j14j736O34J580j430o12J783
$$ 442 222 -312 553 1250 -209 -533 1320 20 -1304 886 772 -964 -330 1250 -180 -792 991
3960I91n00j481J162P96j576q4J661r91q84J624m72j222J389J0r63K91J103j307
$$ 991 491 -990 172 968 -608 -692 969 -22 -906 718 246 -976 413 423 -540 -249 854 -453
3978d53j97J729r29j623J686M49j631K94J523j146q85J654J1j596O62J366j256
$$ -453 -650 1079 150 -1473 213 662 -969 -675 848 -298 -1183 471 482 -1114 -452 914 -342
3995c42k49J188q60o53J220J37j282Q27L28j253N24J296j114o41J661p44j411
$$ -342 -591 597 -263 -916 304 441 -841 -14 314 -939 -415 881 -233 -874 787 43 -1368
4012a368J263J151j823K84J715j638j046K012J14j676Q22J027j095l52J516p92
$$ -1368 -105 1046 -777 -493 1222 -416 -1462 550 664 -1012 -190 837 -258 -610 906 114
4028A14j004J627j85j177O53M93j376M03J374j556m38K072n46j256J249Q56j909
$$ 114 -890 737 552 -625 28 521 -855 -452 922 -634 -1072 1000 454 -802 447 1303 -606
4045f06LJ594q86r33J029P54j907O91J314j402J49J241q22j032J384j24j160J043
$$ -606 -603 991 105 -828 201 955 -952 -261 1053 -349 -200 1041 219 -813 571 447 -713 330
4063C30L83j190L50J135q07q55J512l81j221Q90J314j769l32J559o91j343J422
$$ 330 713 -477 -127 1008 201 -654 858 477 -744 146 1460 -309 -641 918 227 -1116 306
4080C06P54j577M63J091r50m95J034n49o75J016K07j326O87R72j343j40J686j189
$$ 306 1060 -517 -54 1037 87 -408 626 77 -598 418 625 -701 -14 958 -385 -525 1161 -28
4098b8r86J448L67j566J81J535j250o53J633n45j088J064J028j932K60J252q35
$$ -28 -1014 434 801 -765 -584 951 -299 -952 681 136 -952 112 1140 -792 -532 720 -115
4115a15l56Q92j03j360R78M82j346O08R12r24n81J471l13j779J739M10j827O02
$$ -115 -471 421 318 -1042 -64 418 -928 -320 592 -332 -913 558 245 -1534 205 615 -1212 -610
4133f10J460j116n77J422k23j462R50Q72j480o7J422r87m02J139m52q95J215M08
$$ -610 850 -266 -843 579 356 -1106 -156 716 -764 -831 591 -396 -798 341 -111 -1006 209 617
4151F17j302M03J223j497l56J522k67j341J011J021k002L52J709j024j288J479
$$ 617 -685 -282 941 -556 -912 610 343 -998 13 1034 -968 -616 1093 69 -1219 260
4167B60O40j567L57J173j514J55J394r78o75J208j44r28R04N90j025l76J599q25
$$ 260 900 -667 -310 863 -651 -496 898 -80 -755 453 309 -619 285 875 -150 -526 1073 248
4185B48r58J346J7j617J231N83j088o31J826o65r79J111N39j607N75J239j331
$$ 248 -710 636 653 -964 267 850 -238 -869 957 292 -687 424 963 -644 -69 1170 -161
4202a61k53J365l55j305P87K25p61O16O91j480M89J261q71j435J996K86k081M03
$$ -161 -414 951 596 -709 78 303 -458 158 849 -631 -142 1119 248 -1187 809 1095 -986 -583
4220e83J712j271q75J533j50j485J054O59j113J12J369j080m79J236p01o28Q90
$$ -583 1129 -142 -1017 516 366 -1119 -65 594 -519 -407 962 -118 -597 639 -62 -690 200
4237B00M30j599Q44J250j521m10J739p89j598J629L81j407N14J509j364j044J846
$$ 200 630 -969 -125 1125 -396 -806 933 144 -1454 175 556 -851 -337 1172 -192 -1236 610
4254F10j62j531R77O02j181L64Q77j317L3J067m04q21J338J56j475L41J128j199
$$ 610 448 -1083 -106 496 -685 -321 556 -761 -728 339 -65 -886 452 608 -867 -526 602 -597
4272e97m05J650o45j175J415N58j711R1J678r63p68J384k43p72M54Q83j376K00
$$ -597 -1002 648 3 -1172 243 801 -910 -819 859 -104 -872 512 269 -503 -49 834 -542 -342
4290c42J012p58q44J738m09j603J409M53j388O32J170j250o79J846k19j630P31
$$ -342 670 -88 -932 806 397 -1206 203 656 -732 -100 1070 -180 -859 987 768 -862 -131
4307a31R62j289q7J438n42j031J161K50j446P70R06j402J75J029o66r49J356J31
$$ -131 831 -458 -545 893 351 -680 481 731 -715 55 961 -441 -266 763 97 -852 504 635
4325F35j127Q70O13j680L15J088p08j183J928j23j145K40J269j316k68J468n59
$$ 635 -492 378 991 -689 -374 714 6 -1177 751 628 -517 -277 992 -324 -592 876 317
4342C17o94O72N70j338N04N98n03k60P60m45n20O48Q8j470R03Q55j250l29J931
$$ 317 -377 295 865 -473 31 629 126 -134 626 181 -339 309 397 -1073 -170 685 -565 -894 1037
4361A037j104j088J677L04j662K71J684j584k75J374m30j229R65N78j312M80R95
$$ 1037 -67 -1155 522 826 -836 -565 1119 -465 -740 634 204 -1025 -60 518 -794 -314 681
4378F81j183L4J052o96q32J002L83j427O88J142j208j87J011j53j376J319N01
$$ 681 -502 -468 584 -112 -944 58 441 -986 -298 844 -364 -551 460 307 -1069 250 751
4395G51j779N95J203r93o13J225J17j560J244P42j515L94P48o95o41J143l51r08
$$ 751 -1028 -433 770 -223 -836 389 506 -1054 190 932 -583 -189 559 -136 -777 366 15 -893
4413h93J079K13j350O60R42q15p19J518m21j438J396Q45j517P2J056m83p90J251
$$ -893 186 399 -951 -291 651 -164 -883 635 214 -1224 172 1017 -500 -428 628 145 -645 606
4431F06J75j361P64L38r49n1J385j348q4J143j13j078J146M05j656L15J407r63
$$ 606 781 -580 184 522 -427 -478 907 -441 -525 618 505 -573 573 978 -678 -363 1044 81
4449H1o78J247l1j480J005J130j623K03J373r87q53J057J64j171P54R18j617K56
$$ 81 -597 650 619 -861 144 1274 -349 -146 1227 240 -613 444 608 -563 191 1109 -508 -252
4467b52J258j100p35J522l38r02O18R61j715L09J284q76p25R50N56j580P50J203
$$ -252 1006 -94 -829 693 355 -547 71 1032 -683 -374 910 34 -691 259 815 -765 -15 1188
4485A188j408l53J280o56q83J019J80r21O12M13r16q3J149p72o65J120J51j323
$$ 1188 -220 -573 707 51 -832 187 367 -554 58 471 -445 -528 621 -151 -816 304 455 -868
4503h68O66R42j324j6J432m56j315J035M53j083K11J124j039q24J640k03j115
$$ -868 -202 740 -584 -600 832 376 -939 96 549 -534 -323 801 -238 -1062 578 375 -740
4520g40O06M55r68J66J075r19j96J022k88j062Q21L36j318Q80J136j420l38J364
$$ -740 -134 321 -647 -481 594 -325 -521 501 213 -849 -28 308 -1010 -130 1006 -414 -752 612
4538F12l58j574J524N89j650J05J618r33q87J345r1q66P75M72j164L53N00n88
$$ 612 254 -1320 204 793 -857 -752 866 -67 -954 391 300 -566 209 681 -483 -130 370 -218
4556b18j85J063k98q67M40M44j271O53J014p88q66J469J82j547R85R01j668k38
$$ -218 -403 660 362 -505 -65 379 -892 -239 775 -13 -879 590 772 -775 210 1111 -557 -795
4574g95J864r68n37P58K22j190Q30M79q98J82R12q22n32J143k19j157Q58P06j653
$$ -795 1069 101 -436 322 544 -646 184 663 -235 -53 859 37 -495 648 429 -728 130 836 -817
4593h17O4J637q35r15J645J99j909Q45J105j250l0Q40k46j243J084M09j317R46
$$ -817 -753 884 49 -866 779 978 -931 -86 1019 -231 -261 579 333 -910 174 583 -734 212
4611B12P24j235K7J026p82q80J171J26j369J043P76j514J84J168m63j021J080
$$ 212 936 -299 -272 754 -28 -908 263 389 -980 63 839 -675 -491 677 214 -807 273
4628B73L15j348L92J134j214j9J131m88j356J218M55j466Q72N00j075J4J259n46
$$ 273 588 -760 -368 766 -448 -467 664 176 -1180 38 493 -973 -101 399 -676 -662 597 51
4646E1q00R06J0j060P08R97p72j025J697q00j067J175O55j698O98J086j013n35
$$ 51 -749 157 167 -893 -185 812 40 -985 712 -88 -1155 20 675 -1023 -325 761 -252 -787
4664g87J288k85q97Q33N26j703Q59Q38r78l72J342l49j290J229L90j218N02J032
$$ -787 501 216 -681 152 678 -1025 -166 672 -306 -678 664 315 -975 254 644 -574 -72 960
4682I60j192l99J144M9j400J118M13j197J13J075n80n03R66k97p08P44N75j226
$$ 960 -232 -631 513 562 -838 280 693 -504 -391 684 104 -399 567 270 -438 306 881 -345
4700c45L45J059j418k57J093j28j243J213L19j136K60J241j099p45J575k31j003
$$ -345 0 1059 -359 -616 477 349 -894 319 638 -498 -238 1003 -96 -841 734 503 -500
4717e00Q20M75j091j40J480p46l78O40N9r48P28N99j363K85R29n26q09J203j82
$$ -500 320 795 -296 -436 1044 298 -80 560 619 -329 399 998 -365 -80 849 323 -486 717 535
4736E35r60O71R09j425l62J682j355l92J378k11j137M41J082j170n0P51l18p11
$$ 535 -425 246 1155 -270 -632 1050 -305 -697 681 470 -667 -226 856 -314 -364 387 69 -642
4754f42R13L25j125N71L86j112K71J103o90p74J269l52j109R37R19j524l75J471
$$ -642 271 596 -529 42 428 -684 -413 690 0 -774 495 143 -966 -29 890 -634 -1009 462
4772D62k22j327J184K80j091M19P75q42l21J123l23r22R47M64j075k01J363p79
$$ 462 240 -1087 97 377 -714 -295 480 -362 -683 440 117 -805 142 606 -469 -670 693 -86
4790h6l37P46k30j114J371m4j055N23Q41q74n01J180m74r22J289N3o24P8R32r21
$$ -86 -423 323 93 -1021 350 306 -749 -226 615 -259 -760 420 -54 -976 313 366 -258 -180 752 -169
4810a69k69J112n74q02O79O39j034M22O92q47m87J539l76j301J202M18j016m9
$$ -169 -438 674 100 -702 -23 616 -418 4 696 -151 -638 901 525 -776 426 844 -172 -221
4828b21Q91o24n87J228k28q57N51L04r71L76Q31n02n33O87L37j163N93J80n73
$$ -221 670 46 -541 687 459 -398 153 457 -514 -138 693 191 -342 345 682 -481 112 292 -281
4847b81P4J121j187k45J402m64p56L75R19r96m77J416o15r88J117L81j264L97
$$ -281 -207 914 -273 -518 884 420 -336 39 958 -38 -515 901 286 -702 415 796 -468 -71
4865g1Q02r71k15J023k98j018R20K4p68P70M77j254L68R89j111j37Q82k18q00
$$ -71 731 -240 -455 568 270 -748 172 196 -572 198 675 -579 -211 778 -333 -470 412 194 -606
4884f06P63M16q20k30J192p54n82J053M7q16R3O34n97k31J133p29n47J014p0p88
$$ -606 157 573 -247 -477 715 -39 -621 432 479 -337 -244 390 -207 -438 695 -34 -581 433 363 -425
4904d25K78R68j109l04J285q75q15R71M62j349N27J388j365p8J051p34p50R92
$$ -425 -147 821 -288 -592 693 -182 -997 -26 436 -913 -386 1002 -363 -441 610 -124 -874 118
4922A18pq40K86J117p69m89J154m29o69P08O9r61N29R02j243R1J212p56q01J101
$$ 118 111 -729 -443 674 -95 -584 570 141 -528 180 249 -712 -183 719 -524 -433 779 23 -778 323
4942C23Q08j799M30J021r23m18J117l21r92R66M65r42j01R16o90k48R13l37o35
$$ 323 1131 -668 -238 783 -140 -558 559 238 -754 212 677 -265 -366 550 -140 -388 525 188 -447
4961d47O76K76r42N5Q64r50O7R89l83q70P64O08j263M57Q71p36m52J179k38j270
$$ -447 229 505 -437 -382 482 -468 -401 588 205 -665 99 707 -556 -99 772 36 -416 763 525 -745
4981g45O50R23j340K97R92n42n14O73M3r39P20O29j205N0Q38q17j52Q49r9r78
$$ -745 -95 828 -512 -215 777 235 -279 394 437 -502 218 847 -358 -308 530 -287 -439 410 311 -667
5001f67R43N29j344L18R43r46l75Q34N9r26K98J101j203NJ079o07n77O45M5q14
$$ -667 276 805 -539 -221 722 -224 -599 235 294 -632 -334 767 -436 -431 648 41 -536 109 154 -660
5021f60N58N81j137L01N72j98p06R58r3q97N39P67r31l45J114k31p76N79N27j160
$$ -660 -102 479 -658 -357 215 17 -689 269 176 -721 -182 585 -346 -691 423 192 -584 -5 522 -638
5041f38L72O87o51l77R53l88l33L40N47q79J64O92r96lJ236n77q69J076P1j216
$$ -638 -266 421 -230 -607 346 -42 -375 -35 512 -367 -203 489 -507 -510 726 149 -720 356 427 -789
5061g89N20R74r53k41J017k08o82N28L34j001K62R68r22J1O26j43p79O59K94q84
$$ -789 -269 705 -248 -489 528 320 -362 166 500 -501 -239 729 -193 -182 444 301 -478 181 475 -409
5081d09J50J013p36j12Q91p15n68J046N7j268N26P51p41k52R18k71o93M71M75
$$ -409 -259 754 18 -94 797 82 -486 560 617 -651 -125 626 -115 -367 551 280 -413 58 533
5100E33p11p9Q50p66p6J044n16p24M58M62p76L82N95r65o4J051n34n23P43L73
$$ 533 -178 -257 593 -173 -249 795 279 -445 13 475 -301 81 676 -289 -353 698 164 -359 384 757
5120G57r71J78O82n06q01J066Oj257P10M87m54k31O38m14j43M97J54j128R06L59
$$ 757 -214 -36 646 140 -661 405 411 -846 -136 351 -103 -334 304 -110 -253 244 398 -730 176 535
5140E35o26k45Q52n40o75R00L32j220N31P66j231j15J121j63p76J007m8q39J39
$$ 535 -91 -336 516 -24 -699 201 533 -687 -156 610 -621 -736 385 222 -554 453 405 -434 -295
5159b95Q96j005J07M65k01q25J069j58p30Q92J42p22K4R10q09n38J181r0o19L15
$$ -295 601 -404 -297 168 -33 -858 211 53 -677 215 357 -365 -341 569 -240 -778 403 313 -306 9
5179IJ56l09n69J197n08o27Q68Qo38J43P85q32j81O59J4p23Q40l9r32Q11K83p05
$$ 9 165 -144 -713 484 -24 -651 217 225 -413 -270 515 -317 -498 161 175 -548 292 253 -679 132 415 -290
5201b90m38J330m55m43M73K68o69R1R08p73n97J049j29p63P08K48o40j67R80p79
$$ -290 -728 602 147 -296 177 445 -224 -133 775 2 -595 454 325 -438 270 518 -122 -289 691 -88
5221h8k12P55k97r55L79P99p26L64M84o95k5P22j2p42N98L8q51R9R78p19m97J074
$$ -88 -300 455 158 -797 -418 381 -345 19 503 -192 -217 505 493 -249 349 387 -464 -365 613 -106 -603 471
5243D71k48p74P93K52q43L6Q74m73n44R41q4j225J085L19p66r7M26l54m23Q45
$$ 471 223 -551 242 494 -349 -313 561 88 -456 485 401 -824 261 580 -186 -283 143 -211 -634 211
5263B11j35k21J46P06j376K65J033l32r21O99K84q99M38N30q00O7J067j108j57
$$ 211 76 -145 1 707 -669 -404 629 297 -624 75 359 -540 -102 428 -372 -305 762 -346 -503
5282e03Q29j46r15P46K83q68J58Q31m74p65J259k77r36O25R03j060l11J364p68
$$ -503 326 180 -735 11 294 -574 -416 415 -59 -824 435 158 -778 -153 750 -310 -621 743 -25
5301b5m17P64j00r67P30L90q93K17O83m43n63Q04rn00j84J152r16k89J017n48
$$ -25 -442 322 222 -745 -15 375 -518 -301 382 -61 -624 180 171 -329 -513 639 -277 -566 451 -97
5321i7m52O97J51j090P38Q29r30m16R76m17m07N00K55m71Q3O35r56j21J095o36
$$ -97 -549 148 299 -791 -53 776 -154 -570 406 -11 -418 82 337 -134 -51 584 -372 -493 602 -34
5341c4l74Q13K15r95K14Q49q76l18J078l59n42L37O94j252N06O59o14n93J009
$$ -34 -408 405 620 -375 -161 688 -188 -506 572 213 -329 8 702 -550 -44 615 1 -592 417
5360D17m53p40N27M28n03J46N95m30r9O09k57o43P27l82k34Q9J001r87l25Q18
$$ 417 -36 -776 -249 179 -324 -178 417 -13 -112 497 240 -403 324 -58 -292 -203 798 -189 -514 304
5380C04R6j008J001J35p54p6Q19o67j94Q17l24p32N80O12o04l36Q89n89m50J096
$$ 304 400 -608 393 528 -226 -302 517 -150 -344 473 149 -583 -3 609 5 -331 558 -31 -481 615
5400F15l03q06N25K81q04P1Q38r80n13J457k98r81O16M73o75N7N91n8r18Q14M03
$$ 615 312 -494 31 312 -492 -421 417 -563 -1076 381 83 -898 -282 191 -484 -427 164 106 -812 2 405
5421D05q77M18M53q41K49L28l20l59P82N6j136P55N81q22J48O99m73n55N83J03
$$ 405 -472 -54 399 -442 -193 135 -185 -544 238 294 -842 -87 494 -328 -180 519 46 -509 74 177
5441A77q33N20O68p66M6O70j21q24O84j39m10K83K52m88j07R90m95n14N39Pn27
$$ 177 -656 -136 532 -234 -188 482 361 -463 221 82 -328 -45 207 -281 -388 602 107 -407 132 139 -388
5462c88L43N66o67J21M35j65q82J001R4p71K01P21p58k97J201o39n42Q24j11n74
$$ -388 -45 521 -146 -25 410 245 -637 364 458 -313 -112 609 -149 -446 755 116 -426 398 287 -287
5482b87K49L88k54r4K15k46l75O55q9p89M39P44n73m87J209m31r51Q08M85j158
$$ -287 -38 350 96 2 217 -29 -404 251 162 -627 -188 556 -17 -504 705 274 -677 131 616 -542
5502e42N59N66l35m19N80k8p65M01N93j032L89M71k86k93Q53m83r06P32L19p10
$$ -542 17 583 248 -171 409 381 -384 17 610 -422 -33 438 152 -141 712 229 -677 55 374 -336
5522c36M3R42p75m40Q86q3q16P72L31r26K9R33o69n54R02J45j152P14L99n30k30
$$ -336 -293 649 -126 -566 320 237 -579 193 524 -402 -373 560 -109 -663 239 384 -768 -54 345 -185 -415
5543d15J137j035k63R84k56p74O16N34r64O8R53n63o54Q36K56p89n1Q86p82K44
$$ -415 722 -313 -576 408 152 -622 -6 528 -436 -368 585 22 -632 204 460 -329 -380 506 -276 -32
5563c2K69m41n53Q48L29j081Q2P94n85L72N53o48k86M31J20p89M76N23p40k26
$$ -32 237 -204 -757 91 420 -661 -579 215 -370 2 555 -93 -379 52 172 -617 -141 382 -358 -584
5583e84J267p35l86O61L30j140O56K43m07k57M63K09o63P18Qp33J97P53j091j28
$$ -584 683 -52 -438 223 553 -587 69 312 -95 -352 111 320 -343 375 383 -350 -153 600 -491 -619
5603f19J111m89l02O79p7n60K47N06o63k63Q73Nq02O69m7o04K97K36j95k49R91
$$ -619 492 3 -299 380 303 -257 -10 496 -167 -430 443 448 -354 315 268 -336 -39 197 2 -247 744
5624G44o16l86L94j16j72j23Q00m13m74Q08k1n70K68K41j151Q27K08j18n03P36
$$ 744 128 -258 136 20 -152 -275 525 112 -362 446 425 -145 123 364 -787 40 248 130 -373 363
5644C63R0j056P85K14o26O4N95o55j14P34l32m07K50K82m78K21K90p2p63R77l
$$ 363 453 -603 182 396 -230 -166 429 -226 -340 394 62 -345 -95 187 -291 -70 220 148 -615 362 359
5665C59j183J049J63o94P7O61o38m94J068j83o31K34N41o61k72J192o88O0K07
$$ 359 -824 225 388 -306 -229 432 -206 -700 368 185 -446 -212 329 -332 -604 588 -100 -40 167
5684A67J5p90N34O30q00J09J87k12k47J021k88o34J14N94j079L94Q91p10o28J096
$$ 167 182 -608 -74 556 -244 -135 52 -160 -407 614 326 -308 -194 400 -679 -285 606 -104 -732 364
5704C64k9o39M22N61j021r5P57l31n90O63O4o65M39L92l98mK04m9m78Q22k92m47
$$ 364 335 -304 118 679 -342 -437 320 -11 -601 62 126 -539 -100 292 -106 -110 94 45 -433 389 97 -350
5726c50K20O41n21l27J160q57l78N04L33r36N29O69o76n84J179p08j62L24M75
$$ -350 -130 511 -10 -337 823 -34 -412 92 425 -511 18 687 11 -573 606 -102 -264 60 535
5745E35o92J44N66q53j03R51l1j196Q89L62q50J61O34o90l71J103k94m15L23K17
$$ 535 -157 -13 553 -300 -403 548 517 -679 210 572 -278 -117 517 -173 -544 559 265 -150 173 390
5765C90j000L96M83n71J02N10m10m24N39L42l79k24Q16o67n9P33o20l90O90K85
$$ 390 -610 -214 269 -302 -200 310 -100 -524 15 357 -22 -246 570 -97 -156 577 -43 -433 257 542
5785E42j159N98N94n12o22R17j7r60O10L95q46j7R92o08r3N51p4q29O23L40m90
$$ 542 -617 -19 575 63 -559 358 341 -619 -9 386 -460 -477 515 -93 -186 365 291 -538 85 425 -65
5806f5k79L87m09m3O25Qn91M59L33q63O11J48m09n09J081k86p02N61L54n29j90
$$ -65 -344 43 -366 -409 216 224 -367 92 425 -438 173 321 -88 -597 484 198 -504 57 411 -118 -308
5827c08O49m61m16P47K0p57M95N55j128M75O38n85n80P35J74p68N07P99j283K79
$$ -308 341 -120 -536 211 231 -526 -31 524 -604 -129 509 -76 -656 79 253 -515 -8 791 -492 -213
5847b13Q28k25p71N48J43n82M0O71r69M39N83j51q96O05P0m23L22M08k69k3K89
$$ -213 615 390 -381 167 310 -272 -232 439 -530 -91 492 341 -555 50 120 -303 19 427 158 135 424
5868D24l51k39M96J36r29M44L86l12j07O07n16k18N48J10o83M79J10p12n0O42
$$ 424 73 -166 330 466 -463 -19 367 55 -52 555 39 -179 369 479 -204 275 385 -327 -377 265
5888B65k16l90Q07k33l91qP42p09k30R40o52o1L29L25j092M98O22j009j58J065
$$ 265 49 -341 466 233 -158 -166 576 -133 -363 577 -75 -136 193 518 -574 -76 546 -463 -621 444
5908D44j15p46K68L76n41L17M82m70m26O79k15n49O09J8o99K81N67m16r0N34M4
$$ 444 329 -417 -149 227 -314 3 485 15 -411 268 53 -496 113 131 -568 -287 280 -136 -226 308 352
5929C52r77P66L09o72p3N30o78j41R17k10n75N43K56o11j38Q30m93p2K67L16p23
$$ 352 -625 141 450 -222 -295 235 -443 -584 333 123 -452 91 347 -264 -402 428 -65 -137 130 446 -277
5950b77L61K66o56M27K57p12l83R74j0o12M35L65j009L33P22l72o51Q11J41p06
$$ -277 84 350 -306 121 378 -334 -717 257 247 -365 70 435 -574 -241 481 109 -542 269 410 -296
5970b96J34P54r12Q3O49o90j53M25L62q11N48K54p59K07Q79n93m81O09J32o96
$$ -296 -162 592 -320 -237 412 -278 -431 -6 356 -455 93 347 -412 -205 674 81 -400 209 341 -355
5990c55M24L56n20J53N65o74l56P38J57o90L23L59m49m38Q78k04o56O60j45l20
$$ -355 69 425 -95 58 623 -51 -407 331 488 -202 121 480 31 -407 471 267 -389 271 126 -194
6010a94R8P82p67k53O68O3q38M95L16n52PP10o31J29N85j16q66L78M05p26M11
$$ -194 -96 686 -81 -334 334 397 -441 54 370 -182 -175 535 -96 33 618 502 -364 14 419 -307 104
6031A04M15p93J1L28J00n37P27k29l81L48K60m30m8O29n99l18O60Q3n70n6O84
$$ 104 519 -274 -263 65 165 -372 355 126 -255 93 353 -77 -125 504 -95 -413 247 330 -240 -296 388
6052C88o62l04J187q34j44N37L23q42RO89m17k68N14j19m52P28j48p56J56N22
$$ 388 -274 -578 609 -225 -369 168 491 -351 -342 347 -70 -338 176 57 -395 333 185 -571 -415 107
6072A07k82l49Q53k92k86L57Ln55M25N30r23K79J50J50k49q5L99n28L72K48l77
$$ 107 -175 -524 329 37 -249 108 111 -444 -19 511 -412 -133 17 167 -82 -167 232 -296 76 324 -53
6093e3n97O15K07m43L14L30r64J97Q47o98k06Q34jj049Q17N00p94l97P92m73j94
$$ -53 -650 -35 172 -271 43 373 -591 -394 453 -245 -451 383 382 -667 150 650 -144 -541 251 -222 -416
6114d16P26M6o92M84R6n55M8Q09n12k20O52l15n21K46O30o07m0N25k60k68M14
$$ -416 310 356 -336 148 244 -311 -263 546 34 -186 466 151 -370 -124 506 -101 -141 384 124 -144 270
6135B70K28r00K81L83p43L32M69k20m41N39J13o90J13Q22m97k99O57L5o98N83
$$ 270 498 -402 -121 262 -481 -149 320 100 -341 198 311 -379 -266 556 59 -240 417 452 -246 337
6155C37k14n38K78N54o15j30O37l58j56L51Q2n11J37N43k56l65L23J80l20O3J39
$$ 337 123 -415 -137 417 -198 -328 309 -49 -205 146 228 -283 -146 397 141 -224 99 279 -41 22 161
6176A61k64q3N12m87k5M57l48j36M49j4l19Q0J49k1m41Q01k39q66P56L7m86K93
$$ 161 -103 -186 326 -161 -186 271 -77 -213 236 222 -97 -17 132 111 -330 471 232 -634 122 159 -327 -34
6198c4M06o64m6P18k89m79J73L08k32j16P63p75j86P57l49l25M76O9k67k9M78
$$ -34 372 -292 -338 380 91 -388 -215 93 -139 -255 508 -267 -453 304 -45 -370 106 175 -92 -121 357
6219C57n20m58P21k5p19N09M14o35M30L50k17p41P26Q6o76N93J58p76K55K92j88
$$ 357 -163 -621 100 75 -644 -135 279 -356 74 424 207 -534 192 278 -398 195 353 -423 -168 124 -64
6240f4l51O76r8o20O92K71p97R1O60r15j40R89j81m60K42N32r17L4Q81o73j78
$$ -64 -415 261 163 -457 235 506 -291 -200 460 -455 -595 394 213 -247 -5 527 -390 -356 525 -148 -326
6261c26P02J5o82J93M47l08q8N28n27j95O26l83j91M67n1m21K8P08n43o49P53
$$ -326 376 391 -291 -98 349 41 -47 481 -46 -241 385 2 -189 278 227 -194 -166 542 -1 -650 103
6282A03K6o46L11M95k06mJ95l79l27P34M0q90M87O51o73k71N45l07j70O12k43
$$ 103 129 -517 -206 289 83 79 274 -105 -432 302 342 -548 -61 590 -83 -354 191 -116 -286 326 83
6303H3n13N41L68p28J85J83p8n71P71P1p77K43M50l77k36O77l19l81N46O7n84
$$ 83 -430 111 479 -249 -64 119 41 -530 241 312 -465 -222 228 -149 -385 292 -27 -408 138 205 -379
6324c79K15L43k71n81J044k58l71K88J04l20J22O48p62j41P23m08m06L31N18j022
$$ -379 -164 179 -92 -673 371 113 -258 30 134 -186 -64 584 -178 -319 404 -4 -410 -79 439 -583
6344e83O61L92p89j88J001l78m77K25N47q80P38K42o97rO57m05l41M15K51n48
$$ -583 78 470 -319 -507 494 116 -361 -136 411 -469 269 511 -186 -195 462 57 -284 131 382 -166
6364a66N4O16m23l53O40l47l29L93L35l85n17R49o14N7L93R6o26L42K24m80j09
$$ -166 -112 504 81 -272 368 21 -308 85 420 35 -482 467 -147 -90 303 399 -227 115 339 -141 -250
6385b50P72p37Q0R9J54m62P6J060j240L01K90k25j87P81k83l50j7N99q35R8P61
$$ -250 522 -215 -135 -36 118 -344 -268 792 -448 -147 143 -82 -269 512 229 -121 -138 461 -374 -276 485
6406D85m0n91J88J86l13J79R0m58j39O03j12m66N16K07o63J02L41k70K4M97j30
$$ 485 445 -146 42 228 -85 94 184 -274 -413 190 78 -388 128 335 -328 -226 115 -155 -131 366 236
6427B36o42M65O2m35K39O80o15k75O68n07k18N03J88o08J91K45l79Q6M43j00l57
$$ 236 -406 59 121 -314 -75 605 -10 -285 383 -124 -342 161 349 -259 -68 177 -202 -116 327 227 -130
6448a30K57k00k51L89o9k88%O07j60p78M43M60p57N88J10l33l1L62O0o21M0M37
$$ -130 127 -73 -324 65 -4 -292 -292 315 155 -623 -180 280 -477 111 221 -112 -143 219 279 -342 -302 135
6470A35n46N99J52n92q6M05ln14M48K25q29L52L64j73l33N13j72m65N93L01m81
$$ 135 -411 188 340 -252 -338 67 64 -450 -2 223 -606 -254 110 -63 -396 117 -55 -520 73 374 -107
6491a07k40O37m00k23M74J75j031O90K58k09r1N13k18m86N55J4p73M07M91k56
$$ -107 -347 290 -110 -333 141 316 -715 -25 233 24 -67 446 228 -258 297 311 -462 -55 436 180
6511A80m72O88l49l82M01P3m60K88L75l46J19L52p00o7N01Q6m10k4K26m28M27
$$ 180 -292 396 47 -335 66 139 -321 -33 342 -4 115 467 -233 -300 201 287 -123 -147 79 -349 78
6532G8l3K51m17N10Kk77j02L69o49j20Q22j04o87P59j34o00M37L34o54k17P93
$$ 78 45 296 -121 389 391 114 12 381 -268 -388 434 330 -357 402 268 -332 105 439 -215 -432 361
6553C61m46n13O41J31m88K23J11l7l07N59l01k69M07J3l64J77J70k07l9K42P6
$$ 361 -85 -598 43 174 -314 -91 20 -17 -324 235 -66 -335 72 85 -279 -102 68 -139 -178 64 140
6574A40m92K13K01l06j05N47l00l7L99l17l93R78k52m96j93P45o69j23R20k45
$$ 140 -352 -139 62 -244 -349 198 -102 -139 260 -57 -450 528 276 -220 -413 332 -337 -460 460 215
6594B15l93L92j10l07J75L04o6l53L40L2n84L65m1k00P0N22o42q7K20M05l29j58
$$ 215 -178 214 104 -203 -28 276 210 -143 197 229 -355 10 -31 -231 -161 361 -281 -368 -148 257 -72 -230
6616b30M95o01K94L41k89j67P47q19o4K60K0p2L38L1m0m12L26j0o43K45N40l39
$$ -230 265 -336 -42 299 10 -157 590 -229 -293 -33 -13 -85 253 284 244 -168 158 148 -495 -250 290 -49
6638d9K5L69l73k14K73K45l80N1K92n51K59O72o42R5J87K0n18L74L37q10N03K40
$$ -49 -24 345 -28 -242 31 276 -104 -53 239 -312 -53 619 -23 72 259 279 -239 135 472 -338 165 405
6660D05j89n23L64K04n54K84L85o03J36N43l10l27K24K34l86L42L0k49m03N81
$$ 405 216 -307 57 261 -293 -9 376 -227 -91 452 142 -185 39 273 -113 229 259 10 -393 188
6680A88q3o08N38L21l76J16J50k93j59O09k91k14J03J06m37J44O58p11o1M78j47
$$ 188 105 -503 35 356 -20 96 246 -47 -206 403 112 -102 1 107 -330 -186 472 -239 -300 178 31
6701C1k24K72J47m51j61N78n93p5R40m63j92M20k60k87L44L66n10j87L35Kj22
$$ 31 -193 79 226 -225 -386 192 -401 -476 464 1 -191 229 -31 -318 26 392 -118 -305 30 32 -90
6722i0J01R5m69K33L79n68j41P33j62m93L46R6k25j38R30o20k99O35L4p83O67
$$ -90 11 106 -363 -130 249 -319 -460 273 111 -382 -36 60 -165 -303 627 7 -292 343 377 -406 261
6743B61j65k75j9O74o74m6N09j54k90J84M26n74k73N74J27m48O19o20m5j56N08
$$ 261 96 -179 -198 476 -198 -244 265 111 -179 5 431 -143 -416 158 285 -163 456 -164 -209 -365 143
6764A43l17j44O34k27p7j46K04m05k7M17l06M4K05o7l06O59q4m79M75J05m57j32
$$ 143 -174 -318 316 89 12 -134 70 -335 -362 55 -251 -207 -2 -69 -375 284 200 -279 196 301 -156 -288
6786b88O51o58K32J64Ol88L73L53q22M25J69k54l8K74Q4o19O5O78q13K50K42m00
$$ -288 363 -295 -63 101 107 -281 92 445 -377 48 217 -37 -75 199 283 -336 -271 407 -406 -156 86 -314
6808c14L30j04L24q08M82N74l83k35L14n5l86M97n1o07N59J75m39j51M51j08k87
$$ -314 16 -88 236 -572 -90 484 101 -134 180 125 -261 236 185 -422 137 312 -127 -278 173 65 -222
6829b22L82R0p54L47J62k45o3L78j88j27K06K21m03L1N54l74k07K38j01l02N43
$$ -222 160 250 -504 -157 5 -240 -303 75 -113 -240 -34 187 -216 -185 369 -5 -212 26 -75 -377 166
6850A66j37k37J64L65m90m83P78l33j57N19l47k81L10L78l26m6J22J23o97N41
$$ 166 29 -208 -44 321 -169 -652 126 -207 -364 155 -192 -473 -163 215 -111 -157 -35 88 -609 -68
6870f8L83l49J51k75J76j30M21j34k17r7K98k73m0O48p93K85L46l63k46L88J18
$$ -68 315 -34 117 -158 18 -112 309 175 -42 -139 159 -114 -154 494 -299 -14 332 -31 -277 111 229
6891B29n48J59K08r5m09M73J12m25K83M54p13J66M38n03k75O93j34m81J81M82
$$ 229 -319 -160 48 -47 -456 17 129 -296 -13 441 -272 -106 332 -171 -446 247 113 -368 -187 295
6911B95l14j73N87n59k71Q02L70q36K9J98m78J41N43k46l80L57L7k02M56j34n27
$$ 295 -19 -192 395 -164 -435 367 737 -99 -70 128 -350 -209 334 88 -292 65 102 -100 356 222 -305
6932c05J78J33k08J00K91K1m88K83L05k94l89O18m83J7K64K07o48K63L55n19J58
$$ -305 -127 6 -202 -102 189 210 -278 5 310 16 -373 245 -238 -221 43 250 -398 -135 220 -299 -141
6953a41L80k94l74L81K3l35K57P20p71o9M07j68p2J65Q6m76L07L88p79Q5O80n11
$$ -141 239 -55 -429 -48 -25 -360 -103 617 -154 -223 184 16 -56 109 195 -281 26 414 -365 -280 400 -111
6975a11l00P23l55k33L6O18m65k72L53l08M05j40N61o32p4L75j09k34J76k1n87
$$ -111 -411 312 -43 -276 -240 378 -87 -359 -6 -314 91 -49 512 -120 -194 181 72 -162 14 -7 -594
6996e94N22J13l23j78L74k04n0K52K54l31K38j21j33L4J49j37j13J64J03l74M56
$$ -594 -72 41 -282 -460 -86 -290 -340 -88 166 -165 73 -48 -181 -147 2 -135 -248 -84 19 -355 101
7017A01j21j67L41K08n46Q9J17J59l64N9K30l14j99N57j57k30L97k58r3L90J91
$$ 101 -20 -187 154 362 -184 -95 22 181 -183 -124 106 -208 -407 150 -7 -237 160 -98 -191 199 390
7038C90n26k7P94n41j30L08J07J4n06L95o79N04J59n7n30N10J20m62L92o0j16
$$ 390 -136 -163 631 90 -40 268 375 389 -117 278 -401 103 262 205 -325 185 305 -157 235 175 59
7059E9n7N70l09o17Q28k70l95K98L21q39N15L91o58k63O88k40m60O87L59q75K90
$$ 59 2 572 263 -354 474 204 -191 107 428 -411 104 495 -163 -426 262 22 -438 249 608 -267 23
7080B3J58k00j56L68j76k48L53j55j0o1L57l09n8K09K8n8k03L00n0l18O41n27
$$ 23 181 -19 -175 193 17 -231 122 -33 -43 -104 253 -56 -114 95 123 65 -138 162 112 -206 435 -92
7102i2k12M80j93l26K87M09n27j56N35k65m55N28m8k87K12R7l60M39J93l76k98
$$ -92 -304 176 -17 -343 -56 353 -174 -330 205 -60 -515 13 -35 -322 -110 -13 -373 66 259 -117 -415
7123d15L76Q3j36J17J9j32l9J62K7p34P95q9m06N84j38ll40J95J32k57M16r2j00
$$ -415 -39 44 -92 25 44 -88 -127 35 62 -672 123 34 -372 212 74 71 -269 -74 58 -199 217 125 25
7146B5L03q6k83j20K27L13n55K03J96l64k32P89n65R5L28q2n34N99j63K2n9L68
$$ 25 328 242 -41 -161 66 379 -176 27 223 -141 -373 416 -149 -54 274 192 -342 257 94 116 57 425
7168D25m90j11K46n4K8K08l74K12j25K96k93k24M71k58j38L8L74o73K92J72P8
$$ 425 -65 -176 70 16 44 252 -122 90 -35 261 -32 -256 215 -43 -181 -143 231 -442 -150 22 100
7189A00j56M1J38l33L90qK4j98K15k26l06N77q7m31M23j85k21MN20j96l26L37
$$ 100 -56 -15 123 -210 180 172 196 -2 213 -13 -319 258 171 -260 163 -22 -243 -239 281 85 -241 96
7211I6J22k11p6O1k67K00M45k26m60L8L06p8Q3j1n4r1M81m09k61M32k9k15j33
$$ 96 218 7 -69 -8 -275 -75 370 144 -316 -278 28 -50 33 22 -32 -123 358 -51 -312 120 91 -124 -257
7234b57M09k78n21O77J35l91K45J05m40K33J88j19r5L8Jj60L74k12k80P8P62p55
$$ -257 152 -126 -647 30 165 -226 19 124 -316 -83 105 -14 -109 -71 -70 -230 144 -68 -348 -270 492 -263
7256b63J16J04J32j88L84j44j33p7O04m11k23J61m6l64M57K08m72M5K49Kk94Q7
$$ -263 -147 -43 89 -99 285 141 8 -69 535 124 -99 62 16 -348 109 317 -155 -110 139 141 -153 -66
7278f6R8l65M57J31o45M17Ll69M9P05j07p99O86l0k51l2N21k18m99M21k3m74N61
$$ -66 32 -333 124 255 -390 27 30 -339 -290 415 308 -491 195 165 -86 -118 403 185 -314 107 84 -390 171
7301A71J59m45K70M3k65M5J24Kk65L21Pp05K77L46l29K2K06N6Kj34J67m22K03
$$ 171 330 -115 155 198 -67 -22 102 104 -161 160 167 -538 -261 85 -244 -222 -16 40 42 -92 75 -347 -144
7324a44J59k08j89N45k09P4l03M82l91M90J49o25l0K80n0k54j06N73o95R5Q17
$$ -144 15 -193 -382 163 -46 28 -275 207 -184 306 455 -170 -200 80 30 -224 -330 243 -452 -357 460
7345D60l31m26N05r7k74L40nl54R7L30l91j34M62Oo43M04J28m35J64L69n05j3
$$ 460 129 -297 208 111 -163 177 172 -182 -85 245 -146 -280 182 188 -455 -51 77 -358 -194 175 -330 -343
7367c43J11R4qk04L98k64J33N18m09j90K01k09J20j6M98n35K1K83p4l16n6M84
$$ -343 -232 -138 -146 -350 48 -216 -83 435 26 -164 37 -172 -52 -68 430 -105 -84 199 125 -191 -247 237
7389B37n80L50K21l39j08M81l17l11O25k18k00J40L70l19o9J99N4l11j5M29l67
$$ 237 -343 7 228 -111 -219 262 -55 -366 259 41 -159 -19 351 32 -37 162 216 -95 -110 319 -48
7410d8k09M08k29q1N67l78l75L06K45l13K35R9k20l00O85k17k31R7n3k65K54J87
$$ -48 -257 151 -78 -159 408 30 -345 -39 206 -107 128 227 7 -293 392 175 -56 41 -12 -277 -23 164
7432A64l71K08o7K15j66J7K07j23l80O40m97m29Q35P3o41M11k53q4J77K17j53
$$ 164 -207 1 -66 149 -17 0 207 84 -296 344 -153 -582 253 326 -315 96 -157 -241 -64 153 0
7453@l5L77k09m52M57K47p64M34K35k46l89O45%m96N04k13j91j74M57k78J29p2
$$ 0 -35 342 133 -319 138 385 -379 55 290 44 -345 300 300 -196 308 95 -96 -270 187 -91 38 -34
7475c4K21m02M12Om32Q4L67m40K1M63j11p7j60J34l04R5K98m82K81J96k60l21
$$ -34 187 -215 197 203 -229 -145 222 -218 -197 266 155 78 -82 52 -252 -157 141 -341 -60 136 -124 -445
7497d45O89k40k82M42J40l15k47N53r8k88j06N18n25n8R0L8k98K93J21j17j88
$$ -445 244 4 -278 164 304 -11 -258 295 197 -91 -197 321 -204 -262 -172 -134 -432 -139 -18 -135 -323
7518c23K91j58L79n8k52j84M90k26n41Q27j3j80k87M66q8m76N62l15Q4J93P2l49
$$ -323 -32 -190 189 131 -121 -305 185 -41 -582 245 232 52 -235 231 143 -333 229 -86 -2 191 263 -86
7540h6k60N39K2l19L24J90o15N94k72n2k26K14J2m62O83k00m22K44M40l02j58
$$ -86 -346 193 215 -104 220 410 -205 389 117 65 -161 53 65 -397 286 86 -336 -92 348 46 -112
7561a12L5J58m21M42L11p49O3K18j9p3L90J31m71L70j54J57n15O54j28n65L52
$$ -112 -77 81 -340 102 413 -336 -273 -55 -74 -147 243 374 -97 273 119 276 -239 415 287 -278 74
7582G4l26J5N52K30m86K9J59o8o41P05K03o31L87K49r13N87J45n45N0K48o8J44
$$ 74 -252 -237 315 545 59 88 247 179 -462 243 446 -185 202 451 -462 125 270 -275 -225 23 -45 99
7604I9k70K19j40O3K05k84j74L59R5l65K36K70k13k01mJ05l79O15j78k31J8M91
$$ 99 -171 48 -92 -29 176 -108 -282 77 172 -193 43 313 100 -101 -105 0 -379 236 58 -173 -155 336
7626C36m84j46M53k02k62P11l88k75M33n1J5k20J91J82n01J10K85n46J21M07k56
$$ 336 -148 -294 159 -43 -305 406 18 -257 176 125 140 -80 111 293 -208 -98 187 -359 -238 169 -87
7647h7l8M05l37p7K94q4l07K01K46k47m0L27m28K57j67R2n11L13N9k8J37J05j92
$$ -87 -125 280 -57 -134 160 76 -231 -30 216 -31 -71 256 -172 85 -82 10 -501 -188 -129 -157 -20 85 -107
7670a07p5M19l19p4K27J39m38J60J37Q3k69J61L6l37M59Mk14j18J47o1O8j42L75
$$ -107 -182 237 -82 -156 71 210 -228 -68 69 152 -117 44 80 -257 202 206 -8 -126 21 -40 28 -114 261
7693B61l73K38K66p07J22N47n78KK80J41r6r8K28j42k30O35k8q35P84p33L42J76
$$ 261 -112 126 392 -315 -193 354 -224 -222 58 199 103 5 233 91 -139 496 468 -367 417 -316 26 202
7715B02j3j63j34L10j24j09J9n9K04k96L58k52j76L67K15l19K25m29N4LL60k37
$$ 202 189 26 -108 202 78 -31 -12 -71 133 -163 195 -57 -233 134 349 30 255 -174 -120 -117 243 6
7737Fo7J80j7j09k14M08j61r8M61m06k38N54k95j10j79M19k60J27M70l81k65J35
$$ 6 -61 119 102 -7 -221 187 26 -72 389 -17 -255 299 4 -106 -285 134 -126 1 471 90 -175 -40
7759d0l8n9J56L36l83l54K94M59m39J61r9o1j81J83j75N5L27j69k39L73l8j50
$$ -40 -78 -137 19 355 -28 -382 -88 371 -68 93 -6 -67 -248 -65 -240 -185 142 -27 -266 107 69 -81
7781h1L70k00j66k1J53j70K28p9J96k65K2o9J27Q6L22m84L5K69O8m00J41K82m44
$$ -81 289 89 -77 -98 55 -115 113 34 230 -35 -13 -82 45 131 453 -31 4 273 341 -59 82 364 -80
7804h0l06M26Mk17J69L8k96L98p3P4k74O00o31p2K70k13J49L9K93m69J09O3j57
$$ -80 -386 40 44 -173 -4 34 -262 136 63 137 -137 463 -168 -240 30 -183 -34 5 298 -171 -62 1 -156
7827a56K6j2K12j73J31K20m11P4L31M4n18K88j02J40k38M84l38k72N51n44K53
$$ -156 -130 -142 70 -103 28 248 -163 -89 242 286 -232 56 -46 94 -144 340 2 -270 281 -263 -10
7848a0k54J40l7J62L76p07J70L59L6n04J69L36l96k6K10j37O9N3Pj74K32M7m11
$$ -10 -264 -124 -161 1 377 -330 -160 199 235 -269 -100 236 -160 -186 24 -113 -44 9 16 -158 74 121 -290
7871b90N1L59j16l55L65P3j71J04K13m83N40j51k59J5l1K55m83M79kj95K10k61
$$ -290 -239 120 4 -351 14 87 -84 20 233 -250 290 139 -120 -105 -136 119 -364 115 113 -82 128 -133
7893a33q1J29K63l5k14r2K44j99L3K62k25J09R7k09k39L47K4k96K61j0J03m40
$$ -133 -214 -85 178 143 -71 -163 81 -118 -85 177 -48 61 158 -51 -290 57 81 -215 46 36 139 -301
7915c01M21r1J58r5L12m42k75J96K71m46J13Q3PJ41J7k04q6L33l1m30M65K71n38
$$ -301 120 29 187 92 404 -38 -313 -117 154 -292 -179 -96 -89 52 69 -135 -221 112 81 -349 116 387 -151
7938a51j1L34k6p1L03j09m43LL50k43l9L26k33j31M38m51J28K71k31J02j71m3
$$ -151 -162 172 146 75 378 269 -174 -171 179 -64 -103 223 -10 -141 297 -154 -26 245 14 116 -55 -98
7960i8K55l33M38j07k22p2N05j05q1r3j16j9J43M05l67L06l22l9J35p8k61m1L13
$$ -98 157 -176 262 155 -67 -139 366 261 180 87 -29 -48 95 500 133 439 117 78 213 135 -126 -167 146
7983A46N1j38n7J48k18J96K8m80o3M23P2n55K35K39J8j54M01n54J57M90l05m12
$$ 146 197 59 2 150 -68 128 156 -324 -387 36 108 -447 -212 27 45 -109 292 -262 -105 385 80 -332
8005c32M75K42m34j19L54l16n6K45k27J37q4M4N2K18k00j90j9L14k27j16K26K26
$$ -332 143 385 -49 -168 186 -130 -186 59 -168 -31 -115 -71 -19 199 -1 -191 -210 104 -123 -239 -13 213
8027B13k01L1N6m86J31R9J21p9J50L14o05K57M1R2l69L35n5k93L52L25m18k39
$$ 213 12 43 99 -387 -256 -157 -36 -115 35 349 -256 1 42 134 -235 100 45 -248 104 429 11 -228
8049b28P02k49m66J65J39j43R2M3k60J26K34k94j05L80j93j27N7M10o63K17J74
$$ -228 474 225 -241 -76 63 -80 12 55 -205 -79 155 -139 -244 136 -57 -184 -127 283 -380 -163 11
8070A1j81m1L84n8j76J49L40o88J11L65j52P5j14O9j98p3J83j90N1L41k21j27
$$ 11 -170 -211 173 115 -61 88 428 -260 -149 216 64 139 25 94 -104 -177 6 -184 -133 208 -13 -140
8092a40R5K80k78K18L57o92K91j29R7j22K02n0l14J72J00J90l52K33r6j78J92
$$ -140 -45 235 -43 175 532 -160 131 2 99 -23 179 129 -185 -13 87 277 -75 158 62 -116 76
8113G6p1J85m27N74n10L53r2k8p2K97j95j26J24K56k97l79R24p21P3l1L82m38
$$ 76 5 190 -237 337 -173 180 88 60 -12 285 90 -36 88 344 47 -332 592 -129 -56 -87 295 -143
8135a43J58j39K03m09L04L47o84JO16l02L0J19k83J95j14K73p51N48J49l87KM08
$$ -143 15 -124 79 -330 -26 321 -363 -362 254 -48 -18 101 -182 13 -101 172 -579 -31 118 -269 -267 141
8157A41r9q2J45J07l00J40K24k51Rj89J94l10J97J12l68J84L74n65M10j19K89
$$ 141 42 -40 105 212 -88 52 276 25 34 -155 39 -271 -74 38 -330 -146 228 -337 73 -46 243
8178B43j61L3j78j47k91P14k87L6K09K2l22K03j22
$$ 243 82 115 -63 -210 -501 213 -74 -38 171 193 -129 74 -48
8191d8
$$ Imaginary data points
##PAGE= N=2
##DATA TABLE= (X++(I..I)), XYDATA
0@%%%%%%%Qj6J6j6J6j9K7l2L9m7N3o1P2q7J02j18J34j53J75j99K27k58K90l24
$$ 0 0 0 0 0 0 0 0 8 -8 8 -8 8 -11 16 -16 23 -24 29 -32 40 -47 55 -63 71 -82 93 -106 121 -137 153 -171
31a71L62m05M53n07N65o26O96p74Q56r46J047j159J284j423J580j758J959k190
$$ -171 191 -214 239 -268 297 -329 367 -407 449 -497 550 -609 675 -748 832 -926 1033 -1157
49a157K461k783L172l651M260n063O174p816J0481j5514K8149j11802k12755L20995
$$ -1157 1304 -1479 1693 -1958 2302 -2761 3413 -4403 6078 -9436 18713 -93089 -305844 15151
63A5151J53179k54164j06593K63852J02355j99662r8569J40976O1267j10056n8501
$$ 15151 168330 -85834 -192427 71425 173780 -25882 -124451 16525 77792 -32264 -90765
74i0765Q8227N2257n2325k4124M8073p033n2602P279K0737l2488J9529P5505j9579
$$ -90765 -2538 49719 -2606 -26730 21343 14310 -38292 -31013 -10276 -42764 -23235 52270 32691
87C2691o5359M7881M0140r4408m0281R7978J3546r2432K1815R2984k9916o4712
$$ 32691 -32668 15213 55353 -39055 -79336 18642 32188 -60244 -38429 54555 24639 -40073
99d0073M1296L3614n5059k1419M5548Q329k8899K2008M0982l1863o4427K3715
$$ -40073 1223 34837 -20222 -41641 3907 12236 -16663 5345 46327 14464 -49963 -26248
111b6248O8331l8839q1189O8293J09754q1055j12286J02329J04096j23412r2512
$$ -26248 42083 3244 -77945 -9652 100102 19047 -93239 9090 113186 -10226 -102738
122a02738J23848N9303j20585k1016J18884M061r5258R939O1452l1780m7093L8400
$$ -102738 21110 80413 -40172 -61188 57696 61757 -33501 -23562 37890 6110 -40983 -2583
134b583M5604k5595l5177K2724K9440k9255l0877L0873K0415l9172k740M6560
$$ -2583 43021 17426 -17751 4973 34413 5158 -25719 5154 25569 -13603 -16343 30217
146C0217j7549l7738N3538K5624r3559j8558J12023l453j17712L5432J25589n3666
$$ 30217 12668 -25070 28468 54092 -39467 -58025 53998 50545 -67167 -31735 93854 40188
158D0188j22398N5164J01841n7361q4156N2896P2819m5571o4538M2371O4468m1691
$$ 40188 -82210 -27046 74795 17434 -66722 -13826 58993 13422 -51116 -8745 55723 14032
170A4032o6766M1732N6400n2671m1946O9541L2303p2211j6422N9062j1254m5765
$$ 14032 -52734 -11002 45398 -7273 -49219 20322 52625 -19586 -36008 23054 11800 -33965
182c3965L0611K8515l5956k796L4269k0469k5477L7363J3583m5793o986M0388
$$ -33965 -3354 25161 -10795 -13591 20678 209 -25268 12095 25678 -20115 -27101 13287
194A3287Q23k9091N989K4686m554k5990o529K2972J0377k2203J347K9882j5521
$$ 13287 14110 -14981 -8992 15694 11140 -14850 -21379 1593 11970 -10233 -8886 20996 5475
207E475l6202L1053L1909n0337j8601O5480l069p6566K5451P9980m1137o9679
$$ 5475 -30727 326 32235 -18102 -36703 28777 25708 -50858 -25407 54573 13436 -56243
219e6243N3074N1505o2833l7073O3921L1913n4377k9167M3418K6345m1728l0143
$$ -56243 -3169 48336 -14497 -51570 12351 44264 -10113 -39280 4138 30483 -11245 -41388
231d1388M6017L5359n1286l6762N7243L0267n7606j3355N5883n577n0150J6947
$$ -41388 4629 39988 -11298 -48060 9183 39450 -18156 -31511 24372 18795 -31355 -14408
243a4408L2514k2682p172K5917j4606k3360K5888J2813k9450L180L0539j1690
$$ -14408 18106 -4576 -11748 14169 -437 -23797 2091 14904 -14546 -11366 19173 7483
255G483k6454J3084J8609q145j1644L097Q304j058j4793J669K7430k558l3606
$$ 7483 -18971 -5887 12722 4577 -7067 -3970 4334 3276 -11517 -9848 17582 15024 -18582
268a8582J0907L3940k6420k9446M1458K3399m7320j2274M2741l533l2770J6696
$$ -18582 -7675 26265 -155 -29601 11857 35256 -12064 -24338 18403 14870 -17900 -1204
280a204J9966k0091n595J5498r759o088K2326O80k4517m76J8030p78j1649k451
$$ -1204 18762 -1329 -6924 8574 -1185 -7273 15053 15733 -8784 -9260 8770 7992 -3657 -6108
294f108J0603J2493j3569k5656J6751L2502k0707k9403K6796J8698l1826n948
$$ -6108 4495 16988 3419 -22237 -5486 27016 6309 -23094 3702 22400 -9426 -15374
306a5374K8358p074j5658J8544m393k8712K1505L1974l3720k5753M1055J6644
$$ -15374 12984 5910 -9748 8796 4403 -24309 -2804 29170 -4550 -30303 10752 27396
318B7396m6509j1946M4134J4683l5709k1070K6882K6881k5250l4763L0038M2896
$$ 27396 -19113 -31059 13075 27758 -7951 -29021 -2139 24742 -508 -35271 -5233 37663
330C7663l7621m6543M0665M1110m0234k7218L7261J3006k9640l834J3671l16O382
$$ 37663 42 -46501 -5836 35274 -4960 -32178 5083 18089 -11551 -15385 -1714 -2030 4352
343D352K188k3081j500L0385m458l0279J3359K6925j6611k0914J2189J3937l574
$$ 4352 6540 -16541 -18041 12344 7886 -22393 -9034 17891 1280 -19634 -7445 6492 2918
356B918o027l542L356N782p714n809J5553K550j7900O223J4403j9880n726L3418
$$ 2918 -3109 -6651 -3295 2487 -5227 -11036 4517 7067 -10833 -4610 9793 -10087 -15813 17605
370A7605l997l8103J5971L4327l0677k5514M2626J6192m4862o673L9621k007l1880
$$ 17605 13608 -24495 -8524 25803 -4874 -30388 12238 28430 -16432 -23105 16516 14509 -17371
383a7371Q374K7371n991k5172j609K4123P911k4757p673K9706K104l5667N075
$$ -17371 -8997 18374 12383 -12789 -14398 9725 17636 -7121 -14794 14912 17016 -18651 -13576
396a3576L6334j3145k7020K2644J1841l0501M191L1866j7138k3739K7853J0604
$$ -13576 22758 9613 -17407 5237 17078 -13423 -9232 22634 5496 -18243 9610 20214
408B0214l5710l92L7100n474l0272Q153K1132r205j6309O427J8364n31k2973m075
$$ 20214 -15496 -15888 21212 15738 -14534 -6381 14751 5546 -10763 -4336 14028 13497 -9476 -13551
422a3551K6110J396k8716P541L0791j8053k9650K5095J8961k7806k960K8120j2833
$$ -13551 12559 13955 -14761 -7220 23571 5518 -24132 963 19924 -7882 -10842 17278 4445
435D445k3973K2095J3079k5846J141K6448j3064k4035J6609J7186j6342q600J3868
$$ 4445 -19528 2567 15646 -10200 -9059 17389 4325 -19710 -3101 14085 -2257 -10857 3011
448C011M522j2819o756J1615J2214j1947j5426J6721J3506k8354q735M0299J051
$$ 3011 7533 -5286 -12042 -427 11787 -160 -15586 1135 14641 -13713 -22448 17851 18902
461A8902m6610R427M5355k4309l9062L7888L1123m3892j9544M0826O042l5259
$$ 18902 -27708 -18281 27074 2765 -36297 1591 32714 -11178 -30722 10104 16146 -19113
473a9113N437K9621r690k4451P592J9546m790j7827O726K1321j1846k7497J8422
$$ -19113 -13676 15945 6255 -18196 -10604 8942 4152 -13675 -6949 14372 2526 -24971 -6549
486f549L1508k5973k7813L5913J8868m5970p776M9951k591m4726J4381L3652k3064
$$ -6549 24959 -1014 -28827 7086 25954 -20016 -27792 22159 19568 -25158 -10777 22875 -189
499a89k1929K6955J1987k1839m202J4047k470p948M855O532j412p253j902Q511
$$ -189 -22118 4837 16824 -5015 -9217 4830 2360 -5588 -733 5799 4387 -2866 -4768 3743
513C743O86j0989O744J5531j6175j6262K3596J0741k9727K057L4355j5645l4174
$$ 3743 4429 -6560 184 15715 -460 -16722 6874 17615 -12112 -10055 24300 8655 -25519
526b5519K6078K6301l2035j3995L6677J229l6793P075L0916r847k2255J1058J5895
$$ -25519 559 26860 -5175 -19170 17507 18736 -18057 -10982 19934 10087 -12168 -1110 14785
539A4785j1764j5036J0118J7905q352k1068J1418K0595k0258j8527L1797J4384
$$ 14785 3021 -12015 -1897 16008 7656 -13412 -1994 18601 -1657 -20184 11613 25997
551B5997m0649n524M3638r089m2723K3768L8635l3245l0995L5061J9449l3294
$$ 25997 -14652 -20176 23462 14373 -28350 -4582 34053 808 -30187 4874 24323 -8971
563h971q319K8743L828k3829n216J7515P065j2447p753J2860M903j7208j581K0228
$$ -8971 -17290 11453 15281 -8548 -13764 3751 10816 -1631 -9384 3476 8379 -8829 -10410 9818
577I818m207j9294J4167J3161k6033n258L4610m053l6047J5146L1497k6280k4680
$$ 9818 5611 -13683 484 13645 -12388 -17646 16964 12911 -23136 -7990 23507 -2773 -27453
590b7453L1069J8019k9379j0456K2527L869j6680q0J1604L093r313p124Q013P418
$$ -27453 3616 21635 -7744 -18200 4327 8196 -8484 -8564 3040 6133 -3180 -10304 -2291 5127
604E127q938l130J3378l582j6704J0812J4231j8860n385K6935m764l1936J4548
$$ 5127 -3811 -6941 6437 2855 -13849 -3037 11194 -7666 -13051 13884 9120 -22816 -8268
617h268K9565k2894k0811K8670J1307l0846l698K7540q48j9403L270J2996m084
$$ -8268 21297 -1597 -22408 6262 17569 -13277 -16975 10565 9717 -9686 -6416 6580 2496
630B496j0315J714J2233J679j4111j862J6455l966j8398J3617J8854k1468j5041
$$ 2496 -7819 -6105 6128 7807 -6304 -8166 8289 4323 -14075 -458 18396 -3072 -18113
643a8113K7186N077k9970P178L0630j6600k5812K1457J6695k2781o814K2365J037
$$ -18113 9073 14150 -15820 -8642 21988 5388 -20424 1033 17728 -5053 -11867 10498 11535
656A1535j8272o84J2038L094p265m396O278O526j0566p961J6058O702j8167l3
$$ 11535 -6737 -7421 4617 7711 446 -3950 2328 8854 -1712 -9673 6385 13087 -5080 -5113
670e113J6866j0207j3806J8256Q870k2042O67K0683j1495j7261J8998J2337k0511
$$ -5113 11753 1546 -12260 5996 14866 -7176 -6509 14174 2679 -14582 4416 16753 -3758
683c758n432J6922j964j2695M978Q863k957n093k505K485N748l431o320Q872M319
$$ -3758 -9190 7732 5768 -6927 -1949 6914 3957 -1136 -3641 -1156 4592 1161 -5159 3713 8032
698H032j4727j284J6344m610j3607J2851P112j9065p73J9752o932j4172J3649
$$ 8032 -6695 -7979 8365 3755 -9852 2999 10111 -8954 -9727 10025 3093 -11079 2570
711B570O679j7892p99J6359m281j0350P666M023r234P6N300R9L56j502l840L532
$$ 2570 9249 -8643 -9442 6917 2636 -7714 -48 3975 -5259 -5183 117 216 572 -930 -4770 -1238
727a238K696q514K203J3665q232j4270J2906R706j7360j461K0443n955j8612J0801
$$ -1238 1458 -7056 -4853 8812 580 -13690 -784 8922 -8438 -9899 10544 4589 -14023 -3222
741c222J1448j3346k681J3852l771r878N405L853m696K482K879m367R65J597n694
$$ -3222 8226 -5120 -7801 6051 2280 -7598 -2193 1660 -3036 -554 2325 -2042 -1077 520 -5174
756e174L437Q739p888n655J0328k25j2334P100J1616j1114n842J1915j652j0508
$$ -5174 -1737 7002 -886 -6541 3787 3562 -8772 -1672 9944 -1170 -7012 4903 3251 -7257
770g257Q424P009j0435k14Q415p529m149J1814m63j0191N885N483j0048p74J1132
$$ -7257 1167 8176 -2259 -2473 5942 -1587 -5736 6078 5615 -4576 1309 6792 -3256 -4030 7102
785G102k734o471M444M12n327M218K699m769L284L592r519p67J1214l732q861
$$ 7102 4368 -2103 2341 2753 -2574 1644 4343 -426 2858 6450 -3069 -3836 7378 3646 -5215
800e215J0148L333j3786J941J2729p434p305J2742l12j4844N610J1793r241n026
$$ -5215 4933 8266 -5520 -3579 9150 1716 -5589 7153 6841 -8003 -2393 9400 159 -4867
814d867J0567p80r749K824M858j895J274q36m957M394L373q487L64J2572n323
$$ -4867 5700 4920 -4829 -2005 2853 958 2232 1396 -3561 833 4206 -4281 -3917 8655 3332
829C332j2927Q883P468j1230J66J1780o627q677R430J414j0811P199R007j1830
$$ 3332 -9595 -712 6756 -4474 -4308 7472 845 -7832 1598 3012 -7799 -600 8407 -3423
843c423n595J2704j067j0295O234P147p792l094M730r21o90L350k557j600M255
$$ -3423 -9018 3686 2619 -7676 -1442 5705 -2087 -5181 -451 -1372 -2062 1288 -1269 -2869 1386
858A386m018n159R380K740j1058L095R786j0901n757J6164O07j6568O356J3930
$$ 1386 -2632 -7791 1589 4329 -6729 -3634 6152 -4749 -10506 5658 6265 -10303 -3947 9983
872I983j4148r567J8045N289j6989L78J2378m072q013M245N847q59m683l623M755
$$ 9983 -4165 -13732 4313 9602 -7387 -7009 5369 1297 -6716 -2471 3376 2517 -2166 -5789 -1034
887a034O530p302n336J2864J869j7580L275J7269q730j2460J5382N609j9003J257
$$ -1034 5496 -1806 -7142 5722 7591 -9989 -6714 10555 1825 -10635 4747 10356 -8647 -7390
901g390J7943p059j2105J1845O149j4159j559J2271r07o630J635K291q52j274
$$ -7390 10553 3494 -8611 3234 9383 -4776 -6335 5936 5029 -1601 34 2325 1473 199
915A99k831L754O545o399p385R324M232j2768K422J4813q999j2836J3602O428
$$ 199 -2632 1122 7667 1268 -6117 3207 7439 -5329 -2907 11906 2907 -9929 3673 10101
929A0101j6826K466J7572r741j4233J3021P960j4699n88J3491k833j1273L603
$$ 10101 -6725 -4259 13313 3572 -10661 2360 10320 -4379 -4967 8524 5691 -5582 -1979
942a979O602k374k851K32L033J467p428k531J2037J321j4860L737J5128j2062
$$ -1979 4623 2249 -602 -370 2663 4130 -3298 -5829 6208 7529 -7331 -3594 11534 -528
956e28j3477J8358R698k1968k307K0928o028j8686J2664J4149j4807p960J2545
$$ -528 -14005 4353 14051 -7917 -10224 10704 4676 -14010 -1346 12803 -2004 -9964 2581
969B581J989j0399J662P428K34n935l467M542N719o853m851J1478K716j6844J322
$$ 2581 4570 -5829 -4167 3261 3495 -2440 -5907 -1365 4354 -2499 -7350 4128 6844 -10000 -8678
984h678J9045p047j7451J4127J2376k0278o206K1915n53j8306P158J3110j1911
$$ -8678 10367 3320 -14131 -4 12372 -7906 -14112 7803 7250 -11056 -3898 9212 -2699
997b699q127J2571L216q553k05M990r09k715j792L623N666n920p332Q963N569
$$ -2699 -10826 1745 4961 -3592 -3797 1193 284 -2431 -4223 -600 5066 -854 -8186 777 6346
1012F346j3116m28J6989n603j7250J1933J2793j6866n394K0004j384j9472P224
$$ 6346 -6770 -7198 9791 4188 -13062 -1129 11664 -5202 -10596 9408 8024 -11448 -4224
1025d224J4804j0956p985J2489L178j1482k36P176N33l173j625K984K859n202
$$ -4224 10580 -376 -8361 4128 7306 -4176 -4412 2764 3297 124 -1501 1483 4342 -860
1039h60m841R312N338j2478k251J5686n315j6390J2822J4772j7856r798K0890
$$ -860 -5701 3611 8949 -3529 -5780 9906 4591 -11799 1023 15795 -2061 -11859 9031
1052I031J283k0866O107J8491r771j3400J0141O944q790k888O702K270l576m961
$$ 9031 10314 -10552 -4445 14046 4275 -9125 1016 7960 -830 -3718 2984 5254 1678 -3283
1066c283J409P525k278q568O881P486j2378n839J6455O50j6837O372J5348j4216
$$ -3283 -1874 5651 3373 -5195 1686 9172 -3206 -9045 7410 8060 -8777 -2405 12943 -1273
1080a273j1311J7441N957j7636J016J4876p245j0835Q712O659p063k208L579k24
$$ -1273 -12584 4857 10814 -6822 -5806 9070 1825 -9010 -298 6361 -702 -2910 669 445
1094D45j441q54J54N099j341p772L072Q096p903n757J3618O89j6172L913J5332
$$ 445 -996 -1850 -1696 3403 2062 -5710 -2638 5458 -2445 -8202 5416 6105 -10067 -6154 9178
1109I178j0134j0834J5792M949j7736M06J5134n158r902Q000N436q542k167N024
$$ 9178 -956 -11790 4002 8951 -8785 -8379 6755 1597 -8305 -305 5131 -3411 -5578 -554
1123e54R43r07j169p64L303k55o918L108J0033p351q455J1281L735j4486K617
$$ -554 389 -518 -1687 -2451 852 597 -6321 -3213 6820 -531 -8986 2295 6030 -8456 -5839
1138e839J5366p738j2517J1909O226j4108N05J3967m808j1095P701N163p163j024
$$ -5839 9527 1789 -10728 1181 7407 -6701 -6196 7771 2963 -8132 -431 4732 -2431 -3455
1152c455N808r3j577j864j759M753K495o818r8R511n020j0362R879Q158j2749
$$ -3455 2353 2260 683 -1181 -2940 1813 4308 -2510 -2608 6903 1883 -8479 1400 9558 -3191
1167c191j994J3685m965j2516J0019Q395j1506k322J0809l102q584O123M635n072
$$ -3191 -5185 8500 3535 -8981 1038 9433 -2073 -4395 6414 3312 -5272 851 5486 414
1181D14m32K448k793Q67K267l510J482M834n468m230P973J89q164N414O865j0062
$$ 414 -18 2430 -363 504 2771 -739 743 5577 109 -4121 3852 4041 -4123 1291 8156 -1906
1197a906l577J1740k522r844P828O532j1488k216J0822k314p241N473L247o586
$$ -1906 -5483 6257 3735 -6109 1719 8251 -3237 -5453 5369 3055 -4186 1287 4534 -2052
1211b052L49L667k912J69M099l741j892M506k660l545P088O77q693L040P285q101
$$ -2052 -1703 1964 -948 -779 3320 -421 -2313 2193 -467 -4012 3076 3753 -4940 -1900 5385 -2716
1227b716l941J1180n62j0673M501P419q317k264R421j888p663N002J823n826K495
$$ -2716 -6657 4523 3961 -6712 -2211 5208 -3109 -5373 4048 2160 -5503 -501 1322 -4504 -2009
1242b009N275n174j301M884l783k570O735q53n890M520L342q469J300Q641m686
$$ -2009 3266 -1908 -3209 1675 -2108 -4678 2057 1204 -4686 -166 3176 -5293 -3993 4648 -38
1257c8o113P717J366r171L768O806n875k317O464k775n419O356J866n916K720
$$ -38 -6151 1566 2932 -6239 -2471 4335 -1540 -3857 2607 -168 -5587 769 2635 -3281 -561
1272e61M400p216j077Q047k873m895O402J223q320K471P235n265k956P122k143
$$ -561 3839 -3377 -4454 3593 720 -4175 2227 3450 -4870 -2399 4836 -429 -3385 3737 1594
1287A594n922M967K476n120K423M232o287j429P199k815m846P116J204q502K621
$$ 1594 -4328 639 3115 -2005 418 4650 -1637 -3066 4133 1318 -3528 3588 4792 -3710 -1089
1302a089O265o191j766R048k973q178N929M826p975J57P733l992m568M480O01
$$ -1089 5176 -1015 -2781 6267 3294 -4884 1045 5871 -2104 -1947 5786 1794 -2774 1706 2307
1317B307m091M504J247n771K027M102n631o74P442l097n838N935J629q200L669
$$ 2307 -1784 2720 3967 -1804 223 4325 -1306 -1980 5462 2365 -3473 2462 4091 -4109 -440
1332d40P461p375m006R042j771q991O312O683q511k586P849k603n157N069K467
$$ -440 7021 -354 -4360 4682 2911 -6080 232 6915 -1596 -4182 3667 1064 -4093 976 3443
1347C443n092J479J793l932P06M452l779j086M942l818m699P576J062q086L444
$$ 3443 -1649 -170 1623 -2309 -1603 2849 -930 -2016 2926 -892 -5591 1985 3047 -5039 -1595
1362a595P661q826n824J2153J587j1850L710Q792p711n018Q558J209o256K085
$$ -1595 6066 -2760 -8584 3569 5156 -6694 -2984 5808 -1903 -6921 1637 2846 -3410 -1325
1376a325K543l658m7K596j673J252J976n410L73O152l896n168Q463K982j1685
$$ -1325 1218 -2440 -2487 109 -1564 -312 1664 -3746 -3373 2779 -1117 -6285 2178 5160 -6525
1391f525J431J1181o409p563J0694K766j1709J626R865n411n764P922J846p266
$$ -6525 -5094 6087 -322 -7885 2809 5575 -6134 -4508 5357 -54 -5818 2104 3950 -3316
1405c316O78M278j853m8J615k432P54K350m902R57O739l249o903P475L256j0461
$$ -3316 -2638 1640 -213 -261 1354 -1078 -324 2026 -2876 -1919 4820 1571 -5332 2143 5399 -5062
1421e062J343J1742n712r564R396M696j1216P90J1077m822q419P293L248o816
$$ -5062 -3719 8023 2311 -7253 2143 6839 -4377 -3587 7490 2668 -5751 1542 4790 -2026
1435b026M82N407j545k442O93p40J290K234m314k74O694m008p121P484N290j0005
$$ -2026 -1544 3863 2318 -124 569 -171 1119 3353 -961 -1235 5459 1451 -5670 1814 7104 -2901
1451b901m87J1086n371j0479J0025P287j2185j672J1441l193j0010N859O510n916
$$ -2901 -3388 7698 2327 -8152 1873 9160 -3025 -4697 6744 3551 -6459 -600 5910 -6
1465fk239M331j419j151N26o23K165J517n395p42P105k504p698P571O262j1709
$$ -6 -2245 2086 667 -484 42 -581 1584 3101 -2294 -3036 4069 1565 -6133 1438 7700 -4009
1481d009l281J3225k065j1696P224Q615j1148m401J1129m18q552M089N197n297
$$ -4009 -7290 5935 3870 -7826 -602 8013 -3135 -7536 3593 3175 -5377 -1288 3909 -1388
1495a388k716L968J12p71P24j935P35K671m043j738P531p84q775M700P235r697
$$ -1388 -4104 -136 -24 -795 -71 -2006 -1271 1400 -2643 -4381 3150 2366 -6409 -1709 5526 -4171
1511d171l098J2597j378j2244N788R345r270n236J0980J228r870K115O279m443
$$ -4171 -7269 5328 3950 -8294 -2506 6839 -2431 -7667 3313 4541 -5329 -3214 3065 -1378
1525a378j950M219K89k197J45q80J238L072l870j951O833p97r407M951Q919p817
$$ -1378 -3328 891 1180 -1017 -872 -1752 -514 2558 -1312 -3263 3570 2773 -6634 -1683 7236 -581
1541e81n968J0746Q65j2022M186J0368p364o312R493J397r302K352P147l205l960
$$ -581 -6549 4197 5062 -6960 -2774 7594 230 -6082 3411 4808 -4494 -2142 5005 1800 -2160
1556b160K727R15j481Q67j535J235L742m356l565O475J788q711L034Q994p846
$$ -2160 567 1482 1 868 -667 568 4310 -46 -3611 2864 4652 -4059 -1025 7969 123
1571A23p106J0467L691j1587K012J0626o734p610Q128L855p847Q38N740l696l095
$$ 123 -6983 3484 7175 -4412 -2400 8226 1492 -6118 2010 5865 -1982 -1144 4596 900 -2195
1586b195K927N88l51P13k176l87M131k542m680O315L354r055l12Q837m041p368
$$ -2195 732 1320 969 1682 -494 -881 3250 708 -3972 2343 5697 -3358 -3670 5167 1126 -6242
1602f242Q464L913j0450N67R524m935p048P812L459p822j69N373k212k414K862
$$ -6242 2222 6135 -4315 -3748 5776 841 -6207 1605 5064 -2758 -2927 2446 234 -2180 682
1617F82m70j706J502j142j267M088q71m824M066L383p646p66R602l306q081O656
$$ 682 212 -1494 8 -1134 -2401 1687 816 -4008 58 3441 -4205 -4971 4631 1325 -6756 -100
1633a00N533r986j286J0168k667p408N338L882o914k67N928k266k351K495j032
$$ -100 5433 -4553 -5839 4329 1662 -5746 -408 3474 -3440 -3707 2221 -45 -2396 99 -933
1648i33j261K598j178j715M504m68o350K966O169o416k712Q851j536q800N331
$$ -933 -2194 404 -774 -2489 2015 1547 -4803 -1837 4332 -2084 -4796 4055 2519 -6281 -950
1663i50O434p642k181Q462j669p461M373M215m851J4M189l020k243L610n43j702
$$ -950 5484 -2158 -4339 4123 2454 -5007 -634 3581 -1270 -1256 2933 -87 -2330 1280 737 -965
1679i65K929n95l635L594J307n253K139O117n026n219P676Q65p680L045O780o111
$$ -965 1964 1369 -2266 1328 2635 -2618 -479 5638 612 -4607 3069 3934 -3746 -701 6079 -32
1695c2l698O933n46n805M297L297n269n91M605k587j666L689j127k710L507k84
$$ -32 -3730 3203 2657 -3148 1149 4446 -823 -1414 3191 604 -1062 2627 1500 -1210 2297 2013
1711B013m705L496L960n690j263O491l321m958O170K280p175J251O297n144l442
$$ 2013 -2692 804 4764 -926 -2189 4302 981 -3977 2193 4473 -2702 -1451 4846 -298 -3740
1726c740O654K03n537K427K905m748J99M555k696j906L383j483l319L940J301
$$ -3740 2914 3117 -2420 7 2912 -1836 -1637 2918 222 -1684 1699 216 -3103 837 2138
1741B138n172K876L856n895j836O323l84o053M399K847o285k72O671l285l566
$$ 2138 -3034 -158 3698 -2197 -4033 2290 1906 -4147 252 3099 -3186 -3458 3213 -72 -3638
1756c638M692L10n161K219L291l567M96K883l196j549M528j456m209M883K531
$$ -3638 1054 1364 -3797 -1578 1713 -1854 -1358 1525 -1671 -3220 1308 -148 -4357 526 3057
1771C057o759O63N817l403l431N847L52o636K991M414m904r67N242j771l876L571
$$ 3057 -3702 -3039 2778 -625 -4056 1791 2143 -4493 -1502 2912 -1992 -2959 2283 512 -3364 207
1787B07P72l548K612K095m190N25M272l775k118N963p19n584L868K993n906K3
$$ 207 979 -2569 43 2138 -2052 -1527 2745 -1030 -3148 2815 2096 -3488 380 3373 -2533 -2510
1803b510O953l266n049N098J934n809J545M717l409k433M099p64l091L624O92
$$ -2510 4443 1177 -3872 1226 3160 -2649 -1104 3613 204 -2229 1870 1106 -1985 1639 2331
1818B331l525K101J461m150R83M786l786k794N776k81o892L665N782o336j877
$$ 2331 -1194 907 2368 -1782 -799 3987 201 -2593 3183 2902 -3990 -325 5457 -879 -2756
1833b756O649j915n941M797L556n397j17M534k699k944L612N25k592K209j41l395
$$ -2756 3893 1978 -3963 834 4390 -1007 -1124 3410 711 -2233 1379 1904 -688 1521 1380 -2015
1849b015K265K513l896K74M750m035l531O136Q76o696K978N417o091l623P208
$$ -2015 250 2763 -1133 -859 3891 -144 -3675 2461 3337 -3359 -381 5036 -1055 -4678 2530
1864B530K90o315K727M639n077j606M311p15k472K184J13k477J566M90k570K898
$$ 2530 2820 -3495 -768 3871 -1206 -2812 1499 784 -1688 496 609 -1868 -302 188 -2382 516
1880E16J839m985K50N332l595m321O405K400p843Q26O890m297m535O554J967p176
$$ 516 2355 -2630 -2380 2952 -643 -4964 1441 3841 -4002 -3176 3714 -583 -5118 1436 3403 -3773
1896c773J120N249l899k022M294j0k956J366J94j619K465J22k859K297J770m686
$$ -3773 -2653 2596 -1303 -3325 969 959 -1997 -631 -437 -2056 409 531 -2328 -31 1739 -2947
1912b947K41O147l019n463O138K554p875Q14P890l279o311N925K557o508Q08N569
$$ -2947 -2706 3441 422 -5041 1097 3651 -4224 -3410 4480 1201 -5110 815 3372 -3136 -2328 3241
1928C241k370l449L291N37k816J183J506j689K043l12l201K262K779m377m18O147
$$ 3241 871 -2578 713 1250 -1566 -383 1123 -566 1477 1165 -2036 226 3005 -1372 -1790 4357
1944D357k434o565N376M493p381o55P468k562o610N308L883n873o25N365j913
$$ 4357 1923 -4642 734 5227 -2154 -2809 4659 2097 -4513 795 4678 -1195 -1820 3545 1632
1959A632m021K979J365j689O42M9j161J636L6k970K490L121n016j946O348j183
$$ 1632 -2389 590 1955 266 908 957 -204 1432 1468 -1502 988 4109 -907 -2853 3495 2312
1975B312o633N114M878p141k597P955r87o919L989M666n569k238N141m16l505
$$ 2312 -4321 793 5671 -1470 -4067 3888 2901 -4018 -29 4637 -932 -3170 1971 1555 -1950
1990a950K291J519k190J39Rq65K150K35l603J663L584m522k647O801N35p421K746
$$ -1950 341 1860 -330 -191 -182 -1047 1103 1338 -2265 -602 2982 -1540 -4187 2614 3149 -4272 -1526
2007a526N597n802l244P144Q37p076K404M698m329k548M738M13l493J331R79j391
$$ -1526 4071 -1731 -4975 2169 3006 -4070 -1666 3032 -1297 -3845 893 1306 -2187 -856 123 -1268
2023a268O19K04r26J476Q39l950J230M428l522l318N928Q69p291J985P168m928
$$ -1268 -649 -445 -1371 105 944 -3006 -1776 2652 -870 -4188 1740 2609 -4682 -2697 4471 -457
2039d57m661O900J124p195J797O064l998k806M137N97l463P22J987j242N49q2
$$ -457 -5118 1782 2906 -4289 -2492 3572 -426 -3232 905 1502 -1961 -1239 748 -494 55 -27
2055b7j552J603J111k957N95M720k991m441N299K302o825J026P455m244n859N685
$$ -27 -1579 24 1135 -1822 -1227 3493 502 -3939 1360 3662 -3163 -2137 5318 1074 -4785 900
2071I00L258o532O21N414k508l420K853J165k606J419R24j697Q68L30k232K139
$$ 900 4158 -2374 -1753 3661 1153 -2267 586 1751 -855 564 1488 -209 659 989 -1243 896
2087H96J985l523j089N414k078m967M569L738o264j042O630k519n625M949L474
$$ 896 2881 -642 -1731 3683 1605 -3362 1207 4945 -1319 -2361 4269 1750 -3875 1074 4548
2102D548n827l59M739j978l324L456J366l186P67Q46j721P27J360k279J130K148
$$ 4548 -1279 -1638 3101 1123 -2201 1255 2621 -565 202 1048 -673 54 1414 -865 265 2413
2118B413l304j671N119l04n334L142L915n547j984O550j110n848L883L479m965
$$ 2413 -891 -2562 2557 2253 -3081 61 3976 -1571 -3555 2995 1885 -3963 -80 3399 -1566
2133a566j249M570p22l435K329J149k623P81J344j810J159J353l125L97L193k681
$$ -1566 -2815 1755 1033 -2402 -73 1076 -1547 -766 578 -1232 -73 1280 -1845 -1448 1745 -936
2149i36k213M831M74n932K089M496m383k248N735r5n771K439L949l807j028L816
$$ -936 -3149 1682 2156 -3776 -1687 2809 -1574 -3822 1913 1818 -3953 -1514 2435 -1372 -2400 1416
2165A416j084k923K330P91k283J669J122k155N59J810k801o12M563k403l290L898
$$ 1416 332 -2591 -261 530 -1753 -84 1038 -1117 -558 1252 -1549 -2161 2402 -1 -3291 607
2181F07J582m769J088M745l235l535M801Q46m924J923L671l269j495L673o35k957
$$ 607 2189 -2580 -1492 3253 18 -3517 1284 2130 -2794 -871 2800 -469 -1964 1709 1074 -1883
2197a883K587Q77k268J125J314l208J109K742k643j047L848q91m322L352K999
$$ -1883 704 1581 -687 438 1752 -1456 -347 2395 -248 -1295 2553 1662 -2660 692 3691
2212C691m886p5M709k161m026M207J618m467O91L787k724j747L179o52k276K452
$$ 3691 -1195 -1270 3439 1278 -2748 1459 3077 -1390 -699 3088 364 -1383 1796 1144 -1132 1320
2228A320M69k889J542J492k670K42L108k535k347M074L95m315J984L591m262j562
$$ 1320 1789 -1100 442 1934 -736 -494 2614 79 -2268 1806 2201 -2114 -130 3461 -801 -2363
2244b363M485j156l289K988J812l981L11L170k230j257K800o03k411J933O96k907
$$ -2363 2122 966 -2323 665 2477 -1504 -1193 1977 -253 -1510 1290 687 -1724 209 905 -2002
2260b002J981K167l375o12L416j702k842L974J233n061J112M189l475k161M561
$$ -2002 -21 2146 -1229 -1841 1575 -127 -2969 1005 2238 -2823 -1711 2478 -997 -3158 1403
2275A403j3m041J742K221l073K86K701j662j379K264q84j625K500P68l395J410
$$ 1403 1390 -2651 -909 1312 -1761 -1475 1226 -436 -1815 449 -435 -2060 440 1208 -2187 -777
2291g77K178l575k90M662j546l936L363K447n490O51M921k501l146L650R40l818
$$ -777 1401 -2174 -2464 2198 652 -3284 79 2526 -2964 -2313 2608 107 -3039 611 1551 -2267
2307b267J028K756k275k03J990j698p39K419p48j640K390O14l817J143L706k733
$$ -2267 -1239 1517 -758 -961 1029 -669 -1408 1011 263 -1377 1013 1627 -2190 -1047 2659 -74
2323g4k114M232k49n026L146L237m096p74M244j358l444K917J310k858Q15K135
$$ -74 -2188 2044 1795 -3231 -85 3152 -944 -1718 2526 1168 -2276 641 1951 -907 -92 2043
2339B043j874q80J874q73j071L080j258k426K613Q54l433J124L695l009k702M333
$$ 2043 169 -711 1163 290 -781 2299 1041 -1385 1228 2082 -1351 -227 3468 459 -2243 2090
2355B090K84m824K220L932l682k443M319o1l484K194J814l087J15J947j124n34
$$ 2090 2374 -2450 -230 3702 20 -2423 1896 1835 -1649 545 2359 -728 -613 1334 210 -324
2371c24K012j912n38K144q74k639K543K469m586L45M263k401l895M677J734n664
$$ -324 1688 -224 -762 1382 508 -2131 412 2881 -1705 -1360 2903 502 -3393 1284 3018 -2646
2387b646J419L944l233k338L944N41l263J067J634j713m49K017j400l23J825j703
$$ -2646 -1227 2717 -516 -2854 1090 1631 -1632 -565 1069 -644 -1093 924 -476 -799 1026 -677
2403f77r46K712m25l087K372K209m208j003N396j822l987L792K108m988K30M572
$$ -677 -1623 1089 664 -2423 -51 2158 -2050 -3053 2343 521 -3466 326 2434 -2554 -2324 2248
2419B248k388k899L481R56l523O65K239j550l36J793j317p28K064j268j069K835
$$ 2248 -140 -3039 442 1398 -2125 -1460 779 -771 -1107 686 -631 -1359 705 -563 -1632 1203
2435A203k57l585K279K824m276l87M955j596m567L391L166m930k89M369j219l739
$$ 1203 946 -2639 -360 2464 -1812 -2199 2756 1160 -3407 -16 3150 -1780 -2069 2300 1081 -2658
2451b658K925J679l028O41J862j121p75J415j195j26J851j074j570K449M80l951
$$ -2658 267 1946 -1082 -441 1421 300 -475 940 -255 -381 1470 396 -1174 1275 1755 -2196
2467b196K281L363l944j854N185o53n063L149L686m439j652M638j049l690K419
$$ -2196 85 3448 -496 -2350 2835 2182 -2881 268 3954 -485 -2137 2501 1452 -2238 181
2482A81K414k866j49J928j478n91J601j014o83K352j230k155K977O59l810J251
$$ 181 2595 -271 -420 1508 30 -561 1040 26 -657 1695 465 -1690 1287 1946 -1864 -613
2498f13L685l519k570M801Q00n103J894L743l800j984M404Q1l630J681K021k753
$$ -613 3072 -447 -3017 1784 2584 -2519 -625 3118 -682 -2666 1738 1819 -1811 -130 1891 -862
2514h62m98K333q39o50J079j462l66K115p12k305K922J179m385J055M054k907
$$ -862 -1360 973 134 -516 563 -899 -1265 850 138 -2167 755 1934 -2451 -1396 2658 -249
2530b49k897M319J261n089M05M926k767k874L958Q44m163R96K427k012l62J557
$$ -249 -3146 1173 2434 -2655 -2250 2676 -91 -2965 993 1837 -2326 -1330 1097 -915 -1277 280
2546B80o57j004J747j326q27K602n62k586K135K115m126K07M400j987l876L736
$$ 280 -377 -1381 366 -960 -1787 815 253 -2333 -198 1917 -2209 -2002 2398 411 -3465 271
2562B71K047m780M82M480k469k703L271J107l591J097K439j770o35J419r77n56
$$ 271 2318 -2462 -1980 2500 31 -2672 599 1706 -1885 -788 1651 -119 -754 665 -312 -868
2578h68J794n89j298K176K32l546J880K614l228j082M382j224m038K895L231m247
$$ -868 926 337 -961 1215 1447 -2099 -219 2395 -833 -1915 2467 1243 -2795 100 3331 -916
2594i16o43M297j404l414K931J377l023M57K262j826q59J721k72j142J999r63
$$ -916 -1559 2738 1334 -2080 851 2228 -795 -338 1924 98 -761 960 688 -454 1545 582
2610E82j978K404O84k999J116L280l214j871M132L2m368K371K989l582j849M330
$$ 582 -1396 1008 1692 -1307 -191 3089 -125 -1996 2136 2168 -2200 171 3160 -422 -2271 2059
2626B059n39l289K338J826l141j55J926j071m93J732j184o96J668l75k336K271
$$ 2059 1520 -1769 569 2395 -746 -901 1025 -46 -539 1193 9 -687 981 606 -1730 541
2642E41J424l355K30L267k543k266M144K20l928J090L574l157j473L745j90l681
$$ 541 1965 -1390 -1160 2107 -436 -2702 1442 1662 -2266 -1176 2398 -759 -2232 1513 1323 -2358
2658b358K079J348k454J54K178j665o26K202j314j401K323j57k339J466K324l540
$$ -2358 -279 1069 -1385 -1231 947 -718 -1344 858 -456 -1857 466 309 -2030 -564 1760 -1780
2674a780P2L417j349l350L194J508m212Q14L755k421k359L558J19k969J250K068
$$ -1780 -1708 1709 360 -2990 204 1712 -2500 -1686 2069 -352 -2711 847 966 -2003 -753 1315
2690A315k302J49J887j643p02J967m71j803K245L62l177J593K787k970r77L526
$$ 1315 -987 -838 1049 -594 -1296 671 200 -1603 642 1004 -2173 -580 2207 -763 -1740 1786
2706A786j048l278K640K204l688J09L374j845k110K899p6k147J236J583k401j75
$$ 1786 738 -2540 100 2304 -1384 -1275 2099 254 -1856 1043 967 -1180 56 1639 -762 -937
2722i37K388j442p77K368q11k424K472J008l197J231L360l095j807L301N2l554
$$ -937 1451 9 -768 1600 789 -1635 837 1845 -1352 -121 3239 144 -1663 1638 1690 -1864
2738a864K047K724l616l78K838p64k520K662N15k480N28J783j735j93K623j856
$$ -1864 183 2907 -709 -1087 1751 987 -1533 1129 1644 -836 -308 1475 -260 -453 2170 314
2754C14j157K171m94k242J876J927l647J99L261k214k308L520Q92m095J561K579
$$ 314 -843 1328 834 -1408 468 2395 -1252 -1053 2208 -6 -2314 1206 2098 -1997 -436 2143
2770B143k699j130L008n03k468J842Q72k197N51J938j828n30K253j879j345L392
$$ 2143 -556 -1686 1322 819 -1649 193 1065 -1132 -581 1357 -471 -1001 1252 -627 -1972 1420
2786A420m74l050J914K248l464r77M103j253l167L056J336l739N00L033k060j425
$$ 1420 946 -2104 -190 2058 -1406 -2383 1720 467 -2700 356 1692 -2047 -1547 1486 -574 -1999
2802a999K734m27k301J787J049k104N57J912k202l87K419j508j734L304p0l287
$$ -1999 735 308 -1993 -206 843 -1261 -704 1208 -994 -1381 1038 -470 -2204 1100 1030 -2257
2818b257J320K587k984o41L741j031l452K665K164l591j92L362j433j973K373
$$ -2257 -937 1650 -1334 -1975 1766 735 -2717 -52 2112 -1479 -1671 1691 258 -1715 658
2833F58J85k165J721P27k004M54J852k085k01L169j801k784L281P69l603J263
$$ 658 843 -1322 399 1126 -878 -424 1428 -657 -858 2311 510 -2274 1007 1776 -1827 -564
2849e64L519k862k070L783j23l962K448K244k982q23L074q73k231K369J79j856
$$ -564 2955 93 -1977 1806 1683 -2279 169 2413 -569 -1392 1682 809 -1422 947 1126 -730
2865g30J124Q14k150J122K067k550n49K937j095l119L211J369l749J82L443j954
$$ -730 394 1208 -942 180 2247 -303 -852 2085 990 -2129 1082 2451 -1298 -1116 2327 373
2881C73k711L495O16l054R18K674k581j134K557l20k202J675N39j953J220O57
$$ 373 -2338 1157 1773 -1281 -363 2311 -270 -1404 1153 833 -1369 306 845 -1108 112 769
2897G69j440M45J929k303j084L181q33k742K232K216l685m59L787j472l122L311
$$ 769 -671 -226 1703 -600 -1684 1497 664 -2078 154 2370 -1315 -1774 2013 541 -2581 730
2913G30J248l665M58K764j998j463K749k47k024J372N97j970J215J207k196K13
$$ 730 1978 -1687 -1229 1535 -463 -1926 823 576 -1448 -76 521 -1449 -234 973 -1223 -1010
2929a010K155j921j160L114l12l462K236K431l471j096M306j318k853K211J909
$$ -1010 1145 -776 -1936 1178 866 -2596 -360 2071 -1400 -2496 1810 492 -2361 -150 1759
2944A759l333L15L126j418k140K018j3j675J401N68j569O45J326k201p1L029j779
$$ 1759 -1574 -1259 1867 449 -1691 327 314 -1361 40 608 -961 -316 1010 -1191 -1262 1767 -12
2961a2j980L205N38l654J144L233k868j645L865k18l575J756K224k695o30K912
$$ -12 -1992 1213 1751 -1903 -759 2474 -394 -2039 1826 1608 -1967 -211 2013 -682 -1312 1600
2977A600j214j898K094O78k049J274O98k291R77J434j647p0K314j380k176L124
$$ 1600 386 -1512 582 1260 -789 485 1183 -1108 -131 1303 -344 -414 1900 520 -1656 1468
2993A468P83l595J058L174k552k181L176N49l285J526K403k870p06K607n51k025
$$ 1468 2251 -1344 -286 2888 336 -1845 1331 1880 -1405 121 2524 -346 -1052 1555 1004 -1021
3009a021J523Q82j986R08P69j898R63J380j836j048L282j410k423K623J396l897
$$ -1021 502 1384 -602 306 1075 -823 140 1520 -316 -1364 1918 508 -1915 708 2104 -1793
3025a793N81L720j894l086L340R73l261O70K416k107j058K536o21j800J458M73
$$ -1793 -1212 2508 614 -2472 868 1841 -1420 -750 1666 -441 -1499 1037 416 -1384 74 547
3041E47j839J200J080k096N98J862j842r61K566j43l231K348J722l445m42M134
$$ 547 -1292 -92 988 -1108 -510 1352 -490 -1451 1115 972 -2259 89 1811 -1634 -2076 2058
3057B058j755l087L131J091l535P76L097k275j299K514l04j942J318O80j726R81
$$ 2058 303 -2784 347 1438 -2097 -1321 1776 -499 -1798 716 412 -1530 -212 468 -1258 -277
3073b77J260j978j26K353j880j610L307l6l393J608K604k853j062L721q12l140
$$ -277 983 -995 -1121 1232 -648 -2258 1049 1013 -2380 -772 1832 -1021 -2083 1638 826 -2314
3089b314K471J476k808J24K621j553j023J724j48j610J505L32j612N02J532k008
$$ -2314 157 1633 -1175 -1051 1570 17 -1006 718 570 -1040 465 797 -815 -313 1219 -789
3105g89j74K584j220k053K670O27l228J055L006k629j568K986Ll180K063K099
$$ -789 -963 1621 401 -1652 1018 1645 -1583 -528 2478 -151 -1719 1267 1270 -1910 153 2252
3121B252k843m50K680j172j307J719K6j422J041P43j911R49J530j975q67K583
$$ 2252 -591 -1041 1639 467 -840 879 905 -517 524 1267 -644 305 1835 -140 -1007 1576
3137A576o88k614K479J031k894P05K858k382j983L203j03k961J327K357k236p88
$$ 1576 888 -1726 753 1784 -1110 -405 2453 71 -1912 1291 1188 -1773 -446 1911 -325 -1113
3153a113K286n64j688J678L61k203J319J112j985N40J676j826j376K936m65k718
$$ -1113 1173 609 -1079 599 960 -1243 76 1188 -797 -257 1419 -407 -1783 1153 688 -2030
3169b030K198J465k998k70L289j542j978K401O10k804Q83K175k106o80K119n99
$$ -2030 168 1633 -1365 -1635 1654 112 -1866 535 1145 -1659 -776 1399 -707 -1387 732 133
3185A33j973K174J66j957J223R92k077L9K616j376j976L050k54k696J448J841
$$ 133 -1840 334 500 -1457 -234 758 -1319 -1280 1336 -40 -2016 1034 780 -1916 -468 1373
3201A373k671l51L054r11k367J667J376k694P28K186j937q41K207m82j678J436
$$ 1373 -1298 -1649 1405 494 -1873 -206 1170 -1524 -796 1390 -547 -1388 819 337 -1341 95
3217I5Q57k362J083J432j901p1K367j221k064K539K72k631J093K573k295j328
$$ 95 952 -1410 -327 1105 -796 -867 1500 279 -1785 754 1026 -1605 -512 2061 -234 -1562
3233a562K819n68k128J392J962k502r8K166j525r07K021m10j693J721N61k208
$$ -1562 1257 689 -1439 -47 1915 -587 -685 1481 -44 -951 1070 660 -1033 688 1249 -959
3249i59R95J883k317l59K476p18k780K377J356k737K68K814k164j709K745J50
$$ -959 36 1919 -398 -757 1719 1001 -1779 598 1954 -783 -515 2299 135 -1574 1171 1321
3265A321k225J268J253j842k06J504q50j029J834n09j568J680L15j897N33K304
$$ 1321 -904 364 1617 -225 -431 1073 223 -806 1028 519 -1049 631 946 -951 -418 1886
3281A886k422j012K865m30k309J450J761k930j97L024j484j801K356R59l230R03
$$ 1886 -536 -1548 1317 887 -1422 28 1789 -1141 -1338 1686 202 -1599 757 1716 -1514 -611
3297f11J934j834n47K015q77j082J298k79j087J068R78k097J22K210j683j504
$$ -611 1323 -511 -1058 957 80 -1002 296 17 -1070 -2 976 -1121 -999 1211 -472 -1976
3313a976K922l1l024J475J979k385r18L049n75j928J667O80k217M16J813j447
$$ -1976 946 915 -2109 -634 1345 -1040 -1958 1091 516 -1412 255 935 -1282 -866 947 -500
3329e00l68J472p13q45J644mk082J184J303k396M9K629j315j682K331K13k464
$$ -500 -868 604 -109 -954 690 686 -1396 -212 1091 -1305 -1256 1373 58 -1624 707 920 -1544
3346a544R13K183k195j148K944m67k138J428J131j899K39J595j531k84J602p26
$$ -1544 -631 1552 -643 -1791 1153 686 -1452 -24 1107 -792 -553 1042 -489 -773 829 103
3362A03j232J877n6j611R24J674k102o63K658j054k107K335J313l106M12K993
$$ 103 -1129 748 692 -919 5 1679 -423 -1086 1572 518 -1589 746 2059 -1047 -635 2358
3378B358k024j694K716J17k309J067J391k189K74J251o34q94J779n39j756J903
$$ 2358 334 -1360 1356 1473 -836 231 1622 -567 -293 958 324 -570 1209 670 -1086 817
3394H17M03k058J113J555k082o82K061k29k439J876J508k742j90K723j441j594
$$ 817 1220 -838 275 1830 -252 -934 1127 898 -1541 335 1843 -899 -1089 1634 193 -1401
3410a401K196L62k063Q98J110j627N6J327n41j444K006n95j453J732J94j986O71
$$ -1401 795 1157 -906 -8 1102 -525 -469 858 317 -1127 879 284 -1169 563 757 -1229 -558
3427e58K057j767j136K294M0k696J432J500j918m90K344r23j794J676R10k122
$$ -558 1499 -268 -1404 890 930 -1766 -334 1166 -752 -1242 1102 179 -1615 61 971 -1151
3443a151M49J649j431m06J325n76j185J847J13j748J200R84k411L70K211j568
$$ -1151 -702 947 -484 -890 435 -141 -1326 521 634 -1114 86 1070 -1341 -971 1240 -328
3459c28j565K578J48k616R79K327k213q25K580n96k057J378J215j878L70J333
$$ -328 -1893 685 833 -1783 -804 1523 -690 -1515 1065 469 -1588 -210 1005 -873 -503 830
3475H30j409k91J608q49n64J253m32j311J527Q35k270J51K328j257j980K499O15
$$ 830 -579 -870 738 -111 -675 578 146 -1165 362 1197 -1073 -922 1406 149 -1831 668 1283
3492A283k625P28K260j448j865K730M3k428J656P54j387l9J454q55j206J703l43
$$ 1283 -1342 -614 1646 198 -1667 1063 1106 -1322 334 1088 -299 -338 1116 261 -945 758 415
3509D15j199J556K80k027Q02J601j896j26K076p88k200K018J326k671L71K202
$$ 415 -784 772 1052 -975 -173 1428 -468 -594 1482 694 -1506 512 1838 -833 -462 1740
3525A740j416j822K339K77j976J001R91j562q9J697j078n34Q49J08j278J189O49
$$ 1740 324 -1498 841 1118 -858 143 1134 -428 -517 1180 102 -432 417 525 -753 436 1085
3542A085k134P02J847j882q56K277k67k180J626J411k591k97K395j013j464J904
$$ 1085 -1049 -347 1500 -382 -1238 1039 772 -1408 218 1629 -962 -1259 1136 123 -1341 563
3558E63L21k070O44J320j346k45J312n38j055J662m45j248J220Q11k157J56K367
$$ 563 884 -1186 -542 778 -568 -813 499 -39 -1094 568 123 -1125 95 906 -1251 -1095 1272
3575A272j847q71K186kk518J285J991k195p82K591o14k248J489J040k003O38J600
$$ 1272 -575 -1446 740 738 -1780 -495 1496 -699 -1481 1110 496 -1752 -263 777 -1226 -588 1012
3592A012j338p63J417r23m22J367n4j404R82R70j808KK172j097j630K086M65k591
$$ 1012 -326 -1089 328 -595 -1017 350 296 -1108 -126 844 -964 -962 1210 113 -1517 569 1034 -1557
3610a557P97J931j382r51K265m36j830J373P32j640L23J239r53n60J515l05j551
$$ -1557 -760 1171 -211 -1162 1103 667 -1163 210 942 -698 -375 864 -89 -649 866 561 -990
3627i90J537L89j826J186J158j943l44K010l64k247K064Q54k531N37J870j408
$$ -990 547 936 -890 296 1454 -489 -833 1177 813 -1434 630 1484 -1047 -510 1360 -48
3643d8j164J968K45j596R14P57j522m1J815j431k34J449q09r50J244L28j720O63
$$ -48 -1212 756 1001 -595 319 1076 -446 -487 1328 -103 -337 1112 303 -647 597 925 -795 -132
3661a32J444j521r14K094n09k014J847J661k713j8J759o00j484J835M7j945J125
$$ -132 1312 -209 -1123 971 462 -1552 295 1956 -757 -775 984 384 -1100 735 782 -1163 -38
3678c8R48j433l1J436o15j174J640k73j621J347N46j660p8K196j547j195K181
$$ -38 910 -523 -554 882 267 -907 733 460 -1161 186 732 -928 -1006 1190 -357 -1552 629
3695F29k79j703J269J127j949O9J893j046j306J321K74j278R72Q92j483k79J487
$$ 629 350 -1353 -84 1043 -906 -837 1056 10 -1296 25 299 -979 -7 885 -598 -877 610
3712F10j187p83J792r0j754J036J428k146q9K372q23j733J942K23k269R95J577
$$ 610 -577 -1360 432 342 -1412 -376 1052 -1094 -1183 1189 366 -1367 575 798 -1471 -476 1101
3729A101j329o91J665m52j553J680J28j145J34J254j166j98J473n40j514J869
$$ 1101 -228 -919 746 294 -1259 421 549 -596 -462 792 -374 -572 901 361 -1153 716
3745G16M4j753Q48J351j931k7J944o77j907J912P16k092L86J655j316q21J794
$$ 716 760 -993 -145 1206 -725 -752 1192 515 -1392 520 1236 -856 -470 1185 -131 -952 842
3762H42j67j228R10O14j684N72J298j279m47J496n69j043J217M43j516L17J640
$$ 842 675 -553 357 971 -713 -141 1157 -122 -569 927 358 -685 532 975 -541 -224 1416
3779A416j498q43J898M8k024J206J173j815j16J881j190j032J812J5k055J481
$$ 1416 -82 -925 973 1021 -1003 203 1376 -439 -555 1326 136 -896 916 931 -1124 357
3795C57L90j273K26J083r28k63J057l18j177J261P40j998L64J868j581r45J844
$$ 357 747 -526 -300 783 -145 -408 649 331 -846 415 1155 -843 -479 1389 -192 -1137 707
3812G07J24j917J066P12j318k35J998q99j319J492K36j534N53Q98j401M67R61
$$ 707 831 -1086 -20 692 -626 -861 1137 238 -1081 411 647 -887 -334 564 -837 -370 591
3829E91j029p84J937n51j197J243M09j626k06K239j092j127J808j41j841N53J704
$$ 591 -438 -1222 715 164 -1033 210 619 -1007 -1213 1026 -66 -1193 615 474 -1367 -814 890
3846H90j346o04J663n22j290J288L96j493M49J026j019l4J362j014p44J645J59
$$ 890 -456 -1060 603 81 -1209 79 475 -1018 -569 457 -562 -596 766 -248 -992 653 812
3863H12k086J240J117j434n80K083p93j622J402Q73j942M20J867j371n65J164
$$ 812 -1274 -34 1083 -351 -931 1152 359 -1263 139 1012 -930 -510 1357 -14 -579 585
3879E85l54j364J612K19j385O19Q07j087l21J753q67r44J502J81k114R24J696
$$ 585 231 -1133 479 698 -687 -68 739 -348 -669 1084 217 -727 775 956 -1158 -234 1462
3896A462j947k29K036n73j664J256J099j823NJ580j129p22J632K5j504Q83L22
$$ 1462 -485 -714 1322 749 -915 341 1440 -383 -378 1202 73 -649 983 1008 -496 387 709
3913G09j313N13R41j218k76J678j051p30J369J28j720M71J825j620r11K561n38
$$ 709 -604 -91 850 -368 -644 1034 -17 -747 622 750 -970 -499 1326 -294 -1205 1356 818
3930H18j533R90N70j524l68K123r80q10J200k5j068N76P70j725Q04J004j210l05
$$ 818 -715 275 845 -679 -1047 1076 96 -714 486 461 -607 -31 739 -986 -182 822 -388 -693
3948f93J455o48j177J385R30k267M41J447j146j075J993J78j759O70R40j310k15
$$ -693 762 114 -1063 322 1252 -1015 -574 873 -273 -1348 645 823 -936 -266 674 -636 -851
3965h51J730q55j121J297L45j595O39R95j230k10J453r93l90J641k99j938J428
$$ -851 879 24 -1097 200 545 -1050 -411 584 -646 -856 597 -396 -786 855 556 -1382 46
3982D6R58k498P33J972r71j365J551L23k193R60J286j407j80J383o03p29J024
$$ 46 1004 -1494 -761 1211 240 -1125 426 749 -1444 -484 802 -605 -785 598 -5 -734 290
3999B90L98j383M73R77j044j17J209p53p61J626n88j214J011J162j643j36J363
$$ 290 688 -695 -222 755 -289 -406 803 50 -711 915 327 -887 124 1286 -357 -493 870
4016H70j46j875J310J194k247M45J329q91p29J179P2j225J619j67j428O03J009
$$ 870 724 -1151 159 1353 -894 -449 880 -11 -740 439 511 -714 905 738 -690 -87 922
4033I22j044m35J411m98j128J472K89j884R22J234j531r01K360m71j528J140Q97
$$ 922 -122 -557 854 356 -772 700 989 -895 27 1261 -270 -1171 1189 718 -810 330 1227
4050A227j733pJ180n23p40J469k07j224Q39O17j576L82J469j313l51J003k13j322
$$ 1227 -506 -513 667 144 -596 873 666 -558 281 898 -678 -296 1173 -140 -491 512 299 -1023
4068a023J377N71j744K11J620j126q92J628mk014J431R05j362n17J599n23j426
$$ -1023 354 925 -819 -608 1012 -114 -1006 622 618 -1396 35 940 -422 -939 660 137 -1289
4085a289J867k42j085P65N65j179J20J254r23p40J368l55j085R34P41j911L80
$$ -1289 578 336 -749 16 581 -598 -478 776 -147 -887 481 126 -959 -25 716 -1195 -815
4102h15J831j121j173J590J95j565N66J471j402l00J208n09r86R87L08j215R64
$$ -815 1016 -105 -1278 312 507 -1058 -492 979 -423 -723 485 -24 -1010 -23 285 -930 34
4119C4N25j268M41J465j438m49J547m56j082O40R86j514k36J980r22j441J565
$$ 34 559 -709 -268 1197 -241 -690 857 401 -681 -41 945 -569 -805 1175 253 -1188 377
4136C77N88j772M74J447j602k10J417m88n36Q34Lj259P82O79j202l3J651j032
$$ 377 965 -807 -333 1114 -488 -698 719 231 -305 529 532 -727 55 734 -468 -501 1150 118
4154A18r65J558J39j762P41J311j482p60K356o74j667J212R50j733L48J347j211
$$ 118 -847 711 850 -912 -171 1140 -342 -1102 1254 580 -1087 125 1075 -658 -310 1037 -174
4171a74k84J307p32n98O75N61j314O39R33j227p8J290p36j034J501K16j757P38
$$ -174 -458 849 117 -481 194 755 -559 80 1013 -214 -292 998 262 -772 729 945 -812 -74
4189g4J152j308o71J704n10j129Q39P71j342j58J565q52p02J267k78j088Q19O14
$$ -74 1078 -230 -901 803 293 -836 3 774 -568 -726 839 -13 -715 552 274 -814 5 619
4207F19j020J51J182j230l94J251r0j287J061P52j764K15J403j143o86J326K92
$$ 619 -401 -250 932 -298 -692 559 469 -818 243 995 -769 -554 849 -294 -980 346 638
4224F38j659M98R77j062P5J070l08j475J740k35r80P22M07r48k1J339j196m45
$$ 638 -1021 -523 454 -608 -533 537 229 -1246 494 259 -721 1 408 -540 -561 778 -418 -863
4242h63J401Jj598Q81R68j495K5J642r14j013J212M58j768J047O55p97j89J079
$$ -863 538 539 -1059 -178 790 -705 -680 962 48 -965 247 705 -1063 -16 639 -158 -347 732
4260G32m28j176J337m7j450R03Q29j477L04J423p95q06J305J79k033J057J281
$$ 732 304 -872 465 418 -1032 -129 700 -777 -473 950 155 -651 654 833 -1200 -143 1138
4277A138j598k84J836p30j211J391M79j444L50R28r78m19J320n53r65J138M11
$$ 1138 -460 -744 1092 362 -849 542 1021 -423 -73 855 -123 -542 778 225 -740 398 809
4294H09j706R04R81j432j49J591q99j149J619J93j268M48R50q61n64J436n20j141
$$ 809 -897 7 988 -444 -593 998 99 -1050 569 762 -506 -58 892 31 -533 903 383 -758
4312g58J208M13j811J020P72r80l47Q83j77q68R72L21j258M85J232j441l95J618
$$ -758 450 863 -948 72 844 -136 -483 400 223 -645 327 648 -610 -125 1107 -334 -729 889
4330H89j026j073J687J97j694N52J414j322l09J122K6j584J313Q63j833K25J369
$$ 889 -137 -1210 477 674 -1020 -468 946 -376 -685 437 463 -1121 192 1055 -778 -553 816
4347H16r88p10J136m65k95N79P31j762M41J297r11p98J673n58j349J140O14j514
$$ 816 -172 -882 254 -211 -506 73 804 -958 -517 780 -131 -929 744 186 -1163 -23 591 -923
4365i23M74J022k37j449J364K82j293M83P63q48k97J420p05j188J788n01j296
$$ -923 -449 573 336 -1113 251 533 -760 -277 486 -362 -659 761 56 -1132 656 155 -1141
4382a141J288O35j417o8J624r44p44J318m3j636J235Q40j279k11J277o03j025
$$ -1141 147 782 -635 -703 921 -23 -767 551 508 -1128 107 947 -332 -543 734 131 -894
4399h94J382J27j382M13J230j338q8J055m49o81R12K65j039P90P45j244p5J108
$$ -894 488 615 -767 -354 876 -462 -550 505 56 -625 287 552 -487 303 1048 -196 -271 837
4417H37p80j172J867j20j473Q14R34j296m55J788n41j125J098M72j507M35R59
$$ 837 57 -1115 752 632 -841 -27 907 -389 -844 944 403 -722 376 848 -659 -224 735
4434G35n62j30O62o70n62R84j7j120O24R36j248nJ061n29j218J546O83j950M17
$$ 735 173 43 705 35 -527 457 440 -680 -56 880 -368 -373 688 159 -1059 487 1170 -780 -363
4453c63J297j437N7Q60j58j181J163L79j277L32R79q90m70J179n9j474J153K91
$$ -363 934 -503 -446 414 256 -925 238 617 -660 -328 651 -239 -709 470 411 -1063 90 381
4471C81r03O3J450j202m94J504r93o92J095M46j773M69J743j145o99J206j50j413
$$ 381 -522 -459 991 -211 -705 799 -194 -886 209 655 -1118 -649 1094 -51 -750 456 306 -1107
4489a107R62R34j725P03P05o76l58R94j76j191J186J11j412N92J079q67n96J260
$$ -1107 -145 789 -936 -233 472 -204 -562 432 256 -935 251 362 -1050 -458 621 -246 -842 418
4507D18K23j800R63J149j530k68J776j018q58J431J10j071L22R42j318o9J431
$$ 418 641 -1159 -196 953 -577 -845 931 -87 -945 486 596 -475 -153 789 -529 -598 833
4524H33r51m37J288n99p69N42P32j077N3J220q97q30J325Q6j227O73J033j096
$$ 833 -118 -555 733 134 -635 -93 639 -438 -385 835 -62 -892 433 519 -708 -35 998 -98
4542i8q34J816n84p38R57Q4j179N89R93j356p9J265o41p69Q64J87j222Q55R87
$$ -98 -932 884 300 -438 519 603 -576 13 1006 -350 -429 836 195 -574 290 477 -745 110 1097
4561A097j744J55J208n34r63J280N40j877O37J210j362n67J786l38j612J451N31
$$ 1097 -647 -492 716 182 -781 499 1039 -838 -201 1009 -353 -920 866 528 -1084 367 898
4578H98j357L30O72o94m14J270j82j280J280j71r47N28P91j106k79J528j015p71
$$ 898 -459 -129 543 -151 -565 705 523 -757 523 352 -595 -67 724 -382 -661 867 -148 -919
4596i19R86L83j038J96R69o35q55J553n85r06J060K81j361M96J019r03l16J126
$$ -919 67 450 -588 -392 577 -58 -913 640 55 -851 209 490 -871 -375 644 -259 -575 551
4614E51k37j092O54M87j297O90Q26j010n35J489o07r26J154M31j309L18J352r77
$$ 551 314 -778 -124 363 -934 -244 582 -428 -963 526 -81 -1007 147 578 -731 -413 939 -38
4632c8q40J070K7q89M12J012j432N4J313j053j48J036k98j051R11M68j217L49
$$ -38 -878 192 219 -670 -258 754 -678 -624 689 -364 -512 524 226 -825 86 554 -663 -314
4650c14J179q88o84J333k49j212R09Q54j333k40J231n66p82R94J66q76P65O07
$$ -314 865 -23 -707 626 377 -835 74 928 -405 -645 586 20 -762 232 398 -478 287 894
4668H94j124qR87p59o46J235r2j363J178M50j003j22J386o31r27J109K31j406
$$ 894 -230 -238 749 -10 -656 579 487 -876 302 752 -251 -373 1013 382 -545 564 795 -611
4686f11N10J241j587j23J239l46j004J261J77j275K50J127j061j04J099m55r26
$$ -611 -101 1140 -447 -570 669 323 -681 580 757 -518 -268 859 -202 -306 793 338 -588
$$ [...]
8191a13
##END NTUPLES=NMR FID
##END=
