##TITLE=1H_CA-8562
 CDCl3, 8 sc, 
 6.2.2019
##JCAMPDX= 6.0         $$ Bruker NMR JCAMP-DX V2.0
##DATA TYPE= NMR FID
##DATA CLASS= NTUPLES
##ORIGIN= UXNMR, Bruker Analytische Messtechnik GmbH
##OWNER= root
$$ XWIN-NMR		Version 3.5
$$ Wed Feb  6 15:42:10 2019 Russian Standard Time (UT+4h)  she@DPX200
##.OBSERVE FREQUENCY= 200.1313
##.OBSERVE NUCLEUS= ^1H
##.DELAY= (6, 6)
##.ACQUISITION MODE= SIMULTANEOUS
##.ACQUISITION SCHEME= undefined
##.AVERAGES= 8
##.DIGITISER RES= 18
##SPECTROMETER/DATA SYSTEM= spect
##.PULSE SEQUENCE= zg30
##.SOLVENT NAME= CDCl3
##.SHIFT REFERENCE= (INTERNAL, CDCl3, 0, 15.7039)
##AUDIT TRAIL= $$ (NUMBER, WHEN, WHO, WHERE, WHAT)
$$ ##TITLE= Audit trail, XWIN-NMR		Version 3.5
$$ ##JCAMPDX= 5.01
$$ ##ORIGIN= Bruker BioSpin GmbH
$$ ##OWNER= she
$$ F:/spectra/data/she/nmr/H-F/1/audita.txt
$$ ##AUDIT TRAIL=  $$ (NUMBER, WHEN, WHO, WHERE, WHAT)
(   1,<2019-02-06 15:41:22.26 +0400>,<she>,<DPX200>,
      <created by zg, POWCHK disabled, PULCHK disabled
       configuration hash MD5:
       00 E9 B6 7A A2 85 ED C7 34 08 36 98 17 FE 4E 26
       data hash MD5: 16K
       6F 00 E6 B0 E1 30 A8 3F D3 40 66 18 7B 09 8A 58>)
$$ ##END=
$$ 
$$ hash MD5
$$ CB 9A 23 EE 00 71 49 72 52 21 90 52 FA 62 07 0C
##$RELAX= 
##$RELAX= 
##$RELAX= 
##$RELAX= 
##$RELAX= 
##$RELAX= 
$$ Bruker specific parameters
$$ --------------------------
##$DU= <F:/spectra>
##$EXPNO= 1
##$NAME= <H-F>
##$PROCNO= 1
##$TYPE= <nmr>
##$USER= <she>
##$AMP= (0..31)
100 100 100 100 100 100 100 100 100 100 100 100 100 100 100 100 100 100 
100 100 100 100 100 100 100 100 100 100 100 100 100 100 
##$AQSEQ= 0
##$AQ_mod= 1
##$AUNM= <au_zg>
##$AUTOPOS= <>
##$BF1= 200.13
##$BF2= 200.13
##$BF3= 200.13
##$BF4= 200.13
##$BF5= 200.13
##$BF6= 200.13
##$BF7= 200.13
##$BF8= 200.13
##$BYTORDA= 1
##$CFDGTYP= 0
##$CFRGTYP= 5
##$CHEMSTR= <none>
##$CNST= (0..31)
1 1 145 1 1 1 1 1 1 1 1 1 1 1 1 1 1 1 1 1 1 1 1 1 1 1 1 1 1 1 1 1 
##$CPDPRG= <>
##$CPDPRG1= <>
##$CPDPRG2= <>
##$CPDPRG3= <>
##$CPDPRG4= <mlev>
##$CPDPRG5= <mlev>
##$CPDPRG6= <mlev>
##$CPDPRG7= <mlev>
##$CPDPRG8= <mlev>
##$CPDPRGB= <>
##$CPDPRGT= <>
##$D= (0..31)
0 1.2 0 0 0 0 0 0 0 0 0 0.03 0 0 0 0 0 0 0 0 0 0 0 0 0 0 0 0 0 0 0 0 
##$DATE= 1549453281
##$DBL= (0..7)
120 120 120 120 120 120 120 120 
##$DBP= (0..7)
150 150 150 150 150 150 150 150 
##$DBP07= 0
##$DBPNAM0= <>
##$DBPNAM1= <>
##$DBPNAM2= <>
##$DBPNAM3= <>
##$DBPNAM4= <>
##$DBPNAM5= <>
##$DBPNAM6= <>
##$DBPNAM7= <>
##$DBPOAL= (0..7)
0.5 0.5 0.5 0.5 0.5 0.5 0.5 0.5 
##$DBPOFFS= (0..7)
0 0 0 0 0 0 0 0 
##$DE= 6
##$DECBNUC= <off>
##$DECIM= 32
##$DECNUC= <off>
##$DECSTAT= 4
##$DIGMOD= 1
##$DIGTYP= 9
##$DL= (0..7)
0 120 120 120 120 120 120 120 
##$DP= (0..7)
150 150 150 150 150 150 150 150 
##$DP07= 0
##$DPNAME0= <>
##$DPNAME1= <>
##$DPNAME2= <>
##$DPNAME3= <>
##$DPNAME4= <>
##$DPNAME5= <>
##$DPNAME6= <>
##$DPNAME7= <>
##$DPOAL= (0..7)
0.5 0.5 0.5 0.5 0.5 0.5 0.5 0.5 
##$DPOFFS= (0..7)
0 0 0 0 0 0 0 0 
##$DQDMODE= 0
##$DR= 18
##$DS= 0
##$DSLIST= <SSSSSSSSSSSSSSS>
##$DSPFIRM= 0
$$ [...]
##$SUBNAM2= <"">
##$SUBNAM3= <"">
##$SUBNAM4= <"">
##$SUBNAM5= <"">
##$SUBNAM6= <"">
##$SUBNAM7= <"">
##$SUBNAM8= <"">
##$SUBNAM9= <"">
##$SW= 20.0189088683792
##$SWIBOX= (0..15)
0 0 2 0 0 0 0 0 0 0 0 0 0 0 0 0 
##$SW_h= 4006.41025641026
##$TD= 16384
##$TD0= 1
##$TE= 0
##$TE2= 300
##$TE3= 300
##$TEG= 300
##$TL= (0..7)
0 120 120 120 120 120 120 120 
##$TP= (0..7)
150 150 150 150 150 150 150 150 
##$TP07= 0
##$TPNAME0= <>
##$TPNAME1= <>
##$TPNAME2= <>
##$TPNAME3= <>
##$TPNAME4= <>
##$TPNAME5= <>
##$TPNAME6= <>
##$TPNAME7= <>
##$TPOAL= (0..7)
0.5 0.5 0.5 0.5 0.5 0.5 0.5 0.5 
##$TPOFFS= (0..7)
0 0 0 0 0 0 0 0 
##$TUNHIN= 0
##$TUNHOUT= 0
##$TUNXOUT= 0
##$USERA1= <user>
##$USERA2= <user>
##$USERA3= <user>
##$USERA4= <user>
##$USERA5= <user>
##$V9= 5
##$VALIST= <valist>
##$VCLIST= <CCCCCCCCCCCCCCC>
##$VD= 0
##$VDLIST= <DDDDDDDDDDDDDDD>
##$VPLIST= <PPPPPPPPPPPPPPP>
##$VTLIST= <TTTTTTTTTTTTTTT>
##$WBST= 1024
##$WBSW= 4
##$XGAIN= (0..3)
0 0 0 0 
##$XL= 0
##$YL= 0
##$YMAX_a= 226991
##$YMIN_a= -360198
##$ZGOPTNS= <>
##$ZL1= 120
##$ZL2= 120
##$ZL3= 120
##$ZL4= 120
##$ABSF1= 10
##$ABSF2= 0
##$ABSG= 5
##$ABSL= 3
##$ALPHA= 0
##$AQORDER= 0
##$ASSFAC= 0
##$ASSFACI= 0
##$ASSFACX= 0
##$ASSWID= 0
##$AUNMP= <proc_1d>
##$AZFE= 0.1
##$AZFW= 0.1
##$BCFW= 1
##$BC_mod= 2
##$BYTORDP= 1
##$COROFFS= 0
##$CY= 11.3945322036743
##$DATMOD= 1
##$DC= 2
##$DFILT= <>
##$DTYPP= 0
##$F1P= 18.9103706918063
##$F2P= -1.10871071338519
##$FCOR= 0.5
##$FTSIZE= 0
##$FT_mod= 4
##$GAMMA= 1
##$GB= 0.15
##$INTBC= 1
##$INTSCL= 1
##$ISEN= 128
##$LB= 0.24
##$LEV0= 0
##$LPBIN= 0
##$MAXI= 10000
##$MC2= 0
##$MEAN= 0
##$ME_mod= 0
##$MI= 1.114404
##$NCOEF= 0
##$NC_proc= 0
##$NLEV= 6
##$NOISF1= 3.799351
##$NOISF2= 2.8
##$NSP= 1
##$NTH_PI= 0
##$NZP= 0
##$OFFSET= 15.70392
##$PC= 1
##$PHC0= -9045.605
##$PHC1= 22.40004
##$PH_mod= 1
##$PKNL= yes
##$PPARMOD= 0
##$PSCAL= 0
##$PSIGN= 0
##$REVERSE= no
##$SF= 200.130013532006
##$SI= 16384
##$SIGF1= 3
##$SIGF2= 2
##$SINO= 400
##$SIOLD= 16384
##$SREGLST= <1H.CDCl3>
##$SSB= 0
##$STSI= 0
##$STSR= 0
##$SW_p= 3612.71676300578
##$SYMM= 0
##$S_DEV= 0
##$TDeff= 0
##$TDoff= 0
##$TI= <>
##$TILT= no
##$TM1= 0
##$TM2= 0
##$TOPLEV= 0
##$USERP1= <user>
##$USERP2= <user>
##$USERP3= <user>
##$USERP4= <user>
##$USERP5= <user>
##$WDW= 1
##$XDIM= 8192
##$YMAX_p= 0
##$YMIN_p= 0
$$ End of Bruker specific parameters
$$ ---------------------------------
##NTUPLES= NMR FID
##VAR_NAME=  TIME,          FID/REAL,        FID/IMAG
##SYMBOL=    X,             R,               I
##VAR_TYPE=  INDEPENDENT,   DEPENDENT,       DEPENDENT
##VAR_FORM=  AFFN,          ASDF,            ASDF
##VAR_DIM=   8192,          8192,            8192
##UNITS=     SECONDS,       ARBITRARY UNITS, ARBITRARY UNITS
##FACTOR=    0.0002496,     1,               1
##FIRST=     0,             0,               0
##LAST=      2.0444736,     0,               0
##MIN=       0,             -360198,         0
##MAX=       2.0444736,     226991,          0
$$ Real data points
##PAGE= N=1
##DATA TABLE= (X++(R..R)), XYDATA
$$ [...]
$$ plain form
1801 -55 93 -60 -224 68 73 33 349 -111 -354 29 -166 -226 88 119 115 -52 -14 270 164 -152 22 -32 99
1824 99 116 63 -76 -49 -1 245 1 126 -200 -294 -6 -112 23 151 -270 101 63 -52 88 251 89 -146
1846 -146 112 -226 -234 -200 75 43 187 19 117 -138 -8 -207 36 53 -136 82 131 25 -117 -66 242 -264 -44
1869 -44 -105 11 122 -178 123 40 138 -201 99 29 145 25 -23 -3 50 115 -176 -94 -16 -3 51 -39 -171 -76 -52
1894 -52 -65 74 -20 -99 -211 65 -237 86 -83 43 -68 126 203 209 76 -1 24 357 -30 174 100 73 65 10 183
1919 183 41 -25 -53 -2 89 -47 -71 15 61 164 25 -75 -69 63 -195 -4 -6 41 31 -187 -207 -182 54 242 7
1944 7 -50 259 -140 -131 -333 116 20 104 104 -17 -73 27 4 114 -124 30 -72 -82 66 319 -71 22 298 15
1968 15 -6 -77 34 76 -87 11 155 -111 -85 5 249 -103 -22 94 -186 21 -176 -80 305 -163 -145 -79 -128 8
$$ packed form
1801e5J48j53j64K92Nm0L16m60k43L83j95o0L14L1mj67L8K84j06l16J74n4J31
1824I9J7n3j39K7M8K46k44J25l26r4K88j06J35J28m21L71l8j15J40J63j62k35
1846a46K58l38qL4K75l2J44j68R8k55J30j99K43J7j89K18M9j06j42N1L08n06K20
1869d4o1J16J11l00L01q3R8l39L00p0J16j20m8K0N3O5k91Q2P8J3N4r0j32R5K4
1894e2j3J39r4p9j12K76l02L23j69J26j11J94P7Oj33p7K5L33l87K04p4k7qn5J73
1919A83j42o6k8N1R1j36k4Q6M6J03j39j00OJ32k58J91kM7j0k18k0K5K36J88k35
1944Gn7L09l99Rk02M49r6Q4%j21n6J00k3J10k38J54j02j0J48K53l90R3K76k83
1968A5k1p1J11M2j63R8J44k66K6R0K44l52Q1J16k80K07j97R6L85m68J8O6m9J36
$$ plain form
1992 8 -111 104 22 372 -40 37 -11 -231 -43 -196 15 -2 108 -307 -111 -36 -65 17 -82 107 -66 -175 184
2015 184 46 -82 104 33 -58 -4 -39 -106 -19 -71 -147 -365 -76 223 168 33 148 350 -220 26 56 -122 238
2038 238 156 -182 270 -224 -76 -20 57 -14 -107 -1 30 24 175 -39 -166 -116 -109 -30 115 -83 -110 254 52 89 -126
2063 -126 17 -11 73 36 -225 -43 107 277 72 -19 74 84 -83 112 51 -141 -89 29 7 6 1 87 -81 -161 -38
2088 -38 107 -40 131 -36 -208 4 79 3 -284 64 -55 175 -16 -19 -11 -309 257 159 -36 -263 266 -8 3
2111 3 -75 -141 27 53 -163 -104 3 221 122 80 88 -13 77 70 -49 -50 -70 -3 -32 -6 -128 -116 11 -51 -102 -29 -83 68
2139 68 134 16 68 -146 -175 19 -41 40 -117 -17 156 8 191 -177 133 70 28 -127 149 33 -24 -76 -11 -94
2163 -94 -320 -47 -187 -46 -85 -47 -111 -9 92 116 133 -83 -226 -90 -9 168 -71 -27 210 -57 -206 154 -46
$$ packed form
1992Hj19K15q2L50m12P7m8k20J88j53K11j7J10m15J96P5k9Q2r9J89j73j09L59
2015A84j38j28J86p1r1N4l5o7Q7n2p6k18K89K99n5j35J15K02n70K46L0j78L60
2038B38q2l38M52m94J48N6P7p1r3J06L1oJ51k14j27N0PP9J45j98k7L64k02L7k15
2063a26J43k8Q4l7k61J82J50J70k05r1R3J0j67J95o1j92N2J18k2jnQ6j68q0J23
2088c8J45j47J71j67j72K12P5p6k87L48j19K30j91lQk98N66r8j95k27N29k74J1
2111Cp8o6J68K6k16N9J07K18r9m2Qj01R0pj19jk0O7k9K6j22J2J27o2n1P3n4J51
2139F8O6j18N2k14k9J94o0Q1j57J00J73j48J83l68L10o3m2j55K76j16n7n2O5q3
2163i4k26K73j40J41l9L8o4J02J01K4J7k16j43J36Q1J77k39M4K37k67j49L60k00
$$ plain form
2186 -46 147 -127 -67 -155 -171 -8 -184 -25 -51 98 54 32 -1 -31 -106 -50 292 50 113 52 -203 -66 -69 20 190
2211 190 -88 -73 -124 -53 114 206 -156 -37 122 238 -57 196 113 -137 65 -76 300 -54 87 -16 -93 38
2233 38 -112 1 154 102 -49 443 41 -162 16 168 -89 207 -32 -16 85 36 -74 -44 -240 -158 34 -82
2255 -82 -114 1 -38 -279 -187 -94 -4 88 13 39 126 107 -109 26 -68 188 -24 -288 -38 23 -82 262 -16 -98 98
2280 98 60 -58 -73 2 51 -119 -180 -156 28 -28 -292 0 -161 -135 -178 -35 -43 -189 -184 -203 79 94 37 156 -75 -15
2306 -15 -270 14 -159 69 105 -289 78 -188 -20 -124 -281 62 208 -104 -219 130 -161 15 89 15 -112
2327 -112 -207 46 -247 -59 346 176 -54 -19 -78 -60 36 91 -12 -34 -75 11 9 -313 -133 -135 134 9 -31 199 -39
2352 -39 25 106 -134 -227 -102 -94 151 -6 -41 -99 160 183 -213 8 228 -103 -2 306 -44 65 1 100 187 211
$$ packed form
2186d6J93k74O0q8j6J63j76J59k6J49m4k2l3l0p5N6L42k42O3o1k55J37lQ9J70
2211A90k78J5n1P1J67R2l62J19J59J16k95K53q3k50K02j41L76l54J41j03p7J31
2233C8j50J13J53n2j51M92m02k03J78J52k57K96k39J6J01m9j10L0j96Q2J92j16
2255h2l2J15l9k41R2R3R0R2p5K6Q7j9k16J35r4K56k12k64K50O1j05L44k78q2J96
2280I8l8j18j5P5M9j70o1K4J84n6k64K92j61K6m3J43qj46Nj9K82J5n7J19k31O0
2306a5k55K84j73K28L6l94L67k66J68j04j57L43J46l12j15L49k91J76P4p4j27
2327a12r5K53k93J88M05j70k30L5n9J8R6N5j03k2m1Q6kl22J80kK69j25m0K30k38
2352c9O4Q1k40r3J25QK45j57l5n8K59K3l96K21K20l31J01L08l50J09o4R9Q7K4
$$ plain form
2376 211 -57 -98 62 -74 316 93 -234 124 -128 -127 -234 221 -107 -98 -65 -100 29 97 -99 202 115 -15 -8 21
2400 21 99 -81 -111 -22 114 30 143 234 -71 -68 -47 -128 -257 -146 -123 114 -33 44 39 -266 -66 91 143 -128 92
2425 92 -246 90 436 -121 217 239 -38 -192 64 79 50 -52 46 21 126 78 -57 146 144 24 -102 27 72
2448 72 -109 288 -99 -325 300 8 -50 -230 20 -84 273 -72 27 36 -112 -187 -176 -225 24 -78 -7 -15 55 -64
2472 -64 201 -98 128 -58 216 -40 92 27 162 37 -185 -105 50 -109 192 48 213 8 41 83 -15 -261
2494 -261 -51 -194 7 -302 90 176 74 76 264 117 -119 -1 35 -111 -20 0 -220 -47 -40 140 -92 -126 -8
2517 -8 253 -62 61 -41 37 -263 18 56 307 72 -201 42 93 -92 256 -84 21 -61 -13 -2 53 -38 175
2540 175 135 -48 -29 -160 126 -99 -168 77 -172 7 -138 -72 124 19 151 -102 -102 -164 53 438 -126 59
$$ packed form
2376B11k68m1J60j36L90k23l27L58k52Jj07M55l28RL3l5J29O8j96L01q7j30PK9
2400B1P8j80l0Q9J36q4J13R1l05LK1q1j29J11K3K37j47P7nl05K00J57N2k71K20
2425I2l38L36L46n57L38K2k77j54K56J5k9j02R8k5J05m8j35K03kj20j26J29M5
2448G2j81L97l87k26O25k92n8j80K50j04L57l45R9Rj48p5J1m9K49j02P1qP0j19
2472f4K65k99K26j86K74k56J32o5J35j25k22Q0J55j59L01j44J65k05L3M2r8k46
2494b61K10j43K01l09L92Q6j02KJ88j47k36J18L6j46R1K0k20J73PJ80k32l4J18
2517hK61l15J23j02P8l00K81L8K51k35k73K43N1j85L48l40J05q2M8J1N5r1K13
2540A75m0j83J9j31K86k25o9K45k49J79j45O6J96j05J32k53%o2K17L85n64J85
$$ plain form
2562 59 125 -60 -39 -354 -56 93 -12 -60 -30 -45 -34 48 51 90 123 102 13 -140 220 127 298 -61 150 -95 -54
2587 -54 -17 -173 59 197 -262 -3 -207 178 -46 -219 43 -149 102 -42 -121 159 -42 65 -149 177 -49
2608 -49 -209 -50 -147 236 -121 -244 17 205 -68 -72 -120 -91 97 -187 -135 14 336 -201 -52 -82 -13 141 95
2631 95 21 -80 -8 -151 -34 36 151 -25 -249 318 171 38 83 -15 -128 -72 63 -6 -68 213 -46 -171 -424
2654 -424 -15 -64 51 -30 29 30 158 28 139 53 110 -63 291 57 122 -139 8 -11 15 -38 -24 -67 -22 -26 -136
2679 -136 -50 125 -44 -281 -165 0 27 181 52 22 71 -59 -159 -180 61 -39 -94 -212 176 -33 129 28
2701 28 106 31 -44 243 -36 149 -223 202 34 -182 -38 -30 185 -28 -68 71 180 -164 -75 -337 93 -118 -124
2724 -124 -118 35 -82 -130 -40 38 26 145 42 189 -150 -24 73 68 50 136 191 -43 -172 75 45 189 28 -45 -69
$$ packed form
2562E9O6j85K1l15K98J49j05m8L0j5J1Q2LL9L3k1q9j53L60r3J71l59K11k45M1
2587e4L7j56K32J38m59K59k04L85k24j73K62j92K51j44p9K80k01J07k14L26k26
2608d9j60J59r7L83l57j23K61J88k73mm8K9J88k84N2J49L22n37J49l0O9J54m6
2631I5p4j01P2j43J17P0J15j76k24N67j47j33M5r8j13N6J35o9o2K81k59j25k53
2654d24M09m9J15q1N9JJ28j30J11q6N7j73L54k34O5k61J47j9K6n3J4m3M5mj10
2679a36Q6J75j69k37J16J65K7J54j29l0M9j30j00k1K41j00n5j18L88k09J62j01
2701B8P8p5p5K87k79J85l72M25j68k16J44QK15k13m0J39J09l44Q9k62M30k11o
2724a24OJ53j17m8R0P8j2J19j03J47l39J26R7nj8Q6N5k34j29K47l0J44j61p3k4
$$ plain form
2749 -69 -23 69 -179 155 -170 -297 320 106 278 69 -54 11 -256 -46 172 -159 -156 154 88 109 -170 183 -19
2772 -19 144 380 187 64 32 -148 -61 46 135 22 -7 161 -200 -157 330 -160 126 138 -133 -177 -228 -21 -225
2795 -225 200 -58 -188 -341 -29 12 267 -52 -314 76 7 -67 -84 -78 -72 -110 38 400 94 -7 29 -169 21
2818 21 43 -16 352 -38 -268 292 279 139 -49 49 -12 -167 -127 25 103 -43 -55 -181 -34 111 174 -151 59
2841 59 -27 -107 -108 69 -35 73 -259 84 89 86 -44 -101 127 -29 -232 202 -119 8 -66 4 74 -133 260 -239
2865 -239 -141 -155 -66 -1 52 117 214 -198 135 -141 -95 -72 -116 -229 -200 33 -122 -133 -76 -108 -91 136 -239 -117 -140
2890 -140 -28 -39 -36 -102 -69 -107 -123 -28 -131 -30 -177 163 92 221 -72 -56 262 85 22 -92 54 158 365 61
2914 61 -72 50 149 140 166 -190 -173 -60 -185 2 -206 -118 115 94 187 42 89 -25 244 145 18 -185 99 62
$$ packed form
2749f9M6R2k48L34l25j27O17k14J72k09j23O5k67K10K18l31LL10o6K1k79L53k02
2772a9J63K36j93j23l2j80Q7J07Q9j13k9J68l61M3M87m90K86J2k71m4n1K07k04
2795b25M25k58j30j53L12M1K55l19k62L90o9p4j7OOl8J48L62l06j01L6j98J90
2818B1K2n9L68l90k30N60j3j40j88R8o1j55M0J52P8j46j2j26J47J45O3l25K10
2841E9q6q0jJ77j04J08l32L43Nlj30n7K28j56k03M34l21J27p4P0P0k07L93m99
2865b39R8j4Q9O5N3O5R7m12L33k76M6K3m4j13K9K33j55j1N7l2J7K27l75J22k3
2890a40J12j1Lo6L3l8j6R5j03J01j47L40p1J29k93J6L18j77o3j14J46J04K07l04
2914F1j33J22R9rK6l56J7J13j25J87k08Q8K33k1R3j45M7j14K69r9j27k03K84l7
$$ plain form
2938 62 34 -42 -140 180 249 -77 -91 118 85 129 -113 81 -100 357 323 13 25 56 -36 -122 9 16 -51 60 32 -83
2964 -83 -26 -18 189 -82 -21 -157 34 -5 -14 -251 -197 -131 -180 142 -439 86 -68 -146 -92 168 135 -19 -41 -37 108 -56
2990 -56 -58 15 -28 193 -19 -174 254 -47 -85 -328 79 -146 -35 4 147 117 -67 57 10 -24 342 335 -77 51
3014 51 -57 147 -235 116 -110 -77 -213 33 -9 50 -83 220 32 -86 166 79 94 -123 -55 -159 -332 -272 64
3037 64 -65 -3 -149 105 41 71 170 -46 -84 -72 -55 67 142 -73 -60 -101 92 -109 73 12 -221 88 76 -17 165
3062 165 -155 132 4 -42 280 -185 -168 171 -41 178 -109 -36 1 -63 243 383 174 45 -52 67 146 -215
3084 -215 -123 -48 -160 40 322 -186 -49 -169 -189 -96 -25 -204 -165 245 -58 177 164 -34 -135 122 -76 25
3106 25 -183 -131 -7 -283 43 202 -260 -131 161 171 90 100 8 35 -123 -89 -31 -43 64 -5 181 -252 -42 97
$$ packed form
2938F2k8p6r8L20O9l26j4K09l3M4k42J94j81M57l4l10J2L1r2q6J31Po7J11k8j15
2964h3N7QK07k71O1j36J91l9rk37N4O6m9L22n81N25j54p8N4K60l3j54k2MJ45j64
2990e6kP3m3K21k12j55M28l01l8k43M07k25J11L9J43l0j84J24m7l4L66pm12J28
3014E1j08K04l82L51k26L3j36K46m2N9j33L03j88j18K52q7J5k17O8j04j73O0L36
3037F4j29O2j46K54o4L0R9k16l8J2J7J22P5k15J3m1J93k01J82o1k33L09j2r3J82
3062A65l20K87j28m6L22m65J7L39k12K19k87P3L7o4L06J40k09j29r7J19P9l61
3084b15R2P5j12K00K82n08J37j20k0R3P1j79L9M10l03K35j3j98j01K57j98J01
3106B5k08N2J24k76L26J59m62J29K92J0q1J0r2K7j58L4N8j2J07o9J86m33K10J39
$$ plain form
3130 97 -126 -17 92 281 -14 86 9 -355 23 125 -62 286 124 -64 170 302 101 143 66 163 -236 61
3152 61 -88 -89 -157 144 6 -9 213 51 254 80 108 -166 -14 75 -105 134 -96 -305 -20 218 36 115 -100
3175 -100 101 -56 81 161 264 -39 -45 15 128 118 -2 19 165 -66 303 -147 -111 235 107 23 -221 49 44
3198 44 24 -81 -114 -153 117 -56 -52 -231 183 19 -11 -77 -110 -70 84 -45 103 -86 282 -139 -162 -96 166 73
3222 73 80 -236 -54 188 82 141 183 228 107 330 124 -159 22 -33 -203 116 50 73 56 20 -132 76 127 -120
3246 -120 -367 -59 128 191 8 -110 2 24 -111 -139 70 16 -70 73 -59 -106 9 -32 -184 -152 37 -169 36
3269 36 127 -69 -78 -123 210 9 132 159 191 81 46 68 94 191 -209 -9 -101 174 -89 -132 127 63 -86 137 188
3294 188 -122 -113 -168 126 -22 96 -172 139 -53 -76 153 -91 85 60 -206 -156 9 -121 95 35 157 5
$$ packed form
3130I7k23J09J09J89k95J00p7l64L78J02j87L48j62j88K34J32k01M2p7R7l99K97
3152F1j49jo8L01j38j5K22j62K03j74K8k74J52Q9j80K39k30k09K85K38j82P9k15
3175a00K01j57J37Q0J03l03oO0J13j0j20K1J46k31L69m50L6L46j28q4k44K70n
3198D4k0j05l3l9K70j73Mj79M14j64l0o6l3M0J54j29J48j89L68m21k3O6K62r3
3222G3Pl16J82K42j06N9M2M5j21K23k06k83J81n5j70L19o6K3j7l6j52K08N1k47
3246a20k47L08J87O3j83j18J12K2j35k8K09n4q6J43j32m7J15m1j52L2J89k06K05
3269C6R1j96rm5L33k01J23K7L2j10l5K2K6R7m00K00r2K75k63m3K59o4j49K23N1
3294A88l10Rn5K94j48J18k68L11j92k3K29k44J76k5k66N0J65j30K16o0J22j52
$$ plain form
3316 5 -154 28 126 -127 164 -68 84 -20 -347 9 -91 -94 126 -153 -223 49 -47 -3 146 82 -243 -7 -158
3339 -158 -217 38 -66 27 -115 -52 165 59 -75 -153 36 -304 -182 6 -45 -119 -84 76 -306 -32 157 -290
3361 -290 114 46 -157 -7 138 31 146 -58 11 -93 255 -114 -25 173 154 -52 85 26 13 93 -211 104
3383 104 -191 248 133 -11 17 6 51 -216 -66 -159 127 -67 -36 38 -21 59 -76 -445 -142 -126 20 98 76 -94
3407 -94 -44 107 -143 -279 -38 -307 100 186 -177 48 -16 96 172 -20 234 -108 365 -42 -48 -19 137 156 91
3430 91 65 67 -364 92 -178 -91 -101 -159 -96 -102 -61 -63 -208 181 279 -80 -42 -33 -136 -272 184 -106 -194 145 -377 -184
3456 -184 -39 -184 119 -220 -172 37 -58 117 -236 165 36 114 -13 127 -82 323 -81 -257 2 183 211
3477 211 11 -36 -20 -56 -319 146 -17 -7 5 52 36 -38 -97 148 -117 202 210 144 -118 65 20 -35 -51 -118 -105 -106
$$ packed form
3316Ej59J82R8k53K91k32J52j04l27L56j00lK20k79p0K72r6M4J49o4l25K36j51
3339a58n9K55j04R3j42O3K17j06j34p8J89l40J22J88n1p4L5J60l82K74J89m47
3361b90M04o8k03J50J45j07J15k04O9j04L48l69Q9J98j9k06J37n9j3Q0l04L15
3383A04k95M39j15j44K8j1M5k67J50r3K86j94L1P4n9Q0j35l69L03J6J46P8k2j70
3407i4N0J51k50j36K41k69M07Q6l63K25o4J12P6j92K54l42M73m07oK9J56J9o5
3430I1k6Km31M56k70Q7j0n8O3oM1kj45L89R8l59L8Rj03j36M56k90q8L39n22J93
3456a84J45j45L03l39M8K09r5J75l53M01j29P8j27J40k09M05m04j76K59J81K8
3477B11k00m7J6l6k63M65j63J0J2M7j6p4n9K45k65L19Qo6k62J83m5n5j6o7J3j
$$ plain form
3503 -106 122 -209 -169 33 219 289 75 22 -82 109 219 18 -95 -115 14 93 99 201 -221 -207 -130 -6 126
3526 126 248 153 141 97 14 -146 65 71 -106 -196 -298 -60 -51 18 -234 -17 336 9 26 71 -32 181 0 104
3550 104 180 191 -25 100 -50 -7 180 28 219 7 -15 -78 -46 121 -131 13 128 43 -44 -63 -85 209 157 26
3574 26 -71 96 145 -50 17 -182 9 41 -45 -4 99 6 -140 63 264 -223 0 96 35 -61 113 -155 -72 326
3598 326 134 37 -55 -85 185 -230 224 -54 -55 -15 5 61 34 -63 -102 90 123 -147 -185 -87 119 289 0 -229 27
3623 27 92 103 -125 227 -131 -174 163 -69 -119 202 135 -302 177 130 -36 120 -5 -143 -41 -105 170 54 -63
3646 -63 -49 83 -138 52 -131 192 -81 189 -118 47 -26 111 191 26 16 -49 28 -125 62 128 14 -191 66
3669 66 -189 194 -268 183 -297 -144 52 47 -214 -239 -91 283 108 36 -13 -50 207 -84 -269 -5 54 -90 134
$$ packed form
3503a06K28l31M0K02J86P0k14n3j04J91J10k01j13k0J29P9OJ02m22J4P7J24J32
3526A26J22r5j2m4q3j60K11Oj77r0j02K38RO9k52K17L53l27J7M5j03K13j81J04
3550A04P6J1k16J25j50M3J87j52J91k12k2o3L2J67k52J44J15q5q7j9k2K94n2j31
3574B6r7J67M9j95O7j99J91L2q6M1J03r3j46K03K01m87K23R6o1r6J74k68Q3L98
3598C26j92r7r2l0K70m15M54k78jM0K0N6k7r7l9J92L3k70l8R8K06J70k89k29K56
3623B7O5J1k28L52l58m3L37k32n0L21o7m37M79m7j66J56j25j38J02o4K75j16j17
3646f3J4J32k21J90j83L23k73K70l07J65p3J37Q0j65j0o5P7j53J87O6j14k05K57
3669F6k55L83m62M51m80J53J96nk61k5J48L74j75p2m9l7K57k91j85K64N9j44K24
$$ plain form
3692 134 -19 -44 -10 160 -101 -258 241 -64 46 -8 134 41 -7 -136 182 237 -45 94 251 49 -145 218
3714 218 -164 -37 124 217 -223 -30 -137 108 62 -69 -83 128 -61 -93 55 162 13 -70 -76 21 19 76 131 72
3738 72 57 131 164 167 -84 -188 135 -260 143 -351 114 -60 23 -257 -73 243 -6 -234 -80 249 -92 196
3760 196 65 -78 130 -108 -69 17 10 -328 -69 -54 127 -159 -73 187 -41 63 -159 -63 232 4 153 -12
3782 -12 50 65 165 -125 -210 79 103 32 184 -7 78 65 97 -32 -249 84 -77 132 10 -24 195 -216 42
3805 42 -23 -85 -94 32 10 -3 -62 -135 141 118 -8 18 5 -52 74 55 13 -73 -171 77 -84 -63 54 -44 51 -114 93
3832 93 -21 -20 73 84 124 130 50 75 247 201 69 10 305 26 -65 168 53 238 -328 3 8 -192 -15 -270 -227
3857 -227 -148 -144 35 55 44 -146 -89 -104 8 292 -92 -1 -107 -203 -258 -15 -70 39 311 33 45 -87 -173 -45
$$ packed form
3692A34j53k5L4J70k61j57M99l05J10n4J42r3m8j29L18N5k82J39J57k02j94L63
3714B18l82J27J61R3m40J93j07K45m6j31j4K11j89l2J48J07j49q3oR7kN7N5n9
3738G2j5P4L3Lk51j04L23l95M03m94M65j74Q3k80J84L16k49k28J54L29l41K88
3760A96j31j43K08k38L9Q6pl38K59J5J81k86Q6K60k28J04k22R6K95k28J49j65
3782a2O2J5J00k90q5K89K4p1J52j91Q5j3L2j29k17L33j61K09j22l4K19m11K58
3805D2o5o2rJ26k2j3n9p3K76k3j26K6j3n7J26j9m2q6r8K48j61K1J17r8R5j65K07
3832I3j14JR3J1M0Oq0K5J72m6j32n9K95k79r1K33j15J85n66L31Nk00J77k55M3
3857b27P9MJ79K0j1j90N7j5J12K84l84R1j06r6n5K43n5J09K72k78J2j32q6J28
$$ plain form
3881 -45 -138 120 -108 108 -181 -63 211 212 179 238 159 206 -68 55 226 33 65 -38 -84 -217 -47 143 39
3904 39 37 124 46 -48 51 -133 94 -82 -207 -70 21 59 41 -123 -7 -86 -6 140 97 125 -219 -9 17 -15 -138
3929 -138 -315 -82 44 -282 53 -46 -73 206 249 -109 422 108 -224 -297 -5 23 127 -332 21 28 -115 163
3951 163 127 40 -44 -185 -121 -108 68 -56 -213 51 -53 31 -72 125 -56 101 -138 -125 -139 -109 -112 98 -131 -72
3975 -72 51 -65 -108 162 -44 119 122 86 -12 -132 193 -41 -45 119 -24 -289 -53 -90 -49 79 -64 -25 -10 -43
3999 -43 -75 -41 -89 -153 10 -133 -49 -13 50 -43 -157 259 -163 -12 36 -150 -65 183 104 -62 195 -3 75 -65
4023 -65 111 141 -101 6 -134 -104 0 -23 -20 88 47 -25 -69 22 276 -105 -59 63 -66 -75 8 -161 -174 -122 67
4048 67 14 -159 169 -39 -126 123 -11 -130 61 153 120 -161 -129 159 118 -157 -90 -141 131 227 -51 114 -212
$$ packed form
3881d5r3K58k28K16k89J18K74Jl3N9p9M7k74J23J71j93L2j03m6j33J70J90j04
3904C9kQ7p8r4R9j84K27j76j25J37R1L8j8j64J16p9Q0J46m3K8l44K10K6l2j23
3929a38j77K33J26l26L35r9k7K79M3l58N31l14l32p3K92K8J04m59L53Pj43K78
3951A63l6q7q4j41O4J3J76j24j57K64j04Q4j03J97j81J57k39J3j4L0lK10k29N9
3975g2J23j16m3K70k06J63Ll6r8j20L25k34mJ64j43k65K36l7M1J28j43L9J5l3
3999d3l2L4m8o4J63j43Q4L6O3r3j14M16m22J51M8j86Q5K48p9j66K57j98P8j40
4023f5J76L0k42J07j40L0J04k3LJ08m1p2m4R1K54l81M6J22j29rQ3j69j3N2J89
4048F7n3j73L28k08q7K49j34j19J91R2l3k81L2K88m1k75O7n1K72R6k78J65l26
$$ plain form
4071 -212 -155 -89 42 -101 -58 -398 199 37 -85 167 -408 106 112 -104 -53 -53 15 107 17 -4 -12 176 169 -26 -130
4096 -130 127 -192 -71 -181 90 -203 43 52 -126 -117 -48 -1 53 -137 357 -189 192 -6 199 -220 51 301
4118 301 8 -33 -115 -303 -194 111 -100 62 53 135 -65 -17 76 -11 -270 -94 -200 -177 -10 -12 -241 79 -71 130
4142 130 -24 124 -105 -25 109 17 33 -51 0 82 367 325 -173 41 -192 216 244 50 -92 -153 -88 46 78 25
4166 25 -94 19 129 -93 23 -87 44 -19 -84 -22 -107 111 -79 -66 -38 9 -174 64 25 -73 -180 86 136 112
4190 112 -120 -119 -130 -32 120 118 391 -88 -260 148 -15 29 -173 -16 30 -140 104 -155 90 137 -112 45 -113
4213 -113 62 22 67 280 -119 189 113 -40 17 166 216 -187 3 -37 -141 193 164 -185 -137 21 93 -120 22
4236 22 -288 307 29 68 75 -195 34 -139 63 155 99 -150 -72 102 41 -443 -102 143 219 -47 160 26 128
$$ packed form
4071b12N7O6J31j43M3l40N97j62j22K52n75N14Ok16N1%O8R2r0k1qJ88pj95j04
4096a30K57l19J21j10K71k93K46Rj78RO9M7N4j90M94n46L81j98K05m19K71K50
4118C01k93m1q2j88J09L05k11J62rQ2k00M8R3q7k59J76j06K3J67kk29L20j50K01
4142A30j54J48k29Q0J34r2J6q4N1Q2K85m2m98K14k33M08K8j94j42o1O5J34L2n3
4166B5j19J13J10k22J16j10J31o3o5O2q5K18j90J3K8M7j83K38l9r8j07K66N0k4
4190A12k32Jj1R8J52kK73m79j72M08j63M4k02J57M6j70K44k59K45M7k49J57j58
4213a13J75m0M5K13l99L08p6j53N7J49N0m03J90m0j04L34k9l49M8J58P2k13J42
4236B2l10N95k78L9Pk70K29j73K02R2n6k49P8J74o1m84L41K45P6k66K07j34J02
$$ plain form
4259 128 -133 52 -177 95 -95 107 38 -350 -28 -122 291 -189 181 -130 24 23 0 12 -275 -39 -105 83
4281 83 -151 43 -62 -330 196 455 88 -22 -238 43 53 137 19 -67 -216 -290 142 64 -141 9 88 151 168
4304 168 -23 93 -38 -32 -144 240 -8 -110 26 -113 98 -128 33 -80 -200 -116 -41 159 -121 112 -263
4325 -263 202 -68 -8 17 -49 85 38 -72 23 26 -4 98 -120 195 -27 -26 6 57 49 248 178 250 -126 204 7
4350 7 -50 -163 172 -92 -134 54 -45 71 -222 161 92 31 86 117 -61 -6 -16 -3 142 146 -33 -70 160 -108 110
4375 110 -122 14 95 11 174 126 -102 93 113 -62 -12 205 -87 -50 176 -144 58 290 -128 -118 -171 -61 121
4398 121 111 144 -264 30 -219 39 29 -279 118 -110 -41 -191 113 -184 164 -229 55 -246 -47 -179 35
4419 35 204 11 75 -45 -3 74 -87 110 194 0 28 -120 -235 -73 20 -146 -71 55 150 39 -56 145 37
$$ packed form
4259A28k61J85k29K72j90K02o9l88L22r4M13m80L70l11J54jk3J2k87K36o6J88
4281H3k34J94j05k68N26K59l67j10k16K81J0Q4j18q6j49p4M32p8k05J50P9O3J7
4304A68j91J16j31Oj12L84k48j02J36j39K11k26J61j13j20Q4P5K00k80K33l75
4325b63M65k70O0K5o6J34m7j10R5Ll0J02k18L15k22JL2N1qJ99p0P2l76L30j97
4350Gn7j13L35k64m2J88r9J16k93L83o9o1N5L1j78N5j0J3J45Mj79l7K30k68K18
4375A10k32J36Q1q4J63m8k28J95K0j75N0K17k92L7K26l20K02K32m18J0n3J10J82
4398A21j0L3m08K94k49K58j0l08L97k28O9j50L04k97L48l93K84l01J99j32K14
4419C5J69j93O4j20M2P7j61J97Q4j94K8j48j15J62R3j66P5J26R5j11r5K01j08
$$ plain form
4442 37 -138 -1 -74 252 120 17 -86 -169 -115 -221 113 99 0 14 -386 -41 169 -27 -51 -1 152 -65 -95
4465 -95 -135 -20 -137 -47 64 122 -57 -63 -18 203 56 -99 61 73 -58 -80 -76 40 -148 254 -174 -146 95 -186
4489 -186 -104 104 78 183 79 -152 211 -81 148 -108 66 126 -17 -118 -198 125 -148 77 106 76 166 159 -116
4512 -116 163 -152 -132 31 -231 -15 0 218 -103 64 -75 12 -76 -232 -9 -180 -135 -127 4 277 -200 -206 -367
4535 -367 80 -112 -50 -55 212 214 -291 88 18 53 -71 123 208 -99 -92 -94 16 60 -138 -87 -207 -91 41 -8 -126
4560 -126 130 -121 51 50 -140 18 67 47 -55 -161 147 -55 39 90 -189 -161 115 -49 42 -32 15 -75 -102 -63
4584 -63 47 62 184 -65 -161 58 -112 -1 -385 156 -41 -252 -98 -283 71 177 -205 -121 100 15 54 -55
4606 -55 -30 -277 -200 -82 -212 82 20 -69 148 -22 -58 -40 49 253 171 67 3 175 -179 -184 98 -27 141 -269
$$ packed form
4442C7j75J37p3L26j32j03j03q3N4j06L34j4r9J4m00L45K10j96k4N0J53k17l0
4465i5m0J15j17R0J11N8j79oM5K21j47j55J60J2j31k2MJ16j88M02m28K8K41k81
4489a86Q2K08k6J05j04k31L63k92K29k56J74O0j43j01q0L23k73K25K9l0R0pk75
4512a16K79l15K0J63k62K16J5K18l21J67j39Q7q8j56K23j71M5QJ31K73m77oj61
4535c67M47j92O2nK67Kn05L79p0L5j24J94Q5l07PkJ10M4j98N1j20J16J32m9j18
4560a26K56k51J72jj90J58M9k0j02j06L08k02R4N1k79K8K76j64R1p4M7r0k7L9
4584f3J10J5J22k49r6K19j70J11l84N41j97k11J54j85L54J06l82Q4K21q5L9j09
4606e5K5k47P7J18j30K94o2q9K17j70l6J8Q9K04q2j04o4J72l54nK82j25J68m10
$$ plain form
4630 -269 10 387 222 156 80 210 191 281 82 -222 -131 95 262 -56 -219 -16 59 -89 -63 -122 -118 -140 72 -4
4654 -4 193 -11 -54 -94 -57 -126 67 -287 131 91 118 -71 -123 31 20 -115 -116 -129 -18 135 -217 133 218 84 -132
4679 -132 21 163 -169 292 276 -162 -98 190 79 56 -132 41 -182 -286 -2 -227 -176 -23 137 11 -153
4700 -153 -55 -67 -115 80 -29 19 29 -239 -151 233 204 77 -198 -155 -109 -89 -27 -81 79 -103 -22 -122 124 123 -203
4725 -203 -88 103 2 -11 32 -88 -104 -39 -168 -143 335 -102 130 -24 -167 -197 -86 -142 37 90 -208 3 -193
4748 -193 -3 141 -33 174 -224 202 194 -32 -132 154 -71 -104 -75 30 111 -153 -165 -55 -108 -156 0 57 -25
4771 -25 -233 -58 -128 191 13 93 91 -94 72 -72 93 -91 -62 234 67 95 -132 -28 -365 -120 -113 -149 127
4794 127 223 -46 -75 -60 25 150 107 228 -290 302 85 -156 233 158 -14 -160 191 45 170 43 144 48
$$ packed form
4630b69K79L77j65o6p6J30j9R0j99l04R1K26J67l18j63K03P5j48K6n9Mk2K12p6
4654dJ97k04m3m0L7o9J93l54M18m0K7j89n2J54j1j35jj3J11J53l52L50Q5j34k16
4679a32J53J42l32M61j6m38O4K88j11k3j88J73k23j04K84k25N1J53J60j26j64
4700a53R8j2m8J95j09M8J0k68Q8L84k9j27k75M3M6K0O2n4J60j82Q1j00K46jl26
4725b03J15J91j01j3M3j20j6O5j29K5M78m37K32j54j43l0J11n6J79N3k98K11j96
4748a93J90J44j74K07l98M26qk26j00K86k25l3K9J05Q1k64j2J10n3m8J56N7q2
4771b5k08J75p0L19j78Q0kj85J66j44J65j84K9K96j67K8k27J04l37K45Pl6K76
4794A27R6k69k9J5Q5J25m3J21n18N92k17k41L89p5j72j46L51j46J25j27J01r6
$$ plain form
4816 48 -12 29 -13 55 -70 -11 91 48 119 -201 -255 190 186 -22 -130 163 -93 1 -145 -14 127 -44 35 -16 119
4841 119 -19 -173 46 -87 -47 -123 -45 -51 -139 -55 -287 -17 -11 -167 -184 41 -127 7 250 86 -181 76 -76
4864 -76 82 78 198 29 201 -292 196 -47 -25 -38 2 -182 -14 112 -3 -287 -162 38 -79 -7 -61 -112 232
4887 232 85 28 237 -139 107 99 -284 16 86 -53 98 -40 -67 -48 -161 -116 -44 -120 15 214 41 -142 -211
4910 -211 74 141 -177 -152 99 98 25 147 -16 -136 -55 -96 -88 48 -50 -244 273 -110 -6 127 16 -362 135
4933 135 -5 -84 -81 -137 -73 -45 84 123 -102 -113 -219 64 -99 -76 -329 227 159 124 9 7 5 -235 -124 101 -7
4958 -7 -323 77 -74 179 -176 -4 -168 -53 -31 61 194 -132 25 271 -180 160 -83 -42 -17 -129 -179 -93 -90
4981 -90 37 -313 -58 -63 -184 181 -84 -182 -173 -60 -150 -200 145 -12 -54 116 -116 -119 -310 -149 -59 146 -93 -80
$$ packed form
4816D8o0M1m2O8j25N9J02m3P1l20n4M45mk08j08K93k56R4j46J31J41j71P9n1J35
4841A19j38j54K19j33M0p6P8oq8Q4k32K70Oj56j7K25j68J34K43j64k67K57j52
4864g6J58mJ20j69J72m93M88k43K2j3M0j84J68J26j15k84J25K00j17P2n4n1L44
4887B32j47n7K09l76K46ql83L00P0j39J51j38k7J9j13M5P2p6J35J99j73j83o9
4910b11K85O7l18K5K51jp3J22j63j20Q1m1QJ36r8j94N17l83J04J33j11l78M97
4933A35j40p9Ln6O4K8J29L9k25j1j06K83j63K3k53N56o8l5j15kkk40J11K25j08
4958gl16M00j51K53l55J72j64J15K2R2J33l26J57K46m51L40k43M1K5j12n0Q6L
4981i0J27l50K55nj21L65k65r8RJ13r0n0L45j57m2J70k32lj91J61R0K05k39J3
$$ plain form
5005 -80 142 -112 -140 -32 -129 -54 8 87 104 68 243 189 -180 -251 -124 -203 -173 80 124 -18 -7 189 -37 55 219
5030 219 -221 -113 -315 89 174 21 -138 316 -159 90 115 -12 3 60 64 -282 135 272 88 18 40 165 9
5053 9 -130 -191 -185 -111 -56 -41 -132 36 142 -300 -11 -121 -75 -66 -149 -95 43 -28 82 220 -91 -117 -147 -236 259 -99
5079 -99 -89 -163 90 -140 43 7 174 10 232 -4 -165 104 -286 74 5 -25 161 -139 -231 -13 -46 -213 -83
5102 -83 199 -75 -132 16 -238 181 10 60 14 71 -17 89 125 424 194 10 6 145 52 85 76 38 -130 -169 74
5127 74 85 62 -212 13 93 -79 7 73 -232 -293 -245 -98 -196 -98 -12 -120 220 41 75 -115 -385 -240 -123 -259
5151 -259 39 -126 108 -155 -187 47 125 19 279 -3 110 268 89 -317 247 -252 -31 -89 -135 -223 189 79
5173 79 53 101 -259 -78 40 174 -74 -71 268 -24 149 412 107 -6 -7 -251 255 163 28 -220 -62 109 -117
$$ packed form
5005h0K22k54k8J08r7P5O2P9J7l6J75n4l69p1J27p9L0K53M4j42J1J96k26R2J64
5030B19m40J08k02M04Q5j53j59M54m75K49K5j27J5N7Ml46M17J37j84p0K2J25j56
5053Ij39o1OP4N5J5r1J68J06m42K89j10M6Rq3N4J38p1J10J38l11k6l0q9M95l58
5079i9J0p4K53k30J83l6J67j64K22k36j61K69l90L60o9l0J86l00r2K18l3j67J30
5102h3K82k74n7J48k54M19j71N0m6N7q8J06L6K99k30j84mJ39r3L3rl8j68l9K43
5127G4J1k3k74K25Q0j72Q6O6l05o1M8J47r8R8Q6j08L40j79L4j90k70J45J17j36
5151b59K98j65K34k63l2K34P8j06K60k82J13J58j79m06N64m99K21n8m6q8M12j10
5173G9k6M8l60J81J18J34k48LL39k92J73K63l05j13jk44N06r2j35k48J58J71k26
$$ plain form
5196 -117 -62 209 182 76 -3 61 -39 189 14 -112 -12 29 -42 35 179 -67 10 180 -80 -59 105 -11 36
5219 36 293 -225 159 59 -63 319 147 -76 -128 -164 149 -77 -197 -118 156 99 -34 -90 -326 11 -140 -249
5241 -249 182 -426 169 -131 80 113 18 -77 92 13 113 285 -158 -34 -103 -5 -105 113 -68 -77 -79 -82 -138 54
5265 54 -10 -135 198 153 322 316 -21 -134 31 78 -79 -148 -198 -20 228 -67 32 -59 -190 -258 122 -58 -91 -187
5289 -187 137 -271 63 144 -80 163 -48 158 -71 257 -3 -63 122 -113 100 -361 -185 -275 -115 -194 -88
5310 -88 143 -211 -200 -12 -48 143 -40 192 56 -122 79 0 -165 -187 -287 -64 -174 92 255 -222 4 -134
5332 -134 -19 169 83 145 -162 -47 51 15 -228 -122 335 227 9 -124 -43 115 144 -7 20 97 166 -77 -27
5355 -27 189 230 -72 -163 10 -65 -28 -8 -85 -167 50 24 -243 -171 -21 -58 -130 27 263 -16 -36 150 127 161 -236
$$ packed form
5196a17N5K71k7j06p9O4j00K28j75j26J00M1p1P7J44k46P7J70k60K1J64j16M7
5219C6K57n18L84j00j22L82j72k23n2l6L13k26j20P9K74n7j33n6k36L37j51j09
5241b49M31o08N95l00K11L3r5r5J69p9J00J72m43J24o9R8j00K18j81rkln6J92
5265E4o4j25L33m5J69ol37j13J65M7j57o9n0J78K48k95R9r1j31o8L80j80l3r6
5289a87L24m08L34Q1k24K43k11K06k29L28k60o0J85k35K13m61J76r0J60p9J06
5310h8K31l54J1J88l6J91j83K32j36j78K01p9j65k2j00K23j10K66J63m77K26j38
5332a34J15J88q6O2l07J15R8l6k43J06M57j08k18j33Q1J58K9j51K7P7O9k43N0
5355b7K16M1l02r1J73p5L7K0p7q2K17k6k67P2J50l7p2J57K36k79k0J86k3L4l97
$$ plain form
5380 -236 -41 277 94 -78 -4 76 -153 -115 135 144 262 -37 -136 -66 -99 -43 -85 28 124 -2 -215 -117 -195 39
5404 39 84 -93 -249 -141 -46 -199 213 101 114 -3 -161 -244 -96 -19 121 -46 -66 -5 -45 -148 156 -43 81
5427 81 -167 -5 45 91 -72 -29 -166 -6 101 30 -192 22 -117 -288 -16 132 26 128 27 -104 102 -44
5449 -44 81 -234 -104 -81 108 2 63 57 91 -11 -58 50 139 108 -76 11 -12 158 -157 8 -175 46 52 59 -148
5474 -148 -113 -5 -256 97 -8 -111 44 -268 -87 -4 -98 17 31 154 36 19 14 114 -110 -131 41 -90 322
5497 322 60 -63 36 145 -58 60 -179 -192 68 90 7 114 58 -41 16 -32 173 -83 13 22 -24 -151 -26 91
5521 91 -208 66 394 -148 -69 307 202 -65 -32 -17 54 169 -92 -169 43 -26 -30 -53 63 67 -31 -38 111 2 34
5546 34 191 246 137 64 -56 -100 241 -295 -78 89 -156 114 134 62 174 -2 64 -102 -17 -23 -157 -151 107 61
$$ packed form
5380b36J95L18j83j72P4Q0k29L8K50RJ18k99r9P0l3N6m2J13R6j26k13R8p8K34
5404C9M5j77j56J08R5j53M12j12J3j17j58q3J48P7J40j67k0O1m0j03L04j99J24
5427H1k48J62N0M6j63M3j37J60J07p1k22K14j39j71K72J48j06J02j01j31K06j46
5449d4J25l15J30K3J89j06O1oL4j02m7J08Q9l1j84Q7k3J70l15J65j83K21OPk07
5474a48L5J08k51L53j05j03J55l12J81Q3r4J15J4J23j18j7nJ00k24k1J72j31M12
5497C22k62j23R9J09k03J18k39j3K60K2q3J07n6r9N7m8K05k56R6Rm6j27J25J17
5521I1k99K74L28n42P9L76j05k67L3J5P1J15k61p7K12o9mk3J16Mr8pJ49j09L2
5546C4J57N5j09p3j20m4L41n36K17J67k45K70K0p2J12j76O6j66Q5oj34OK58m6
$$ plain form
5570 61 362 -45 -187 155 -65 -191 291 -101 -82 -100 133 141 220 181 20 -61 286 -104 293 97 79 -123 184
5593 184 -7 -170 260 39 158 186 -54 -324 -220 4 -194 47 -22 -58 -355 -465 -75 -78 40 -231 -243 288
5615 288 0 185 37 -76 202 -219 -94 -79 172 187 66 -66 102 110 93 -23 -114 -65 53 -136 376 63
5637 63 26 300 -152 -143 99 79 58 -33 103 -40 168 -295 147 -247 -110 16 -55 85 -167 -9 259 58 -231
5660 -231 310 -180 41 -144 45 -158 -231 -303 -10 -38 305 166 -60 -106 -185 28 -114 -183 5 -86 -113 88 -95
5683 -95 -110 101 149 95 79 21 24 -118 -60 193 49 225 161 14 51 129 -98 -149 -32 -98 -367 105 -47 -9 -56
5708 -56 -91 33 -146 22 80 166 -43 -133 -15 -58 -182 -310 -187 -85 358 184 -115 -159 29 -71 -83 116 -69
5731 -69 72 239 -172 -164 -31 -166 -38 -166 145 -86 172 121 -4 227 -76 -69 22 -39 -20 -273 -38 -115 136
$$ packed form
5570F1L01m07j42L42k20j26M82l92J9j8K33QP9l9j61q1L47l90L97j96j8k02L07
5593A84j91j63M30k21J19K8k40k70J04K24j98K41o9l6k97j10L90lJ18k71j2N31
5615B88k88J85j48j13K78m21J25J5K51J5j21j32J68Qj7j16r1M9J18j89N12l13
5637F3l7K74m52RK42k0k1r1J36j43K08m63M42l94J37J26p1J40k52J58K68k01k89
5660b31N41m90K21j85J89k03p3p2K93k8L43j39k26m6p9K13j42o9J88r1k7K01j83
5683i5j5K11M8n4j6n8Lj42N8K53j44J76o4j47L7P8k27n1J17o6k69M72j52L8m7
5708e6l5J24j79J68N8Q6k09r0J18m3j24j28J23J02M43j74k99m4J88j00j2J99j85
5731f9J41J67m11QJ33j35J28j28L11k31K58n1j25K31l03PR1o1J9k53K35p7K51
$$ plain form
5754 136 -259 84 47 -24 -102 -272 53 -124 42 6 -99 -218 -10 74 42 76 -118 -37 -266 -98 1 -110 116
5777 116 -84 70 132 -66 -50 206 -288 216 -23 -302 162 41 -17 246 69 79 -48 106 -20 -57 71 -191
5799 -191 -146 109 -17 135 4 24 23 16 76 2 -164 -53 113 412 -340 102 125 -89 168 111 -47 146 2
5822 2 121 152 -313 -80 14 7 22 -1 58 200 -112 -22 -128 227 -53 -168 313 0 45 -42 -22 -36 -15 -8 -128 342
5848 342 77 64 219 8 -14 136 277 -50 -167 38 53 184 352 -20 40 -295 60 -203 137 60 -20 101
5870 101 364 142 262 127 -78 -35 216 -117 -37 199 166 -125 -396 -19 91 -188 -139 -85 248 112 -28 -28
5892 -28 -202 109 -145 -304 -2 80 -95 -95 120 -99 -44 37 287 209 116 -25 131 -41 -161 -224 -102 252 -65
5915 -65 6 26 74 298 -206 -65 -203 48 -3 -138 76 110 144 294 181 -83 -25 45 77 229 235 90 -178 72
$$ packed form
5754A36l95L43l7p1p8j70L25j77J66l6j05j19K08Q4l2L4j94Q1k29J68R9j11K26
5777A16k00J54O2j98J6K56m94N04k39k79M64j21n8K63j77J0j27J54j26l7J28k62
5799a91M5K55j26J52j31K0jpO0p4j66J11J66K99p52M42K3k14K57n7j58J93j44
5822BJ19L1m65K33R4pJ5k3N9J42l12R0j06L55k80j15M81l13M5q7K0j4K1Pj20M70
5848C42k65j3J55k11k2J50J41l27j17K05J5J31J68l72O0l35L55k63L40p7q0J21
5870A01K63k22J20j35k05M3K51l33Q0K36l3k91k71L77J10k79M9N4L33j36j40%
5892b8j74L11k54j59L02Q2j75%K15k19N5Q1K50p8r3j41J56j72j20o3J22L54l17
5915f5P1K0M8K24n04J41j38K51n1j35K14L4L4J50j13k64N8P0L2J52Oj45k68K50
$$ plain form
5939 72 -14 -172 220 -52 -94 -149 -32 -32 217 -64 -175 2 129 64 67 83 105 -104 -18 275 -136 -34 -39 131 -1
5964 -1 -37 42 -101 22 -23 -208 89 -272 -133 -13 11 -101 20 -6 52 47 60 -255 0 66 -108 -274 -26 219
5988 219 -145 -113 187 160 196 -57 -113 -91 147 -39 2 164 -136 -40 -29 -96 233 285 -104 87 -166 86 -32
6011 -32 56 182 293 88 136 82 -138 205 -64 -82 -357 -51 -101 3 40 -467 -94 224 72 12 -48 165 126
6034 126 17 115 -122 95 -24 89 48 226 31 -37 -54 111 -160 -154 37 33 -73 -154 125 -139 -218 -21 75 92
6058 92 60 -244 -56 81 284 11 -132 -86 90 312 -124 207 -234 -246 -94 195 -140 -81 45 220 -25 37
6080 37 -35 60 -96 -24 -153 -158 -164 -223 136 -48 81 81 -76 64 -178 -238 -67 76 35 -129 25 -19 62 -35 -157
6105 -157 182 -438 241 -17 56 24 228 17 54 116 -7 121 313 240 169 -195 92 237 -260 36 34 1 347
$$ packed form
5939G2q6j58L92k72m2n5J17%K49k81j11J77J27o5LJ6K2k09Q6K93m11J02nJ70j32
5964al6P9j43J23m5j85K97l61J39J20K4j12J21k6N8nJ3l15K55O6j74j66K48K45
5988B19l64L2L00k7L6k53n6K2K38j86M1J62l00R6J1o7L29N2l89J91k53K52j18
6011c2Q8J26J11k05M8n4k20L43k69j8k75L06n0J04L7n07L73L18j52o0o0K13l9
6034A26j09R8k37K17j19J13m1J78j95o8j7J65k71OJ91mj06q1K79k64p9J97R6J7
6058I2l2l04J88J37K03k73j43M6J76K22m36L31m41j2J52K89l35N9J26J75k45O2
6080C7p2R5j56P2j29non9L59j84J29%j57J40k42o0J71J43m1j64J54m4Q1r7j22
6105a57L39o20O79k58P3l2K04k11L7O2j23J28J92p3p1l64K87J45m97K96kl3L46
$$ plain form
6128 347 148 -243 46 363 -315 116 -21 -85 136 184 -154 -8 -38 30 -26 93 43 148 66 -30 -192 409 56
6151 56 -81 18 94 -190 -287 34 10 -145 48 -199 156 -55 17 -286 -150 2 -266 -71 -56 -9 -138 -3 -189
6174 -189 62 7 -4 -114 30 83 -62 -20 22 153 -85 12 114 98 -108 -4 1 -136 145 183 -177 -292 108
6197 108 94 286 -88 0 -122 -125 136 305 -78 -119 -90 15 -113 143 199 108 144 -208 -1 74 31 223 154 -50
6221 -50 5 -180 256 34 320 -237 11 182 -16 -63 182 -75 -70 136 7 -39 -191 161 39 85 49 -103 -119
6244 -119 -21 -162 22 -152 -60 -170 -177 119 -274 -273 -108 12 -127 72 118 -55 -85 -246 170 26 43 -43 -51 24
6268 24 116 162 70 43 98 418 20 -321 -52 150 183 -20 -256 306 -14 3 169 -107 -95 22 14 -63 243 -79
6292 -79 -123 124 151 137 -75 -237 -81 65 -115 254 134 86 -127 137 101 76 -53 -253 74 8 -218 39 -16
$$ packed form
6128C47j99l91K89L17o78M31j37o4K21M8l38J46l0O8n6J19n0J05q2r6j62O01l53
6151E6j37R9P6k84r7L21k4j55J93k47L55k11P2l03J36J52k68J95J5M7j29J35j86
6174a89K51n5j1j10J44N3j45M2M2J31k38R7J02j6k06J04Nj37K81L8l60j15M00
6197A08j4J92l74Q8j22lK61J69l83m1K9J05j28K56N6r1L6l52K07P5m3J92o9k04
6221e0N5j85M36k22K86n57K48J71j98m7K45k57NK06j29m6j52L52j22M6l6j52j6
6244a19R8j41J84j74R2j10pK96l93JJ65J20j39J99M6j73l0j61M16j44J7q6qP5
6268B4R2M6r2k7N5L20l98l41K69K02L3k03k36N62l20J7J66k76J2J17qp7L06l22
6292g9m4K47K7j4k12j62J56J46j80L69j20m8k13K64l6k5j29k00L27o6k26K57n5
$$ plain form
6315 -16 -137 45 -180 -175 -18 -105 -109 104 230 -72 23 -66 -68 89 -130 185 -140 -88 110 -6 -64 -85 -55 -76 175
6340 175 31 188 29 133 -52 9 -81 -124 -2 -3 206 265 150 127 92 161 -154 -123 18 33 -16 -8 210 -149 -286
6365 -286 -7 327 148 -164 54 19 -40 141 259 -90 41 -110 -228 -156 -166 -303 -128 -101 -63 -168 39 126
6387 126 -11 203 -13 -95 -37 -58 83 114 -174 -147 -13 -121 -141 -166 285 88 42 -157 -25 -150 158 111 -160
6410 -160 -262 -92 -108 127 69 195 -15 109 -229 160 56 -119 -47 -27 -2 -147 161 130 274 -86 -142 -136 -40
6433 -40 -48 150 -81 171 106 233 -14 168 -135 -43 -93 -41 63 189 198 -12 -24 63 35 -121 -100 -90 23 -94 48
6458 48 -67 -137 -32 -119 35 -175 -6 -213 265 121 -81 128 241 156 -76 -16 44 -214 -57 -68 182 21
6480 21 -19 -26 166 111 225 1 -141 -36 -105 41 -15 165 -42 102 -355 -212 -18 -74 -212 -95 -176 10 -87
$$ packed form
6315a6j21J82k25NJ57q7mK13J26l02R5q9kJ57k19L15l25N2J98j16n8k1L0k1K51
6340A75j44J57j59J04j85O1r0m3J22jK09N9j15k3l5O9l15L1J41J5m9QK18l59j37
6365b86K79L34j79l12K18l5n9J81J18l49J31j51j18P2j0j37J75K7L8j05K07Q7
6387A26j37K14k16q2N8k1J41L1k88K7J34j08k0k5M51j97m6j99J32j25L08m7k71
6410a60j02J70j6K35n8J26k10J24l38L89j04j75P2K0K5j45L08l1J44l60n6OR6
6433d0qJ98k31K52o5J27k47J82l03R2n0N2J04J26Rk10j2Q7k8j56K1J0J13j17J42
6458D8j15p0J05q7J54k10J69k07M78j44k02K09J13q5k32O0O0k58J57j1K50j61
6480B1m0pJ92n5J14k24j42J05o9J46n6J80k07J44m57J43J94n6j38J17q1J86r7
$$ plain form
6503 -87 -180 -261 -20 6 100 -123 -91 161 1 -91 84 12 260 -80 -22 -18 130 144 -54 364 135 -30 -37 11 -252
6528 -252 -334 -63 -218 29 89 -46 61 -194 -63 -25 -113 76 102 -35 202 -53 -132 -221 67 11 -221 -148 -199
6551 -199 -39 -21 21 -271 61 -9 -216 -148 -137 20 -8 8 -165 129 -58 -178 152 13 71 -249 71 16 -101
6574 -101 -41 91 -13 -63 -80 211 124 -25 -70 -297 60 137 91 -229 142 -237 33 17 -90 149 -204 -27 38
6597 38 245 -88 -190 -73 130 -63 47 -157 -90 -5 -11 96 -245 144 30 -44 -5 -80 -275 -42 27 107 40 193
6621 193 -113 -294 43 242 95 -119 -71 -26 -123 -271 28 179 -82 -234 139 286 64 -430 -18 158 37
6642 37 81 24 148 -11 44 27 -47 -252 31 249 -261 64 165 -89 -43 138 308 125 -54 -200 263 245 109
6665 109 -340 229 -76 195 -15 -81 -171 -198 34 -54 43 -47 208 -29 -107 -3 59 104 -20 -53 159 -33 134
$$ packed form
6503h7r3q1K41K6R4k23L2K52j60r2J75p2K48l40N8MJ48J4j98M18k29j65pM8k63
6528b52q2K71j55K47O0j35J07k55J31L8q8J89K6j37K37k55p9q9K88n6k32P3n1
6551a99J60J8M2k92L32p0k07O8J1J57k8J6j73K94j87j20L30j39N8l20L20n5j17
6574a01O0J32j04n0j7K91q7j49m5k27L57P7m6l20L71l79K70j6j07K39l53J77O5
6597C8K07l33j02J17K03j93J10k04O7Q5oJ07l41L89j14p4L9p5j95K33O9Q0o7J53
6621A93l06j81L37J99j47k14M8M5r7j48K99J51k61j52L73J47k22m94M12J76j21
6642C7M4n7J24j59N5j7p4k05K83K18n10L25J01k54M6J81J70j83j79j46M63j8j36
6665A09m49N69l05K71k10o6r0k7K32q8R7r0K55k37p8J04O2M5j24l3K12j92J67
$$ plain form
6688 134 5 95 -149 -127 168 -31 -172 4 -21 -9 -283 -121 -344 -32 226 -63 -59 -193 -7 58 -220 -27
6710 -27 -191 24 30 -79 194 -154 -143 48 -42 -18 181 54 40 257 -215 -174 90 -51 -84 -48 2 56 86 -19
6734 -19 -51 -52 -65 29 -249 -112 -306 16 -116 -49 -38 140 135 244 178 41 25 -150 177 -189 72 -103 33 106
6758 106 -36 -301 111 147 24 269 123 145 106 170 106 -210 159 4 -53 72 -107 -244 -38 -283 -120 25
6780 25 70 -128 240 218 -107 -26 113 -96 -75 -120 -160 100 -55 67 -6 -109 -67 60 -94 94 3 -46 265 -86
6804 -86 162 5 115 -21 81 15 -48 128 119 -47 -218 -115 -90 239 25 52 -587 63 -47 128 -141 74
6826 74 -145 -218 80 191 71 181 302 -64 -1 4 217 219 134 80 -32 106 -144 -18 -176 -166 -32 -192 -9
6849 -9 -147 38 40 -22 -13 27 60 213 8 -60 65 -128 -62 87 -169 24 -210 36 -120 136 36 -161 -244 -47
$$ packed form
6688A34j29R0k44K2K95j99j41J76k5J2k74J62k23L12K58k89Mj34J86O5k78J93
6710b7j64K15Oj09K73l48J1J91r0K4J99j27j4K17m72M1K64j41l3L6N0N4L0j05
6734a9l2jj3R4k78J37j94L22j32O7J1J78nJ09o6j37j6j75L27l66K61j75J36P3
6758A06j42k65M12L6j23K45j46K2l9O4o4l16L69j55n7J25j79j37K06k45J63J45
6780B5M5j98L68k2l25Q1J39k09K1m5m0K60j55J22p3j03M2J27j54J88r1m9L11l51
6804h6K48j57J10j36J02o6o3J76rj66j71J03K5L29k14K7o39O50j10J75k69K15
6826G4k19p3K98J11j20J10J21l66O3NK13Kq5n4j12J38k50J26j58J0J34j60J83
6849ij38J85Ko2RM0L3J53k05o8J25j93O6J49k56J93k34K46j56K56j00j97q3J97
$$ plain form
6873 -47 227 124 -32 -17 -206 -226 202 23 -84 -212 25 -109 -16 77 -155 209 13 -180 -7 -14 77 86 191
6896 191 154 -223 -364 -31 76 -10 -37 11 87 -26 -132 -134 61 -24 224 -110 -110 105 471 117 41 -73 -74 191
6920 191 68 34 -54 -159 6 263 82 77 -97 -112 6 41 -294 -36 -2 -190 -153 -21 173 14 -43 -356 29
6943 29 -23 88 -20 128 -148 -261 -115 91 129 -5 72 -60 54 38 -274 28 -438 -47 34 -257 28 -33
6965 -33 234 90 -29 -118 92 45 46 -38 61 -199 -56 -62 0 -168 -114 -128 -82 178 -116 174 -3 -122 94 106 33
6990 33 -106 29 -66 58 -173 -154 -97 -102 -30 59 -136 55 141 208 -144 -247 -229 -115 84 -136 -11 37 -43 66
7014 66 -91 48 -69 103 28 57 256 -272 15 -278 14 -58 46 -103 50 35 -218 57 134 -49 -244 187
7036 187 155 -135 179 -33 136 4 84 -74 12 -35 -104 191 23 18 77 168 254 88 28 -141 -127 4 100 24 -81
$$ packed form
6873d7K74j03j56J5j89k0M28j79j07j28K37j34R3R3k32L64j96j93J73pR1RJ05
6896A91l7l77j41L33J07q6k7M8P6j13j06kJ95q5K48l34%K15L66l54p6j14jK65
6920A91j23l4q8j05J65K57j81nj74j5J18L5l35K58L4j88L7J32J94j59n7l13L85
6943B9n2J11j08J48k76j13J46K06L8j34P7j32J14j6l12L02m66L91Q1k91K85o1
6965c3K67j44j19q9K10m7Jq4R9k60J43oO2j68N4j4M6K60k94K90j77j19K16J2p3
6990C3j39J35r5J24k31J9N7nP2Q9j95J91Q6O7l52j03J8J14J99k20J25M8q0J09
7014F6j57J39j17J72p5K9J99n28K87k93K92p2J04j49J53j5k53K75P7j83j95M31
7036A87l2k90L14k12J69j32Q0j58Q6m7o9K95j68nN9R1Q6j66o0j69J4J31R6p6j05
$$ plain form
7061 -81 96 -15 38 134 -100 -339 -147 -75 -174 -4 -69 -21 -296 -23 -107 231 129 218 -117 -44 79 134 112 58
7085 58 -134 -83 130 101 -50 -106 -128 -188 265 265 17 -33 -49 -25 208 39 -240 95 146 23 7 68 -54 5 66
7110 66 3 75 -21 -197 160 41 12 90 -278 -276 116 119 272 -118 -40 -124 318 271 254 -98 -121 -64 71 31 -122 100
7136 100 -96 -126 -17 -135 -286 151 34 -7 -132 -63 -78 -20 339 45 -31 -161 -10 -47 -13 -9 44 -70 119 39
7160 39 -170 -43 73 88 -126 -22 149 -149 11 -119 -190 159 -138 84 -50 -78 -10 177 -93 314 162 171
7182 171 -63 169 47 126 16 -45 18 -186 51 98 322 -167 -216 -112 -15 -201 153 -247 5 85 -27 64 -155
7205 -155 165 168 46 -189 -133 29 315 -10 30 -35 -190 -170 -8 102 -63 -19 70 -171 242 -246 -15 -56 27
7228 27 -87 21 201 -87 -234 -121 -280 -57 -125 286 4 -116 -127 197 196 -11 60 -85 173 310 89 -221
$$ packed form
7061h1J77j11N3R6k34k39J92P2r9J70o5M8k75K73q4L38j02Q9l35P3J23N5k2n4
7085E8j92N1K13k9j51n6k2o0M53%k48n0j6K4K33j69k79L35N1j23j6O1j22N9O1
7110F6o3P2r6j76L57j19k9P8l68KL92LJ53l90P8q4M42m7j7l52k3N7J35m0j53K22
7136A00j96l0J09j18j51M37j17m1j25O9j5N8L59k94p6j30J51l7L4MN3j14J89q0
7160C9k09J27J16J5k14J04J71k98J60j30p1L49k97K22j34k8O8J87k70M07j52R
7182A71k34K32j22P9j10o1O3k04K37M7K24m89m9J04R7j86L54m00K52Q0j12R1k19
7205a55L20Lj22k35N6J62K86l25M0o5j55K0J62J10j65M4Q9k41M13m88K31m1Q3
7228B7j14J08J80k88j47J13j59K23o8M11k82j20j1L24jk07P1j45K58J37k21l10
$$ plain form
7250 -221 -64 261 -156 16 -78 -216 -170 129 103 -298 -77 -52 15 2 177 -137 30 231 -16 -32 33 -19 -43
7273 -43 -162 -32 53 45 62 -272 39 42 -13 7 137 93 56 -127 -225 164 47 -43 192 -156 -139 88 -92 -150 101
7298 101 59 -73 -60 -83 32 88 -51 40 -90 111 -116 131 -196 -103 66 33 -8 -109 -11 -18 -187 186 25 67
7322 67 8 -40 -253 217 -109 69 -165 -37 17 72 -115 159 -330 -155 -178 -1 -323 -73 -135 47 -1 111 225
7345 225 251 -260 56 -55 13 29 41 -120 -251 -43 114 -158 -113 310 -74 -111 -114 92 176 57 -59 95 -70
7368 -70 143 -47 -60 -59 329 209 -46 164 -31 75 -8 -295 -164 94 -38 -102 86 -198 38 -37 -80 -65 -20
7391 -20 -288 79 73 120 90 137 163 -195 -15 2 -199 -33 10 59 151 -318 -208 119 33 -117 -37 -88 58 -77 1
7416 1 65 24 -8 -149 -60 167 -254 -93 -311 -20 -259 -79 -32 -193 141 36 -205 51 16 -151 -49 -94 69
$$ packed form
7250b21J57L25m17J72r4j38M6K99k6m01K21K5O7j3J75l14J67K01k47j6O5n2k4
7273d3j19J30Q5qJ7l34L11Ln5K0J30m4l7j83r8L89j17r0K35l48J7K27j80n8K51
7298A01m2j32J3k3J15N6j39R1j30K01k27K47l27R3J69l3m1j01R8pj69L73j61M2
7322F7n9m8k13M70l26J78k34J28N4N5j87K74m89J75k3J77l22K50o2J82m8J12J14
7345B25K6n11L16j11O8J6J2j61j31K08J57k72M5M23l84l7lK06Q4j19j16J54j65
7368g0K13j90j3JL88j20k55K10j95J06q3k87J31K58j32o4J88k84K36p5m3J5M5
7391b0k68L67oM7l0M7K6l58J80J7k01J66M3M9R2m69J10L27q6j50Q0n1J46j35P8
7416AO4m1l2j41Q9K27m21J61k18K91k39J80M7j61L34j05k41K56l5j67J02m5J63
$$ plain form
7439 69 43 -8 -254 74 -73 206 -32 93 -31 -110 126 77 58 -110 268 152 190 -29 -204 58 -141 114
7461 114 123 43 -167 170 118 200 -66 -14 47 -36 8 50 -7 -6 -241 -97 168 27 72 -169 -20 92 -179 156 81
7486 81 184 -155 -355 86 -130 101 124 -166 63 -53 -6 -154 -104 123 300 -258 -30 -125 183 247 -92 37
7508 37 -173 263 13 -76 -203 319 88 -197 -89 -97 -54 -42 -6 -167 -46 270 -46 -138 -21 -86 -57 259 -227
7531 -227 -16 4 134 55 33 113 171 -37 -214 88 -110 -50 50 88 -22 -297 188 127 -208 30 -139 121 178
7554 178 -28 123 -139 -92 61 276 -53 -81 22 -137 -80 -115 -85 -10 41 -72 4 230 -60 10 -189 63 31
7577 31 -39 52 132 13 95 -50 -189 -115 182 186 -68 144 -57 74 52 98 1 7 16 -255 -40 -288 180 2 176
7602 176 36 121 -270 194 -5 -198 -57 -79 -63 -281 -152 6 123 -278 -35 -86 10 -55 47 -20 144 -152
$$ packed form
7439F9k6n1k46L28j47K79k38J25j24p9K36m9j9j68L78j16L8k19j75K62j99K55
7461A14Rq0k10L37n2Q2k66N2O1q3M4M2n7Jk35J44K65j41M5k41J49J12k71L35p5
7486H1J03l39k00M41k16K31K3k90K29j16M7j48N0K27J77n58K28r5L08O4l39J29
7508C7k10M36k50q9j27N22k31k85J08qM3J2L6j61J21L16l16r2J17o5K9L16m86
7531b27K11K0J30p9k2Q0N8k08j77L02j98O0J00L8j10k75M85o1l35K38j69K60N7
7554A78k06J51k62M7J53K15l29k8J03j59N7l5L0P5N1j13P6K26k90P0j99K52l2
7577C1p0R1Q0j19Q2j45j39P4K97Mk54K12k01J31k2M6r7ORk71K15k48M68j78J74
7602A76j40Q5l91M64j99j93J41k2J6k18J29J58J17m01K43n1R6o5J02o7J64k96
$$ plain form
7624 -152 -29 -60 -51 233 289 436 -128 62 -108 71 150 24 -74 50 -97 0 -142 -61 126 211 90 124 -90
7647 -90 -205 176 -115 -185 157 91 226 51 -190 61 15 67 -3 -131 -137 -151 48 -37 14 32 -39 75 -195 193
7671 193 135 -164 29 89 -271 47 382 -48 155 -241 -22 39 -43 27 347 168 170 -243 -51 -62 25 -1 -117
7694 -117 -80 -105 266 -93 115 270 -72 143 -141 -90 59 17 -136 -6 -181 13 -169 -5 316 -57 246
7715 246 -39 -126 -164 279 -261 -68 -24 149 60 -273 -59 -227 -156 -211 -35 0 -67 -76 116 243 -116 37 -150
7738 -150 -69 -39 -86 207 115 65 -186 -100 14 138 -134 -23 -208 -145 184 -232 156 318 292 -100 -101 18 -97
7761 -97 140 -25 85 -46 70 52 114 -291 -323 76 154 -25 -148 137 134 -164 -313 197 38 110 -227 77 218
7784 218 -32 177 -192 219 -55 121 -84 112 201 -122 175 -84 126 -286 -196 5 -253 42 -52 172 51
$$ packed form
7624a52J23l1RK84N6J47n64J90j70J79P9j26r8J24j47R7j42Q1J87Q5j21L4k14
7647i0j15L81k91p0L42o6J35j75k41K51m6N2p0j28oj4J99q5N1J8p1J14k70L88
7671A93n8k99J93O0l60L18L35m30K03l96K19O1q2P0L20j79Km13J92j1Q7k6j16
7694a17L7k5L71l59K08J55l42K15k84N1J49m2j53J30j75J94j82J64L21l73L03
7715B46k85q7l8M43n40J93M4J73q9l33K14j68P1n5J76L5o7rJ92J27l59J53j87
7738a50Q1L0m7K93r2n0k51Q6J14J24k72J11j85O3L29m16L88J62k6l92jJ19j15
7761i7K37j65J10j31J16j8O2m05l2L99P8j79j23K85lk98j49N10j59P2l37L04J41
7784B18k50K09l69M11k74J76k05J96Q9l23K97k59K10m12R0K01k58K95r4K24j21
$$ plain form
7805 51 -57 -33 -227 169 -161 -132 28 27 36 138 260 -114 38 -237 25 -71 44 1 -80 181 -386 63 22 -163
7829 -163 169 177 287 2 -171 67 106 -223 86 -221 -55 -117 -378 -4 10 117 -198 39 36 287 -353 21
7851 21 10 168 -203 -166 -3 107 142 185 144 173 220 194 137 113 -117 -470 -25 164 -60 90 47 -39 -129 127 170
7876 170 -33 171 152 156 -2 69 80 -114 8 72 31 -105 -71 -24 47 -125 114 -158 -18 244 -160 -249 -48 134
7900 134 168 -7 -15 -161 215 222 104 -72 330 86 181 -91 218 -10 -35 1 -258 -7 -96 128 -203 23 87
7923 87 -262 -39 -21 75 -29 -47 -186 -417 91 -127 2 65 114 5 4 -46 76 215 133 -241 100 272 35
7946 35 25 -35 -210 -238 125 -127 -151 -131 -95 -127 245 298 3 -75 175 14 -366 -83 -1 317 -193 17 209 63
7970 63 -25 -144 152 12 -103 17 -41 -11 -10 -54 265 -80 -124 93 80 52 -255 -153 -22 8 204 69 -114 -87
$$ packed form
7805E1j08K4j94L96l30K9J60jRJ02J22l74J52k75K62r6J15m3q1K61n67M49m1j85
7829a63L32QJ10k85j73K38L9l29L09l07J66o2k61L74J4J07l15K37lK51o40L74
7851B1j1J58l71L7J63J10L5M3m1K9M7k6n7k4k30l53M45J89k24J50m3q6r0K56M3
7876A70k03K04j9Mj58P1J1j94J22O4m1j36L4M7P1j72K39k72J40K62m04q9K01J82
7900A34L4j75qj46L76Pj18j76M02k44R5k72L09k28k5L6k59K51q9K24l31K26O4
7923H7l49K23J8R6j04j8j39k31N08k18J29O3M9j09jn0J22J39q2l74L41J72k37
7946C5j0o0j75k8L63k52k4K0L6l2L72N3k95p8K50j61l80K83Q2L18n10K10J92j46
7970F3q8j19K96j40j15J20n8L0Jm4L19l45m4K17j3k8l07J02J31L0J96j35j83K7
$$ plain form
7994 -87 -175 -33 5 36 -249 -143 140 -88 -197 65 -30 -49 -211 18 97 -166 -13 -181 93 -283 -70 92
8016 92 -119 -152 -1 93 -230 60 -22 86 -22 -103 -113 41 -149 139 106 -19 211 -83 -101 123 -39 20 60
8039 60 234 -150 79 13 129 175 -41 -149 177 72 201 16 -93 31 164 -17 -58 -56 -177 169 67 -197
8061 -197 95 276 -68 -148 298 -21 -20 128 -85 -73 152 179 -137 103 -125 186 -194 -59 -124 -383 -18 -93
8083 -93 -189 87 -189 112 86 175 -168 -113 144 -40 151 -292 -14 -56 182 31 52 -59 -244 38 5 -41 -107
8106 -107 -111 125 -64 -167 18 -117 23 5 -246 -236 -54 71 -16 -63 107 -323 -39 -67 -122 -185 -136 -18 201
8129 201 -264 -99 48 -19 -202 122 18 -229 259 -215 45 210 219 171 -44 -52 321 -133 130 19 222 197
8151 197 -85 -91 -93 171 -93 57 -151 110 -225 161 -114 158 126 -56 97 168 45 -3 149 -244 -292 28 -86
$$ packed form
7994h7q8J42L8L1k85J06K83k28j09K62r5j9j62K29P9k63J53j68K74l76K13J62
8016I2k11l3J51R4l23K90q2J08j08q1j0J54j90K88l3j25K30k94j8K24j62N9M0
8039F0J74l84K29o6J16M6k16j08L26j05J29j85j09J24J33j81m1Kj21L46j02k64
8061a97K92J81l44q0M46l19JJ48k13J2K25K7l16K40k28L11l80J35o5k59L65p5
8083i3r6K76k76L01k6Q9l43N5K57j84J91m43K78m2K38j51K1j11j85K82l3m6o6
8106a07mK36j89j03J85j35J40j8k51J0J82J25q7m7J70m30K84k8n5o3M9J18K19
8129B01m65J65J47o7j83L24j04k47M88m74K60J65Rm8k15qL73m54K63j11K03k5
8151A97k82okK64k64J50k08K61l35L86k75K72l2j82J53P1j23m8J52l93m8L20j14
$$ plain form
8174 -86 -94 285 -68 -62 60 101 -156 52 -235 -18 67 -46 121 141 -36 9 72
$$ packed form
8174h6qL79l53OJ22M1k57K08k87K17Q5j13J67K0j77M5O3
8191G2
$$ Imaginary data points
##PAGE= N=2
##DATA TABLE= (X++(I..I)), XYDATA
$$ plain form
0 0 0 0 0 0 0 0 0 0 0 0 0 0 8 -8 8 -8 8 -16 16 -19 24 -28 32 -40 48 -56 64 -72 83 -96 108 -124 140 -161
34 -161 179 -203 227 -255 284 -318 352 -391 434 -481 530 -585 646 -711 785 -865 953 -1050
52 -1050 1158 -1277 1413 -1565 1739 -1941 2176 -2454 2792 -3206 3737 -4441 5419 -6875 9284
67 9284 -13978 26570 -135564 -360198 -79908 150525 121381 -47621 -40180 79453 132761
78 132761 32385 -57960 -49571 3706 -24879 -92771 -91489 569 21243 -94537 -192081 -106003
90 -106003 45874 71225 -20679 -57367 27110 131245 124164 31415 -20382 22588 80376 82269
102 82269 39665 11804 15730 17772 -7587 -26523 -5367 31687 33346 -261 -7125 45286 85852
115 85852 33797 -53806 -59549 11341 51011 6506 -63804 -77151 -32101 -8492 -50968 -97217
$$ packed form
0@%%%%%%%%%%%%Qj6J6j6J6k4L2l5M3n2O0p2Q8j04J20j36J55j79K04k32K64l01
34a61L40l82M30m82N39o02O70p43Q25r15J011j115J231j357J496j650J818k003
52a050K208k435K690k978L304l680M117m630N246n998O943q178R860j2294J6159
67I284k3262M0548j62134k24634K80290K30433k9144j69002P441J19633N3308
78A32761j00376r0345Q389N3277k8585o7892J282R2058K0674j15780r7544Q6078
90a06003J51877K5351r1904l6688Q4477J04135p081r2749n1797M2970N7788J893
102H2269m2604k7861L926K042k5359j8936K1156L7054J659l3607o864N2411M0566
115H5852n2055q7603n743P0890L9670m4505p0310j3347M5050K3609m2476m6249
$$ plain form
127 -97217 -74731 -14444 63 -31973 -29717 25711 47796 42 -30615 17592 78710 69443
139 69443 8594 -20444 15889 52290 20633 -42578 -51737 -1213 29061 2367 -27636 -8583
151 -8583 25639 16494 -16000 -11264 28270 45850 20000 -9431 153 31145 28343 -13617 -39432
164 -39432 -17575 13730 10636 -17578 -30443 -15617 639 -4380 -16956 -12604 5015 13382 3539
177 3539 -5839 2664 13139 956 -22003 -22797 -1018 13277 2250 -19707 -22793 -2032 15167
190 15167 6230 -11619 -7340 16351 28622 16838 4020 9912 19258 11805 -1918 -463 11981
203 11981 12865 -4263 -19984 -12963 5229 3410 -18172 -25796 -6326 14494 10137 -8141 -11531
216 -11531 3193 12095 3128 -5799 -1787 7898 5995 -5472 -8959 413 5233 -5700 -15931 -7884
$$ packed form
127i7217K2486O0287J4507l2036K256N5428K2085m7754l0657M8207O1118r267
139F9443o0849k9038L6333L6401l1657o3211r159N0524L0274k6694l0003J9053
151h583L4222r145l2494M736L9534J7580k5850k9431R584L0992k802m1960k5815
164c9432K1857L1305l094k8214j2865J4826J6256n019j2576M352J7619Q367r843
177C539r378Q503J0475j2183k2959p94K1779J4295j1027k1957l086K0761J7199
190A5167q937j7849M279K3691J2271j1784j2818N892R346p453j3723J455J2444
203A1981Q84j7128j5721P021J8192j819k1582p624J9470K0820m357j8278l390
216a1531J4724Q902q967q927M012R685j903j1467l487R372M820j0933j0231Q047
$$ plain form
230 -7884 6981 8852 -3341 -11438 -3789 9330 10015 -754 -5117 2797 10879 7625 -1233 -3051
244 -3051 1707 2166 -3012 -4393 738 4702 2321 -3921 -4841 2465 8255 3307 -4436 -4011 4853 8763
260 8763 2589 -5604 -5168 457 1571 -2481 -5572 -3158 540 -526 -5309 -4869 927 3377 -1446 -4706
276 -4706 215 7015 6718 -826 -4699 307 5864 3511 -2740 -4121 424 3600 187 -4001 -2361
291 -2361 1719 1144 -1764 -1447 2584 4750 1544 -3014 -1329 3899 5034 -42 -4121 -1668 3469 3175
307 3175 -1730 -4664 -2406 260 -64 -1584 -2039 78 832 -792 -1504 470 2738 982 -2114 -1984
323 -1984 1553 3297 873 -2999 -2526 492 2495 764 -2178 -1826 400 1972 75 -1080 -12 1285
339 1285 662 -457 190 1674 1634 -741 -1822 -53 2137 1280 -1775 -3048 -443 2173 1295 -1591 -2126
$$ packed form
230g884J4865J871j2193q097P649J3119O85j0769m363P914Q082l254q858j818
244c051M758M59n178j381N131L964k381o242r20P306N790m948p743M25Q864L910
260H763o174q193M36N625J114m052l091K414L698j066m783M40N796K450m823l260
276d706M921O800k97p544l873N006N557k353o251j381M545L176l413m188J640
291b361M080n75k908L17M031K166l206m558J685N228J135n076m079K453N137k94
307C175m905k934K258K666l24j520m55K117P54j624p12J974K268j756l096J30
323a984L537J744k424l872M73L018K003j731k942L52K226J572j897j155J068J297
339A285o23j119O47J484m0k375j081J769K190q57l055j273K605K616q78k886n35
$$ plain form
356 -2126 134 2010 1109 -363 -591 616 838 -2 -647 357 1068 -517 -1843 -804 750 1030 -1035
373 -1035 -2425 -757 1288 1351 -190 -1283 43 1463 1592 329 -536 573 783 268 -154 39 624
390 624 208 -889 -923 108 903 220 -1508 -964 580 1363 196 -1437 -121 738 933 -101 -704 -339
408 -339 403 365 -573 -422 297 66 -162 -644 158 774 674 -352 -888 293 1081 419 -271 -550 354 714
428 714 160 -651 -527 52 226 -32 -484 5 427 345 -121 -197 567 962 39 -527 397 604 579 -129 -420
449 -420 7 214 73 -548 -562 -133 -338 -59 -538 -184 182 42 -145 -393 340 711 252 -330 -296 203 465
470 465 69 -509 -328 -172 113 -287 -426 29 157 169 -79 -55 88 258 55 -233 80 309 327 -323 -392 -107
492 -107 36 62 -127 -53 117 452 261 -160 -77 171 127 54 24 312 385 3 -472 -155 35 117 -119 -456 -237
$$ packed form
356b126K260J876r01j472k28J207K22q40o45J004P11j585j326J039J554K80k065
373a035j390J668K045O3j541j093J326J420J29j263q65J109K10n15m22J93N85
390F24m16j097l4J031P95o83j728N44J544P83j167j633J316Q59J95j034o03L65
408c39P42l8r38J51P19k31k28m82Q02O16j00j026n36J181P88o62o90k79R04L60
428G14n54q11J24N79J74k58m52M89M22q2m66p6P64L95r23n66R24K07k5p08k91
449d20M27K07j41o21j4M29k05K79m79L54L66j40j87k48P33L71m59n82L4M99K62
470D65l96n78J81J56K85m00j39M55J28J2k48K4J43J70k03k88L13K29J8o50o9K85
492a07J43K6j89P4J70L35j91m21Q3K48m4p3l0K88P3l82m75L17J90Q2k36l37K19
$$ plain form
515 -237 163 10 -106 -140 61 38 181 -244 -233 5 171 -108 -125 57 106 -57 -144 -56 97 -23 -161 -191 -343
538 -343 -23 432 -273 -309 -40 298 277 69 -111 8 255 105 143 -69 220 159 12 -225 -103 215 23 50
560 50 9 -297 -4 -1 56 -72 -81 93 -222 -40 126 -53 -16 -87 -135 -199 -89 -104 -344 87 -28 226 -109 -76 -229
585 -229 227 -107 -131 115 51 98 23 124 3 -150 51 31 36 101 -33 -13 -122 -382 -161 98 -22 149 -91
608 -91 74 304 256 18 -78 -67 -166 -261 27 91 -47 -24 121 36 46 -15 34 -224 -121 -196 38 -64 91 123 -83
633 -83 57 -142 143 189 237 113 -187 36 130 77 245 -74 132 -113 161 45 212 11 137 -173 139 -53
655 -53 -7 47 -61 -259 18 -300 318 276 223 85 -77 -91 33 108 -5 197 116 -129 188 19 8 23 -93 240
679 240 234 115 -75 60 -11 306 64 192 3 58 -60 9 -156 19 65 166 -148 185 -77 -51 67 -206 -16
$$ packed form
515b37M00j53j16l4K01k3J43m25J1K38J66k79j7J82M9j63q7Q8J53j20j38l0j52
538c43L20M55p05l6K69L38k1k08j80J19K47j50L8k12K89o1j47k37J22L18j92K7
560E0m1l06K93LN7j28rJ74l15J82J66j79L7p1m8o4J10j5k40M31j15K54l35L3j53
585b29M56l34k4K46o4M7p5J01j21j53K01k0NO5j34K0j09k60K21K59j20J71k40
608i1J65K30m8k38r6J1r9r5K88O4j38K3J45q5J0o1M9k58J03p5K34j02J55L2k06
633h3J40j99K85M6M8j24l00K23R4n3J68l19K06k45K74j16J67k01J26l10L12j92
655e3M6N4j08j98K77l18O18m2n3j38j62j4J24P5j13K02q1k45L17j69j1J5j16L33
679B40oj19j90J35p1L17k42J28j89N5j18O9j65J75M6J01l14L33k62K6J18k73J90
$$ plain form
702 -16 42 71 200 312 -162 -372 3 75 -25 116 -297 -114 -18 250 -143 -146 -63 -180 -126 64 62 -5 19 -43 -140
727 -140 -5 -120 -207 -179 -6 164 50 -71 177 106 4 -244 155 -156 9 16 -78 4 -83 -39 31 62 -108 -35
751 -35 -57 13 -168 200 -26 -143 281 -92 -235 51 -180 -12 16 -36 -77 -98 -195 -235 78 -18 203 -88 126 41
775 41 152 -163 -85 -23 203 57 -7 278 114 31 3 -60 89 214 9 321 -23 29 -278 105 -100 49 -78
798 -78 -51 -29 238 3 -13 -34 202 115 -17 -50 193 -3 120 -93 -101 93 -91 65 -54 19 -138 30 -142 101
822 101 -3 128 -112 34 87 -2 -62 -129 295 -145 115 77 -234 219 6 141 78 -95 45 -143 -276 -321 211
845 211 68 -47 216 -79 -27 -196 -139 -83 72 83 268 -159 -255 -2 -29 145 79 9 -98 -67 287 315 118 -142
869 -142 -46 -142 -36 -191 29 94 -113 -173 96 -100 92 69 -183 185 -99 227 119 72 8 105 28 -82 -12 126
$$ packed form
702a6N8K9J29J12m74k10L75P2j00J41m13J83R6K68l93lQ3j17N4J90ko7K4o2r7
727a40J35j15q7K8J73J70j14j21K48p1j02k48L99l11J65Pr4Q2q7M4P0L1j70P3
751c5k2P0j81L68k26j17M24l73j43K86k31J68K8n2m1k1r7m0L13r6K21k91K14q5
775D1J11l15P8O2K26j46o4K85j64q3k8o3J49J25k05L12l44N2l07L83k05J49j27
798g8K7K2K67k35j6k1K36q7j32l3K43j96J23k13qJ94j84J56j19P3j57J68j72K43
822A01j04J31k40J46N3q9o0o7M24m40K60l8l11M53k13J35o3j73J40j88j33m5N32
845B11j43j15K63k95N2j69N7N6J55J1J85m27r6K53k7J74o6p0j07L1L54K8j97k60
869a42R6r6J06j55K20O5k07o0K69j96J92k3k52L68k84L26j08m7o4R7p7j10P0J38
$$ plain form
893 126 -208 -9 93 -256 253 -65 42 154 101 -3 -24 -281 76 -254 -14 -24 -26 21 169 35 -51 -234 47
916 47 152 312 169 89 75 12 -28 77 151 232 -32 -145 56 -4 27 10 93 21 44 92 -43 -23 -237 42 220
941 220 28 148 -37 -26 -226 -32 -5 147 160 21 -126 130 98 -118 91 -113 57 304 48 21 -204 68
963 68 -169 -151 -185 225 -94 -13 -194 -35 57 -164 -209 369 -80 -172 -53 -101 117 82 121 -136 -22 58 233 -87
987 -87 -32 -64 -30 201 -25 -105 -187 208 -177 29 10 181 79 100 -19 160 -67 -95 -78 9 239 67 -7 25 43
1012 43 10 -97 15 -38 -356 -214 -7 -256 -90 13 -172 -251 129 -135 200 23 129 78 105 212 -2 -86
1034 -86 -310 -81 -112 -279 191 104 8 -31 96 -153 139 145 -199 -54 -163 2 373 -78 19 -52 92 141 71 198
1058 198 -177 52 -277 -23 -28 228 -42 -54 -91 -45 231 148 171 -235 -362 -36 -4 -62 -89 5 -9 -36 150 134 50
$$ packed form
893A26l34J99J02l49N09l18J07J12n3j04k1k57L57l30K40j0kM7J48j34q6j83K81
916D7J05J60j43q0j4o3m0J05P4Q1k64j13K01o0L1j7Q3p2K3M8j35K0k14K79J78
941B20j92J20j85J1k00J94K7J52J3j39j47K56l2k16K09k04J70K47k56k7k25K72
963F8k37J8l4M10l19Q1j81J59R2k21m5N78m49r2J19m8K18l5L9k57J14Q0J75l20
987h7N5l2L4K31k26q0q2L95l85K06j9J71j02K1j19J79k27k8J7Q7K30j72p4L2J8
1012D3l3j07J12n3l18J42K07k49J66J03j85p9L80k64L35j77J06n1K7J07k14q4
1034h6k24K29l1j67M70q7r6l9J27k49K92Ol44J45j09J65L71m51R7p1J44M9p0J27
1058A98l75K29l29K54nK56k70j2l7M6K76q3K3m06j27L26L2n8k7R4j4k7J86j6q4
$$ plain form
1083 50 9 124 90 -96 -262 307 -77 -87 -61 65 -59 130 -21 136 -47 209 3 91 -1 45 127 -19 -104
1106 -104 171 46 264 107 147 -131 -197 -30 27 251 -85 -39 -126 -76 -56 -153 -206 -75 7 46 65 132 -257 27
1130 27 91 243 -42 134 -145 113 89 38 125 -111 -223 111 -103 -72 292 155 218 81 2 -48 -116 31 47 -35
1154 -35 175 -108 59 -108 -155 5 -9 -7 -160 110 -116 211 -30 24 59 -146 16 81 63 -248 -92 -121 94
1177 94 82 -79 -34 241 222 -336 -77 -249 204 -73 14 3 -218 6 189 173 1 -5 -81 -64 88 66 -57 -3
1201 -3 -26 136 -12 -228 171 34 23 112 -186 -178 124 3 86 59 -51 118 -27 20 -163 29 -5 16 36 66 295
1226 295 -94 -294 -257 -191 0 -100 331 -71 64 123 -15 13 133 164 93 -158 46 108 -222 140 115 -76 -106
1249 -106 -6 -175 -42 -94 -82 261 248 -27 16 -209 165 47 -181 43 118 -125 -50 147 -176 68 -61 -338
$$ packed form
1083E0m1J15l4j86j66N69l84j0K6J26j24J89j51J57j83K56k06Q8r2M6Q2j46q5
1106a04K75j25K18j57M0k78o6J67N7K24l36M6q7N0K0r7n3J31Q2L9J9O7l89K84
1130B7O4J52k85J76k79K58k4n1Q7k36j12L34k14L1L64j37O3j37p9n0o8J47J6q2
1154c5K10k83J67j67m7J60j4Kj53K70k26L27k41N4L5k05J62O5j8l11J56k9K15
1177I4j2j61M5K75j9n58K59j72M53k77Q7j1k21K24J83j6j72op6J7J52k2j23N4
1201ck3J62j48k16L99j37j1Q9k98QL02j21Q3k7j10J69j45M7j83J92l4K1K0L0K29
1226B95l89k00L7O6J91j00M31m02J35N9j38K8J20L1p1k51K04O2l30L62k5j91l0
1249a06J00j69J33n2J2L43j3k75M3k25L74j18k28K24P5k43P5J97l23K44j29k77
$$ plain form
1271 -338 45 -19 168 281 260 179 92 371 21 -114 111 -37 -86 -148 46 84 202 225 171 -90 39 -7 190
1294 190 25 -138 80 -35 40 29 -89 -105 -42 132 14 -141 13 -7 -43 -57 203 -43 14 -89 -61 86 -140
1317 -140 -93 -3 -136 56 -26 -93 200 -86 -58 -134 26 38 -98 -30 34 -220 -29 101 198 105 29 45 -15 -26 20
1342 20 -176 -59 -23 64 -204 175 -20 62 77 96 -39 -25 207 20 160 235 -28 155 -1 256 58 -162 -261
1365 -261 -101 28 42 -152 79 -101 138 111 -29 -45 190 68 -85 62 -66 192 91 -91 -46 -15 39 -134
1387 -134 -1 -36 81 -125 193 82 -88 -108 91 -191 63 -156 -157 -108 -147 -71 -142 174 -293 -202 113 107 -9 -154
1411 -154 321 48 -160 -61 -133 47 -166 103 -127 128 59 -121 220 -227 63 -298 64 -11 -161 -90 225 -85
1433 -85 141 16 157 35 92 127 237 -2 -282 -112 -77 97 137 212 66 -180 -60 225 -122 -114 24 -124 1
$$ packed form
1271c38L83o4J87J13k1q1q7K79l50j35K25j48m9o2J94L8J18K3n4k61J29m6J97
1294A90j65j63K18j15P5j1j18j6O3J74j18j55J54k0l6j4K60k46N7j03K8J47k26
1317a40M7R0j33J92q2o7K93k86K8p6J60J2j36O8O4k54J91J30R7r3p6J6o0j1M6
1342B0j96J17L6Q7k68L79j95Q2J5J9j35J4K32j87J40P5k63J83j56K57j98k20r9
1365b61J60J29J4j94K31j80K39k7j40j6K35j22j53J47j28K58j01j82M5L1N4j73
1387a34J33l5J17k06L18j11j70k0J99k82K54k19jM9l9P6p1L16m67R1L15oj16j45
1411a54M75k73k08R9p2J80k13K69k30K55o9j80L41m47K90l61L62p5j50P1L15l10
1433h5K26j25J41j22N7L5J10k39k80J70L5J74M0P5j46k46J20K85l47QJ38j48J25
$$ plain form
1456 1 -25 -272 -20 143 -138 186 28 141 -132 138 -449 192 203 37 -11 -123 203 -101 142 -42 215 -20
1478 -20 -177 252 -92 -139 97 46 -9 28 35 -89 215 -62 -96 -156 174 -273 58 217 -426 -139 81 -90 98
1501 98 -42 -203 69 114 -276 477 103 -37 -201 229 138 419 91 14 -10 33 -78 50 -181 182 -254 35
1523 35 -39 -83 108 -179 99 99 -201 -149 -172 49 -268 -215 65 -16 192 328 112 178 111 -14 -107 115 -89 -31
1547 -31 -56 3 -116 -80 -41 -94 -16 -216 -16 158 -135 -88 -224 -1 -57 157 241 65 128 61 208 -121 153 -32
1571 -32 -57 95 234 65 -12 -272 111 44 56 102 131 -174 -133 100 78 -179 49 79 24 49 -123 -16 63 305
1595 305 -143 -4 -212 -125 11 135 -79 11 51 167 65 19 136 -102 -45 49 137 17 55 -121 2 -19 162
1618 162 -184 -45 102 50 116 102 48 195 157 8 -237 -3 78 70 -40 -157 44 -191 -24 -154 -183 -83 230
$$ packed form
1456Ak6k47K52J63k81L24j58J13k73K70n87O41J1j66m8j12L26l04K43j84K57k35
1478b0j57M29l44m7K36n1n5L7Pj24L04k77l4o0L30m47L31J59o43K87K20j71J88
1501I8j40j61K72M5l90P53l74j40j64M30r1K81l28p7k4M3j11J28k31L63m36K89
1523C5p4m4J91k87K78%l00N2k3K21l17N3K80q1K08J36k16O6o7j25r3K22k04N8
1547c1k5N9j19L6L9n3P8k00K00J74k93M7j36K23n6K14Q4j76O3o7J47l29K74j85
1571c2k5J52J39j69p7k60L83o7J2M6K9l05M1K33k2k57K28L0n5K5j72J07P9K42
1595C05m48J39k08Q7J36J24k14R0M0J16j02m6J17k38N7R4Q8j20L8j76J23k1J81
1618A62l46J39J47n2O6j4n4J47l8j49k45K34Q1qj10j17K01k35J67j30k9J00L13
$$ plain form
1641 230 -77 -48 -112 18 -237 -67 -71 115 80 224 -38 19 50 152 244 0 -195 247 33 -60 -106 -100 -37 -80 89
1666 89 -18 43 142 51 186 -232 28 -52 -128 37 -38 -19 94 -86 -86 -67 107 82 67 254 -42 55 61 -49 5 -190
1692 -190 152 52 149 -79 -104 6 8 206 -40 121 -100 16 -65 -198 -106 -66 48 155 26 158 -165 -97 -160
1715 -160 -75 124 -76 -274 -63 22 7 -129 13 -76 -29 129 -97 66 40 115 -95 -56 211 70 -149 76 -45
1738 -45 -319 -328 75 36 1 32 425 -98 -63 -227 -100 83 -87 -55 31 -98 -122 -55 17 -20 131 -80 142 -111
1762 -111 -8 33 -197 67 22 95 37 -18 -80 102 3 95 39 126 296 130 -76 -126 116 45 81 -35 -83 -101 -35
1787 -35 8 2 30 -292 145 -133 84 1 -40 131 -201 173 110 186 -45 -6 145 33 171 104 54 -276 -157 -90
1811 -90 -11 -101 -17 -107 7 -47 -9 -197 -76 -100 -4 96 78 -107 -42 100 -260 52 -136 -22 35 95 42 -121 -18
$$ packed form
1641B30l07K9o4J30k55J70mJ86l5J44k62N7L1J02R2k44j95M42k14r3m6OO3m3J69
1666H9j07O1R9r1J35m18K60q0p6J65p5J9J13j80%J9J74k5j5J87k96R7Oj10N4j95
1692a90L42j00R7k28k5J10KJ98k46J61k21J16q1j33R2M0J14J07j29J32l23O8o3
1715a60Q5J99k00j98K11Q5j5j36J42q9M7J58k26J63k6P5k10L9K67j41k19K25j21
1738d5k74rM03l9l5L1L93n23L5j64J27J83j70L2Q6j29k4O7P2l7J51k11K22k53
1762a11J03M1k30K64m5P3n8n5o2J82r9R2n6Q7J70j66k06n0K42p1L6j16m8j8O6
1787c5M3oK8l22M37k78K17q3m1J71l32L74o3P6k31L9J51j12J38o7n0l30J19O7
1811i0P9r0Q4r0J14n4L8j88J21k4R6J00j8j85O5J42l60L12j88J14N7O0n3j63J03
$$ plain form
1836 -18 60 -117 -226 240 19 139 143 15 142 -39 -59 143 -95 -155 -134 -83 -162 16 -152 32 109 349 -47
1859 -47 2 0 -185 160 -18 -98 126 -47 -148 -560 203 89 106 102 96 60 -49 87 159 166 -204 -117 202 -137 -214
1884 -214 -91 -240 -50 175 -263 106 2 -83 -65 181 39 63 135 -260 216 162 -204 106 -225 380 -425 33
1906 33 126 130 -76 -137 -121 -53 3 40 131 -19 43 -21 24 -127 -93 -149 17 -128 58 12 11 -138 -203 -57 152 150 112
1933 112 226 -314 -412 152 -194 -163 89 208 55 47 106 20 -97 -282 61 -18 26 -101 38 -392 81 111 -192
1956 -192 104 11 191 -204 -141 -196 2 45 67 -251 -136 95 69 -34 -248 175 -17 -120 -51 416 -177 26
1978 26 -9 -75 244 316 73 -74 -105 33 -89 -13 -111 157 73 -12 192 -34 154 185 38 -84 -155 -238 -188 -15
2002 -15 125 -122 -80 76 -164 11 -371 -42 16 -64 -18 -274 219 -101 217 -157 -68 6 -156 -112 53 63 67 115
$$ packed form
1836a8P8j77j09M66k21J20Mj28J27j81k0K02k38o0K1N1p9J78j68J84P7K40l96
1859d7M9kj85L45j78q0K24j73j01m12P63j14J7mol6j09J36P2Pl70Q7L19l39p7
1884b14J23j49J90K25m38L69j04q5J8K46j42K4P2l95M76n4l66L10l31O05q05M58
1906C3R3Mk06o1J6O8N6L7R1j50O2o4M5j51L4n6J66j45J86m6jj49o5J46K09kl8
1933A12J14n40r8N64l46L1K52J19j53qN9q6j17j85L43p9M4j27J39m30M73L0l03
1956a92K96r3J80l95O3n5J98M3K2l18J15K31k6j03k14M23j92j03O9M67n93K03
1978B6l5o6L19P2k43j47l1J38j22P6r8K68q4q5K04k26J88L1j47j22p1q3N0J73
2002a5J40k47M2J56k40J75l82L29N8q0M6k56M93l20L18l74Q9P4j62M4J65J0MM8
$$ plain form
2026 115 49 111 -101 207 17 75 122 -162 -82 -114 -99 -76 42 -91 3 -85 -160 -13 51 50 -181 -115 110 -52 21
2051 21 -15 116 -101 151 154 1 -66 110 203 -37 -2 52 20 -144 -53 32 -41 31 93 -25 -208 -13 227 3 -59
2076 -59 128 32 37 -57 77 104 72 -67 -101 -53 97 155 -28 18 -149 160 52 -6 -82 44 20 197 -78 254 154
2101 154 97 -170 -85 -48 -104 118 -33 -377 52 -68 -104 -159 116 -138 -31 108 -12 167 -127 -85 -140 101 134
2124 134 -202 -176 77 -20 49 -250 -54 23 -19 79 145 -13 94 157 -213 55 38 11 -14 -34 361 -273 61 -110
2148 -110 -97 168 13 107 -92 -119 332 -369 -60 -89 2 -106 -321 -42 -248 60 -367 16 106 4 -172 -13
2170 -13 -47 -76 -214 -84 197 -19 98 25 -73 -27 -48 41 -94 100 73 -344 113 249 -212 -84 -126 19 -120
2193 -120 130 23 -52 -41 103 30 121 -20 -85 215 -53 67 -228 223 -136 -274 -156 153 340 32 101 -75
$$ packed form
2026A15o6O2k12L08j90N8M7k84Q0l2J5K3J18j33R4q8p5J47O4jk31O6K25j62P3
2051B1l6J31k17K52Lj53o7J76R3k40L5N4l2j64R1Q5p3P2O2j18j83J95K40k24o2
2076e9J87r6Nr4J34K7l2j39l4M8J50N8j83M6j67L09j08n8p6J26k4J77k75L32j00
2101A54n7k67Q5L7n6K22j51l44M29j20l6n5K75k54J07J39j20J79k94M2n5K41L3
2124A34l36K6K53r7O9k99J96P7m2R8O6j58J07O3l70K68j7k7k5k0L95o34L34j71
2148a10J3K65j55R4j99k7M51p01L09k9R1j08k15K79k06L08m27L83R0j02j76J59
2170a3l4k9j38J30K81k16J17p3r8M6k1Q9j35J94k7m17M57J36m61J28m2J45j39
2193a20K50j07p5J1J44p3R1j41o5L00k68J20k95M51l59j38J18L09J87l08O9j76
$$ plain form
2215 -75 96 8 60 -108 -117 -84 -105 65 -11 -137 36 121 -26 83 175 92 124 185 69 235 -192 102 23 21 79 -129
2241 -129 72 -76 75 -4 -116 -135 186 -48 148 -107 245 11 -215 32 -34 -8 108 65 22 98 45 29 60
2264 60 97 191 70 -138 -19 -56 -21 49 -95 160 7 29 -62 -157 -125 92 53 114 -48 -13 54 -250 -12 -208 -120
2289 -120 235 -80 -34 -112 -83 -16 -273 -31 108 -102 108 17 -193 -114 128 -249 -34 160 -127 -20 142 -5
2311 -5 -73 -126 97 -64 -201 52 14 -380 177 -77 -171 88 -105 207 63 -9 102 -157 -137 1 -124 -43 26
2334 26 -406 78 -37 -79 115 143 -115 -46 -142 -167 260 217 56 -117 -272 -92 226 154 172 -70 -136 -198 -283 2
2358 2 96 12 47 120 329 -144 -10 12 -5 -60 193 66 199 84 84 -34 25 21 178 34 -10 143 62 -35 97 52
2384 52 -58 -170 -164 -52 122 55 -47 -118 -37 -18 -269 -288 162 263 -43 35 -90 1 60 126 50 107 -205 87 -194
$$ packed form
2215g5J71q8N2j68rL3k1J70p6j26J73Q5j47J09R2q3L2O1j16J66m27K94p9kN8k08
2241a29K01j48J51p9j12j9L21k34J96k55L52k34k26K47o6K6J16m3m3P6n3j6L1
2264F0L7R4j21k08J19l7L5P0j44K55j53K2r1r5L2K17l9O1j62L5O7l04K38j96Q8
2289a20L55l15M6p8K9O7k57K42J39k10K10r1k10P9K42l77K15J94k87J07J62j47
2311eo8n3K23j61j37K53l8l94N57k54r4K59j93L12j44p2J11k59K0J38j25Q1O9
2334B6m32M84j15m2J94K8k58O9r6k5M27m3j61j73j55J80L18p2J8k42o6o2q5K85
2358BR4q4L5P3K09m73J34K2j7n5K53j27J33j15%j18N9mJ57j44m4J53q1r7J32m5
2384E2j10j12OJ12J74o7j02p1Q1J9k51j9M50J01l06P8j25R1N9O6p6N7l12K92k81
$$ plain form
2409 -194 353 -57 -99 238 -3 154 -1 53 -87 59 -171 252 -16 -44 52 -166 -476 171 87 -197 -75 81
2431 81 188 -50 120 68 -212 -205 -259 -63 30 -63 33 -69 6 -161 -45 -107 133 -24 87 231 -132 -159 -173 52
2455 52 -81 239 44 -18 57 31 77 -44 81 78 158 161 253 194 -62 -49 128 4 107 13 184 -173 36 276 102
2480 102 180 201 -58 34 -26 92 184 -281 -55 -100 -148 28 110 16 206 67 -179 -22 135 43 -6 84 113 -105
2504 -105 112 -77 12 18 -53 -17 -110 33 -76 75 -10 -72 51 192 52 316 81 60 143 -31 114 -236 449
2527 449 -160 226 299 84 -105 -139 54 217 -29 56 27 -357 -81 -19 -156 89 -335 -213 33 82 -128 -63
2549 -63 -8 87 -66 -80 -275 347 -22 -108 140 253 -161 316 152 -123 158 -22 335 -180 -67 124 282 -65
2571 -65 467 -4 83 -40 127 123 33 140 -164 -152 -165 -7 31 -293 136 -32 -118 72 26 -64 191 70 69 76 -167
$$ packed form
2409a94N47m10m2L37k41J57j55N4j40J46k30M23k68k8R6k18l10O47q4k84J22J56
2431H1J07k38J70n2k80Pn4J96R3r3R6j02P5j67J16o2K40j57J11J44l63k7j4K25
2455E2j33L20j95o2P5k6M6j21J25lQ0LR2n9k56J3J77j24J03r4J71l57K09K40j74
2480A02P8K1k59R2o0J18R2m65K26m5m8J76Q2r4J90j39k46J57J57r2m9R0K9k18
2504a05K17j89Q9Op1L6r3J43j09J51q5o2J23J41j40K64k35k1Q3j74J45l50O85
2527D49o09L86P3k15j89l4J93J63k46Q5k9l84K76O2j37K45m24J22K46M9k10O5
2549f3N5R5j53j4j95O22l69q6K48J13m14M77j64k75K81j80L57n15J13J91J58l47
2571f5N32m71Q7j23J67mr0J07l04J2j3J58L8l24M29j68q6J90m6r0K55j21jPk43
$$ plain form
2596 -167 66 -45 133 230 -106 84 -111 157 -84 -87 -135 258 131 179 265 85 -34 308 -14 117 -53 82
2618 82 -140 -153 -120 35 25 329 90 139 114 52 84 -52 -173 101 -146 -21 -64 -245 3 76 -202 246 223 -73
2642 -73 -135 -123 -44 7 -317 332 44 80 38 234 -180 70 106 54 135 -30 105 -90 74 169 14 -233 5 -68
2666 -68 -84 36 -17 173 174 154 294 120 -90 -197 -185 -64 -70 -73 45 -100 -225 -115 -210 198 35 -31 16 131 -203
2691 -203 -221 175 -117 -87 27 -232 92 -94 -341 -12 -82 175 -43 134 90 -192 -55 -59 -139 -404 -94 144
2713 144 200 123 76 90 181 94 -9 37 -61 -56 -60 272 -84 -31 136 242 101 37 142 154 51 100 74 -39 39 -17
2739 -17 -76 20 -283 121 73 -83 -79 213 30 -46 -89 -72 29 210 207 -81 -170 -265 -137 -26 200 -176 7 -197
2763 -197 -115 9 269 -73 -38 -249 22 -78 -177 -95 84 136 170 -167 39 -155 -54 137 -83 55 -177 190
$$ packed form
2596a67K33j11J78R7l36J90j95K68k41lm8L93j27M8Q6j80j19L42l22J31j70J35
2618H2k22j3L3J55j0L04k39M9k5o2L2j36j21K74k47J25m3j81K48P3k78M48k3k96
2642g3o2J2P9N1l24O49k88L6m2J96m14K50L6n2Q1j65J35j95J64R5j55k47K38p3
2666f8j6J20n3J90Jk0J40j74k10j07J2J21olJ18j45j25J10r5M08j63o6M7J15l34
2691b03j8L96k92L0J14k59L24j86k47L29p0K57k18J77m4k82J37mq0k65L10K38
2713A44N6p7m7J4R1q7j03M6r8NmL32l56N3J67J06j41o4J05J2j03M9k6j13P8n6
2739a7n9R6l03M04m8j56MK92j83p6m3J7J01J81lk88q9r5J28J11K26l76J83k04
2763a97Q2J24K60l42L5k11K71j00r9Q2J79N2L4l37K06j94J01J91k20J38k32L67
$$ plain form
2785 190 -76 10 -114 42 27 -85 33 290 55 3 246 117 113 -178 52 -2 41 155 231 -126 241 31 174
2808 174 242 261 -38 98 -66 -250 -82 240 20 74 -66 -13 -159 73 9 217 -189 -127 -176 -92 130 137 -19
2831 -19 -20 -331 -223 -14 -33 -223 22 -216 -81 152 40 -58 -303 -107 -104 -102 -223 106 -136 142 -25 166 199
2854 199 119 -245 77 -84 -104 70 2 355 -15 59 39 74 63 -149 -242 58 -323 -142 -81 28 51 -156 122
2877 122 -58 85 47 15 6 10 -233 97 8 59 146 -81 -27 -252 -170 50 -247 108 103 224 -117 -146 43 -117 -3
2902 -3 83 173 283 114 -209 84 130 166 -71 -174 -140 -34 174 30 81 9 125 -113 34 167 68 -140 -50 125
2926 125 -114 154 249 -111 -61 -61 65 -87 -6 185 -45 -43 187 -130 2 -162 -90 154 -210 99 -16 108 -1
2949 -1 23 113 185 -157 197 177 170 130 -225 -3 54 5 25 -9 -108 59 -13 -77 -391 -16 21 11 -83 3 7 -69 -30 -185
$$ packed form
2785A90k66Q6j24J56j5j12J18K57k35n2K43j29mk91K30n4M3J14P6l57L67k10J43
2808A74O8J9k99J36j64j84J68L22k20N4j40N3j46K32o4K08m06O2m9Q4K22Pj56
2831a9jl11J08K09j9j90K45k38J35K33j12r8k45J96LKj21L29k42K78j67J91L3
2854A99q0l64L22j61k0J74o8L53l70P4k0L5j1k12r3L00l81J81O1J09K3k07K78
2877A22j80J43l8l2rMk43L30q9N1Q7k27N4k25Q2K20k97L55nJ21l41k9J89j60J14
2902cQ6R0J10j69l23K93M6L6k37j03L4J06K08j44N1p2J16k38J47J33r9k08R0J75
2926A25k39K68R5l60N0%J26j52Q1J91k30KK30l17J32j64P2K44l64L09j15J24j09
2949aK4R0P2l42L54k0pm0l55K22N7m9K0l4r9J67p2o4l14L75L7j0r4Q6Mp6L9j55
$$ plain form
2977 -185 -40 35 -124 -100 113 143 99 -119 -245 -21 187 121 150 63 157 -164 81 -208 56 25 -1 289 142
3000 142 309 65 -6 -36 -162 272 59 -16 156 -116 -224 -37 93 -87 -70 -146 -110 55 -117 123 -41 13
3022 13 49 244 -38 -114 223 51 98 4 -170 137 -124 -134 -74 138 106 180 112 86 -65 224 115 73 -86 48
3046 48 40 83 -97 -1 -76 -27 70 124 -241 -233 -186 77 -321 219 -69 41 -158 113 231 -126 95 -278 -195 50
3070 50 15 -157 80 157 213 -111 -74 171 -70 45 54 -2 -95 -205 -16 -228 3 -54 -81 260 -192 -9 -80 70
3094 70 -95 100 -47 56 -175 179 84 71 232 238 100 1 42 -163 45 -123 219 169 -77 388 -396 43 69
3117 69 312 29 -131 -121 7 -7 151 -183 21 201 -69 263 -106 -168 -96 -69 -140 -67 133 -62 154 -126 44
3140 44 61 -95 43 -19 127 31 26 229 19 16 -107 -38 -35 -78 280 9 -83 43 65 -130 -25 88 124 -261 -230
$$ packed form
2977a85J45P5j59K4K13L0m4k18j26K24K08o6K9q7R4l21K45k89K64l1k6K90j47
3000A42J67k44p1l0j26M34k13p5J72k72j08J87J30j80J7p6L6J65j72K40j64N4
3022A3L6J95k82p6L37j72M7r4j74L07k61j0O0K12l2P4o8k6j51K89j09m2j59J34
3046D8qM3j80R6p5M9R7N4l65QM7K63l98N40k88J10j99K71J18l57K21l73Q3K45
3070E0l5j72K37P7N6l24L7K45k41J15Rn6r3j10J89k12K31n7k7L41m52J83p1J50
3094G0j65J95j47J03k31L54r5j3J61Oj38r9M1k05K08j68L42n0k46M65p84M39K6
3117F9K43k83j60J0J28j4J58l34K04J80k70L32l69o2P2K7p1P3K00j95K16k80J70
3140D4J7j56J38o2J46r6nK03k10lj23O9Lm3L58k71r2J26K2j95J05J13L6l85L1
$$ plain form
3165 -230 200 -15 350 64 150 -330 -115 -351 148 -51 -78 -290 181 -35 -28 29 190 -78 -11 6 66 -71 -10
3188 -10 -46 -105 -74 -149 72 -195 145 -44 -27 19 -8 -236 141 203 -207 -130 -84 13 75 13 -147 -67 -32 -48 119 -250
3214 -250 97 48 -142 109 10 73 -191 -75 -123 62 -130 168 54 142 235 -167 18 -10 -10 -85 106 -26 13 63
3238 63 8 -115 -211 -161 43 -329 114 127 44 -39 113 132 108 -290 156 -18 -151 128 -185 83 300 97 -193
3261 -193 124 116 -84 -60 -95 16 -166 36 138 -378 -91 -301 -149 -53 112 -97 -39 -172 82 -73 327 136
3283 136 -78 41 -149 120 -91 -146 -8 -50 47 109 186 22 203 48 -82 88 -94 -103 114 295 -323 -97
3305 -97 169 14 68 -199 126 -66 21 153 210 -162 27 -213 24 30 114 -41 -19 13 -187 60 131 -88 297
3328 297 127 169 72 1 -133 105 185 136 30 -115 -151 -96 -102 11 74 181 117 -58 31 5 412 0 -41 -104 165
$$ packed form
3165b30M30k15L65k86Q6m80K15k36M99j99k7k12M71k16PN7J61k68O7J7O0j37O1
3188a0l6n9L1p5K21k67L40j89J7M6k7k28L77O2m10P7M6R7O2o2j60Q0L5j6J67l69
3214b50L47m9j90K51r9O3k64J16m8J85j92K98j14Q8R3m02J85k8%p5J91j32L9N0
3238F3n5j23r6N0K04l72M43J3q3q3J52J9k4l98M46j74j33K79l13K68K17k03k90
3261a93L17qk00K4l5J11j82K02J02n16K87k10J52R6J65k09N8j33K54j55M00j91
3283A36k14J19j90K69k11n5J38m2R7O2P7j64J81j55j30J70j82rK17J81o18K26
3305i7K66j55N4k67L25j92Q7J32N7l72J89k40K37OQ4j55K2L2k00K47P1k19L85
3328B97j70M2r7p1j34K38Q0m9j06j45l6N5oJ13O3J07o4j75Q9k6M07m12m1o3K69
$$ plain form
3353 165 20 -123 50 212 96 77 82 -27 -91 17 117 120 258 -7 -72 70 214 -104 91 117 -190 -31 -41
3376 -41 -164 -100 13 -168 -129 318 122 -114 -230 -131 -54 76 -128 -202 -110 -306 154 -141 -168 28 -94 52 -106
3399 -106 168 -125 -183 -130 -4 101 104 -245 -178 298 -25 113 -10 -322 -191 219 113 44 221 125 -27 69 153
3422 153 -206 -15 -113 22 -104 39 -190 237 -220 70 -96 -9 181 -164 114 -355 26 -16 94 -109 -19
3443 -19 -129 -1 53 -55 -230 -34 40 178 -148 188 -42 -160 59 171 259 39 146 -143 113 12 68 -312
3465 -312 6 319 -173 -50 -193 -83 79 -63 -96 49 -237 -101 -73 101 161 80 199 69 -215 146 -11
3486 -11 -81 -112 14 225 -176 136 -44 -76 -140 68 134 -83 200 42 170 -52 130 156 -78 -106 33 0 -88
3509 -88 64 214 72 -57 179 -94 -246 -94 145 -85 -128 212 -293 92 -139 199 -69 196 102 -49 -51 84
$$ packed form
3353A65j45j43J73J62j16j9Nj09o4J08J00LJ38k65o5J42J44l18J95K6l07J59j0
3376d1j23O4J13j81L9M47j96k36j16R9P7J30k04p4R2j96M60k95k7J96j22J46j58
3399a06K74k93n8N3J26J05Ll49O7M76l23J38j23l12J31M10j06o9J77r6j52R6Q4
3422A53l59J91r8J35j26J43k29M27m57K90j66Q7J90l45K78m69L81m2J10k03R0
3443a9j10J28N4j08j75J96P4J38l26L36k30j18K19J12Q8k20J07k89K56j01N6l80
3465c12L18L13m92J23j43J10J62j42l3J45k86J36K8J74O0q1J19j30k84L61j57
3486a1p0l1J26K11m01L12j80l2o4K08O6k17K83j58J28k22J82K6k34k8J39l3q8
3509h8J52J50j42j29K36k73j52J52K39k30m3L40n05L85k31L38k68K65r4j51kJ35
$$ plain form
3531 84 142 -103 156 -123 25 -105 -196 -125 -168 -14 97 193 -65 -34 -176 -112 145 103 48 -41 172 1 -69 282
3555 282 16 -45 -199 27 -74 228 -170 26 234 -151 -73 -251 -65 97 -40 -241 162 -321 49 -4 26
3576 26 -65 -52 -85 136 58 245 7 -9 56 -102 264 102 71 -60 164 -199 56 154 4 92 -2 -156 0 30
3600 30 119 173 5 -178 181 31 -228 -1 -59 26 84 241 -56 171 -146 -174 69 -119 -40 -108 1 -56 -11 -184
3624 -184 -30 117 -14 155 6 -179 26 -12 -200 -52 -252 79 -257 -140 95 163 251 137 -131 17 188
3645 188 352 111 25 24 -30 261 182 88 -11 199 344 3 -79 -242 143 65 121 77 60 146 -290 101 94 178 -38
3670 -38 156 94 29 -33 -95 -32 -52 -121 -65 24 176 -203 -129 85 -128 -161 -48 0 13 -70 -191 133 -9 -206 168
3695 168 113 -40 4 -158 101 -48 143 115 110 -38 59 -153 46 -78 196 -67 45 124 -152 -17 -78 -25 24
$$ packed form
3531H4N8k45K59k79J48j30r1P1m3J54J11R6k58L1j42O4K57m2n5q9K13j71p0L51
3555B82k66o1j54K26j01L02l98J96K08l85P8j78J86J62j37k01M03m83L70n3L0
3576B6r1J3l3K21p8J87k38j6O5j58L66j62l1j31K24l63K55R8j50Q8r4j54J56L0
3600C0Q9N4j68j83L59j50k59K27n8Q5N8J57k97K27l17k8K43j88P9o8J09n7M5j73
3624a84J54J47j31J69j49j85K05l8j88J48k00L31l36J17K35O8Q8j14k68J48J71
3645A88J64k41q6jn4K91p9r4r9K10J45l41q2j63L85p8N6m4j7Q6m36L91pQ4k16
3670c8J94o2o5o2o2O3k0o9N6Q9J52l79P4K14k13l3J13M8J3q3j21L24j42j97L74
3695A68n5j53M4j62K59j49J91k8nj48R7k12J99j24K74k63J12P9k76J35o1N3M9
$$ plain form
3718 24 -193 68 -86 13 25 113 -100 62 37 -122 -76 -163 249 10 256 -13 133 -46 -114 77 -82 91 262
3741 262 40 81 -184 -62 -96 -98 -20 -97 -120 4 -59 -9 -76 148 30 39 101 -135 -269 178 191 -229 299 -198 169
3766 169 -64 42 404 309 11 -36 -7 312 -5 -122 -187 35 -47 -162 -99 47 26 45 121 214 -25 -71 -4 36
3790 36 196 281 120 17 85 114 -7 108 153 -58 49 -372 -51 -277 122 -50 -151 85 108 152 30 20 -196
3813 -196 -95 -27 -103 -82 -43 -153 -75 -104 -76 45 -183 -65 4 229 -6 -142 19 35 88 166 -6 -294 -229 -68
3837 -68 -22 -66 81 66 -8 -63 -18 -161 -150 175 41 85 -224 82 -15 31 199 -51 -174 30 53 -46 -78 70 -98
3862 -98 106 4 -303 59 21 -40 50 -125 -95 171 -167 114 141 2 83 -106 -182 -213 89 31 -114 -122 118 -88
3886 -88 -92 183 -124 195 -28 147 66 -132 -60 31 52 -43 55 -204 -204 -207 -18 102 -42 205 -21 -65 -18 252 107
$$ packed form
3718B4k17K61j54R9J2Q8k13J62k5j59M6q7M12k39K46k69J46j79o8J91j59J73J71
3741B62k22M1k65J22l4kP8p7k3J24o3N0o7K24j18RO2k36j34M47J3m20N28m97L67
3766A69k33J06L62r5k98m7K9L19l17j17o5K22q2j15O3J46k1J9P6R3k39m6O7M0
3790C6J60Q5j61j03O8K9j21J15M5k11J07m21L21k26L99j72j01K36K3M4j22j0k16
3813a96J01O8p6K1L9j10P8k9K8J21k28J18O9K25k35j36J61J6N3P8j72k88O5J61
3837f8M6m4J47j5p4n5M5j43J1L25j34M4l09L06r7M6J68k50j23K04K3r9l2J48j68
3862i8K04j02l07L62l8o1R0j75L0K66l38K81K7j39Q1j89p6l1L02n8j45qK40k06
3886h8mK75l07L19k23J75q1j98P2R1K1r5R8k59%lJ89J20j44K47k26m4M7K70j45
$$ plain form
3911 107 -82 124 -177 -85 -269 8 -147 -8 171 127 93 -67 135 190 -23 -28 192 -159 200 19 -81 55
3933 55 18 -123 -180 110 -13 164 -191 -172 9 87 -9 -116 -143 56 211 -8 302 54 -390 -13 73 -72 32
3956 32 172 129 -119 126 -171 -16 147 53 50 118 -175 -22 183 -112 161 -25 34 -129 316 -175 114 -195
3978 -195 -68 -57 277 -8 -156 -243 98 -133 -26 -172 -52 -234 -156 85 -143 -104 93 129 -129 -54 -42 -140 40
4001 40 78 -4 -5 130 -103 -270 33 -238 204 53 159 82 19 77 -52 -49 -233 42 -6 -197 168 217 -19 -110
4025 -110 108 64 39 -115 -112 1 -93 -83 -4 -24 71 -105 145 24 1 -9 -48 3 60 77 -159 -154 82 -200 -36 -66
4051 -66 75 -44 7 -37 195 -42 -264 252 81 -123 -119 102 66 23 59 129 -56 -90 171 -268 -211 39 -12 163
4075 163 -107 -27 -132 -114 99 244 61 -100 346 25 -21 -132 147 22 -16 142 6 177 -26 -65 -52 227
$$ packed form
3911A07j89K06l01R2j84K77j55J39J79m4l4j60K02N5k13nK20l51L59j81j00J36
3933E5l7j41n7K90j23J77l55J9J81P8r6j07k7J99J55k19L10k48m44L77Q6j45J04
3956C2J40m3k48K45k97J55J63r4lO8k93J53K05k95K73j86N9j63M45m91K89l09
3978a95J27J1L34k85j48q7L41k31J07j46J20j82P8K41k28L9J97L6k58P5J2r8J80
4001D0L8q2jJ35k33j67L03k71M42j51J06p7o3N8j29Lj84K75m8j91L65M9k36r1
4025a10K18m4k5j54LJ13r4J0P9k0R5j76K50j21k3j0l9N1N7J7k36NK36k82J64l0
4051f6J41j19N1m4K32k37k22N16j71k04MK21l6m3L6P0j85l4K61m39N7K50n1J75
4075A63k70Q0j05J8K13J45j83j61M46l21m6j11K79j25l8J58j36J71k03l9J3K79
$$ plain form
4097 227 -117 -184 -51 124 89 56 161 46 179 209 -23 63 134 -28 236 104 -188 115 45 131 -256 -124 70
4120 70 140 -138 -28 66 3 -233 -101 16 22 25 397 5 52 -198 -107 32 38 131 178 -93 -209 57 242 74 213
4145 213 -262 -110 -112 -140 132 -99 145 55 -94 203 -12 -59 -69 25 -118 131 -42 16 75 -44 170 141 135 193
4169 193 19 -185 14 81 -34 -83 0 225 -24 -101 61 -80 -46 98 -164 16 68 24 83 35 15 -232 -80
4192 -80 -193 231 99 209 129 73 197 35 -92 44 134 95 -20 97 33 39 76 89 -105 220 -129 -49 240 113
4216 113 107 -259 -90 -183 -3 0 -318 -245 146 82 -65 -49 83 130 -258 -90 162 188 -102 -238 -16 13 -256 204
4240 204 141 -4 -42 -149 -108 -96 -116 8 -5 -66 39 369 157 100 -36 -100 156 78 220 -271 -283 99 101 123 -54
4265 -54 -4 90 -182 113 -195 200 43 85 -193 -122 -74 58 62 -179 -20 -116 -171 63 75 -259 204 -70 -54 39
$$ packed form
4097B27l44o7J33J75l5l3J05j15J33L0k32Q6P1j62K64j32k92L03p0Q6l87J32J94
4120G0P0k78J10R4o3k36J32J17OLL72l92M7k50R1J39OR3M7k71j16K66J85j68J39
4145B13m75J52kk8K72k31K44r0j49K97k15m7j0R4j43K49j73N8N9j19K14k9oN8
4169A93j74k04J99O7j15m9Q3K25k49p7J62j41L4J44k62J80N2m4N9m8k0k47J52
4192h0j13M24j32J10q0n6J24j62j27J36R0l9j15J17o4OL7J3j94L25l49Q0K89j27
4216A13ol66J69r3J80Ll18P3L91o4j47J6J32M7l88J68K52K6k90j36K22K9k69M60
4240B04o3j45l8j07M1J2k0J24j3o1J05L30k12n7j36o4K56p8J42m91j2L82KK2j77
4265e4N0R4k72K95l08L95j57M2k78P1M8J32Mk41J59r6n5K34J2l34M63k74J6R3
$$ plain form
4289 39 62 91 -56 -109 -229 -166 6 -71 -162 -84 -212 163 142 -85 -74 197 -205 -47 63 98 -34 7 143 -159
4313 -159 -82 -253 -130 -109 138 6 -58 -179 -50 -84 -70 7 -92 -127 159 195 24 -114 -161 -90 -263 -53 -40 344
4337 344 -99 28 207 -4 205 -200 -92 -163 -191 11 129 14 7 137 144 10 28 72 256 231 236 75 428 358
4361 358 -313 141 39 -57 56 171 -18 87 -177 -43 199 -28 42 32 10 -51 -241 106 42 40 -260 161 58
4384 58 -156 -128 -65 -73 53 118 -125 -197 -16 66 86 -173 -60 -149 157 -32 34 53 218 -12 361 -169 64 -139
4408 -139 -5 -130 140 -45 285 31 78 -32 -147 -22 123 70 7 -57 78 48 98 -1 -37 -60 122 -41 113
4431 113 -108 76 260 -249 -77 -194 57 -77 30 104 75 -9 -134 6 -215 245 -59 -179 103 -40 49
4452 49 -23 2 -124 -44 18 -79 129 60 172 -164 -40 126 -303 -16 -113 -111 -165 -74 -187 -299 -122 236 54 9
$$ packed form
4289C9K3K9j47n3j20O3J72p7r1P8j28L75k1k27J1K71m02J58J10L5j32M1J36l02
4313a59P7j71J23K1K47j32o4j21J29l4J4P7r9l5K86L6j71j38m7P1j73K10J3L84
4337C44m43J27J79k11K09m05J08p1k8K02J18j15pJ30Pj34J8M4J84k5Nj61L53p0
4361C58o71M54j02r6J13J15j89J05k64J34K42k27P0j0k2o1j90L47o4kl00M21j03
4384E8k14K8O3qJ26O5k43p2J81Q2K0k59J13q9L06j89O6J9J65k30L73n30K33k03
4408a39J34j25K70j85L30k54M7j10j15J25J45n3o3o4J35l0N0r9l6k3J82j63J54
4431A13k21J84J84n09J72j17K51j34J07P4k9q4j25J40k21M60l04j20K82j43Q9
4452D9p2K5j26Q0O2r7K08o9J12l36J24J66m29K87r7Kn4R1j13j12J77L58j82m5
$$ plain form
4476 9 237 304 123 341 -10 66 -181 75 109 5 122 -79 -71 76 -211 -66 42 246 78 92 276 47 186
4499 186 138 159 -68 220 -90 -7 170 72 300 -32 -53 168 -179 -178 -18 88 136 -27 197 70 60 -20 -186
4522 -186 38 60 -179 30 -197 -175 134 -115 -86 72 345 195 10 114 -35 51 160 193 148 -118 -68 -99 131
4545 131 -192 -80 -74 -3 20 -51 -309 -237 -98 -380 167 -15 -23 -261 -13 4 43 -303 81 6 54 102 -36 8 115
4570 115 -18 2 28 -74 -172 -79 -46 270 179 -148 -111 56 -26 -35 -56 -123 41 -237 -137 3 138 149 -153 -131 -249
4595 -249 -33 1 240 -74 34 -73 139 -50 -283 196 -228 58 -101 141 -22 102 -16 258 -93 34
4615 34 186 217 -84 193 0 362 183 -1 -258 145 131 -196 94 -9 73 72 224 18 162 115 -66 -109 147
4638 147 -44 334 105 18 -188 34 -192 44 73 -243 -115 -58 14 11 206 122 -240 -135 -71 -39 -121 136 -21
$$ packed form
4476IK28O7j81K18l51P6k47K56L4j04J17k01QJ47k87J45J08K04j68J4J84k29J39
4499A86m8K1k27K88l10Q3J77r8K28l32k1K21l47JJ60J06M8j63K24j27j0q0j66
4522a86K24K2k39K09k27K2L09k49K9J58K73j50j85J04j49Q6J09L3m5k66N0l1K30
4545A31l23J12OP1K3p1k58P2J39k82N47j82qk38K48J7L9l46L84p5M8M8j38M4J07
4570A15j33K0K6j02r8R3L3L16r1l27L7J67q2rk1o7J64k78J00J40J35J1l02K2j18
4595b49K16L4K39l14J08j07K12j89k33M79m24K86j59K42j63J24j18K74l51J27
4615C4J52L1l01K77j93L62j79j84k57M03j4l27K90j03Q2jJ52k06J44m7j81m3K56
4638A47j91L78k29q7k06K22k26K36K9l16J28N7P2lJ95q4l62J05O4L2q2K57j57
$$ plain form
4661 -21 -21 -163 -7 198 -159 125 -141 -32 -57 422 54 -99 116 176 -172 -100 378 166 37 74 28 -69 -234
4684 -234 -50 -27 -215 -221 50 -231 -231 157 27 19 132 -138 41 93 -466 86 4 31 26 -63 -315 -298 -107 111 107
4709 107 106 -58 -160 14 -76 -188 131 -4 -122 129 15 -54 37 -72 -112 -122 -33 -2 98 126 -21 -172 57
4732 57 -133 128 80 -218 8 -140 139 -83 -142 26 -161 133 33 63 42 -323 24 119 -154 167 -45 -66
4754 -66 104 -241 -208 83 135 122 -179 -161 67 -185 196 -82 -84 -19 76 -52 12 -219 20 -199 -77 -81 -9 -171
4778 -171 39 261 245 70 235 103 43 -258 0 -279 27 49 148 -39 201 187 -198 24 18 37 -15 11 -51 156
4802 156 32 -6 62 -127 16 43 124 -34 -49 -121 -203 323 9 -125 -155 146 38 -47 38 -191 -372 158 123 -53
4826 -53 -126 85 -184 90 -20 -173 126 71 -123 -38 146 -266 -272 -99 -13 -110 166 147 198 83 -24 -60 39 246
$$ packed form
4661b1%j42J56K05l57K84k66J09k5M79l68j53K15O0l48P2M78k12j29L7m6r7j65
4684b34J84K3j88oK71k81%L88j30qJ13k70J79N2n59N52q2K7nq9k52J7J91K18m
4709A07jj64j02J74r0j12L19j35j18K51j14o9R1j09m0j0Q9L1J00K8j47j51K29
4732E7j90K61m8k98K26j48K79k22n9J68j87K94j00L0k1l65L47R5k73L21k12k1
4754f6J70l45L3K91N2j3l01J8K28k52L81k78kO5R5j28O4k31K39k19J22mP2j62
4778a71K10K22j6j75J65j32o0l01K58k79L06K2R9j87K40j4l85K22oJ9n2K6o2K07
4802A56j24l8O8j89J43K7Q1j58j5p2q2N26l14j34l0L01j08q5Q5k29j81N30l5j76
4826e3p3K11k69K74j10j53K99n5j94Q5J84m12oJ73Q6r7K76j9N1j15j07l6R9K07
$$ plain form
4850 246 93 140 111 214 272 78 -21 -229 -225 183 69 -82 -75 -172 10 147 -332 356 -4 38 -7 -178 -112 -233
4874 -233 295 -143 226 130 59 -193 -108 -197 163 233 9 -4 -71 300 13 246 187 12 -201 -17 119 -78 -18
4897 -18 -26 38 23 -21 121 -31 -113 -74 -93 -162 118 -34 214 70 23 -287 4 11 161 262 -285 19 -33 96 121
4922 121 -57 -71 60 -310 -16 -62 -248 -42 162 -156 159 57 69 -49 43 -126 159 28 153 127 160 13
4944 13 -202 -82 -196 204 247 152 195 95 -123 280 -149 -77 -25 -93 -69 38 39 72 -87 57 197 92 179 -201
4968 -201 179 -26 -184 -97 111 122 -153 -78 -4 -192 169 -27 -198 319 -25 48 88 63 -82 -155 -49 45 236
4991 236 -59 -53 -107 13 -221 51 256 -173 -103 -20 -189 51 -185 -252 -40 -75 101 -107 -475 27 127 -253
5013 -253 -40 -21 -43 -66 -58 -33 -65 152 -160 87 205 -19 17 111 -84 -261 -109 -104 -271 215 65 -30 -349 121
$$ packed form
4850B46j53M7k9J03N8j94r9k08MM08j14j51Pr7J82J37m79O88l60M2m5j71O6j21
4874b33N28m38L69r6p1k52Q5q9L60P0k24j3o7L71k87K33n9j75k13J84J36j97O0
4897a8qO4j5m4J42j52q2L9j9o9K80j52K48j44m7l10K91PJ50J01n47L04n2J29K5
4922A21j78j4J31l70K94m6j86K06K04l18L15j02J2j18R2j69K85j31J25k6L3j47
4944A3k15J20j14M00M3r5M3j00k18M03m29P2N2o8K4J07JL3j59J44J40j05Q7l80
4968b01L80k05j58Q7K08J1k75P5P4j88L61j96j71N17l44P3M0k5j45p3J06R4J91
4991B36k95On4J20k34K72K05m29P0Q3j69K40k36o7K12l5J76k08l68N02J00l80
5013b53K13J9k2k3QK5l2K17l12K47J18k24L6R4j95j77J52Nj67M86j50r5l19M70
$$ plain form
5037 121 -58 10 -19 83 -4 -26 41 24 239 -108 47 2 -373 27 233 -130 48 -73 -127 27 -117 202 296
5060 296 38 151 60 173 -144 -67 -47 113 -151 -31 81 -43 -239 -185 -157 32 -328 -27 142 -328 -107 28
5082 28 -165 216 18 18 70 78 15 105 -11 -121 -73 67 -173 70 -61 -118 26 141 27 0 -145 201 165 -342
5106 -342 -430 -1 170 121 -68 60 172 59 154 -147 332 -40 -200 78 -5 -155 39 -75 199 -130 -131 172
5128 172 257 28 -172 61 -5 -29 113 12 202 -125 134 -155 -34 33 16 85 31 53 -129 -74 55 83 117 -53
5152 -53 417 -220 -102 -289 144 -57 39 -177 -146 212 10 112 458 144 85 66 342 179 -187 153 -106 98
5174 98 -147 -318 -87 -165 55 -77 16 33 41 70 -227 172 65 -107 145 -59 180 -39 -16 177 169 11 -18 51
5198 51 -43 103 -169 -50 165 -31 -61 -213 254 19 -87 187 -79 -185 111 106 9 -124 145 126 -124 96
$$ packed form
5037A21j79O8k9J02q7k2O7j7K15l47J55m5l75M00K06l63J78j21n4J54j44L19R4
5060B96k58J13r1J13l17P7K0J60k64J20J12j24j96N4K8J89l60L01J69m70K21J35
5082B8j93L81j98%N2Qo3R0j16j10M8J40k40K43j31n7J44J15j14k7j45L46l6n07
5106c42q8M29J71m9j89J28J12j13R5l01M79l72j60K78q3j50J94j14K74l29jL03
5128A72Q5k29k00K33o6k4J42j01J90l27K59k89J21O7j7O9n4K2j82N5J29K8L4j70
5152e3M70o37J18j87M33k01R6k16L1L58k02J02L46l14n9j9K76j63l66L40k59K04
5174I8k45j71K31p8K20j32R3J7QK9k97L99j07j72K52k04K39k19K3J93qj58k9O9
5198E1r4J46k72J19K15j96l0j52M67k35j06K74k66j06K96nr7j33K69j9k50K20
$$ plain form
5220 96 -8 -56 83 173 40 -122 -23 -78 67 22 40 168 191 192 82 -90 181 239 85 -9 -35 -14 138 -116 96
5245 96 65 126 396 -75 15 -65 92 -47 -97 -109 289 -27 -251 -231 -125 96 -35 -61 -167 161 71 -85 157
5268 157 -240 -66 -109 165 41 116 45 71 146 149 84 -71 -123 -126 7 151 -95 13 28 16 82 -151 128 -206 -92
5293 -92 15 -34 139 57 -28 52 -41 -152 17 48 153 92 21 87 105 -58 41 52 341 171 -169 -176 -148 19 132
5318 132 -145 -50 127 109 -78 -7 73 -262 -157 -30 -34 153 62 127 152 -48 -32 22 -170 -1 61 -246 51 -30
5342 -30 105 202 147 -83 66 -186 146 215 -158 177 19 -205 -85 24 -189 -275 101 -59 -197 -33 -144 107
5364 107 -181 9 330 -41 221 -120 202 64 -64 11 22 101 -68 -185 -304 -68 185 -15 -37 -66 -139 -36
5386 -36 42 30 -86 -91 -45 -131 228 -90 -253 66 88 43 -149 -71 -239 53 -59 82 136 -134 101 -36 -35 -105 22
$$ packed form
5220I6j04m8J39R0j33j62R9n5J45m5J8J28K3Jj10j72K71N8j54r4k6K1J52k54K12
5245I6l1O1K70m71R0q0J57j39n0j2L98l16k24K0J06K21j31k6j06L28r0j56K42
5268A57l97J74m3K74j24P5p1K6P5Lo5j55n2lJ33J44k46J08J5j2O6k33K79l34J14
5293i2J07m9J73q2q5Q0r3j11J69L1J05o1p1O6J8j63R9J1K89j70l40pK8J67J13
5318A32k77R5J77j8j87P1Q0l35J05J27mJ87r1O5K5k00J6N4j92J69O2l07K97q1
5342c0J35R7n5k30J49k52L32O9l73L35j58k24J20J09k13q6L76j60j38J64j11K51
5364A07k88J90L21l71K62l41L22j38j28P5J1P9j69j17j19K36K53k00k2k9p3J03
5386c6P8j2j16nM6q6L59l18j63L19K2m5j92P8j68K92j12J41N4k70K35j37Jp0J27
$$ plain form
5411 22 -15 85 195 -46 43 183 -83 -326 -113 -207 -108 46 254 -87 -94 35 -46 129 -98 -24 87 -18 -196
5434 -196 131 -90 96 11 -110 132 35 -107 -145 -105 -236 -16 136 -237 -109 112 -220 137 -86 -30 -85 169
5456 169 -25 -38 57 -6 10 -121 202 -45 -276 -135 105 -84 242 35 -153 223 29 18 -284 -196 256 -210
5478 -210 -2 77 262 -92 -135 -20 -22 34 -22 -89 -20 -71 -132 -181 -70 -117 189 -12 -202 -111 183 48 77 32 75
5503 75 132 -66 6 -101 58 -226 128 -281 -28 141 148 -20 50 46 -137 101 42 -110 -4 24 31 11 -102 64
5527 64 -265 -164 -137 -44 63 -15 -49 80 51 -37 112 173 -199 -42 -55 -69 145 75 -135 215 -120 7 -5 -80
5551 -80 16 227 127 84 -57 -76 212 -63 -57 -128 -18 -99 -237 -67 255 -135 -118 44 71 97 241 6 5 66 64
5576 64 -173 -254 87 2 24 121 197 35 211 -116 82 -208 11 -141 76 -205 -42 88 -218 -46 -15 30 79
$$ packed form
5411B2l7J00J10k41Q9J40k66k43K13r4R9J54K08l41pJ29q1J75k27P4J11j05j78
5434a96L27k21J86q5j21K42r7j42l8M0j31K20J52l73J28K21l32L57k23N6n5K54
5456A69j94j3R5o3J6j31L23k47k31J41K40j89L26k07j88L76j94j1l02Q8M52m66
5478b10K08P9J85l54m3J15kN6n6o7O9n1o1m9J11m7L06k01j90R1K94j35K9m5M3
5503G5N7j98P2j07J59k84L54m09K53J69Pj68P0mj83K38n9j52J06K8Pk0j13J66
5527F4l29J01K7R3J07p8l4J29k9q8J49O1l72J57j3j4K14p0k10L50l35J27j2p5
5551h0R6K11j00m3j41j9K88k75Op1J10q1j38J70L22l90J7J62K7K6J44k35jO1k
5576F4k37q1L41q5K2R7P6j62J76l27J98k90K19j52K17k81J63J30l06J72L1M5M9
$$ plain form
5599 79 348 319 -76 77 2 -258 -242 -4 282 -153 61 -143 30 92 -439 129 219 -16 -195 -24 23 105 99
5622 99 317 -89 31 -181 -102 -4 -271 -77 95 274 32 -63 -115 -55 30 85 36 -63 -149 121 -173 -155 22 242
5646 242 -149 -123 0 160 -85 -122 -31 -4 -154 -121 146 -218 18 103 -103 -21 -158 -178 247 118 303 -44 1
5669 1 28 2 273 -237 100 -175 37 -100 -220 88 -20 -26 93 51 -33 121 43 126 -293 -295 99 -25 51 -132
5693 -132 -59 54 37 277 -184 0 -157 61 -185 -22 49 141 -59 26 71 -54 8 280 -115 -3 177 167 -128
5716 -128 30 -128 -62 12 -57 -41 -280 -56 -233 130 210 -144 -195 69 4 109 -31 -36 -225 124 2 87 97 -93
5740 -93 -57 183 -23 6 -137 245 81 60 149 92 -208 -50 -136 46 290 -16 -20 197 21 112 -163 132 -60
5763 -60 -49 184 -67 -327 -58 63 -9 153 -101 272 10 -130 4 -34 -8 -42 -23 -88 -67 39 -90 -47 22 -139
$$ packed form
5599G9K69k9l95J53p5k60J6K38K86m35K14k04J73O2n31N68R0k35j79J71M7Q2o
5622I9K18m06J20k12P9R8k67J94J72J79k42r5n2O0Q5N5m9r9q6K70k94J8J77K20
5646B42l91K6J23J60k45l7R1K7j50L3K67l64K36Q5k06Q2j37k0M25j29J85l47M5
5669AK7k6K71n10L37k75K12j37j20L08j08oJ19m2q4J54p8Q3m19kL94j24P6j83
5693a32P3J13j7K40m61J84j57K18k46J63P1R2k00Q5M5j25O2K72l95J12J80j0k95
5716a28J58j58O6P4o9J6k39K24j77L63Q0l54n1K64o5J05j40nj89L49j22Q5J0j90
5740i3L6K40k06K9j43L82j64k1Q9n7l00J58q6J82K44l06mK17j76R1k75K95j92
5763f0J1K33k51k60K69J21p2J62k54L73k62j40J34l8K6l4J9o5K1J06j29M3O9j61
$$ plain form
5787 -139 -192 -158 216 7 38 -36 9 7 -78 112 -17 -136 54 -117 93 107 84 131 196 -85 26 117 -176 -349
5811 -349 -22 64 -126 107 -209 75 21 142 165 14 81 151 -27 -39 70 16 319 -46 -139 191 -106 87 -24
5834 -24 -123 39 7 -1 267 -19 -163 -62 155 -112 -16 127 61 71 30 -153 13 114 274 264 17 27 44 117
5858 117 2 95 -42 116 -246 87 -253 -46 -35 174 139 -85 49 -194 185 31 -196 -26 -126 -12 54
5879 54 -8 -48 -100 82 7 106 -335 -243 183 6 -53 19 149 -127 171 -162 -241 97 23 -77 9 228 32 -46
5903 -46 -38 6 54 204 57 82 -144 -88 -240 113 104 39 -37 -104 97 233 -163 245 -46 -74 188 17 -179 28
5927 28 -199 -36 186 -5 165 -183 -49 99 -99 -185 -5 96 78 -142 208 114 21 195 -139 -3 166 36
5949 36 136 -159 -111 -109 63 243 -79 -34 180 -95 -335 198 7 131 161 -25 60 -6 86 -93 320 -201 173
$$ packed form
5787a39n3L4L74k09L1p4M5kq5J90j29j19J90j71K10J4k3M7O5k81J11R1k93j73
5811c49L27Q6j90K33l16K84n4J21K3j51O7P0j78j2J09n4L03l65r3L30k97J93j11
5834b4r9J62l2qK68k86j44J01K17k67R6J43o6J0m1j83J66J01J60j0k47J0J7P3
5858A17j15R3j37J58l62L33l40K07J1K09l5k24J34k43L79j54k27J70j00J14O6
5879E4o2m0n2J82p5R9m41R2M26j77n9P2J30k76K98l33p9L38p4j00Q6K19j96p8
5903d6QM4M8J50j47K5k26N6j52L53ro5p6o7K01J36l96M08k91k8K62j71j96K07
5927B8k27J63K22j91J70l48J34J48j98q6J80J01j8k20L50r4r3J74l34J36J69j30
5949C6J00k95M8KJ72J80l22M5K14k75k40N33j91J24L0j86Q5o6R2j79M13n21L74
$$ plain form
5972 173 132 -63 -131 -108 -119 160 118 -360 -170 -128 8 -214 195 -208 187 169 73 81 149 -120 204 -164 -45 340
5996 340 71 -55 144 26 145 105 -284 -103 -153 140 -79 -11 -241 -236 -140 6 40 -1 -35 34 53 11 -45 -267
6020 -267 10 235 -148 -170 9 14 -10 173 6 -106 -43 47 30 179 44 123 -137 209 69 34 223 -98 -241
6043 -241 8 0 123 103 352 -219 33 -104 -13 281 256 -24 -147 82 82 117 19 188 21 160 163 130 131 -77 -30
6068 -30 -140 265 -16 -253 179 -110 -12 -205 143 127 4 -163 6 186 -150 -3 163 -19 110 -177 84
6089 84 189 -33 210 -104 -63 -60 33 15 -77 -208 -54 174 65 47 -179 171 26 -94 226 -13 138 115 202
6112 202 57 114 188 -117 276 -36 63 87 43 9 23 -76 89 -95 41 68 91 13 -44 -25 36 -75 30 54 6
6137 6 84 -81 52 115 64 -149 -98 16 142 12 34 7 250 -125 -128 179 -226 -55 -159 104 -83 81 344
$$ packed form
5972A73m1j95o8K3j1K79m2m78J90M2J36k22M09m03L95j8r6QO8k69L24l68J19L85
5996C40k69j26J99j18J19m0l89J81n0K93k19O8k30NR6J46L4m1l4O9J9m2n6k22
6020b67K77K25l83k2J79Nk4J83j67j12O3R0j7J49j35P9k60L46j40l5J89l21j43
6043b41K49qJ23k0K49n71K52j37R1K94k5k80j23K29%L5r8J69j67J39Ll3Jk08M7
6068c0j10M05k81k37M32k89R8j93L48j6j23j67J69J80l36J47J66j82J29k87K61
6089H4J05k22K43l14M1LR3j8r2j31J54K28j09j8k26L50j45j20L20k39J51k3Q7
6112B02j45N7P4l05L93l12R9K4m4l4J4r9J65j84J36K7K3p8n7J9O1j11J05K4m8
6137FP8j65J33O3n1k13N1J14J26j30K2k7K43l75lL07m05J71j04K63j87J64K63
$$ plain form
6160 344 -32 209 -54 84 -65 20 -322 -125 -246 -35 -1 -19 102 -73 42 -126 141 215 -42 -172 -103 176
6182 176 18 179 107 63 141 10 153 -36 156 133 217 -97 -46 25 -116 3 177 9 -336 143 -88 -114 -112
6205 -112 130 -83 -371 46 109 113 -135 -227 75 11 -46 235 15 98 -205 77 136 -88 45 -167 -163 109 -331
6228 -331 19 76 -8 -129 -291 157 119 -95 -91 5 -86 -20 2 1 50 168 121 21 121 -22 -45 -149 -23 238 7
6253 7 -126 11 184 69 117 -237 -11 -308 9 -8 11 146 73 156 -102 140 31 -66 -176 -77 186 -56 -23
6276 -23 29 10 232 299 -175 146 108 297 -54 203 119 96 117 -21 -206 -24 -52 -72 129 -57 -10 -264 -74 -103
6300 -103 -39 51 -271 -74 -31 -62 18 -81 238 74 -42 -74 -265 -19 218 130 -33 311 -141 -127 -128 259 85 31
6324 31 167 20 -17 184 -4 111 72 -2 -303 29 -65 91 115 93 47 49 -85 36 55 -126 141 -42 174 -189
$$ packed form
6160C44l76K41k63J38j49Q5l42J97j21K11L4j8J21j75J15j68K67P4k57j30O9K79
6182A76j58J61p2m4P8j31J43j89J92k3Q4l14N1P1j41J19J74j68l45M79k31k6K
6205a12K42k13k88M17O3Mk48r2L02o4n7K81k20Q3l03K82N9k24J33k12MK72m40
6228c31L50N7q4j21j62M48l8k14MR6r1O6K2jM9J18m7j00J00j43k3j04J26K61k31
6253Gj33J37J73j15M8l54K26k97L17j7J9J35p3Q3k58K42j09r7j10R9K63k42L3
6276b3N2j9K22O7m74L21l8J89l51K57q4k3K1j38j85J82k8k0K01j86M7k54J90k9
6300a03O4R0l22J97M3l1Q0r9L19j64j16l2j91K46K37q8j63L44m52J4jL87j74n4
6324C1J36j47l7K01j88J15l9p4l01L32r4J56K4k2m6Kj34J21J9j81K67j83K16l63
$$ plain form
6348 -189 277 -172 51 244 -118 33 212 -56 150 -89 64 308 133 299 226 20 78 -184 -95 191 40
6369 40 -133 15 214 134 3 64 99 -181 218 9 -192 22 167 -32 -16 24 143 195 -51 54 -108 101
6391 101 160 140 -13 71 130 72 149 -143 -104 30 -164 11 104 93 260 152 57 31 -27 -168 53 -226 100 -170
6415 -170 73 -112 -118 198 33 -207 -280 143 103 -198 -31 -98 124 83 93 -102 252 -232 79 -186 -98 163 -121
6438 -121 105 -199 -178 -131 -76 -255 -163 -133 48 118 261 53 -45 -34 -187 267 4 60 -62 -52 -271 -147 119
6461 119 18 188 -224 73 83 -48 -17 85 11 -98 -85 176 -125 -110 93 -140 315 31 158 205 54 -27
$$ packed form
6348a89M66m49K23J93l62J51J79k68K06k39J53K44j75J66p3k06N8k62Q9K86j51
6369D0j73J48J99q0j31O1L5k80L99k09k01K14J45j99J6M0J19N2k46J05j62K09
6391A01N9k0j53Q4N9n8P7k92L9J34j94J75R3j1J67j08r5k6n8j41K21k79L26k70
6415a70K43j85oL16j65k40p3M23m0l01J67o7K22m1J0j95L54m84L11k65Q8K61k84
6438a21K26l04K1M7N5j79R2L0J81P0J43k08r8J1j53M54k63N6j22J0k19J24K66
6461A19j01J70m12K97J0j31L1J02p4j09J3K61l01J5K03k33M55k84J27M7j51q1
$$ [...]
8191d7
##END NTUPLES=NMR FID
##END=
