##TITLE=1H_CA-8562-2
 CDCl3, 8 sc, 
 8.2.2019
##JCAMPDX= 6.0         $$ Bruker NMR JCAMP-DX V2.0
##DATA TYPE= NMR FID
##DATA CLASS= NTUPLES
##ORIGIN= UXNMR, Bruker Analytische Messtechnik GmbH
##OWNER= root
$$ XWIN-NMR		Version 3.5
$$ Fri Feb  8 14:21:03 2019 Russian Standard Time (UT+4h)  she@DPX200
##.OBSERVE FREQUENCY= 200.1313
##.OBSERVE NUCLEUS= ^1H
##.DELAY= (6, 6)
##.ACQUISITION MODE= SIMULTANEOUS
##.ACQUISITION SCHEME= undefined
##.AVERAGES= 8
##.DIGITISER RES= 18
##SPECTROMETER/DATA SYSTEM= spect
##.PULSE SEQUENCE= zg30
##.SOLVENT NAME= CDCl3
##.SHIFT REFERENCE= (INTERNAL, CDCl3, 0, 15.7039)
##AUDIT TRAIL= $$ (NUMBER, WHEN, WHO, WHERE, WHAT)
$$ ##TITLE= Audit trail, XWIN-NMR		Version 3.5
$$ ##JCAMPDX= 5.01
$$ ##ORIGIN= Bruker BioSpin GmbH
$$ ##OWNER= she
$$ F:/spectra/data/she/nmr/H-F/1/audita.txt
$$ ##AUDIT TRAIL=  $$ (NUMBER, WHEN, WHO, WHERE, WHAT)
(   1,<2019-02-08 14:20:04.71 +0400>,<she>,<DPX200>,
      <created by zg, POWCHK disabled, PULCHK disabled
       configuration hash MD5:
       00 E9 B6 7A A2 85 ED C7 34 08 36 98 17 FE 4E 26
       data hash MD5: 16K
       1E A1 AD 4E 83 90 B1 1F A4 E2 A3 13 1F EF CC 6D>)
$$ ##END=
$$ 
$$ hash MD5
$$ 02 05 1F 05 35 AA EB E5 F8 6B BB 1A AB 77 73 35
##$RELAX= 
##$RELAX= 
##$RELAX= 
##$RELAX= 
##$RELAX= 
##$RELAX= 
$$ Bruker specific parameters
$$ --------------------------
##$DU= <F:/spectra>
##$EXPNO= 1
##$NAME= <H-F>
##$PROCNO= 1
##$TYPE= <nmr>
##$USER= <she>
##$AMP= (0..31)
100 100 100 100 100 100 100 100 100 100 100 100 100 100 100 100 100 100 
100 100 100 100 100 100 100 100 100 100 100 100 100 100 
##$AQSEQ= 0
##$AQ_mod= 1
##$AUNM= <au_zg>
##$AUTOPOS= <>
##$BF1= 200.13
##$BF2= 200.13
##$BF3= 200.13
##$BF4= 200.13
##$BF5= 200.13
##$BF6= 200.13
##$BF7= 200.13
##$BF8= 200.13
##$BYTORDA= 1
##$CFDGTYP= 0
##$CFRGTYP= 5
##$CHEMSTR= <none>
##$CNST= (0..31)
1 1 145 1 1 1 1 1 1 1 1 1 1 1 1 1 1 1 1 1 1 1 1 1 1 1 1 1 1 1 1 1 
##$CPDPRG= <>
##$CPDPRG1= <>
##$CPDPRG2= <>
##$CPDPRG3= <>
##$CPDPRG4= <mlev>
##$CPDPRG5= <mlev>
##$CPDPRG6= <mlev>
##$CPDPRG7= <mlev>
##$CPDPRG8= <mlev>
##$CPDPRGB= <>
##$CPDPRGT= <>
##$D= (0..31)
0 1.2 0 0 0 0 0 0 0 0 0 0.03 0 0 0 0 0 0 0 0 0 0 0 0 0 0 0 0 0 0 0 0 
##$DATE= 1549621204
##$DBL= (0..7)
120 120 120 120 120 120 120 120 
##$DBP= (0..7)
150 150 150 150 150 150 150 150 
##$DBP07= 0
##$DBPNAM0= <>
##$DBPNAM1= <>
##$DBPNAM2= <>
##$DBPNAM3= <>
##$DBPNAM4= <>
##$DBPNAM5= <>
##$DBPNAM6= <>
##$DBPNAM7= <>
##$DBPOAL= (0..7)
0.5 0.5 0.5 0.5 0.5 0.5 0.5 0.5 
##$DBPOFFS= (0..7)
0 0 0 0 0 0 0 0 
##$DE= 6
##$DECBNUC= <off>
##$DECIM= 32
##$DECNUC= <off>
##$DECSTAT= 4
##$DIGMOD= 1
##$DIGTYP= 9
##$DL= (0..7)
0 120 120 120 120 120 120 120 
##$DP= (0..7)
150 150 150 150 150 150 150 150 
##$DP07= 0
##$DPNAME0= <>
##$DPNAME1= <>
##$DPNAME2= <>
##$DPNAME3= <>
##$DPNAME4= <>
##$DPNAME5= <>
##$DPNAME6= <>
##$DPNAME7= <>
##$DPOAL= (0..7)
0.5 0.5 0.5 0.5 0.5 0.5 0.5 0.5 
##$DPOFFS= (0..7)
0 0 0 0 0 0 0 0 
##$DQDMODE= 0
##$DR= 18
##$DS= 0
##$DSLIST= <SSSSSSSSSSSSSSS>
##$DSPFIRM= 0
$$ [...]
##$SUBNAM2= <"">
##$SUBNAM3= <"">
##$SUBNAM4= <"">
##$SUBNAM5= <"">
##$SUBNAM6= <"">
##$SUBNAM7= <"">
##$SUBNAM8= <"">
##$SUBNAM9= <"">
##$SW= 20.0189088683792
##$SWIBOX= (0..15)
0 0 2 0 0 0 0 0 0 0 0 0 0 0 0 0 
##$SW_h= 4006.41025641026
##$TD= 16384
##$TD0= 1
##$TE= 0
##$TE2= 300
##$TE3= 300
##$TEG= 300
##$TL= (0..7)
0 120 120 120 120 120 120 120 
##$TP= (0..7)
150 150 150 150 150 150 150 150 
##$TP07= 0
##$TPNAME0= <>
##$TPNAME1= <>
##$TPNAME2= <>
##$TPNAME3= <>
##$TPNAME4= <>
##$TPNAME5= <>
##$TPNAME6= <>
##$TPNAME7= <>
##$TPOAL= (0..7)
0.5 0.5 0.5 0.5 0.5 0.5 0.5 0.5 
##$TPOFFS= (0..7)
0 0 0 0 0 0 0 0 
##$TUNHIN= 0
##$TUNHOUT= 0
##$TUNXOUT= 0
##$USERA1= <user>
##$USERA2= <user>
##$USERA3= <user>
##$USERA4= <user>
##$USERA5= <user>
##$V9= 5
##$VALIST= <valist>
##$VCLIST= <CCCCCCCCCCCCCCC>
##$VD= 0
##$VDLIST= <DDDDDDDDDDDDDDD>
##$VPLIST= <PPPPPPPPPPPPPPP>
##$VTLIST= <TTTTTTTTTTTTTTT>
##$WBST= 1024
##$WBSW= 4
##$XGAIN= (0..3)
0 0 0 0 
##$XL= 0
##$YL= 0
##$YMAX_a= 231497
##$YMIN_a= -320408
##$ZGOPTNS= <>
##$ZL1= 120
##$ZL2= 120
##$ZL3= 120
##$ZL4= 120
##$ABSF1= 10
##$ABSF2= 0
##$ABSG= 5
##$ABSL= 3
##$ALPHA= 0
##$AQORDER= 0
##$ASSFAC= 0
##$ASSFACI= 0
##$ASSFACX= 0
##$ASSWID= 0
##$AUNMP= <proc_1d>
##$AZFE= 0.1
##$AZFW= 0.1
##$BCFW= 1
##$BC_mod= 2
##$BYTORDP= 1
##$COROFFS= 0
##$CY= 11.3945322036743
##$DATMOD= 1
##$DC= 2
##$DFILT= <>
##$DTYPP= 0
##$F1P= 18.9103706918063
##$F2P= -1.10871071338519
##$FCOR= 0.5
##$FTSIZE= 0
##$FT_mod= 4
##$GAMMA= 1
##$GB= 0.15
##$INTBC= 1
##$INTSCL= 1
##$ISEN= 128
##$LB= 0.24
##$LEV0= 0
##$LPBIN= 0
##$MAXI= 10000
##$MC2= 0
##$MEAN= 0
##$ME_mod= 0
##$MI= 1.114404
##$NCOEF= 0
##$NC_proc= 0
##$NLEV= 6
##$NOISF1= 3.799351
##$NOISF2= 2.8
##$NSP= 1
##$NTH_PI= 0
##$NZP= 0
##$OFFSET= 15.70392
##$PC= 1
##$PHC0= -8679.933
##$PHC1= 13.20019
##$PH_mod= 1
##$PKNL= yes
##$PPARMOD= 0
##$PSCAL= 0
##$PSIGN= 0
##$REVERSE= no
##$SF= 200.130013532006
##$SI= 16384
##$SIGF1= 3
##$SIGF2= 2
##$SINO= 400
##$SIOLD= 16384
##$SREGLST= <1H.CDCl3>
##$SSB= 0
##$STSI= 0
##$STSR= 0
##$SW_p= 3612.71676300578
##$SYMM= 0
##$S_DEV= 0
##$TDeff= 0
##$TDoff= 0
##$TI= <>
##$TILT= no
##$TM1= 0
##$TM2= 0
##$TOPLEV= 0
##$USERP1= <user>
##$USERP2= <user>
##$USERP3= <user>
##$USERP4= <user>
##$USERP5= <user>
##$WDW= 1
##$XDIM= 8192
##$YMAX_p= 0
##$YMIN_p= 0
$$ End of Bruker specific parameters
$$ ---------------------------------
##NTUPLES= NMR FID
##VAR_NAME=  TIME,          FID/REAL,        FID/IMAG
##SYMBOL=    X,             R,               I
##VAR_TYPE=  INDEPENDENT,   DEPENDENT,       DEPENDENT
##VAR_FORM=  AFFN,          ASDF,            ASDF
##VAR_DIM=   8192,          8192,            8192
##UNITS=     SECONDS,       ARBITRARY UNITS, ARBITRARY UNITS
##FACTOR=    0.0002496,     1,               1
##FIRST=     0,             0,               0
##LAST=      2.0444736,     0,               0
##MIN=       0,             -320408,         0
##MAX=       2.0444736,     231497,          0
$$ Real data points
##PAGE= N=1
##DATA TABLE= (X++(R..R)), XYDATA
0@%%%%%%%%%%qJ6j6J6j6K4l2M0m8N6p2Q8j04J20j37J61j88K16k53K90l30L78m30
33b29M88n50O22p02P87q80R80j092J217j351J497j656J830k022K231k460K712
50A422k989L292l627L999m414M883n414O020o721P542q518R704j1181J3075j5609
65h536J9202k4732L4434n6469K01642J7711k39013J63938J23320n1679j65590
76A4228k1975J7056k0805p7969j8617N006J3041j1057j7307j4162O6266P1681
88E386l3887q7629M9027J30817K0561j16124o2049P4032R3350k7199j02251o6426
100a22392J9800P3424N5913l7213o7292L2186R5814J1215m9324K2568P4191j0351
112I8539r0559j9087Q7708L2239j03852r3312L7792Q2166P869o4633n5973K8635
$$ plain form
0 0 0 0 0 0 0 0 0 0 0 0 -8 8 -8 8 -8 16 -16 24 -24 32 -40 48 -56 64 -73 88 -100 116 -137 153 -177 201 -229
33 -229 259 -291 331 -371 416 -464 516 -576 641 -710 787 -869 961 -1061 1170 -1290 1422
50 1422 -1567 1725 -1902 2097 -2317 2566 -2848 3172 -3549 3993 -4525 5179 -6002 7073 -8536
65 -8536 10666 -14066 20368 -36101 165541 183252 -55761 108177 231497 179818 14228
76 14228 -7747 9309 -11496 -89465 -108082 -103076 -90035 -101092 -118399 -132561 -66295 5386
88 5386 -28501 -116130 -67103 63714 84275 -31849 -93898 -19866 73484 46285 -55966 -122392
100 -122392 -102592 -29168 26745 -10468 -77760 -45574 50240 61455 12131 34699 108890 98539
112 98539 7980 -11107 76601 108840 4988 -88324 -50532 31634 39503 -25130 -81103 -52468
124e2468R4198M1187o0722n4658M9242R4289J6013o6845l2776M0662J2073o0803
136A9392m7411R299P417m1098o2741j7251N3958M7522l8283o1725K7270J01475
148b176N2328m8766n5549M1056Q5256O668o2995l2006K7085L5119p487m8612k7039
161c7118K8914K4198l0626l3775K5744N4326P081m4805j0353O2896M8993l3866
173F1609n5659L34M1793J4509n1424o7999N173O4059J0828o8987m4641M9211P3110
186C1916m661n4415N497O6430J8230m8007k2594L2473L1905j4922n0836l0767
198c9751K3218K8501k8970o2317j6777M7760L6918l7419m5285M3566Q1824L348
210C4616n2667k770O1323M7776j9379n1910j0751L5888J5697l6438m4142O03L9098
$$ plain form
124 -52468 41730 82917 22195 -32463 16779 111068 127081 60236 27460 68122 80195 19392
136 19392 -28019 -18720 -11303 -52401 -115142 -132393 -78435 -30913 -69196 -130921 -103651 -2176
148 -2176 50152 1386 -54163 -13107 72149 78817 15822 -16184 10901 46020 38533 -10079 -37118
161 -37118 -8204 15994 -14632 -48407 -22663 31663 38744 -6061 -16414 46482 95475 61609
173 61609 5950 6284 48077 62586 11162 -56837 -51664 12395 23223 -45764 -90405 -41194 31916
186 31916 27255 -27160 -21663 44767 62997 14990 -7604 24869 56774 41852 -8984 -39751
198 -39751 -16533 11968 -17002 -79319 -96096 -48336 -11418 -48837 -94122 -50556 31268 34616
210 34616 -18051 -20821 40502 88278 68899 16989 6238 42126 57823 21385 -22757 -22154 16944
223A6944P986n0933l1021M5410M6723k8359m9480J2735N9086K3119l8373l3738
235a9901K9241M4678j2636n4630k5116L4529M2026k4755p1259j3451O2894L5909
247B7529l9953m0562K8939O1108N209n2305j8207M7406L1237l5606m5870O841
259b4234M1362Q140m7447l4026L2732M2882j9500m9268l068N4342M3516k5724
271A9707n1580J0565O5217K9400l8309m2579J3385M4597j525n5922k8549L0335
283e258K1333k8365l2955J3009L7959M762l8003j5024M6046M3954k0579n1426
295b4547l693N6721M0758l9771o5245O922N9175J2434n1081m1638J4671L5517
307B23j597l3382q262K8163J8162r696q625J8725L2501l34m0738j4995M6120L6872
$$ plain form
223 16944 24930 -26003 -57024 -11614 35109 6750 -42730 -29995 29091 52210 13837 -19901
235 -19901 9340 54018 41382 -13248 -38364 -3835 38191 13436 -57823 -71274 -8380 27529
247 27529 -12424 -52986 -24047 37061 42270 -10035 -28242 19164 50401 14795 -31075 -24234
259 -24234 17128 25268 -22179 -56205 -23473 19409 -91 -49359 -52427 1915 45431 19707
271 19707 -31873 -21308 43909 73309 35000 -7579 5806 50403 48878 -7044 -35593 -5258
283 -5258 16075 -12290 -45245 -32236 5723 10485 -27518 -42542 3504 47458 26879 -24547
295 -24547 -28240 28481 69239 29468 -35777 -28855 30320 42754 -8327 -49965 -35294 223
307 223 -1374 -34756 -43018 -14855 3307 -6389 -15014 3711 36212 35878 -4860 -19855 26265 63137
321F3137l6381o3118m231N7629L2811m3469n8054Q348N1461J9848k7765l1070
333c0854O435L5072J2967j9304o654K1405Q933k0874j6935J7755K7175j7475n4531
346c6885j3674M8743L5049l0952n2908k339N7253M4934k6417n2128J393M9006
358B1075K6025k4994l4323L573K5177k714k5944q65J8384o720l1317j1716K9654
371a4705L3946j4343m7344l607N6965M5572k0085n0209o562N0751L8491l0000
383C8870n3066o374L1049J2472k3239k6671L671J7549o263j7290J1480K6982q78
396H292k8228j0288L5715M2200j2916n1939j2327M6578L6134k4105n3235j5701
408c9820L5913K8833k3636l7906K320L0270J4725j1517r882J6484K0000j1042
$$ plain form
321 63137 26756 -36362 -40593 17036 49847 6378 -51676 -43328 8133 27981 216 -30854
333 -30854 -24419 10653 23620 4316 -2338 19067 28000 7126 -9809 7946 35121 17646 -36885
346 -36885 -50559 -1816 33233 2281 -50627 -52966 4287 49221 22804 -29324 -27931 21075
358 21075 47100 22106 -12217 -8644 16533 13819 -12125 -12990 5394 -1326 -32643 -44359 -14705
371 -14705 19241 4898 -42446 -46053 10912 56484 36399 -13810 -20372 30379 68870 38870
383 38870 -14196 -20570 10479 22951 -288 -26959 -23288 -5739 -12002 -29292 -17812 9170 8292
396 8292 -19936 -30224 5491 47691 34775 -17164 -29491 17087 53221 29116 -24119 -39820
408 -39820 -3907 24926 1290 -36616 -34296 -4026 10699 -818 -10700 5784 25784 14742
420A4742j8822J2445K5534o973l7992k2140K4143L4776j5376n1040j4999L9442
432a6260L6368j3347l7991m126M1201L1219j6223k3340J1332K7813M108k2033
444A8721j4534J3170Q843k7108l0250P413K4977m477l4853j8192K8800M1479k555
457A1434l6202o073L7455L3584r640l3409n797L1964J7505k6875k8152Q321K1143
470A5258n117k8508j1064K3295J6261k0728k1207J7672L2945N270k5820j5964
482a7707K3221L1632r251l8826j2575K4789J8957j9531l4415O96L3862J2452k5231
495a1927j4939K2425K8207k412k1728k187K6055J5249k1806k3857O952K1395q80
508B0547l0893k3931J3760K5957j0712l3728m300L1821K3428j3684k1901J4088
$$ plain form
420 14742 -4080 8365 33899 26926 -11066 -33206 -9063 25713 10337 -40703 -55702 -16260
432 -16260 20108 6761 -31230 -35356 5845 37064 20841 -2499 8833 36646 40754 18721
444 18721 4187 17357 26200 -908 -31158 -23745 1232 -3245 -38098 -56290 -27490 13989 11434
457 11434 -24768 -30841 6614 40198 30558 -2851 -8648 23316 40821 13946 -14206 -5885 15258
470 15258 10141 -18367 -29431 -6136 10125 -10603 -31810 -14138 18807 24077 -1743 -17707
482 -17707 5514 37146 27895 -10931 -23506 1283 20240 709 -33706 -33010 852 13304 -11927
495 -11927 -26866 -4441 23766 21354 -374 -2561 23494 38743 16937 -6920 32 21427 20547
508 20547 -10346 -34277 -20517 5440 -5272 -39000 -43300 -11479 11949 -1735 -23636 -9548
520i548L7562P130k5614j1707J9168J8575j1420k9612j0542J8751J2039j9304
532d522k4990M276K4445P883k2168j5860K3678K9294r607k6048N146L0080J0274
545C1881k2378k1741R296K2082m008k7498j5192J3077K1645k695k6858q463L0641
558b11K6103j4308k3503J0765K8549J904k5872j1699J8664J0974j9087k1326K882
571a6165J5712M295j7314k0670Q768L1109P917k6718j5580K7009L5348o467l3268
584f024k646L1757J2774k2722j9733L146R468k264j4327r510R280J2176o849j6594
598b2068L675K6877J4053k4071k4251K1661L7744n515l6478j1314K3176K0135
610B3624j0493k6360p840J6358J4161p566j6379j496J7021R534j3212o607K1327
$$ plain form
520 -9548 28014 35144 9530 -2177 16991 35566 24146 -5466 -16008 2743 14782 -4522
532 -4522 -29512 -25236 -791 7092 -15076 -30936 -7258 22036 12429 -13619 -8473 21607 31881
545 31881 9503 -12238 -2942 19140 15132 -12366 -27558 -14481 7164 4469 -22389 -30852 -211
558 -211 25892 11584 -11919 -1154 27395 29299 3427 -8272 10392 21366 2279 -19047 -16165
571 -16165 -453 3842 -13472 -34142 -25374 5735 13652 -13066 -28646 -1637 33711 27244 -6024
584 -6024 -8670 23087 35861 13139 -6594 -3448 6020 3756 -10571 -20081 -10801 1375 -5474 -22068
598 -22068 -18393 8484 22537 -1534 -25785 -4124 33620 28105 -8373 -19687 3489 23624
610 23624 13131 -13229 -21069 -4711 9450 1884 -14495 -15991 1030 10564 -2648 -9255 12072
623A2072J4459j9755k1762J1908K6650j403l3238k0287J8599K6967l663k8155
635a7608j5570J7736L0831J685k7410r103K4200J9208j0274j4305N425J3050n569
648A2296j7097J162J7477Q88k4545j8586J0083K6728N662k8258k2924K0920L7618
661B1424K289k9697j3690K0788K4482m934k3115n429J2872N859p833r472J157
674e299Q369l987j6120J299K3557R621k3821k1524J5542L4384N242l0762j9374
687b2873J9283K6854r92k4074j6929Q877K0344N5k0180o806J5534Q206j2334p816
701a2851J4498J4360j2374j8988R795K5869P42k4888j6080J1629K4483O110k4151
714a846k3715R845K8798N203k4055j6971J5552K0557p186j5796O298J3905m181
$$ plain form
623 12072 26531 6776 -14986 -3078 23572 22169 -11069 -31356 -12757 14210 10547 -17608
635 -17608 -33178 -15442 15389 17074 -10336 -19439 4761 23969 13695 -610 4815 17865 12296
648 12296 -4801 -3639 13838 14726 -9819 -28405 -18322 8406 14068 -14190 -37114 -16194 21424
661 21424 23713 -5984 -19674 1114 25596 20662 -2453 -7882 4990 10849 3016 -6456 -5299
674 -5299 3070 -917 -17037 -15738 7819 17440 -6381 -27905 -12363 22021 27263 -3499 -22873
687 -22873 -3590 23264 22272 -1802 -18731 -9854 10490 10545 -9635 -16441 -907 7299 -5035 -12851
701 -12851 1647 16007 3633 -15355 -5560 20309 21051 -3837 -19917 -8288 16195 22305 -1846
714 -1846 -25561 -15716 13082 18285 -5770 -22741 -7189 13368 6182 -9614 -3316 10589 6408
727F408j2182O09J2736O817j1421j6244J927J8829Q181j6610k0916N552K9267
740A2953Q889k6249j9372J6551K4849l075j9572o444J2586R832o572r496L529
753a591Q563j589j1349o230J1653J3416q694k2198J466K4717J0103j8342j9018
766a9093R153K5145M563k1088j3705J1855J7127k664j6028p240J1754J0418q771
779A426j2929N094J3228j765j3894n562J4244J4681q192j9451J069K1484J0573
792B0006j4920j8054O023K1173K043k1369j0628J2407J2718n284j4145l284J3060
805b54R582q940j2310N840J5879K311j6191q666J5312J7298j0342k1070K839J8648
819I936L489j6291j2469P359J4344q9j4349p311J0819J4114j243j5580l795J8682
$$ plain form
727 6408 -5774 -5165 7571 14388 2967 -13277 -11350 7479 15660 -950 -21866 -16314 12953
740 12953 21842 -4407 -23779 -7228 17621 14546 -5026 -11470 1116 10948 4376 -5120 -1591
753 -1591 6972 5383 -5966 -12196 -543 12873 4179 -18019 -16553 8164 18267 -75 -19093
766 -19093 -9940 15205 19768 -1320 -15025 -3170 13957 11293 -4735 -11975 -221 10197 1426
779 1426 -11503 -6409 6819 5054 -8840 -14402 -158 14523 6331 -13120 -12051 9433 20006
792 20006 5086 -12968 -6945 14228 16271 -5098 -15726 -3319 9399 4115 -10030 -13314 -254
805 -254 9328 388 -11922 -6082 9797 12108 -4083 -12749 2563 19861 9519 -11551 -8712 9936
819 9936 13425 -2866 -15335 -7976 6368 6279 -8070 -15381 -4562 9552 8309 -7271 -11066 7616
833G616J1763j5893j6021J0066J7368m255j8590n282J4375R854r675j3017J499
846a0192J1334N855o984j1371M121J8678K129j8564p173J7131J4239j2073j9782
859a2652L008J8615K899j7231r988Q138J2036J266j0151p415R045J3983k646j4599
873e692r04J4602N812j3505j1689J0800J4096q554j8717N13J5970O819r841j4590
887a4880J370J7667R969j1630j4339N942J8611M197j5326r392J1051R566r901
900B905j2332L738R469j554j1447m890J0785J1613n188j4332n73J7284J3437j0159
914H756j9508J773K1401P085j6090j4248N699J1770o4j1280o740N893O589m490
928c454o035L983J0379J978j0823n616J4792J4525r379j9766m46J8202R506j3539
$$ plain form
833 7616 19379 3486 -12535 -2469 14899 10644 -7946 -13228 1147 11001 1326 -11691 -10192
846 -10192 1142 6997 13 -11358 -7237 11441 13570 -4994 -12167 4964 19203 7130 -12652
859 -12652 -9644 8971 11870 -5361 -15349 -7211 4825 6091 -4060 -11475 -2430 11553 8907 -5692
873 -5692 -6596 8006 13818 313 -11376 -576 13520 4966 -13751 -13238 2732 9551 -290 -14880
887 -14880 -13510 4157 14126 2496 -11843 -5901 12710 16907 1581 -7811 3240 12806 2905
900 2905 -9427 -5689 3780 2226 -9221 -14111 -3326 8287 3099 -11233 -11806 5478 18915 8756
914 8756 -10752 -8979 12422 19507 3417 -10831 -5132 6638 6574 -4706 -11446 -5553 1036 -3454
928 -3454 -9489 -5506 4873 6851 -3972 -9588 5204 19729 10350 -9416 -9862 8340 17846 4307
942D307j8750P45J6622P118j1056j2375K870J3171M839r453n218R486O892p590
956A608o751P655J0035m869j5715l600J4348J0625j0933j7496n83J6456J2720
969A3500q288j7788M33J8907R216j0841j1177L628J0273k26r692k396O735O30
983B914r305l619P128Q529k981j3484l873J5658J4630p684j7008j825J7830J2695
997A9605j0004j8030O25J4111M367j0367r067J861O954kp203L8R451K213q429
1012c877m383R676J2327l147j6124n098J5693J2554r990j7867k646J4455J0302
1025A1875r635j4997P15J3412M810p400n465M786Q090j480p233K514R398j09j1174
1040a893o116P379J1072m479j6579n381J4361J2038p367j4483j307J4347J0521
$$ plain form
942 4307 -14443 -13698 2924 10042 -1014 -13389 -10519 2652 7491 -1962 -7180 2306 9198 1608
956 1608 -5143 2512 12547 7678 -8037 -11637 2711 13336 2403 -15093 -15676 780 13500
969 13500 5212 -12576 -12143 6764 15980 5139 -6038 -2410 7863 7637 -2055 -4451 2284 2914
983 2914 -6391 -10010 -2882 5647 2666 -10818 -14691 967 15597 7913 -9095 -10920 6910 19605
997 19605 9601 -8429 -7804 6307 10674 307 -8760 -6899 55 53 -7150 -7112 2339 4552 -3877
1012 -3877 -8260 1416 13743 10596 -5528 -10626 5067 17621 7631 -10236 -12882 1573 11875
1025 11875 2240 -12757 -12042 1370 6180 -1220 -6685 -1899 6191 4711 -2522 -8 9390 9281 -1893
1040 -1893 -8009 -630 10442 5963 -10616 -15997 -1636 10402 3035 -11448 -12755 1592 12113
1053A2113p423j1844K755J1988J893p919n542N311N924m865r432K154R970j05
1067D978j1666n709Q685J2768k509j4850l778J4494J1006o717j3415j118J1969
1080D138O963r125j0580M032R387m18q810l164P299O826n449q963M186J1250Q09
1095H381j0823o315Q420J1484l125j4562l848J1225P788o674j1073o0J0460N264
1109F542p879p257O269R720j192q169k731Q317O801o872j0401L268J0402J15j0637
1124c704o521O491J0606k724j1599j989J0099O606n139q789J499J1082L127r801
1138g56o342P591Q764l440j0642k561R474O221p553q963K580R557J690p926n443
1153g749N760Q664j829r767j340Q928M739o527p541K947R944Q42r960n257P659
$$ plain form
1053 12113 4690 -7154 -4399 7589 9482 1563 -3979 1332 7256 2391 -7041 -4887 5083 4978
1067 4978 -6688 -12397 -3712 9056 6547 -8303 -12081 2413 13419 6702 -6713 -7831 4138
1080 4138 11101 1976 -8604 -4572 4815 4397 -4413 -7577 -278 6548 1099 -7864 -3678 7572 8381
1095 8381 -2442 -8757 -337 11147 8022 -6540 -10388 837 8625 1951 -9122 -9182 1278 6542
1109 6542 -1337 -8594 -2325 7395 6203 -1966 -4697 3620 10421 3549 -6852 -3584 6818 6933 -3704
1124 -3704 -10225 -3734 6872 4148 -7451 -9440 659 7265 2126 -6663 -5164 5918 9045 -756
1138 -756 -7098 493 9257 5817 -4825 -7386 2088 8309 756 -8207 -5627 3930 5620 -2306 -7749
1153 -7749 -1989 6675 4846 -4921 -6261 2667 7406 879 -6662 -3715 6229 7071 -2889 -8146 -487
1168d87Q443l122j0069l209R158P835n460j0244J801R449K039o880n430M810P084
1183E718l260q099P78Q397K939o381p474L815J0902Q50j1759o131Q499J0061l176
1198E679j1739k783R704P163o014q004J524P057J941m455m064L625N842l305p979
1213e808J560R482K793r576p960N967J2066p89j2966m480Q868Q831k249r840m136
1228h237P988Q202l658q583j10O456K479o400l770O091N569o234p685M846J0058
1243G012Rr818o028O460J1255o45j1416n996O833J0085j131j1453m609R132O746
1258F436n572o668L101O069j209n656L34P324K540p046n568M147Q703J184r897
1273a778q437N761J2171l18j2619n849Q427R973k824r479j290P988M103m168l298
$$ plain form
1168 -487 7956 4834 -5235 -8444 714 8549 3089 -7155 -5354 4095 6134 -746 -6176 -1366 5718
1183 5718 2458 -5641 -4863 3534 6473 92 -7382 -3567 7335 8185 -3574 -9705 -1206 8855 5679
1198 5679 -6060 -8843 861 8024 2010 -5994 -4470 2587 4528 73 -3991 -366 5476 2171 -5808
1213 -5808 -4248 5234 8027 -1549 -9509 -3542 8524 7735 -5231 -9711 -843 7988 5739 -4101 -8237
1228 -8237 -249 7953 4295 -4288 -4398 2058 4537 -1863 -5633 458 6027 -207 -7892 -3046 7012
1243 7012 7021 -2797 -8825 -2365 8890 8245 -3171 -9167 -2334 7751 6620 -4833 -9442 -310 6436
1258 6436 864 -5804 -2703 3366 2157 -3499 -3165 4159 6699 -347 -5915 -1768 6935 8119 -1778
1273 -1778 -10215 -4454 7717 7399 -5220 -11069 -2642 7331 4507 -4972 -6262 1726 5829 1661 -1637
1288a637K159K886j216m312l33N456K558p309p520M322R609K167j0499p582O918
1303d333J2019n12j0383k996O545P320j724p659j415N316K211m660l444K019L486
1318A790j676n638K12P758L167p315o923N794J0149J308r811o740O771R320j403
1333F763r213l741M860N630j525o584j151N364K193m063k270M050M308k175o433
1348c987Q96Q102K428q200o228M008P702J014q546n967M844Q083L12p145l426
1363f110N284O464j664o282Q47O159L97n967j527M329L177m093p088O70O967K347
1379C910n830n935K300Q414L044p209n458O115Q358j353p302k510N578L580m185
1394A517n483J769M186j94m989k320L222M978j100o696j18Q441M202o110o377
$$ plain form
1288 -1637 522 3408 2192 -2120 -2453 3003 5561 -1748 -9268 -4946 4663 6830 -3669 -11251 -4333
1303 -4333 7686 7174 -3209 -6205 340 7660 5936 -1723 -3138 2178 4389 -271 -3715 -1696 1790
1318 1790 114 -5524 -5312 2446 5613 -1702 -8625 -2831 7318 8626 -1185 -7925 -1154 8166 6763
1333 6763 -2450 -6191 -1331 4299 2774 -3810 -4961 403 2596 -1467 -3737 313 4621 2446 -3987
1348 -3987 -3091 5011 7439 -761 -6989 -2981 4721 5735 -2811 -8778 -3934 4149 4461 -2684 -6110
1363 -6110 -826 5638 3974 -2308 -1461 4698 5095 -872 -2399 1930 5107 1014 -6074 -5404 1563 3910
1379 3910 -1920 -7855 -5555 2859 5903 -1306 -6764 -649 7709 6356 -946 -3456 2122 5702 1517
1394 1517 -3966 -2197 1989 1795 -3194 -5514 -2292 2686 1586 -5110 -5228 3213 7415 1305 -5072
1409e072L282Q135L74p802l823M704M531k695n552j040M051M043k950n697K252
1424c259P216M97o127k556O221N472m030p113M84O721J256n749m406K054M821
1439A502J135n167m303N256N801j826o320n8P827L258o423n045M411N729k148
1454C629n898k236L914L653j843n704p46N592L156l506m625K441O887L7p147j721
1470d117P020L246n452n291J774N343J104n403l978K652N360O11n135k953M589
1485f30O339j785o589O11O080J067n527k461L368L260k937n545N57M237K406l057
1501f06m919O00O888L815n508n833L947P324k89n986k372L951L533k924m322R67
1517a734L063k52l172j843K622L853j334n756o2O800L813m626o455K002P566J852
$$ plain form
1409 -5072 -1790 6345 6719 -1083 -4906 -202 4329 1634 -3918 -4958 -907 3136 186 -5511 -3259
1424 -3259 3957 4454 -1673 -4229 1992 7464 3434 -3679 -3195 3526 4782 -967 -5373 -3319 1502
1439 1502 2637 -2530 -6833 -1577 4224 2398 -3922 -3980 3847 7105 682 -4363 48 5777 3629
1454 3629 -2269 -4505 -591 3062 1219 -4485 -5231 361 3517 11 -4614 -2173 4714 4751 -2396 -4117
1470 -4117 2903 6149 697 -4594 -2820 2523 3627 -1776 -5754 -3102 2258 2869 -2266 -5219 -630
1485 -630 5709 3924 -2665 -2054 4026 5093 -434 -2895 473 3733 796 -4749 -4192 45 2451 -606
1501 -606 -5525 -4925 1963 5778 270 -5563 -1616 5708 5419 -567 -2939 1012 4545 1621 -2701 -1734
1517 -1734 1329 1077 -2095 -3938 -1316 2537 1203 -4553 -4615 2185 5998 1372 -5083 -3081 4485 6337
1533F337o777m208L267M284L49m331k653K642L284j046l967J064M145M06m581
1548a785j684M729M302l501o879R87O773K085n053n468J515O157K658n476m361
1563e001K687N125P08l889k234L264K830k685k850K473K599j485m566m08M457
1578A025L437l561o109O24O375L185m116n748J162P354J811n266l660K503M114
1593C130m22l866r99K534J401k724k005K229L369j006m636j092N034M422l605
1608A764o149J096N843K985m008o026J338O082J144m559l157K225L147m97k953
1623a725k44K724J051l316j673L252L571j166n280j019N283L901l314o069O20
1638c404N500K668m202m686J163N209J013m114k295K358K572j086k572K3L983
$$ plain form
1533 6337 -440 -4648 -1381 2903 3252 -1079 -3732 -1090 2194 1148 -2819 -1755 2390 2796 -1785
1548 -1785 -3469 1260 5562 2061 -4818 -3831 2942 5027 -26 -5494 -3979 2178 4836 -640 -5001
1563 -5001 -2314 2811 3519 -370 -2604 660 3490 805 -2045 428 3027 1542 -3024 -3432 1025
1578 1025 4462 901 -5208 -4584 1791 4976 860 -4888 -3726 3628 5439 173 -3487 -984 3130
1593 3130 2708 -1158 -2157 377 1778 -946 -2951 -722 2647 1641 -2995 -4087 947 5369 1764
1608 1764 -4385 -3289 2554 5539 1531 -4495 -3157 2925 4069 -490 -3647 -1422 1725 1228 -1725
1623 -1725 -1969 755 1806 -1510 -3183 69 3640 2474 -2806 -3825 1458 5359 2045 -4024 -3404
1638 -3404 2096 4764 562 -4124 -2961 2248 3261 -853 -3148 -790 1782 696 -1876 -1853 2130
1653B130K18l510k041L290L803j614m845j214N329L371l261n617O07M807K360
1668C813l698l911J389M430O08l904j608K706K208j435k876P51L966N70m380j873
1684c244L390L430j188n169j287M698L432l074m594N42M665K005l486l541K224
1699a197L911l35l498j041K743J998k042l006J084L702K81m297k169L478L677
1714C289j368m102r76M408K543k830l420N74L587J377l302k887K118L594j019
1729A586l769r23L742K160k536l273J465L935L00l382j713K424L279j128l733
1744a566j093L361K156k695l341P53L699P77l462j819L026L003j140l654J81L516
1760A702J715j942l581Q19L793j00l081k325J851L156p51m207j73L728J922k843
$$ plain form
1653 2130 2348 -1162 -3203 87 3890 2276 -2569 -3783 1546 4917 1656 -3961 -3354 1453 3813
1668 3813 115 -3796 -2407 2023 2631 -1273 -2881 -175 2033 598 -2278 -1527 2439 3009 -1371 -3244
1684 -3244 146 3576 2388 -2781 -4068 630 4062 988 -3606 -3064 1601 3606 120 -3421 -1197
1699 -1197 2714 2379 -1119 -2160 583 2581 539 -2467 -1383 2319 2600 -1697 -3866 -388 3289
1714 3289 1921 -2181 -3157 1251 3794 964 -2456 -1882 1705 3082 -220 -3107 -989 2605 1586
1729 1586 -2183 -3106 636 2796 260 -3013 -1548 2387 2687 -695 -2408 16 3295 2167 -1566
1744 -1566 -2659 702 2858 163 -3178 -2425 1274 2051 -1411 -3230 -204 2799 1659 -1995 -1814 1702
1760 1702 3417 1475 -2106 -1287 2506 2406 -675 -3000 -1149 2007 1256 -2951 -3124 604 2526 -317
1776c17k075J699L003J48l048j658K837K874j571l733o37L447K072k816l738J050
1792b463L716P05l106j760K431K908p46l149K02K872J199k243k624J121L087J21
1808B271m012j695K870L268j937l839J18L962K022k264l012R37L184Q49k165k217
1824a660J347K330r98k845j75L091Q33l071k362K242L891n92m295m55L570K575
1840C426j489l101o37K973K032k021l573J49K793R13k390j599J806K197j369k735
1856b625J792L046j16k588j323J995L243m05m608j276K870K805j617l772j006
1871c585L420K462k797k429J503K704j36j505j67J703J047j754j433R52K539j93
1887B331l426j868J914L441j24m555j476L503K919j309k991q4K612J438j760j386
$$ plain form
1776 -317 -2392 -693 2310 2458 -590 -2248 589 3463 1892 -1841 -2478 969 3041 225 -3513 -2463
1792 -2463 1253 1958 -1148 -2908 -477 2431 1685 -1464 -1262 1610 2809 566 -2058 -937 2150 2271
1808 2271 -1741 -3436 -566 2702 765 -3074 -2956 1006 3028 764 -2248 -1311 1873 2722 557 -1660
1824 -1660 -313 2017 1019 -1826 -2001 1090 1923 -1148 -3510 -1268 2623 2031 -2264 -2719 851 3426
1840 3426 1937 -1164 -1801 1172 3204 1183 -2390 -2241 552 1465 -925 -2524 -718 1479 110 -2625
1856 -2625 -833 2213 2097 -491 -1814 181 3424 3019 -1589 -2865 5 2810 1193 -2579 -3585
1871 -3585 -165 2297 -500 -2929 -1426 1278 1142 -363 -530 1173 2220 466 -967 -15 2524 2331
1887 2331 -1095 -2963 -1049 2392 2268 -2287 -3763 -260 2659 1350 -1641 -1725 887 2325 565 -821
1903h21R92J185m10j471l88J320P65j895j991J106L181L26l037k002K592L671
1919C123p42l922q49K488K274j041k759l0J661J196j458j404O79J343m10j603
1935a454k84K683J489k411k179J685L371j87l098j704J762K625o29l018j186J886
1951f49J895p07j957n36K425R00j456r85J286J729p38k465J48K839L44k256k284
1968b467J420K202O49k402k098J085L241k99k201j281J902K085p26k384N15K094
1984A335L88k375p23J648J064j147j849j61K493R51j904k073R08K870Q08k583
2000c50j650J745K170l61k427k16J816J291j834j534K16J977mj943p49J410J735
2017A292n64k364j78K502J491k165j666J144K300k11k153j134J620J930j410j677
$$ plain form
1903 -821 171 1356 946 -525 -913 407 1172 -723 -2714 -1608 1573 1899 -1138 -3140 -548 3123
1919 3123 2381 -1541 -2390 98 2372 1331 -1428 -1458 203 1399 -59 -1463 -784 559 149 -1454
1935 -1454 -1738 945 2434 23 -2156 -471 2900 2713 -385 -2089 -327 2298 1669 -1349 -2535 -649
1951 -649 1246 539 -1418 -1954 471 1371 -85 -1070 216 1945 1207 -1258 -1110 1729 2073 -183 -2467
1968 -2467 -1047 1155 1804 -598 -2696 -1611 1630 1331 -870 -2151 -249 1836 1110 -1274 -759 1335
1984 1335 1723 -652 -1375 273 1337 190 -1659 -1820 673 1624 -280 -2353 -1445 1425 2233 -350
2000 -350 -2000 -255 1915 1554 -873 -1089 727 2018 184 -1350 -1134 843 839 -1104 -1853 -443 1292
2017 1292 728 -1636 -1814 688 2179 14 -1652 -508 1792 1581 -572 -1706 -86 1844 434 -1243
2033a243j45J853P42p10k087P73K335j0k267l87J541J216q48k212K49K079P53
2050A632k103j270O27K178J85j776j581J798K338r70k361P9K044N88j601j496
2066a689J305J695j63j934p55J228J191m08k036K70J899Q66j776j042Q55J957
2082A463j74j901o68J680J450j324j601J81J587P91j657j607P29J989K46j810
2098f26r52J061J933n28k079J17J762O85j371r33Q90J189k16j560n35J430R26
2115A193q27j556K07J549J181j985j672J024K277j15k275l52J341J202l99j744
2131i51M9J414M99p19j260N58J315k32j845k02J681J129j469j378N66K115M0j588
2149b78j504J125J915k45j164r72R33J445o46j682J75J408J76p62j161J098Q39
$$ plain form
2033 -1243 -1388 465 1207 497 -1590 -817 1518 1508 -759 -1146 395 1611 763 -1449 -1200 879 1632
2050 1632 -471 -1741 -1114 1064 1249 -527 -2108 -310 2028 1058 -1303 -1224 820 1408 -193 -1689
2066 -1689 -384 1311 1148 -786 -1541 -313 878 470 -1566 -1296 603 1469 -307 -1349 -494 1463
2082 1463 1289 -612 -1280 400 1850 526 -1075 -894 693 1484 -173 -1780 -1051 938 1184 -626
2098 -626 -1578 -517 1416 888 -1191 -1074 688 1373 2 -931 -41 1148 932 -628 -1163 267 1193
2115 1193 366 -1190 -983 566 1747 -238 -1910 -886 1391 1276 -999 -1351 -10 1192 793 -951
2131 -951 -902 512 1011 292 -968 -410 905 673 -1172 -1374 307 1436 -33 -1411 -845 1270 1310 -278
2149 -278 -1782 -657 1258 1013 -151 -1123 -190 1255 609 -1073 -898 510 686 -76 -1237 -139 700
2166G00j20j749qK049O50j393j478N29J689P83j774j615R35J720K50j430r80R03
2184c39R99j65j083MJ296j72r40k97Q01J393j005j741O0J994M36j123j781N93
2202a070J596N56j274j304M41J959J64j071p17Q63J018q52j326P94J097m09j292
2219h27m76J328J033r11j558l02J947J530j243j716N12J258J110j340j165M52
2235c68J387k21j235m3N29O91j106q52Q79J197j17j667j54J140J464p23j629j38
2253i66J490J254r47j664l0J655M16j276q28K90J139j33j337L3J288O84j234r72
2271a138J171J184o5j605o32J315J111r01j433j1J183J171j366r24K22J038O25
2288I45r93j307J295N68j07r30j04J262K01j172o41R75R17m12q48p06R44J139
$$ plain form
2166 700 580 -1169 -1177 872 1522 129 -1349 -820 869 1652 -122 -1737 -802 918 1168 -262 -1242 -339
2184 -339 660 495 -588 -584 712 540 -400 -697 104 1497 492 -1249 -1189 805 1241 118 -1663 -1070
2202 -1070 526 1082 -192 -1496 -1055 904 1068 -3 -720 143 1161 309 -1017 -223 874 465 -827
2219 -827 -1303 25 1058 147 -1411 -1713 234 1764 521 -1195 -683 575 1685 345 -820 -368
2235 -368 1019 798 -437 -480 49 740 -366 -1218 -339 858 741 -926 -1080 60 1524 801 -828 -966
2253 -966 524 1778 831 -833 -863 792 1208 -68 -896 -606 533 400 -937 -904 384 1068 -166 -1138
2271 -1138 33 1217 1152 -453 -1085 230 1341 440 -993 -1004 179 1350 -16 -940 -718 320 945
2288 945 -48 -1355 -60 508 401 -529 -633 629 830 -342 -983 -8 909 497 -351 -1057 -113 1026
2306A026p40j146j56J438O43p06j075K66J521j59r76m85O23P73r23p96J16Q06
2324E0M54r82n44Q75R47j77r56m34J152R72n59j495L9J374K70j026q32N16J013
2343F57K2j394j13Q01O56n95p58J68J023K40o95n88L83P92L04r25p88R17J075
2362A182p08j462J98Q42P20j149m59O09J061j10r12m11Q69P17m49j057N4P81N12
2381H28r62r53Q70O88j83r99k23Q42R53o68p74J38J118K1q19l97K55Q66J57j160
2401d02o70J063P43m44j160K4J162N15j106m58P45R01l53q58r7O58P34p78j080
2420h61J64J186K07q19p58L69J087o7j293J5J082N84l39r52N4J046Mo14q24L57
2440c72O92pn49p03J105M67p77p29L83R31J78r22n05M99J155J00j451k23J227
$$ plain form
2306 1026 286 -860 -1016 422 1065 359 -716 -450 1071 912 -64 -549 74 847 -76 -872 -756 50
2324 50 504 -478 -1022 -147 800 623 -333 -767 385 1357 798 -697 -658 716 986 -40 -872 -356 657
2343 657 679 -715 -828 -27 629 34 -724 -556 467 707 12 -576 -193 599 903 -22 -810 107 1182
2362 1182 474 -988 -790 52 772 -377 -836 -227 834 724 -188 -599 270 987 538 -519 -465 316 828
2381 828 -134 -1087 -217 471 288 -711 -934 -92 861 193 -581 -443 675 696 -123 -520 -265 601 758 -402
2401 -402 -1072 -9 734 290 -870 -846 316 831 -275 -733 12 913 560 -298 -395 263 997 219 -861
2420 -861 -697 489 696 -123 -881 -512 575 508 -785 -770 312 896 557 -395 -341 705 709 95 -729 -372
2440 -372 320 313 -236 -939 166 633 -144 -873 -490 441 619 -303 -808 -309 846 946 -505 -728 499
2459D99L19l64j074Q7R35Q2l79r15L98Q18l14o60J73R05M11o11q01M30O42K51
2479H32j078n42Q57P75l69j277j33N66P98M9j148n6Q29L07n76l41N37O56l79p43
2499d36j08R83K53o96q97K81J183K61j121q04P89Q80j71o39m12M86Q28l54o46
2518c40P8P34P6q04m6K33K46k50n22J35J034K12q50p74N22P82K35r68p82Q42R26
2539G19j87q74j54P91K0n16k52L38M32k97j17l43N04N19l51p82r5J145J63m74
2559A89m90N4P74K28o58r03L62N90K42o47m38O08O04l45n60J15N88p5k78l78M19
2580AP42p12p32K28Q20M06p47p53K51O04Q34r12o12L90O71l23o79N2P65L56p35
2601h5j12M2O15J64o99n75M97Q09l37m59m82M63O32m33o00O2P21L05m83m31L25
$$ plain form
2459 499 818 454 -620 -533 402 484 105 -810 -412 406 92 -568 -395 510 921 310 -491 -61 581 832
2479 832 -246 -788 69 844 475 -802 -935 -369 429 478 -670 -726 103 410 -166 -507 30 686 307 -436
2499 -436 -544 439 692 -4 -901 -620 563 824 -297 -1101 -312 568 397 -242 -654 -168 660 306 -340
2518 -340 -262 472 548 -256 -302 -69 177 -73 -595 -460 574 786 -64 -838 -316 466 701 -267 -1049 -207 719
2539 719 532 -342 -496 295 315 -201 -453 -115 317 20 -97 -440 64 583 232 -550 -645 500 663 189
2559 189 -301 -247 527 755 97 -806 -444 146 388 -259 -697 -89 515 170 -390 -275 313 238 -40 -418 1
2580 1 743 31 -701 -473 347 753 6 -747 -496 108 942 30 -582 -192 479 156 -523 -471 294 650 -85
2601 -85 -197 -155 460 624 -75 -650 -153 656 319 -140 -622 -159 473 40 -560 -498 223 528 45 -386 -61
2622f1P05n31k71k41O50J94j77n73L4N67J52p07m35L20Q53j87q41L65Q07k30m22
2643b9k40r7P24J75n07l72J76M81j99m42Q3Q39P8n54q61j3J304o1n72k80N88M84
2665G05j48r01N8N18L2j71m69J12O47L43q99o52O77N61j48o02k14P83M93n26o43
2686d44J42P68r7n41q4N6P73n7r50j76O43P77o87n90M1Q17j92l15p8N04M34l89
2708C55p70J42M44K92k91o75r7Q27K08k22o98L41L86k34k63j13N06P33n89n95
2728c13K97K58K57q94j54N53K24Jq47R8P76K02r2q12OR38K19p98k51K82L32K48
2750E30r54O5N03o3j44m81K6P76K51q12j19O42N36m77r05J31O48L07n09j99K05
2771d3N19j91n35r3L22M17m02l60L14K20M15l59r21J41J208j20p82o8Q7Q54l97
$$ plain form
2622 -61 644 113 -158 -399 251 445 268 -305 -271 296 448 -259 -694 -374 479 292 -549 -184 623 393 -29
2643 -29 -269 -366 358 533 26 -346 -170 311 112 -330 -247 592 670 116 -745 -758 546 485 -87 -367 221 705
2665 705 557 -344 -286 232 264 93 -376 -264 383 726 -173 -825 -148 413 265 -337 -551 232 725 199 -444
2686 -444 -302 466 369 -172 -256 -200 573 516 -434 -610 33 810 123 -467 -426 391 199 -116 -194 310 744 355
2708 355 -415 -273 171 463 172 -503 -600 227 435 213 -485 -144 242 8 -255 -368 138 871 282 -313
2728 -313 -16 242 499 -395 -549 4 228 229 -618 -520 256 458 366 -446 -440 498 717 -81 -332 -50 282 530
2750 530 -424 -359 144 81 -63 -544 -518 258 509 -303 -422 220 756 279 -626 -495 153 460 -49 -248 -43
2771 -43 476 285 -250 -343 -21 396 -6 -366 -52 168 583 224 -697 -556 652 532 -250 -318 -231 623 226
2792B26n22l57N59K77R2m65j17N28J12n28l2O6O25n27l81Q5K44M00n8j021M78
2813c16J040m77k90p04M06R57L2q28m57Q72K83j25q60L18N71m01m93N3N29M85
2833E95m55n76n1P18L55o89n38L69J153j33q57m36O88N78l34r16J35L55K80k81
2853d0m33J90O63j61l86l12N34M47l17o11J15O33L15m73n51M10L84j91l08m0o2
2874a94L58j68j45k45P32N5m00m51J43O81j75k95l26L6O90Nn65l6P38j12m06l88
2896d68N6M18L35k60n27M18L75J97n31k23K97L78n20o24J39P49J93o38j67L43
2916f0L20Q3n76j78M92K67j04n80K5O28L48q90j97K72N73j00q09K20J59L32o0
2937A65p04J61K94L57j25p63P20M59m14m82J68N09J98m41p57M21N91j64n51q1
$$ plain form
2792 226 -296 -653 -94 183 275 -190 -307 221 333 -195 -227 -161 464 -63 -444 -359 -115 285 227 -794 -316
2813 -316 724 247 -43 -747 -341 616 648 -180 -637 235 518 393 -467 -149 422 21 -472 -419 110 595
2833 595 140 -436 -487 231 586 -103 -641 -272 881 748 -109 -545 143 721 387 -529 -394 -39 241 -40
2853 -40 -473 -283 380 219 -167 -479 55 502 185 -426 -311 322 637 164 -387 23 407 216 -92 -132 -194
2874 -194 164 -4 -149 -394 338 393 -7 -458 -315 366 191 -104 -430 -394 296 301 -264 -300 438 326 -80 -468
2896 -468 -412 6 341 81 -446 -28 347 544 13 -210 87 465 -55 -679 -540 209 402 -236 -403 -60
2916 -60 260 343 -233 -411 81 348 244 -336 -311 317 665 -225 -422 -150 423 323 -486 -266 -107 225 165
2937 165 -539 -378 -84 273 148 -615 105 564 150 -332 -164 345 543 102 -655 -234 357 193 -358 -439
2957d39K84K93j82n67N62L86L3l52l74J33N57J0n29l32N76K38j62n29q2Q55j17
2978B62l72k02K0M62j10l19j17J78L29J12n85k58O58M15l81n04M76L89k28m48
2998b23m97M81N80j04l30m82N96L85j98n77PL15N73m53k81K33J80L11r56N3M99
3019A12P9M0o09L06P58j83o38l52M81J46ml60j36K87L31k49n82N02N05l45n18
3040d29l8N54O34n11o89L02M90M1m77m62J80N04P12q58n36Q57K46p26k25QM43
3061B0L6k1n17N42N42l00o28j97O05Q95o16q27L04K76N80n93l97j01P82q5m52
3082a52j06K83K01j95l86NO59R6o26j26K33M85j49k89l10K82P88q89k39K52L74
3103A91M31n68n84K65M87J19o43j32L45L79k96k93Q9N58p2o74j6M32L01p7m84
$$ plain form
2957 -439 -155 138 -44 -611 -49 337 370 18 -356 -223 334 344 -185 -517 59 297 135 -394 -476 379 262
2978 262 -110 -312 -292 170 60 -259 -376 -198 131 243 -342 -600 58 473 92 -412 64 453 225 -223
2998 -223 -720 -239 341 237 -93 -575 21 406 208 -369 -362 -47 526 73 -208 25 205 516 -440 -387 112
3019 112 191 231 -378 -72 686 503 -135 -487 -6 140 136 -224 -360 -73 258 9 -573 -71 434 89 -429
3040 -429 -467 87 721 210 -479 -177 313 354 -123 -585 -405 99 811 -47 -583 274 520 -206 -431 -423 20
3061 20 56 35 -482 60 602 302 -326 -523 82 977 361 -466 -162 114 694 101 -296 -397 385 300 -152
3082 -152 -258 25 226 31 -355 -350 309 405 -221 -347 -114 371 222 -67 -377 -95 693 -196 -435 -183 191
3103 191 622 54 -530 -265 222 341 -302 -434 -89 290 -6 -299 -210 348 276 -398 -414 18 319 242 -242
3124b42l01N64J90J9l19l84O65J16j86k74R4K44j03l20j08M90L46o08l58l3R38
3145D30Mm57n39P2P08q8l8m52O13J17k34o58j74O45M48l18m30L37K19N9l61k89
3167c86M37O00l62q61J44P17r1j70o62O41M52k80m15n14P60K47n32J36j40K65
3187a4L77n31l81M01O45k91n78R2M07K38l91l84M9M53K64l45m40O9O56j62k21
3208h7m22N81K56m93k83L62L48K50l91n19L33L03m79j62j62N78L39k92m36J05
3228b71N74j8l54l42K71M85k03o26K14m1M78j4o25J57M54%p81K08M94M28k35o13
3250c60j26M55L60j1p12LN98J48l62k30O6M35N2m56l37N80L62o02j96J28K96M03
3272D94m91o3K48L80k51o19J7K19L78k66k31k10M18L19m94l75N23L06j15n31M6
$$ plain form
3124 -242 -543 21 211 230 -89 -473 192 308 122 -152 -58 186 83 -237 -345 145 491 -117 -475 -508 430
3145 430 434 -23 -562 -490 218 130 92 -360 253 370 136 -522 -696 -51 397 79 -351 -14 205 264 -97 -386
3167 -386 51 651 289 -572 -428 289 198 28 -634 7 459 179 -236 -750 10 257 -275 -139 -279 -14
3187 -14 363 -168 -549 -148 497 206 -372 -280 127 365 -26 -410 -361 92 356 11 -429 -360 296 134 -87
3208 -87 -509 72 328 -165 -448 -86 262 512 121 -398 -65 238 -241 -403 -565 13 352 60 -376 -271
3228 -271 303 285 -69 -411 -140 345 142 -484 -270 -311 167 153 -472 -315 139 139 -642 -434 60 488 253 -360
3250 -360 -486 -31 329 318 -394 -391 207 355 -7 -237 -171 264 316 -140 -477 103 465 -137 -333 -205 91 494
3272 494 3 -60 188 568 317 -302 -285 -66 312 46 -185 -395 23 342 -152 -527 -4 302 187 -344 -298
3293b98K23N48m77n25K10P32k69l85m68O40O75n46l58m01O01M48j74p50J48O66
3313B40L45p81J9M35k1l4l63P2J32M74k12p50K17M48K9l09l31M06N30m71m63l58
3335g46P21N49l75l01M1M82k83l88p4J34M45m5l86j48L75M55k47q02L41N18J12
3356C78o56j92O05L29j54n13mL92n0j54k35K19J10J83n35j96M89K51ro49l2N59
3378A36N88n53l63K37N11m59j92m42N88L84j98l00j38Q3N10n65n33L22O95L6n38
3399a91q9K53M69n67j27J2L88N4m42k81M49M83j55j48j95J79K80L61r46l5L57
3420A09J31n11j00K22O67k75j18o01O17J48m9l53m48P50K33k83m61L58N5M06n63
3441f6k56O20J16k70m33K04L57J23m54l92K47M70j57m22j75M10M31n9m92k4M37
$$ plain form
3293 -298 -75 473 -4 -529 -319 413 144 -241 -709 -69 606 60 -298 -699 -98 350 176 -574 -426 240
3313 240 585 -196 -177 258 237 203 -160 -88 44 518 306 -444 -227 221 250 -59 -390 16 546 75 -388 -746
3335 -746 -25 524 149 -152 -111 371 88 -300 -374 -240 205 160 -226 -374 1 456 209 -593 -252 266 378
3356 378 -278 -470 135 464 310 -203 -207 185 135 -19 -254 -35 75 258 -277 -473 16 267 258 -391 -423 136
3378 136 724 171 -192 45 556 97 -95 -537 51 435 237 -63 -201 -118 392 -173 -706 -384 311 347 -191
3399 -191 -280 -27 442 -125 -252 -240 148 202 -240 -521 -72 411 256 108 -87 92 372 733 -213 -248 109
3420 109 240 -271 -371 -149 518 243 125 -476 141 289 240 -113 -561 189 422 139 -322 36 91 497 -66
3441 -66 -322 298 414 144 -289 -85 272 395 -59 -451 -204 266 109 -313 -488 -78 353 294 -198 -222 215
3462B15J0n81JK22O51n5o25k34O73J10j42m97kL17J08l97l74N60P04m61n42J7
3484c22K60N29k82m74n7L15M81o31k40K23O24k50n52lK59O49l34m15r9M41L42
3505D64o67pJ45M88m23l59M8O09l37o4j31Q1M16j47k23l21L03K01j61k31m3O37
3527B78K10l96j50l95O31J46l83m59N38L07No43l09N94N21m88m95J32Q06j36m61
3548a47k06M64K21o41l43O40J07L62m93n11L88M69L8l70l14K28O07K4p51Q6M81
3569C39j4K6p59J43N59K38o03j61K58K18m76j05J5M91k9j00l55j7O65m9l44j56
3591b16J99N08j27o44J6K51L30m95k43J71L03n1j44j20L07M55m10k71K34K57J77
3612D87m86m53N49J13k4k98j32K84J82q1m86L16L96o7k85m50K27N16j95lj88J30
$$ plain form
3462 215 225 -356 -355 -133 518 463 -162 -396 277 387 245 -252 -254 63 171 -226 -600 -40 664 203 -339 -322
3484 -322 -62 467 185 -289 -346 -31 450 -181 -421 -198 426 176 -376 -379 -120 529 195 -220 -319 122 464
3505 464 -203 -210 -65 423 0 -359 -311 298 -39 -103 -234 -153 263 116 -107 -428 -125 76 -85 -316 -359 278
3527 278 488 92 -58 -453 178 324 -59 -518 20 327 332 -311 -620 -26 495 7 -488 -356 450 314 -147
3548 -147 -353 111 332 -309 -652 -12 95 457 -36 -547 -159 310 348 -22 -336 -108 499 523 -228 -142 339
3569 339 325 351 -408 -265 294 532 -71 -232 26 244 -232 -337 -322 169 140 40 -315 -332 333 284 -60 -216
3591 -216 -17 491 364 -280 -264 -13 317 -178 -421 -250 53 2 -142 -262 45 500 90 -181 53 310 487
3612 487 1 -452 97 210 186 -112 -244 40 222 141 -345 -29 367 300 15 -435 -208 308 113 110 -78 52
3634E2K30k86l18J62O31m57j03n23M08N96k34j13l36O70K13m99n79N85L02n17
3654a16J00k27J8M49Oq07J76N56P0k58m23K41N49nk85m94M61N07l90n62K39J99
3676DJ73Q7m63r7L28K92o80j82L99Q4K46m33j2N23L84l23n73J30N11R8m24m79
3698d07K68P07m54k43l62P83j17k00j45l6M10K78n36k41K51%J43m1k62J70M66
3719D32k48n48J7O93J40n02n78L45N17O5o06P0L71p1J33m61L61k97O07p29j33
3740d22L67K63P5o69Q1N22J35k72j32P9M09l72lk35K10K78j75k43m04N76N97p35
3762g0j32j3M47j91j39r7L24J64q0m51l9O67l9l73l19K90L40k04k07k73N58N16
3784F79r96j82K52N98J53n76l34L52M01P7m12l15N11J23l04l39O4M30K34n70n45
$$ plain form
3634 52 282 -4 -322 -160 471 14 -89 -612 -204 392 158 45 -291 379 592 93 -486 99 401 -116
3654 -116 -16 -243 -225 224 230 -577 -401 155 225 -33 -456 -215 334 329 44 -450 11 518 128 -434 -195 4
3676 4 177 264 -199 -296 32 324 -356 -538 -139 -55 191 -242 -254 269 653 330 -243 -113 398 496 72 -407
3698 -407 -139 568 114 -129 -491 292 175 -25 -170 -206 204 482 -54 -295 -44 -44 99 58 -204 -34 432
3719 432 184 -364 -347 346 486 -16 -594 -249 268 333 -273 -203 168 97 230 -231 130 -167 440 -289 -422
3740 -422 -55 208 283 -386 -305 217 352 80 -52 27 436 64 61 -174 36 314 139 -104 -508 68 665 -70
3762 -70 -202 -215 232 41 -98 -195 129 293 213 -238 -277 390 351 -22 -341 -51 289 85 -122 -395 163 679
3784 679 -317 -499 -247 351 504 -72 -406 -54 347 424 12 -303 208 331 27 -312 -248 182 416 -154 -699
3805f99M93Q22l30m89j10J91L23l47K4k19Q36j63n83J44J8K82k6l65n11P75N0
3826A16J89p01L05K17K17o47j17M41L58k67k70k46M54M68n60j72O6K26M03m38
3846D2m85L54M01O3p63j83Q55J84m91k49K99k02K24l22m7N18K81m75j44j60M80
3867A80J64m37r2J52O5J84n12K73l6L92j66p14M45M3l2J89n03L97J21j56j39l10
3889d92M29L00j45m86K98J90K19j91n57L56N13j10l19m35M04K67l33j22m18N77
3909e5L43l02o2J84M40p9n07l29M89M40o15k18R4L17L59m10n55K24K19L03l92
3930a12j81K00P0J18k60k17O96J93n11l14M0M42K45p87L14m9N10k81m34M1O27
3951C50l6j62n06J16M52K51n78l80K75M56k79j96L84M1Oj92j55m7J83L81m98j93
$$ plain form
3805 -699 -206 616 286 -203 -313 -122 201 -146 -122 -341 495 332 -251 -107 -89 193 167 -198 -709 66 116
3826 116 305 -396 -91 126 343 -304 -421 20 378 111 -159 -405 49 517 -43 -215 -149 77 480 42
3846 42 -443 -89 312 375 -388 -571 284 468 -23 -272 27 -175 49 -273 -320 198 479 4 -140 -300 180
3867 180 344 -93 -185 -33 32 216 -296 -23 -59 333 167 -547 -102 -59 -91 98 -405 -8 113 -43 -182 -492
3889 -492 -63 237 92 -394 -96 94 313 122 -435 -79 434 324 5 -430 -26 241 -92 -214 -632 -55
3909 -55 288 -14 -76 108 548 469 -38 -367 122 562 -53 -271 -177 140 499 89 -466 -242 -23 280 -112
3930 -112 -293 -93 -23 95 -165 -382 314 507 -4 -318 -278 164 409 -378 -64 -113 397 116 -318 -277 350
3951 350 314 152 -354 -238 214 465 -113 -493 -218 238 -41 -237 147 188 194 2 -153 -200 -17 364 -134 -327
3973c27N20L0j00m23J31L23J98j01k07l25N42K23l69m96J49M05p6j35j69J90K28
3994B11k32q1J29J15L75o83J25J39M63m83l84L3K10r8K43n44L05N64j31n77K45
4015e6L89K4m14l97K70M85j78R3l30j55L74N6m62Q3L59%j73j12J25n5L46m69q
4038b05J53K95M9k85k31K15j84J72m15J41M84m2k34p2K49J96l51k08R7L80k17
4059a3l03L78j91N22k36k67l05K05N18j89l56k1J96M13l17P0n16O09k38J52j8
4080I3K73j12l29o9K10J95j9l13k22J72l5M21k96o02O89K67p1l32j08J90L90l33
4102E9j24L43K81p21j31ql4N71m99J01J36J33L21n18j99RN39Ln87J80L79K09n09
4125f6m39K15N46j82k35O7o2O2O8m5J32K39k07j77O0O5K58J7l27j86L16J47r3
$$ plain form
3973 -327 193 223 123 -300 -169 154 352 251 44 -281 261 484 115 -381 -232 173 97 -38 -207 -17 211
3994 211 -21 -102 27 142 517 -166 -41 98 561 78 -306 -273 -63 -161 82 -462 -157 407 276 -301 -56
4015 -56 333 357 -57 -454 -184 301 123 216 -114 -269 105 161 -301 -218 141 141 -32 -144 -19 -74 272 -197 -205
4038 -205 -52 243 292 7 -224 -9 -193 -21 -436 -295 189 147 -87 -159 90 286 -65 -273 -176 204 -13
4059 -13 -316 62 -129 393 157 -110 -415 -210 308 119 -237 -258 -62 351 34 104 -412 197 -41 111 93
4080 93 366 254 -75 -144 66 261 242 -71 -293 -121 -156 265 -31 -633 56 323 252 -80 -188 2 392 59
4102 59 -65 278 559 -162 -293 -301 -335 236 -263 -162 -26 107 428 -90 -289 -280 259 262 -325 -145 234 443 -66
4125 -66 -505 -290 256 74 -161 -94 -156 -94 -26 -71 61 300 93 -84 -24 41 299 316 -11 -197 119 266 173
4148A73k06j03L04L3P4q27P26J30n61L57j68O5m7J13j36l01M67R2O8k17L72l96
4170A2L6j01j42J78Q6k30j14j15M19J40o4l11J61O4M15m05mj68M45n73k29L99
4192a01K64Ql28j14N5M03k67j60n9L48K16m61J5J50n5J56k21M6j50L04K86m28
4214i3L6p8p0K18J18k57L4M43k08n3m14P06l63k59K07j63M12k11k02J37L51k21
4236G0K9k01L4J86q1k0j70JM34q6k54j55L37j69j44j52M83J96m71K30l70L49K91
4259C67k61j49K6j26M81Kk73lQ5k53J89m03L67J1J15m18j34M49L34l53j49P4K11
4282A89P8l26k41O93j82j4l01j63K62K11l6m01M63k36Ok03P1p5N70m26n55M52
4304a64L18m01j00l0K61L43j93J74m44oJ47L7J7J70K38m9k01m20L66R8l83J8N5
$$ plain form
4148 173 -33 -136 168 201 275 -552 174 304 -257 100 -68 -3 -50 63 -73 -374 93 185 253 36 408 12
4170 12 48 -53 -195 -17 69 -161 -275 -390 29 169 105 -206 -45 19 434 29 25 -143 302 -271 -500 -101
4192 -101 163 171 -157 -271 -216 187 -80 -240 -299 49 265 -196 -181 -31 -86 70 -151 -105 -255 49 335 -93
4214 -93 -57 -135 -205 13 131 -126 -92 351 143 90 -324 382 19 -240 -33 -196 216 5 -197 -60 291 70
4236 70 99 -102 -68 118 37 17 -153 -152 282 196 -58 -213 124 -45 -189 -341 142 338 -133 97 -273 76 367
4259 367 106 -43 -17 -143 338 340 67 64 149 -104 85 -318 49 60 175 -243 -377 72 406 53 -96 -22 189
4282 189 267 -59 -300 393 211 197 -104 -267 -5 206 170 -231 232 -4 2 -201 -130 -205 365 -61 -616 -164
4304 -164 154 -247 -347 -377 -116 227 34 208 -236 -242 -95 -58 -41 129 367 318 117 -303 63 161 -222 -204 -149
4327a49q5M64q2l70j11L00J0j15k9K12N89l92m00qM14j55o9m14L81r8N02n51j10
4350b66L81K14k31l84j27M35K34j67j2NM2N8J20j86l83N66k95l63P2L16L6j29
4372f4m38J33M43J35l00k2K25N8j40J00o87Q37o6J39m17k18N22m68R9q4j06M69
4394A50j0m41L7N36k11n5j73Q3J20o8m5n3M1K18J84m79K5K52m29J94L21j56O2
4417A03J5l62j71K68M32j41j65k15L64M22o66nJ22l2J0kk4J5L39l77K5q9L62L9
4441B67j40j50O6n9k80J16j5K75N7k74k13O3O38k01k31P1k40M13J26m04K50k83
4463a48L72j98k70J04N01m05P2N2J0J5J23m54J14k7K69J09m16N4L17M2o51R8J89
4486a28J79K6k37O2R1j1o0l78M75L70k54l66K16r7R9k22N24mk95K8p8J84N9N4
$$ plain form
4327 -149 -234 230 148 -222 -333 -33 -23 -138 -167 45 634 242 -158 -166 248 93 24 -390 -9 -107 395 -156 -266
4350 -266 115 329 98 -286 -413 22 256 89 77 82 124 182 302 116 -267 299 4 -359 -287 29 65 -64
4372 -64 -502 -369 74 209 -91 -113 112 170 30 130 -557 280 214 353 -64 -282 240 -228 -129 -213 -319 150
4394 150 140 -301 -264 272 61 6 -167 -84 36 -32 -77 -130 -89 129 313 -166 -141 111 -318 -124 197 41 103
4417 103 118 -244 -415 -147 285 144 -21 -236 128 550 -116 -121 1 -31 -21 -23 -47 -32 307 -70 -45 -134 228 267
4441 267 127 -23 43 -16 -296 -180 -195 80 137 -137 -350 -287 351 150 -81 -10 -250 163 289 -115 135 -148
4463 -148 224 26 -244 -140 361 -44 28 80 90 105 228 -226 -112 -139 130 239 -177 -123 194 236 -415 -317 -128
4486 -128 51 77 -160 -98 -7 -18 -78 -456 19 389 135 -231 -15 -112 -13 -235 289 285 -10 18 -60 124 183 237
4510B37m4k19k50K85K86J10k94n7k08L50k99j90R7K51j6k16J0nK88k90J3O6K35
4533A40J21k80O2J0R2J29j86m90M7L74J49l35Q9j6L16j40k20o7K33J54L6k09m0
4556c1M7J53J34n16L00J3j35q6J36L1L27q73J15M51LN6j31QJ49l31N2j22j19M34
4580F5j95pk9K96j99M3l42L03k4Q5j92J66j94K76n7J56j86O9j3j6M1l10L03J23
4604A62k00l70L71J84k34m1j04K07J08m05M3J16L86j54j12j21j57N54K75m83m8
4625b3n7K77k30j20K41N4q6m1q2R8n3j92J50K55o4R6l00K83j01l12K39K44j16
4648A60o5M66n06m53P3L31J24l60J47j4M21l83k90K65qJ68j20l2Q6K31l10J76
4670A07n59L70K67j32m06p8O73L1j62m9K05k02No6k6P1J56r2l27L20k61M68n04
$$ plain form
4510 237 193 -26 -276 9 295 405 111 54 -154 196 -103 -293 -196 55 39 -177 -167 -172 116 -174 -161 -95 140
4533 140 261 -19 43 53 145 274 88 -402 -355 19 168 -167 -78 -94 222 82 -138 -205 28 182 218 9 -31
4556 -31 16 169 303 -213 87 100 -35 -121 15 46 373 -500 -385 66 69 125 -6 2 151 -180 -128 -250 -369 65
4580 65 -130 -137 -166 130 -69 -26 -368 -65 -89 -4 -196 -30 -224 52 -5 151 -35 34 21 5 46 -264 39 162
4604 162 -38 -408 -37 147 -87 -128 -232 -25 83 -322 -279 -163 223 69 -43 -164 -321 233 508 25 -23
4625 -23 -80 197 -33 -153 88 142 56 15 -67 31 -22 -214 -64 191 127 223 -77 206 105 -207 32 276 160
4648 160 95 561 55 -398 -325 6 130 -230 -83 -97 324 -59 -349 -84 -92 76 -44 -76 10 241 -69 107
4670 107 -452 -82 185 53 -353 -431 242 273 111 62 267 65 70 4 -22 49 205 113 -214 106 -155 313 -191
4693a91Q4m9R0k6Q2l93L92j7j48J11k24M67j15J33l71J01J33L68k46l01K05J38
4715B23m6k11o6K53m07K64k07R0K43J25m87J62J72l05K09j69k73N58K18n24l07
4736d85L76L74k43J5Q5k59K26K69k12l49K86KM6r0k0K89j36o2k35K06J22k59o1
4759a15j05M91j13m22K24J5Q6l68K38m6J78Rp6m3l4nL2K96m14lJ13J05j29P4m22
4784d34P18j55k80K10J13J31j89L01p05O79k43j98k10L16l0O4o02N26Jp0j23M5
4806a35m7L56L72p15K25k17L89j54K6k83L25n1n9m2l6J46r9l00L94j36J21o9k65
4829b54J36L6J15k06j43L29Rl03J17j39M16j04k30J48N3k2j9J15j81J39J90l45
4851a43r7J87k84M29k03n1l9M37N7k01p7k63K28j90K27m5j46L57r1l01J23J45
$$ plain form
4693 -191 -107 -156 -66 -92 -10 -403 -11 -28 -176 -65 -289 178 63 196 -175 -74 59 427 181 -120 85 223
4715 223 177 -34 -100 153 -254 10 -197 -107 136 261 -226 -64 108 -197 12 -157 -430 128 346 -178 -485
4736 -485 -109 265 22 37 122 -137 89 358 146 -203 83 85 131 41 21 310 174 112 -123 83 205 -54 -115
4759 -115 -220 271 158 -264 -40 -25 61 -307 -69 -115 63 72 -4 -47 -81 -86 -54 242 -172 -175 -62 43 -86 -12 -434
4784 -434 284 129 -151 59 172 303 114 415 -290 389 146 -52 -262 54 24 88 -514 12 13 -57 -180 -135
4806 -135 -182 174 546 -169 56 -161 228 74 100 -183 142 91 32 -10 -46 100 1 -299 95 -41 80 11 -254
4829 -254 -118 -82 33 -173 -316 13 22 -281 -164 -303 113 9 -221 -73 -20 -42 -61 54 -127 12 202 -143
4851 -143 -240 -53 -337 92 -111 -162 -201 236 293 92 15 -248 -20 -210 17 -28 -174 183 92 -209 -86 59
4873E9l9j42j62O5K56n6l4j16J24L49J43m80J40j49l7K98k66R4N5k15K09k98K57
4896E5Q8q6K1q3J86kj89j86L16J3r7m67K51K55K05n07J60L89m31J98O3k60m4L32
4920A80q3P5K5R1q6l23lK48L9k93L51m01L66j19N6k48o2L52K6l45j07N18P3k50
4944H0j34l9O7J60j8l84J9L41n9j75J56K35j17l3l06L04O2k02J99m08J51k5J17
4967ij66NJ68k4o5p4M0l75L76L53m91l4N59K90k41k65N1J00M5m15J85J42o4Lj61
4992f7J85O7o7l4o0L0j2k33j89L53Q9j08o4M9j23L05k5j05q1L28l54J25p6nK10
5017A38j75n7M1k08L02M00m74k47J51P3J51l63K18P1r4J67m02M40r4L46k06k70
5039i2J17K61l06j14L3K48l10L23k42L40j86j81Q2j83k1k4K6K28K5M9k81J47L8
$$ plain form
4873 59 20 -122 -284 -219 37 -19 -53 -169 -45 304 447 -33 107 -42 -79 219 -47 47 102 -113 96 -202 55
4896 55 143 57 78 -5 181 179 -10 -196 120 133 36 -431 -180 75 280 -227 -67 322 -109 89 152 -108 -152 180
4920 180 97 172 197 288 202 -121 -124 124 163 -130 221 -180 186 67 123 -125 -187 165 191 -154 -261 257 330 80
4944 80 -54 -93 -26 134 116 -268 -249 92 33 -142 14 249 132 99 -207 97 159 -43 156 -252 -101 -126 -9
4967 -9 -175 -170 -2 -26 -91 -165 -125 -500 -124 229 -262 -296 263 553 312 47 98 198 243 -172 13 155 91 94 -67
4992 -67 118 185 118 84 24 54 42 -191 -380 -27 62 -46 -110 -61 -184 121 96 -9 -90 238 -116 9 -67 -72 138
5017 138 -37 -94 -53 -261 41 441 -33 -280 -129 -56 95 -268 -50 21 -73 94 -308 132 38 384 178 -92
5039 -92 25 286 -20 -134 -101 147 -163 160 -82 258 72 -109 -27 -210 -231 -255 -229 -1 24 73 -208 -61 -23
5062b3n1J73j89j0J20J12l76J02j83L00m4n4j6j3K20q8qk5l28L94Q0J55l77K4
5086a05K37P0M6L3k3O5l05n7j3J28K34l97j8r8K55L2k07J94l23Ll9J51l3O4K33
5111A27l60M37m27K45K0m9q6m1K18j0m37K64J78k9K43l11K55j81J52j05m9j55
5133a01OKk61N42k34k23K64j05j66K61J25j41k36m1J95k2L6jK63q2k3J1K4K11
5157C04j42k58l33M06J93o8j01j29J54m2k13R5o7J70N27n78j47L31J26P4k96Q3
5179H9k09J42k43M5K94pLn43j09L97N06n42J23J01K18j51n1k04J61j68K57k3m57
5202c71L37j1J03k47K42pJ92l36K39j58j09lM8Q4k15L80j40k17L7J70K62k75l02
5225b97L27P5k3p7l9J27p4j65l25K37K75J30j93j28J44n3K04k60P3m1O34l91m02
$$ plain form
5062 -23 -74 99 -90 -100 20 132 -244 -142 -325 -25 -69 -123 -139 -152 68 -20 -28 -53 -381 13 93 248 -129 -105
5086 -105 132 202 248 281 258 323 18 -39 -52 76 310 -87 -105 -203 52 84 -123 71 -252 -249 -288 -137 -170 -106 127
5111 127 -233 204 -223 22 42 -7 -93 -134 84 74 -363 -99 79 50 293 -18 237 56 208 103 54 -101
5133 -101 -95 -93 -354 188 -46 -269 -5 -110 -276 -15 110 -31 -267 -308 -113 -135 -99 -100 163 81 58 69 93 304
5157 304 162 -96 -429 -23 170 102 1 -128 26 -16 -229 -134 -201 -31 496 -82 -229 102 228 302 6 89
5179 89 -120 22 -221 -176 118 111 114 -429 -538 -141 365 -177 -54 47 265 114 63 -141 20 -148 109 86 -371
5202 -371 -34 -45 58 -189 53 46 238 -98 141 -17 -126 -129 -81 3 -212 168 28 -189 -152 18 280 5 -297
5225 -297 30 105 82 5 -34 93 19 -146 -471 -234 41 171 -22 -150 -6 -59 145 -115 -42 -83 551 160 -242
5248b42K44O3r9n2j59K59L9N0n1J53J9k59l46M59K69l4l73J09J67l42L47k75J07
5271E3j62L2L16l35j06J92mK55l38K40k26pL87k50J22J7nj57j19L99l67O4R9r
5295I1RK16m12R7L7J44k28L24o27L12L62j93k92n0K12K77k35M9k36K57k89K57
5317H2J53j82N9K5o7Q8k70J47j12j7K71j99O5j84N07l21K21l27jj53M78k86l44
5340c67L93P6ql1j96o8J63J69m38j58M59O3N0q6Q8J69l65J39j62j64r4N44j69
5363Gk79L75j58J24J69m69K43J77j37j67L26j48p4M8Nn5R7k57K15l35p4N63l33
5386a37R6j88o2L23J85m31J52j82M3L38m13J24K65m5J83n29O70r0m81q5K02J90
5408A28l1j18K33j04K9j27l37M88j17p6R5J2j78K47k47j31J91o5M20k00k38R3
$$ plain form
5248 -242 2 65 -34 -86 -245 14 53 103 52 205 224 -35 -381 78 347 313 -60 49 216 -126 221 -54 53
5271 53 -109 -77 239 -96 -202 -10 -14 241 -97 143 -83 -90 297 47 169 186 181 24 -95 304 -63 1 100 91
5295 91 100 316 -96 1 38 182 -46 278 -349 -37 325 132 -160 -210 2 279 44 93 -143 114 -175 82
5317 82 235 53 112 137 70 158 -112 35 -77 -94 177 -22 43 -141 366 45 266 -61 -62 -215 263 -23 -367
5340 -367 26 102 94 63 -133 -201 -38 131 -307 -465 -6 57 107 21 109 278 -87 52 -110 -274 -368 176 7
5363 7 -272 103 -55 69 238 -231 12 189 52 -115 211 63 -11 37 42 -13 84 -173 42 -293 -367 196 -137
5386 -137 -41 -229 -291 32 217 -214 -62 -244 -201 137 -276 -152 113 68 251 -278 392 302 -179 -264 -62 128
5408 128 97 -21 212 108 137 10 -327 161 44 -32 63 75 -103 144 -103 -234 -43 -108 312 112 -126 -33
5430c3j23J58q8k13K3K93j8L1k90N61l27Q8J45k56L5K51k34k49J95J49l3LO7K6
5454A61n0K01l40q2K04j30k29M4J69q4l8k71N17k1n0k25K59k58L97N9j55J23l44
5477a43J93j6l0j02K18k49J11j40J50J08N2j26%J21j71J47k5n8L15j48l01j76
5499b70L25K24m06K9M65m58OO3L24n02m6L38k91k43M71n6K40k07K0k2L01k09k93
5522a97K8J79j92L16P3k91K58O6K1o27J00R8N17l31m2M8j53J82j28J45J95k73
5544hl2l97O73l24j37K46J17P3k63l16K67m61M32L9R5pj03L22n7j65k32L17J48
5567B27p5J20n28J85J41k77L16j94M21k74k56K93J78N3m47R6j65L23j83J9l13
5588c40L84K32l43J98k37J41k22L47k78j49M24j31k6J36p9M1j08l8p7r7L43k22
$$ plain form
5430 -33 -156 2 -86 -299 -276 17 -1 30 -260 301 -26 62 207 -49 -14 237 3 -246 -51 98 65 68 135 161
5454 161 111 312 -28 -110 94 -36 -265 -221 -52 -136 -174 -445 72 51 1 -224 35 -223 174 233 78 201 -143
5477 -143 50 34 4 -98 120 -129 -18 -158 -8 100 152 26 26 147 -24 123 98 40 355 207 -94 -270
5499 -270 55 279 -127 -98 367 -91 -85 -22 302 -200 -246 92 -199 -442 29 -27 213 6 26 4 305 96 -197
5522 -197 -169 10 -182 134 207 -84 174 240 261 -366 -266 -168 349 18 -24 24 -129 53 -75 70 265 -8
5544 -8 -40 -437 236 -88 -225 21 138 211 -52 -368 -101 -562 -130 -91 4 -3 -106 216 159 -6 -238 79 227
5567 227 152 272 -256 -71 70 -207 109 -85 336 62 -194 99 277 330 -117 -21 -186 137 -46 -27 -340
5588 -340 44 276 -67 131 -106 35 -187 160 -118 -267 157 26 0 136 57 98 -10 -48 -125 -222 121 -101
5610a01N7m7J83q3Q3p3k43J08j07L21j43J20j55o0K88j91K09J06l64J48P6r6K17
5633B53l35j58L0M65l99P9J9K70k82K00J29n23M69k88K07q8r2J67k40k00O0N8
5655a99K71j02j20J35J0M8l6J34k13M2kK18l02Q0K1J93j66P3l66J95J74j97J35
5678B6j14J60j26k26J22R1l25M93M22l67m61O2K54P7n8k89L42k02k5K67o9J02
5700A56R2k23p6j49L22J06j26o8j26K41J16k54l03L10J19j77j57R7K2N6Q4k25
5722a63K46K86m82J82k60o0O6Jo5L63q7J5j29L5k17P1M89k01r2K68j10J28j22
5745A62k62j8L25m05L34m37N85j04J61m05O1M42o78j07J81M64l03J29r2rK6j1
5767C9k65K14j35J93j97K00p6j0J30R5Mm97L96l32J45j00J43J47j22k1K33p9o9
$$ plain form
5610 -101 -44 -91 92 9 92 19 -224 -116 -223 98 -45 75 -80 -140 148 -43 166 272 -92 56 132 36 253
5633 253 -82 -240 -210 255 -144 -65 -46 224 -58 142 271 -252 217 -71 136 48 -44 123 -117 -317 -257 -199
5655 -199 72 -30 -150 -15 -5 43 7 141 -72 -30 -32 186 -116 -36 -15 178 12 85 -281 -86 88 -109 26
5678 26 -88 72 -54 -280 -158 -67 -392 101 523 156 -305 -243 11 88 30 -259 83 -119 -144 123 54 156
5700 156 248 25 -51 -200 122 228 102 34 -92 149 265 11 -292 18 137 -40 -197 -100 -78 -22 62 -163
5722 -163 83 369 -113 69 -191 -251 -185 -184 -249 114 27 42 -87 -52 -269 -198 291 90 -2 266 156 284 162
5745 162 -100 -118 207 -198 136 -301 284 180 341 -64 -3 439 -239 -346 -165 299 -4 125 33 24 50 39
5767 39 -226 -12 -147 46 -151 49 -27 -37 93 188 192 -305 91 -241 -96 -196 -53 94 -28 -49 184 105 36
5790C6K38m87P3L80j57o3m21J86J41N6j57K3L87j74q9j65k37L60Q0j50n7K47J71
5813B21o3j94l16K82Q2n3J29J78l71R8n5j09K05%J9K7j35m6J73l49J94P7o5L66
5837B95l69L20M3k14J01j45l6k52L15o5l5N7R3k79Q2J19L7K19k12j18J58q1j97
5860a64J10j87o3K67K1n4oJ15k51L05j0k69K05p8k80L35J5N9m6l64J28n0K63k02
5884b01K59m2k26K39j26J12m4jR4R8m35P2K78j64k40J12O9J55r7J90J03j95r8
5907h8m9K65Q2J4m71O25l87K00j16J9k15j36M00k91J29o4L00r0P9k70m9K69l12
5930a56K28n67N55K05l12J98o43N34Q2j95l4K41j57l1J07k39L97P3j13m39L03
5951C7l11M21k52K51P1m90M09q4j77N0J92j74K59m7j82O6l39L42Rj64J09j23K89
$$ plain form
5790 36 274 -213 -140 240 83 20 -401 -215 -74 -18 -175 -152 235 61 -28 -193 -430 -70 10 -140 -197 50 221
5813 221 158 -36 -352 -70 12 -41 88 266 -105 -7 -62 -171 34 34 53 80 -55 -101 72 -277 -83 -6 -71 295
5837 295 -74 246 289 75 176 31 -5 -257 58 -7 -42 15 108 -171 -89 30 67 286 74 -44 114 33 -164
5860 -164 -54 -241 -304 -37 -16 -70 -76 39 -212 93 83 -186 19 -59 -339 -4 11 70 24 -340 -212 -262 1 -201
5884 -201 58 16 -210 29 -97 15 -29 -30 64 162 -273 -201 77 -87 -327 -215 -146 9 -88 102 205 10 -88
5907 -88 -137 128 210 224 -247 378 -9 191 75 94 -121 -257 143 -148 -19 -83 217 127 206 -64 -113 156 -156
5930 -156 72 -495 60 265 -47 151 -492 42 124 -71 -105 136 -21 -52 55 -184 213 286 173 -266 37
5951 37 -274 147 -105 146 217 -273 136 52 -125 -75 117 -57 202 155 -27 39 -300 42 51 -113 -4 -127 162
5974A62L4l56J34J7j67J84k01J91j12j05J82J42j40n7O0j86k0L75m6j29K32k73
5996g9P8L17l10R3k79J10q7K44qk29L0K34j03J0J12l40M0j8M00k02K16m49J08
6019a12j13K17L23m50K34k0J2M6m56M67p9L0J37l56m8L10j65l6k5j01K29m3j4
6042a3OJ45J24q8j1j55J83j77k9k74R2K72K9q6j14J22m8j16L22m82J70j78N70
6065B64j25l12M9J05N8J2M3n2mj54J74L7j33M6q9K39J7l80L65k61O4L49q3k95
6089f6J24j61N0K45k44Q7j35K2NK36k92L79K6q4k15O9RJ26l63K63L6J62k05J01
6113A75j04k64M2J46J00j7j50J24o0k45J01J53j82M5L01j96L15K69q92M87J7l36
6135a71J03N1N7L88n60j20r1K78N50k41k61n1K48j53j03J33L2O8l00L9K57l48
$$ plain form
5974 162 196 -160 -26 -9 -176 8 -193 -2 -114 -219 -37 105 -35 -92 -32 -218 -238 137 91 -38 194 -79
5996 -79 -1 316 6 99 -180 -70 -157 87 79 -150 -120 114 11 21 133 -207 -167 -185 215 13 229 -220 -112
6019 -112 -225 -8 315 -135 99 79 91 137 -319 148 69 99 236 -120 -168 142 -23 -59 -84 -185 44 1 -13
6042 -13 -7 138 262 174 163 8 191 14 -15 -289 -197 75 104 18 -96 26 -22 -138 184 -298 -128 -306 264
6065 264 139 -173 -124 -19 39 51 94 42 38 -116 58 95 -38 8 -81 158 175 -205 160 -101 -37 312 229 -66
6089 -66 58 -103 -53 192 -52 35 -100 -78 -73 163 -129 250 276 192 -23 46 55 181 -182 81 117 279 74 175
6113 175 71 -193 -151 -5 95 78 -72 52 -8 -253 -152 1 -181 -136 165 -31 284 553 -339 148 165 -171
6135 -171 -68 -17 40 428 -132 -252 -343 -65 485 244 -17 -68 180 27 -76 57 89 157 -143 -104 153 -195
6157a95L97k03j99J35P9K69r6j35J12r8J73l88k48N21k53J70L6j14n0j64j66M38
6179B1p1p0K28O2l3J74l63o4M05k53Q6q8J44k88K15j6R4l37L77p6mj94M9J2M7
6204E7k0r9K3J09j8J01o3j33K17Q0k17nK23l72J81j9k11K73j83r6M66k06l6j16
6228f4J42P4l22K36Q3j10j3j86J71M0j08K20p2K08k19M39l96L17n89n1L11j18
6250gJ7K3p8K69q7m06J02L29O0q3O3k02Q7N9o5k12J27J90J77m90Q7J63j21r1K84
6275A95j10j81K12j07k9j31M9L12k49k97K74j6J33k28j17K48J16l2M33m91k66
6296b82L44M7j79L0L3J47n9k02%K73M4j71O3j84J81r5O3m78L17L1K4k04K94j54
6320a17K08j17R1J05K32l47j77M7J26r2k81J20L50J48k29l05N30k52P6N3k14j8
$$ plain form
6157 -195 202 -1 -200 -65 14 283 187 52 164 66 239 -149 -397 124 -129 41 77 -37 -87 -251 -417 21
6179 21 -50 -120 108 170 137 311 -52 -116 289 36 122 34 178 -110 105 89 183 -154 223 147 143 -51 -2 10 57
6204 57 37 -62 -39 70 52 153 90 -43 174 254 37 32 255 -117 64 45 -166 107 -76 -172 294 88 52 -64
6228 -64 78 152 -170 66 149 39 26 -160 11 51 -57 163 91 299 80 519 123 440 -149 -200 111 -7
6250 -7 10 33 -45 224 137 -269 -167 162 222 139 202 0 87 146 81 -131 -4 186 363 -127 -40 123 2 -89 195
6275 195 85 -96 116 9 -20 -151 -102 210 -39 -336 -62 -78 55 -173 -290 -42 74 42 475 -16 -282
6296 -282 62 109 -70 -40 -7 140 81 -121 -121 152 196 25 88 -96 85 -10 53 -425 -108 -77 -53 -257 37 -117
6320 -117 91 -26 65 170 402 55 -122 -75 51 -41 -322 -202 148 296 67 -238 292 40 116 169 -45 -63
6342f3L61m29K62j62J37O4n1j10j50K75q9K12k70qJ83k2k06J8R2j14q2j93K45
6365a00m7r9K48q4J08K7j29m2j80J26J60k88L74j24k2L81l66q9n1L47j67j51k09
6388c77J21K96k87M10m96L81J26q4l05Q0J78J88J02l42j44L60l15RJ32n18M39
6409d6j87K4K76j01M8j88j07O26l98p3N4K5PR0m8k59K87L51l61j71k86J95l9N6
6433b25K61l66N54M1k97j14L37l3j66k67K58L3j03N2o5J36J87j25Lq1o7K3L64
6456C40j05n38M86k01m1L7j80L87k41k1P5K73P4j79p9j42K46m1O3m40m0N44m51
6479a74K15k54R1M28l88N0R7n1r2J67j63j08L93pl57K18k42K00nq6mq3J14K12
6503A71l91P8J43J43J31m51KJ93K8n6j05l2M77j94J5k19K43K04l71p5J39j01j02
$$ plain form
6342 -63 298 -131 131 -31 106 170 119 9 -141 134 45 257 -13 -21 162 140 -66 -48 44 -70 -152 -345 -100
6365 -100 -147 -246 2 -82 26 53 -76 -118 -298 -172 -12 -300 74 -50 -72 309 -57 -146 -197 150 -17 -168 -377
6388 -377 -256 40 -247 163 -333 48 174 90 -215 -135 43 231 333 -9 -153 207 -108 -99 33 -485 -46
6409 -46 -233 -209 67 -34 14 -174 -281 345 -53 -126 -72 -47 -40 50 2 -257 30 381 20 -151 -437 -242 -281 -225
6433 -225 36 -330 224 265 -32 -146 191 158 -8 -275 -17 16 -87 -35 -100 36 223 98 101 20 -47 -24 340
6456 340 235 -303 183 -18 -59 -22 -202 185 -56 -77 -2 271 345 166 87 -55 191 150 213 -227 -267 277 -174
6479 -174 41 -213 -122 306 -82 -32 65 14 -78 89 -74 -182 211 204 -153 65 -177 23 18 -68 -72 -155 -41 171
6503 171 -220 -142 1 144 275 -176 -174 19 47 -9 -114 -146 331 137 152 -67 176 380 9 -66 73 -28 -130
6526a30O2m24O64J89l98R6q2L45l83j06J87k10L96Pm39J51J31L08m98P9J72j82
6548f5J40j47k5K06P9j0l08j13M23q0K6l27K85J35M6m49L57ROk42j39j0qK63k67
6573b15J93K5J65k20J83j50J97L52n18j71L57K48m90K4j57J01J98k23M2k69M59
6594A31L0J32l63k36J87L92k85n24M70K00k98K61l35J74J22k57P0J01O2J31k12
6615d7q4J00k86L91j77p3J69J19k16k11N6L87j26P5j08L19k52J63k66j78M02P6
6637B33m01O5r0J24L03j44J11j44j18j51J38o4K17l7j35n9J26q0L27l58j64L63
6659F2P6j08j84p1L90l1p5j68l58N40k7j76J46K52j61k20j46Q1K96k4k80J88l89
6682c87L81QL5m0l76M37J47l30K45J7J1k42q1K96oL6k81o6M2O3N7k07n3N00m1
$$ plain form
6526 -130 -68 -492 172 361 -37 59 -23 322 -61 -167 20 -190 206 213 -226 -75 56 364 -134 -55 117 -65
6548 -65 75 -72 -97 109 188 178 -130 -243 180 100 126 -201 84 219 265 -184 173 182 188 -54 -193 -203 -211 52 -215
6573 -215 -22 3 168 -52 131 -19 178 530 12 -159 198 446 -44 -20 -177 -76 122 -101 -59 -328 131
6594 131 161 293 -70 -306 -119 273 -12 -536 -66 134 -164 97 -238 -64 58 -199 -129 -28 34 165 -47
6615 -47 -131 -31 -317 74 -103 -176 -7 112 -104 -315 -259 128 2 77 -31 288 36 199 -67 -245 157 233
6637 233 -168 -103 -193 -69 234 90 201 57 -61 -212 -74 -138 79 42 -93 -152 -26 -106 221 -137 -301 62
6659 62 138 30 -154 -225 165 134 59 -109 -467 73 46 -130 16 268 107 -113 -259 -178 118 94 -186 2 -387
6682 -387 -6 2 37 -3 -379 58 205 -125 120 137 148 -94 -175 121 115 151 -130 -196 -154 -91 -34 -241 -294 206 165
6707A65j90j64n4K72Kl00L37j42J84j7l03K02N3m0l37J09J19L22o2k33l9p2N3
6730a35M79n16n0J46J39q7q3K73j82J08m27L17q0K52j7n85J62L31R4q4l69K59
6752e5J62O3k4J29j5k38oj73L9O5mK98k24k8J13k82O46n05L16j82j30o9J44R0
6776A30k83J64j25J53j87L09k40J54j39j75K28j38r1K16J00l46o3M09J56j05k26
6797i9N5K94Q7k53k54O5K0K98j63j31M0N62k81m2k0m4k7m9j3J4J02M46o08p0K25
6822A54j3P6l46K18K34m25J00n38L82K45j05%k70L27M51m23m93N41q5K01j48l28
6844b45K5M72k19J2r8J29J65k22m9n6J46M8l2m2l4L99p69K35k9K21J91o6l09k0
6868a47J67M5j34m4J60j16K46l34J0L81m74J78M3j63O33m64j45p1J50K24j03j41
$$ plain form
6707 165 -25 -189 -243 29 31 -269 68 -74 110 93 -210 -8 45 5 -332 -223 -104 218 156 -77 -116 -188 -135
6730 -135 344 -172 -222 -76 63 -24 -107 166 -16 92 -335 -18 -98 154 137 -448 -286 45 139 55 -314 -55
6752 -55 107 170 146 275 260 22 16 -157 -118 -53 -57 241 17 -11 102 -180 466 -39 277 95 -35 -104 40 130
6776 130 -153 11 -114 39 -148 161 -79 75 -64 -239 -11 -149 -240 -24 76 -270 -333 76 232 127 -99
6797 -99 -44 250 337 84 -170 -105 -85 213 50 -81 -41 521 240 198 178 134 107 58 45 59 161 607 -1 -71 154
6822 154 141 217 -129 89 323 -102 -2 -540 -158 87 -18 -18 -288 39 490 67 -426 115 30 231 83 -245
6844 -245 -220 252 33 45 -53 76 241 19 -30 -86 60 108 76 34 0 399 -370 -135 -164 57 248 182 -127 -147
6868 -147 20 65 -69 -113 47 -69 177 -157 -147 234 -240 -62 -19 -182 451 -13 -158 -229 -79 145 42 -99
6890i9J03j01K08n3j38J20j9k05K81k58J00L60j11p6k69r4L25Rl53K01N3p3P9
6913a0OP2m8k50L70k53j62L09q8p8Q0M9K7p9j91N88l77l3l8J9O8N17n94P2j8P8
6939C6J77p19O70k94M11k82m4nK04j95P3L1p1O3Om5j01K24j91R2R0j73Q7jL3q1
6965eQ0J04j45n3j80K89k62K0Q8j12J99k3J11j61l25L62o0K03k29J48J88q5k87
6988a35k08J69J05K87J7o1j45P1k25r5J84K13m01L13j59K22l72L9J30k19Q1P3
7010a16K06j96J48J53%n41K99j99L16J17m5j35J09m34J99j27J59J33L0M8m76L19
7032c3L49l20J1k27j8m6L33l2j08J50Q4o6J3K18j41M6l50J45J92q4o3k19j19N10
7056B25j29l67J19QK98k82K97o0J4n8n1j97M07q7q0l09J34j1L83j43l54l2K93
$$ plain form
6890 -99 4 -97 111 58 -80 40 21 -184 97 -161 -61 299 188 112 -157 -251 74 83 -270 -69 -16 -89 -10
6913 -10 -4 68 20 -230 140 -113 -275 34 -54 -132 -52 -3 24 -55 -246 342 -35 -68 -106 -87 -19 498 -96 -24 -42 36
6939 36 213 -506 164 -130 281 -1 -45 -50 154 -41 32 63 -8 55 61 16 -85 139 -52 40 130 -43 44 43 76 -5
6965 -5 75 179 34 -19 -199 90 -172 -152 -64 -176 23 0 111 -50 -375 -13 -73 130 -99 49 237 152 -135
6988 -135 -343 -174 -69 218 235 174 29 100 -125 -220 -36 177 -224 89 -70 152 -220 -181 -51 -270 -189 -116
7010 -116 90 -106 42 195 195 -346 -47 -246 70 187 142 7 116 -318 -119 -246 -87 46 76 124 -352 -33
7032 -33 316 -4 7 -220 -238 -284 49 17 -91 59 143 77 90 308 167 213 -137 8 200 116 53 -166 -285 225
7056 225 96 -271 -152 -144 154 -128 169 109 123 65 14 -183 224 137 57 -252 -118 -129 254 111 -243 -275 18
7079A8Q3j30K33N8o2j32m05L12L31k12Kj61J32J6j44j2J44o3M14l45J64j75p6
7102a0L48l89l4L08j39M2j46j26l7M38m75p4K50l9N09m70K34j85j5O1j81J6R3
7125b1J92mj71K22j69J14j52R3m21M41K1J6m49J01K78j53j15J99L69k64k26R5
7147dj6L87P3p21%N20j57o3j05oN8J01R4l34Q5q4nO1J60J70J3k91k3k80L30K8
7173ij56J91K2K81k01k80o4N00l82k10K72m7K32K32l61l0J00j43p1J59k30J50
7195d5L92m69j21L28j28J6J9q0M59j01j14n46K72N01l59k05R5m35M18K76q0k97
7217b04K14K01j78k17L25k49K55k41L73n11J18J32k03j95K46L68p3m06j8M44k84
7238a03k7j3J4K40K08n75j32L98P6j66k5L6L68r8l2m3k80M74k31j4P5l20J90l32
$$ plain form
7079 18 101 -29 204 262 200 68 -337 -25 306 94 96 -65 67 83 -61 -73 71 8 422 77 241 66 -10
7102 -10 338 -51 -85 223 84 126 -20 -146 -183 255 -220 -294 -44 -83 426 -44 190 5 -10 51 -130 -114 -21
7125 -21 171 167 -4 218 49 163 11 104 -317 124 145 161 -288 -187 91 -62 -177 22 391 127 -99 -4
7147 -4 -20 367 440 -281 -281 239 82 19 -86 -92 -34 67 161 -173 -88 -172 -177 -116 44 214 227 -64 -87 -367 -37 -9
7173 -9 -165 26 48 329 128 -152 -216 284 -98 -308 -36 -83 149 381 20 -10 90 -53 -124 35 -195 -45
7195 -45 347 -122 -243 85 -43 -27 -8 -88 371 270 156 -390 -118 383 24 -181 -86 -521 -103 173 93 -204
7217 -204 10 211 33 -184 141 -108 147 -94 279 -232 -114 18 -185 -380 -134 234 161 -245 -263 181 -103
7238 -103 -130 -143 -129 111 319 -256 -388 10 86 -80 -105 -69 299 201 169 126 -154 320 89 75 150 -170 20 -312
7262c12L87j2N5j93K3k30J28M34j88k70J85P7O0l33N4r9J61M0kq1J52J27p4j15
7286b6J40l61M28j24j68K33O4J34j76m07R1N20m86p7q6J92K03K27m31nJ35Q3n1
7309E2j18J39QK5m16L72j55M28l87j55l79O92J53m68J71j72L64K07n63J15q7K50
7331G6j57Q8N7M8k13J81j84J81L28n59L9l8K02O8K9k97j91L63N6n9q1r2L73j93
7355B5j47m1L66l74K10J37L4j88K8J65l76L02K19l29j25J2m6K87l23K73k29j28
7377b48J33J29n6q3J69N8k1K05l17J05l79J85K63K6k56N4J24j22n9J78J27j08
7399A07n1j67J29j55L4J13O8k47l05M93K76k77n1k08O01j56m48K9J24p3J59J13
7421A08l92N81j57l58J74j69L01P9k45j06O8K02j42j2J79R3Kl31j81L30k59L88
$$ plain form
7262 -312 75 63 118 -75 -52 -282 -154 280 92 -178 7 84 144 -189 -135 -234 -73 -33 -35 -116 36 163 89 -26
7286 -26 114 -247 181 57 -111 122 186 320 144 -263 -172 348 -138 -215 -301 -109 94 321 -110 -115 20 103 52
7309 52 -66 73 81 106 -310 62 -93 335 -52 -207 -586 106 259 -209 -38 -210 154 361 -202 -87 -174 76
7331 76 -81 7 64 112 -101 80 -104 77 405 -154 -115 -153 49 117 146 -151 -342 21 77 18 -63 -155 218 25
7355 25 -122 -163 203 -171 39 176 210 22 50 215 -161 141 360 31 -94 -82 -128 159 -164 109 -120 -248
7377 -248 -115 14 -42 -125 44 102 81 286 -31 74 -305 -120 143 169 -87 -33 91 -31 -90 88 215 107
7399 107 56 -111 18 -137 -103 10 78 -169 -474 19 295 18 -33 -241 360 204 -244 -215 -91 -164 -5 108
7421 108 -284 297 140 -218 -44 -213 88 167 -78 -184 -116 86 -56 -68 111 204 206 -125 -306 24 -235 153
7443A53k81r5L20op8R9j97J59j30O5j52j10J34N3k03r7O15L6M9m19l39L59J48
7466H3P7l79J53K00j22k31L38q5J05k12J87p6j14N77l85r9l05J53J27j88J08K00
7488A12J0j30j48K18R7r1k27m1k4L90l32j90J29m5K21J04j69K8R0kN2k18J16n1
7512a01K42k61J04m0M9R8l35K40n3k74Q6K35k1K39k46K16n7k91O4J74j34K65j06
7535I3K47l26l15K40J76Kk70K79j53q3J98J28Ok11Q8k0m1j18j44L82o10O80J65
7558C93l42J39k30J9K4j15j06j41L32M50o99K50l0k39K36K83l83N3J12K81k24
7579F3K73m17J76j26L2k1K61k18P6k3P0j22J87j55j91Q3k08L89k39j5p0L10j8
7602I7k66K79j9j31j25p2M79ql55L58k47N2J54P7Ol98Q8L03l91L5M7J98m8l45
$$ plain form
7443 153 -128 -223 97 91 13 112 -85 74 -56 9 -143 -253 -119 -66 -269 -366 249 285 334 -85 -424 -65 83
7466 83 160 -219 -66 134 12 -219 119 34 139 -73 114 38 -76 501 116 17 -288 -135 -8 -196 -88 112
7488 112 122 -8 -156 62 159 68 -159 -200 -224 166 -166 -356 -227 -272 -51 53 -116 -88 2 0 52 -166 -50 -101
7512 -101 141 -120 -16 -56 -7 91 -244 -4 -57 -331 -245 -10 -31 208 -38 178 121 -170 -106 68 -66 199 93
7535 93 340 14 -301 -61 115 117 -153 126 -27 -110 88 216 222 11 99 79 38 -80 -224 158 -452 228 393
7558 393 51 190 -40 -21 3 -112 -218 -359 -27 423 -276 -26 -56 -295 -59 224 -159 -106 6 287 63
7579 63 336 -81 95 -31 1 -20 241 23 99 76 146 24 211 56 -135 -52 -260 129 -110 -125 -195 115 97
7602 97 -169 110 91 -40 -165 -237 242 234 -121 237 -10 42 196 273 279 -119 -31 272 -119 -84 -37 161 113 -232
7626b32K93QL8oQ9l78nK03R1M3j60J7L98m58L10J19j59j13k73k9O8N1j42j07J92
7651a42M64k10K08m14J38J56j19j95J40j19q6j81j75M77q4J62k11J05k26K13P9
7672b0l02R4K23P0Q7k40q8L04j09R1l60K45k18J28kK20K5r2J15k23L96n8l88j
7696a03j48L19k13R6k55K10P9M39n78K05Ol47L77k22J20K52j98J02l12M5l9M8
7718a17N2K55l29L04o6n2J38j17p4k10K39o3n3J93l16R6P3k5K61k45J49O8n3N9
7742A67j76L42l23j9Lk54M05O4j21l46R6N6j29L39k08K24j70L04q0r9n9j35O7
7765e2k62K39Q0m2k7J50j38O1n8j20j7J61J5N0l3j31K12Q3k88k11O30m38L83l37
7789i0j39O39k29J67l06p8j18J83J49l81J58J28Q3k46K70l82K99j61Q0j19K81
$$ plain form
7626 -232 61 69 107 101 190 -188 -193 10 101 144 -16 1 399 -59 251 370 211 98 -175 -204 -136 -85 -227 -334 -142
7651 -142 322 112 320 -94 44 200 81 -114 26 -93 -179 -360 -535 -58 -142 20 -191 -86 -312 -99 -20
7672 -20 -322 -228 -5 65 152 -88 -176 128 19 110 -250 -5 -223 -95 -97 123 148 56 171 -52 344 286 -102 -103
7696 -103 -251 68 -145 -49 -304 -94 -15 424 -154 51 57 -290 87 -135 -15 237 39 141 -171 -126 -165 -117
7718 -117 -65 190 -139 165 99 47 185 68 -6 -216 23 -40 -93 100 -216 -120 -47 -72 189 -56 93 161 108 167
7742 167 -9 333 10 -9 -6 -260 145 209 88 -258 -162 -106 -235 104 -104 120 -50 254 174 75 16 -119 -52
7765 -52 -314 -75 5 -37 -64 86 -52 9 -49 -169 -186 -25 -10 40 7 -124 88 171 -117 -328 302 -136 247 -90
7789 -90 -229 410 181 348 42 -36 -154 29 178 -203 -45 83 166 -80 190 -192 107 -54 26 -93 188
7810A88j65O5l28K3L60K04m57K16j15K48l16k95N85k26L4j15J29j80L79l86O2
7831i0MJ71n0j40K00p7j36K87l06o6K41r9m3J63k01J54K4j00n7Q5J16J63j36n4
7855E3j87J15m8r5K82l51L73k11k21K22K23l18J25N9p8J51j69j18K67MOq7l66
7878c69L66j29L30m7j32j21J83L39n73J30K39P8o1k62j35J03J1j31k62M78O1k60
7900a64j14K26J83l7O1o9J34m19K40l12r7K60O5J78j6l87N71j53l48k3N4L94P
7923B34k7k08j10P4J59L01q88J32L08j43j03K46k21K39j5l4K15N8k15P6m80M09
7945Go8K95k94L17j79l03l7J68K67j02j3j85J49L0K74m34L24j94k9p6K2J32R1
7968A62l68K89j92pQ0j71L86o2j88J34J49k06j12K81k94J35L5k14K52j4j24k53
$$ plain form
7810 188 23 88 -240 -217 143 347 -110 106 -9 239 -77 -372 213 -13 21 -94 35 -145 234 -152 -90
7831 -90 -86 85 35 -105 95 18 -118 169 -137 -203 38 -61 -104 59 -142 12 36 -64 -121 -36 80 243 107 53
7855 53 -134 -19 -67 -162 120 -231 142 -69 -290 -68 155 -163 -38 21 -57 94 -75 -193 74 78 84 -3 -369
7878 -369 -3 -132 198 151 19 -102 81 420 -153 -23 216 294 233 -29 -164 -61 -50 -181 -443 35 96 -164
7900 -164 -278 -52 131 94 155 86 220 -199 41 -271 -368 -108 -43 135 119 -268 303 150 -198 -221 -167 227 234
7923 234 207 -1 -111 -37 122 423 -465 -333 -25 -168 -271 -25 -246 -7 -22 -56 159 217 2 78 -402 7
7945 7 -61 234 -60 257 78 -225 -262 -94 173 71 58 -127 22 52 326 -108 216 22 -7 -83 -61 71 162
7968 162 -206 83 -109 -116 -36 -207 179 117 -71 63 212 6 -106 175 -119 16 51 -163 89 75 -49 -302
7990c02K46n8M39k50k02L38j2l71J37p6K31R3m25P5K16k26q6L6L9L59J13j72J5
8013A57l93K39q0J79k14J75J08J77l40Ko2M42k61j58K02K9k06J02L63m58R5o6
8035C2J8P8J39j26j53j00J06J73j34j73J98M4j73K65j51l88J68J97j84K30RO5
8057A40k1P4l35m6N9K39q9j65M99k83j65k34L89r5K15j36m2k57L23m68K46j32
8079b84J37m3J94j53J99j78j29K52J44o6k81J05Jj97K53R1mj33J49J08l6k19m7
8102a37L33j56O8j32l9J17j25j48K51l4K2j49m9l8K92l59K54l78N11K0j4j24n5
8125f9R3J69n3k77j41K81M0O9n7K67n10L38j68l08M13k21%mM6J14N0L9pr7j98
8150a91K03N1J87l73N7p1P2q2L91l3o6r3QK55k17K5l03O10n41O4OK9K2j47l0L57
$$ plain form
7990 -302 -56 -114 325 75 -127 211 199 -172 -35 -111 120 213 -212 -137 79 -147 -233 -197 -158 201 314 142 157
8013 157 -236 3 -77 102 -112 63 171 348 8 10 -52 390 129 -29 173 202 -4 98 461 3 98 32
8035 32 50 128 267 141 -12 -112 -6 167 33 -140 58 102 -71 194 43 -345 -177 20 -164 66 75 140
8057 140 119 193 -142 -188 -129 110 21 -144 355 72 -93 -327 62 -33 182 46 4 -253 70 -398 -152 -284
8079 -284 -147 -190 4 -149 50 -128 -257 -5 139 73 -208 -103 -102 -299 -46 45 41 -92 57 165 129 -90 -137
8102 -137 196 40 108 -24 -63 54 -71 -219 32 -2 20 -129 -178 -216 76 -283 -29 -407 104 124 110 -14 -69
8125 -69 24 193 140 -137 -278 3 43 112 55 322 -188 150 -18 -326 87 -134 -134 -138 -92 22 72 111 104 7 -191
8150 -191 12 63 250 -123 -66 -137 -65 -147 244 211 145 52 60 315 98 123 -180 430 -111 -47 -41 -12 10 -137 -167 190
8176A90j82MP7K05l34j5K66l18k76J21L97K5j9p1k8
$$ plain form
8176 190 8 12 89 294 -40 -55 211 -107 -383 -262 135 160 141 70 42
8191D2
$$ Imaginary data points
##PAGE= N=2
##DATA TABLE= (X++(I..I)), XYDATA
0@%%%%%%%%%%%%%qJ6j6J6k1K9l2M0m8N6o8P7q9J04j21J41j62J85k14K42k72L09
35A64l48L91m39M88n44O06o74P49q27R16j014J117j233J360j497J649j816K002
53A050k209K440k700K998l340L735m200M760n445O306p428Q956j1174J4691k1147
68a2707L6859j46519j98041K67054K01126m4717j35644L3083Q0483Q50p0268j6843
80e284Q605j0274l9167l5173k2391L1730L1913n1501p6786N9460J28870Q625j02193
93g3566j3182J24135J05062l6950r5252k0788O2612O5255N259p7583q5624J7307
105b3315P5048j0372o6614J6128P5325j261o3848J3038J00576K7919j03137p4590
117c5103N9100P2549l7398j00781n7532K7090O0178q730r2201n4845N9212Q6474
$$ plain form
0 0 0 0 0 0 0 0 0 0 0 0 0 0 0 -8 8 -8 8 -13 16 -16 24 -24 32 -36 41 -48 56 -65 76 -86 99 -115 127 -145 164
35 164 -184 207 -232 256 -288 318 -356 393 -434 482 -532 585 -648 712 -785 864 -952 1050
53 1050 -1159 1281 -1419 1579 -1761 1974 -2226 2534 -2911 3395 -4033 4923 -6251 8440 -12707
68 -12707 24152 -122367 -320408 -53354 147772 103055 -32589 494 80977 81827 11559 -5284
80 -5284 3321 -6953 -46120 -81293 -103684 -71954 -40041 -91542 -168328 -108868 20002 28627 -73566
93 -73566 -86748 37387 142449 105499 10247 -10541 52071 117326 122585 45002 -40622 -23315
105 -23315 51733 41361 -25253 -9125 66200 64939 1091 14129 114705 142624 39487 -35103
117 -35103 23997 96546 59148 -41633 -99165 -72075 -11897 -20627 -112828 -167673 -108461 -21987
129b1987o01o3112l416Q0012N0944k4462r170M8585L1013l0793m6584m887L7249
142D2791P408p3301p6625K1296P7264J2257p2555m5760O0549R0942J251n9538
154a4021n382N9074M5372j0013m0168j2405L4714J8326m1250m2261J4333K9510
166C5829k2452n8842j3221N6113L5552m0702m2237L1593O2674J6338m3293m2297
178b4945K2851N7388j2703q6412m5204M6914M9127l3483o7948N023O6406J5709
190g277m5299n636N6598M2697j0221k9279L373M6656L5520k7550n1463k125M3059
203D9053J1071o0690n9532K5458N2557k8084p0046K608P0026M0518k5874l6288
215b9223J7723N7397K2720l2849l0300J5694L6459l808n5237k9624M0482L0667
$$ plain form
129 -21987 -22588 -85700 -89116 -9104 41840 17378 8208 56793 87806 57013 10429 5542 42791
142 42791 50199 -23102 -99727 -78431 -1167 11090 -61465 -107225 -46676 44266 45517 -14021
154 -14021 -19403 39671 85043 75030 34862 22457 57171 75497 34247 -8014 6319 35829
166 35829 13377 -45465 -58686 -2573 32979 -7723 -49960 -18367 44307 60645 17352 -24945
178 -24945 -2094 55294 42591 -43821 -89025 -42111 7016 -26467 -94415 -89392 -22986 -7277
190 -7277 -52576 -58212 -1614 41083 30862 1583 4956 51612 87132 59582 8119 5994 49053
203 49053 60124 -566 -60098 -34640 17917 -10167 -80213 -77605 -7579 32939 7065 -29223
215 -29223 -11500 45897 68617 35768 5468 21162 57621 53813 -1424 -31048 9434 40101
227D0101m6831n5622J6790N2234M692m8526k6000M0350M7787j3223m2360K042
239b8566N1154L5582l3048o3924j137O1038J7356n9633m4754L2883N2403q087
251A1267n1391m693N9848L4114l5005l3021K5924M6252M95m7055k4433L7055L3998
264E3355l3070n3266K767M5819J6747m7228n3012J7899O4222J5899m5821k8426
276d4115L6025N4193R91m6133j3036M2566K1474l6610l6079J1605K5946j2305
288D522m4333j3013M1713K9811l3533m6079J3511O1246K8752m4304m8491L0463
300a9735P0888Q400n3436k7496L0906L6362j3538m3208j2931K2502O313k3425
312a8398j5149J5264K2678m725l0041J330N2891L1994l9616m8931J8515O2582
$$ plain form
227 40101 -6730 -62352 -45562 6672 11364 -37162 -63162 -22812 24975 11752 -30608 -28566
239 -28566 22588 58170 25122 -38802 -39939 21099 38455 -21178 -65932 -33049 19354 11267
251 11267 -40124 -44817 15031 49145 14140 -18881 7043 53295 53790 6735 -17698 19357 53355
264 53355 20285 -32981 -30214 15605 32352 -14876 -67888 -49989 14233 30132 -15689 -44115
276 -44115 -8090 46103 47094 961 -12075 30491 51965 15355 -20724 -9119 16827 4522
288 4522 -39811 -52824 -11111 18700 -14833 -60912 -47401 13845 42597 -1707 -50198 -19735
300 -19735 51153 59553 6117 -21379 9527 45889 32351 -10857 -23788 -1286 5027 -18398
312 -18398 -33547 -18283 4395 -330 -30371 -29041 23850 55844 16228 -32703 -14188 48394
324D8394J7723n5603n1759K3230N3475K925m4814l2570J2525L1201L400k7988
336a9861j0142K2549J2040j5084n033K6224K5809j6614m1188J704N0343J9272
348E0019m8547n2374R358N3875K2767m3842n0429J6947N7969J9294l2496k7472
360b4931J7526L4747J756k2842J353K1072m993k8159n327K6033J5309l1387m8993
373d8836O22N1082K3774m0110m6607J3204O1539L2972l3420m1151J6546M7590
385C7205J2401k8435k4228P231J6012j0656k2485L341J7280j1518l0949m554L3776
398e579K7636k3275m5005N562N8083L1505l1722m2839N719M7373K2849l4409m0419
411b4521N937K7987K109k4772j5626J3277J7629q645j2902J9474K8631n231k8481
$$ plain form
324 48394 66117 10514 -41245 -18015 35460 38385 -6429 -38999 -26474 4727 8127 -19861
336 -19861 -30003 -7454 4586 -10498 -15531 10693 36502 19888 -21300 -19596 30747 50019
348 50019 1472 -50902 -41544 12331 35098 -8744 -59173 -42226 15743 35037 2541 -24931
360 -24931 -7405 27342 29098 6256 7609 28681 23688 -4471 -9798 16235 31544 157 -48836
373 -48836 -48214 2868 26642 -13468 -60075 -46871 14668 47640 14220 -26931 -10385 37205
385 37205 49606 21171 -3057 4174 20186 9530 -12955 -9614 7666 -3852 -34801 -39355 -5579
398 -5579 22057 -1218 -46223 -40661 17422 48927 17205 -25634 -19915 27458 50307 15898 -24521
411 -24521 -18584 9403 11512 -13260 -28886 -15609 2020 -6625 -19527 -53 28578 23347 -5134
424e134m216L4079K7736k4408m9247n290M1730K0207l3997m5155r97L7978J6741
437A0027k9094k5939J7828L2604N354j5354l82K5722J8156j5726j7964J6315K3224
450D4771j4321l9681j6290K3759K2716k3404m4609l304L8924K3678j9773k9438
462c6972P908M0051J8611k4470j9176K0624K6918o676k6654o026K1840Q474k7780
475c328k3774J5207K4405q214k9157p861K9825L0032j1287l1301K695L5304J5940
488C8486k4037l1089M633K9155K34l5237j8387K1428K0115j1516k3003L280K9387
501C449J4249j8972j3545K0397K7987m69k4819j1801K0884K2146j8443l7415n166
514b1518K5679P002k8543k7507J2762L2022L60k6504k251L0711K2363r023j9420
$$ plain form
424 -5134 -9350 24729 52465 28057 -21190 -26480 15250 35457 1460 -43695 -44692 -6714 10027
437 10027 -19067 -45006 -27178 5426 10780 -4574 -4956 20766 38922 23196 5232 21547 44771
450 44771 30450 -9231 -25521 -1762 20954 -2450 -47059 -50363 -11439 12239 -7534 -36972
462 -36972 -29064 10987 29598 5128 -14048 6576 33494 26818 164 -5862 15978 24452 -3328
475 -3328 -27102 -11895 12510 4296 -24861 -32722 -2897 27135 15848 -15453 -12758 22546 38486
488 38486 14449 -16640 -12007 17148 17382 -17855 -36242 -14814 5301 -6215 -29218 -25938 3449
501 3449 17698 -1274 -14819 5578 33565 33096 8277 -3524 17360 39506 21063 -16352 -21518
514 -21518 4161 11163 -17380 -44887 -32125 -103 257 -26247 -28498 2213 24576 15553 -3867
527c867L313K6071J1145k1909k3069P767K0039k601k8712j6489K0448K0781j7700
540d783k8034R543L1783O160k1668j2056K0799K6093m925k4589o542J7521J4367
553B3669j2780l0847q720K6574J5172k3914k4316J5616L0511R57k2523j876K7361
566A4884J4861j7309j6075J0996J6697k568k0681j7396R125K2161n181l3981j4669
579c9136K6416K6262j5550l2033O183L9256J4214k2642j1831J6062J6320j684
591B1837j3647o726P590N835j3153j8410K671J9028L761k6286j7730K5827L4358
604B4955j1648l5625j205L3274J8963j6165k3678L86K1509R574j4305j8502l52
617a2819J3938M090j5736q412J8328J2268j7959j4476K0675K8231n146k9389r302
$$ plain form
527 -3867 -554 25517 36662 14753 -8316 -549 19490 16889 -11823 -28312 -7864 12917 -4783
540 -4783 -32817 -23274 8509 14669 -6999 -19055 1744 27837 22912 -1677 -8219 9302 23669
553 23669 10889 -19958 -28678 -2104 13068 -10846 -35162 -19546 10965 11922 -10601 -12477 14884
566 14884 29745 12436 -3639 7357 24054 21486 805 -16591 -7466 14695 9514 -24467 -39136
579 -39136 -12720 13542 -2008 -34041 -27858 11398 25612 2970 -8861 7201 23521 21837
591 21837 8190 1464 9054 14889 1736 -16674 -14003 5025 8786 -17500 -35230 -9403 24955
604 24955 13307 -22318 -23523 9751 28714 12549 -11129 -10743 10766 20340 6035 -12467 -12819
617 -12819 1119 5209 -10527 -18939 -611 11657 -6302 -20778 -103 28128 22982 -6407 -15709
630a5709K6019K2846j4888l2831j0163K0489K0966r742l1896o665K7704J5814
642A1944j4774j4309R834J6289j775j1258O198J9530m83k1569j0239J6765K0250
655B6403o968l2415j9303K3088K9060j0794l4939q002K7962K3702r430k1632J733
668a1535K0218P978r542p966L667O892l679j3187J706J8885J328k6585j6406K0047
682h179K8884n873l2949j2188K7675K6762q476k4593p439J7673K0203m749k2148
695e397n868J5818N555j5512q617J2358J0448j2783j5648J3023K4346m206k5549
708a2032p242K0146K1380l040k5732j6009J7878K6956k639k8298j2879J9014J8599
721A6102j1923j9114N949J4841m194j2084M305J4615L584j1705j1039P416J7492
$$ plain form
630 -15709 10310 33156 18268 -14563 -24726 -4237 16729 6987 -24909 -31574 -3870 11944
642 11944 -2830 -17139 -7305 8984 7209 -4049 2149 21679 21196 -373 -10612 6153 26403
655 26403 19435 -12980 -32283 -9195 19865 9071 -25868 -33870 -5908 17794 8364 -13268 -11535
668 -11535 8683 16661 7119 -847 2820 9712 6033 -7154 -5448 13437 14765 -11820 -28226 -8179
682 -8179 20705 14832 -18117 -30305 -2630 24132 15656 -8937 -16376 1297 21500 16751 -5397
695 -5397 -11265 4553 10108 -5404 -14021 -1663 8785 -3998 -19646 -6623 17723 13517 -12032
708 -12032 -19274 872 22252 19212 -6520 -22529 -4651 22305 19666 -8632 -21511 -2497 16102
721 16102 4179 -14935 -8986 5855 1661 -10423 -6118 8497 12081 376 -10663 -3247 14245
734A4245K014j9282j6382J1096K5333J075k9373j5279K3087K3360j0022k2023
746a2151k528J6447R255q456j0203N520R999k082r896j432J1665R168j1981j9299
760a5974M933K3116K853k2673j5378J4428K3481j097k3444q935J8262J6482o652
773I402j6641k771J4266R437j0348j2130P002J2420m884j3516k706J3601R045
786A2177j2892j7947N563K1295N399j7473j3371J2245K1666p63k1563o534J6902
799D704J1541r959j4861k02J2604N911j1717j1910P388J4052j748j5870n306J6533
813A160J4592j2488j8332Q486K1190J328j7464q586J1191J3340n074j6792n241
826a2690J1407R953p206j5098j013J8271Q676j5901j2826J4659J8304o883j7833
$$ plain form
734 14245 16259 -3023 -19405 -8309 17024 18099 -11274 -26553 -3466 19894 9872 -12151
746 -12151 -14679 1768 11023 2567 -7636 -2116 7883 5801 -4095 -5527 6138 15306 3325 -15974
760 -15974 -11041 12075 14928 -7745 -23123 -8695 14786 13689 -9755 -18690 -428 16054 9402
773 9402 -7239 -10010 4256 13693 3345 -8785 -1783 10637 5753 -7763 -10469 3132 12177
786 12177 -715 -18662 -13099 8196 13595 -3878 -17249 -5004 16662 15899 -5664 -12198 4704
799 4704 16245 6286 -8575 -8777 3827 9738 -1979 -13889 -6501 7551 5803 -10067 -15373 1160
813 1160 15752 3264 -15068 -6582 14608 15936 -1528 -10114 1077 14417 9343 -7449 -12690
826 -12690 -1283 8670 1464 -13634 -14647 3624 12300 -3601 -16427 -1768 16536 9653 -8180
839h180m71J6808P736j2893j2806M773J1290J234r523j0111N250J4387r01j8321
853a1728l764J9037J2240j3212j5689Q272J9935O38j9189p602J1836R733m771
866E736j3003n436R292J1343o074j3870K361J5520M944j3012p735J3040J3245
879A6351r827j6777M542J7419K511j5273j2538M630J5531L105j5973j2773R689
892i383J7672Q29j5556n582J4943J1620r443j0162O839J0635m382j1982l387R416
906B077O962r852j4667K367J6544P199j3744j5841P588K3048M703j8178j0001
919a1795J2056J4314k382j1702m962P378M768o933p873K256P460k643j0863k844
933a3765J4105J1496j1323j5856P416K0519N659j5503j4566O713J8379K464j5978
$$ plain form
839 -8180 -8651 8157 15893 3000 -9806 -5033 6257 7491 -2032 -12143 -6893 7494 6593 -11728
853 -11728 -15492 3545 15785 2573 -13116 -4844 15091 15729 -3460 -11062 774 10507 5736
866 5736 -7267 -12703 -3411 7932 1858 -12012 -9651 5869 10813 -2199 -9934 3106 16351
879 16351 6524 -10253 -5711 11708 14219 -1054 -13592 -8962 6569 9674 -6299 -19072 -9383
892 -9383 8289 9118 -6438 -12020 2923 14543 5100 -5062 1777 12412 8030 -3952 -7339 2077
906 2077 9039 -813 -15480 -13113 3431 10630 -3114 -18955 -11367 11681 16384 -1794 -11795
919 -11795 261 14575 12193 491 -4471 2907 7675 742 -7131 -4875 2585 -58 -10921 -13765
933 -13765 340 11836 513 -15343 -7927 12592 18251 2748 -11818 -5105 13274 15738 -240
946b40j1506N656J2073L80j2176o018R671O845p887n765R282R182n564j1593J896
961e764J6065O701j3983j5576L760J6523O046j4111j7386L940J9539N324j4095
974c017r969Q609J2241j76q591p00P977J191q777k314P327M768o595j2850j236
989a2112J4455Q881j2577j6638L731J9673Q766j3047j4725O886J8211L271j2045
1002B730p524N077P257k106q718j742O769k19r134l177R281R084n591j3744L15
1017a1442J7825J0394j2391j5123M187J6609O317j2930j3930L926J3540J038j1558
1030c538o537N447O959k858p063L217R998n92r254j632J0982R147o834j4569j258
1045h385J5118P715j2648j5339K332J4371N990j1436j1736O219J2711R20q728
$$ plain form
946 -240 -11746 -6090 5983 6363 -5813 -11831 -2160 4685 -3202 -8967 315 9497 3933 -7660 -5764
961 -5764 10301 17002 3019 -12557 -8797 7726 13772 -339 -17725 -13785 5754 11078 -3017
974 -3017 -12986 -4377 7864 7688 -903 -1603 6374 7565 -1212 -3526 3801 8569 1974 -10876 -12112
989 -12112 2343 11224 -1353 -17991 -14260 5413 14179 1132 -13593 -6707 11504 14775 2730
1002 2730 -4794 283 7540 5434 -3284 -5026 1743 1524 -7610 -10787 -1506 7578 1987 -11757 -11442
1017 -11442 6383 16777 4386 -10737 -6550 10059 16376 3446 -10484 -6558 6982 8020 -3538
1030 -3538 -10075 -4628 2331 -527 -7590 -4373 5625 5033 -4221 -5853 5129 14276 7442 -7127 -8385
1045 -8385 6733 14448 1800 -13539 -11207 3164 9154 -2282 -14018 -7799 4912 5832 -2896
1058b896k892P287O321m224p403L973R313k226j1743l800R789Q890p002j5349
1072a1962n24J5299Q092j0082j2349L599J4139N009j0580r154O552J0322k251
1085F110r814k176P590M359o612q346N138J0290j549j1269k758J0353R570n200
1099E686j3193O2J3475O254r801j0421K582J0385K069j0208p139O515Q607l338
1113A535q881J87R235N703p322p517N701J1120j455j1179l577Q235Q066m950j1905
1128g004n94J0520M242q247q092L454J0066J204j0146m352R504Q063n161r244
1142e787O27J0458M249q413q717N053R244j242q898m071O804P324l607r826N91
1157f211J0039K835p734o033M637Q978j078j0162l366R586P219n319r913l33J0095
$$ plain form
1058 -2896 -5788 1499 7820 3596 -3807 166 9479 7253 -4490 -8290 1499 10389 3387 -11962
1072 -11962 -12486 2813 10905 823 -11526 -7927 6212 11221 641 -8513 -1961 8361 6110
1085 6110 -3704 -5880 1710 6069 -543 -8889 -3751 6539 4990 -6279 -9037 1316 10886 5686
1099 5686 -7507 -7445 6030 12284 2483 -7938 -5356 5029 7098 -3110 -10249 -3734 4873 1535
1113 1535 -7346 -7159 2076 7779 457 -7060 -1359 9761 8306 -2873 -6450 1785 9851 4901 -7004
1128 -7004 -7598 2922 7164 -1083 -9175 -5721 4345 5549 -4597 -8949 555 8618 3457 -5787
1142 -5787 -5160 5298 9547 1134 -7583 -2530 6714 5472 -3426 -7497 -693 6631 3024 -6802 -6211
1157 -6211 3828 6663 -1071 -7104 -2467 6511 5433 -4729 -8095 1491 8710 3391 -6522 -6855 3240
1172C240N765p998r299L736R937M66q214l808O224N936m172p720J895Q424J098
1187E510p782n050N437R169j625j1313l101J0761Q266o280j1203M0J0942N122
1201H893q351q062L236P893N48n815l272M164N628l601o693K587Q654O42r516
1216c065n712Q039J0675m083j2766j998J1066O858n960r982r59R412O624n925
1230B224q050J749P651J335o174l523O066M408o567o547N656Q752k917j0002k832
1245h771Q494R151l035j1468k712R611Q375m393j1086k002J0150O182p797p234
1259f535M037O227k167o189P44O518J177o709l821O457P559j423r027m315Q081
1274F14R913l387j3087l300J0014Q101n784j0298N0Q474L428n830l531L592M109
$$ plain form
1172 3240 9005 1007 -8292 -4556 5381 5847 -2367 -6175 49 5985 1813 -5907 -4012 4412 5510
1187 5510 -2272 -7322 -1885 7284 5659 -5654 -8755 2006 10272 3992 -7211 -7171 3771 8893
1201 8893 542 -7520 -4284 3609 4157 -1658 -4930 -766 4862 1261 -5432 -2845 5809 6451 -3065
1216 -3065 -8777 -738 9937 5854 -6912 -8910 2156 9014 3054 -6928 -7887 1525 8149 2224
1230 2224 -5826 -4077 3574 4909 -1265 -4788 1278 5686 -881 -7428 -1772 6980 4063 -5939 -8771
1245 -8771 -277 8874 5839 -5629 -8341 1270 9645 5252 -5834 -7836 2314 8496 699 -6535
1259 -6535 -2498 3729 1562 -4627 -3883 2635 3812 -2897 -6718 -261 7298 5875 -3152 -7467 614
1274 614 10527 7140 -5947 -9247 767 8868 3084 -7214 -7164 1310 4738 -1092 -4623 -1031 3078
1289C078j435l282O13N612J622p182m946O073P909j927j1105n623Q768J0023m383
1304C815j1644j592R435O188l698o854K26P196K620m648k754K811L054k188m921
1319b954M62O449O62q236n611O883Q679j858j0002l792R003Q731l213r391j066
1334e254P209M881l168o724m05N424J375n415k319M039L434l412n060K364P943
1349D912J087q478l772O554P324j639q945l970O624O877l202q441j947N812N258
1364D054l403o520J915O638O23n235k52N675K744m251m968K472O419K16p456n133
1380f462L760O371j71q233m586P245P560l136p718M02P122L614l990m194K855
1395D39M605j096n472j060L428K906l069o404M79P893K037p792n191O059Q022
$$ plain form
1289 3078 1643 -1639 -1026 4586 6208 -974 -5920 153 8062 6135 -4970 -10593 -1825 8198 3815
1304 3815 -7829 -9421 14 6202 2504 -4350 -4124 3072 5692 1044 -1710 1101 4155 1967 -2954
1319 -2954 -2492 3957 4619 -3617 -9228 -2345 6334 4476 -5526 -9318 -315 8416 5203 -4188 -5254
1334 -5254 1955 6836 3668 -3056 -3461 1963 3338 -2077 -4396 -357 3077 -335 -5395 -3031 4912
1349 4912 5999 -2479 -6251 303 7627 5988 -2957 -6927 -303 6574 3372 -5069 -7016 -1204 4054
1364 4054 651 -5869 -3954 2684 3307 -1928 -2180 3495 6239 1988 -2980 -508 5911 6127 -1329 -6462
1380 -6462 -2702 3669 3498 -4735 -9321 -2076 5484 2348 -5370 -4968 2154 5768 1778 -2416 439
1395 439 5044 3948 -1524 -2584 844 3750 681 -5723 -5244 2649 4686 -3106 -8297 -2238 5784
1410E784j118p217k135O809M561l731n695P09L964K159m230n307K239N874q63
1425A803o778q02O476M604m056o233L247P303k24n750k661L412M450n35o306k838
1441d888M404M506l407o731J209O985K409o863l974O505N877k899n752jN377K757
1457E514l732n316N65N079J480m806m262K936O217j413p063P8P789K424n918l735
1473d163L761N790m92n715l544L730M670j616n807k569M791N004l116o361J504
1488d133P219Q75n218j282M640L152l097m584J312N049K64m629m251J291N690
1503B298J625o690n120N027P092j571o536n00N823L272l250l502K081L458q60
1518B647k968j471K133K874k426n334K74O537J989n876m980M023P161M35p032
$$ plain form
1410 5784 4666 -2551 -4686 2123 6684 2953 -2742 -2033 1931 4090 -140 -5447 -3208 2666 1803
1425 1803 -4975 -5777 699 5303 1247 -4986 -1739 5564 5340 -410 -3071 341 4791 4256 -2050 -4888
1441 -4888 -484 4022 615 -6116 -4907 2078 4487 -2376 -6350 155 6032 3133 -2619 -2620 2757 5514
1457 5514 1782 -3534 -2969 2110 3590 -1216 -5478 -2542 3675 2262 -4801 -4723 3066 5490 -428 -4163
1473 -4163 -402 5388 4896 -819 -4363 -633 4037 2421 -3386 -5955 -1164 3840 724 -5637 -4133
1488 -4133 3086 3961 -1257 -2539 2101 5253 2156 -2428 -1116 3933 4197 -432 -4683 -3392 2298
1503 2298 3923 -2767 -7887 -2860 4232 2661 -3875 -4375 1448 4720 1470 -2032 49 3507 2647
1518 2647 -321 -1792 341 3215 789 -4545 -4271 2266 4255 -1621 -6601 -2578 4583 5018 -2014
1533b014l059N394M645j459m982j370L036K985k138l933R98L648j59m279r06M901
1549A308L344m324n284K783O847Q75o210m124L014O105M95o552l848L523N253
1564C205p79m643j796M015K976k934k490K740L033k150l367M45M526J485m412
1579a46m580J854O468J180n968n067L118P078M07o313l126M421M438j297l661
1594a194r93L377J456k519k073K446K439k257l965MM878K782n117n103K481P112
1610C754J178n722m152K880N795O34n112k446K987L299j309l398k95L029O10l075
1626a343j590L412K524k603l979L86N063K817m305n014K167O189J032n126m336
1641d706K756N648l74m654j547K818K353j682k967O34L234K27l788r80L885K828
$$ plain form
1533 -2014 -5073 321 4966 3507 -1475 -2845 191 3176 1038 -2895 -1897 1751 1592 -2687 -3593 1308
1549 1308 4652 328 -4956 -2173 4674 5549 -661 -4785 -1771 4334 4829 -1723 -5571 -2048 3205
1564 3205 2426 -2217 -4013 2 2978 44 -2446 294 3327 1177 -2190 -1745 2781 4266 -146
1579 -146 -4726 -2872 3596 4776 -1192 -6259 -3141 3937 4344 -1969 -5095 -674 3764 2467 -1194
1594 -1194 -2187 1190 2646 127 -1946 500 2939 682 -3283 -3279 1599 4381 -736 -5839 -3358 3754
1610 3754 4932 -790 -4942 -2062 3733 4367 -745 -3191 -204 3095 1786 -1612 -1907 1122 1732 -1343
1626 -1343 -2933 479 3003 400 -3579 -3193 1870 4687 382 -4632 -2465 3724 4756 -370 -4706
1641 -4706 -1950 3698 3324 -1330 -2877 -59 2294 612 -2355 -1721 1513 1740 -2048 -3028 857 3685
1657C685k427m719L10N270K561m116n061J961N769O15m113l400K504M041j27m616
1673a863r17L147J880j979k806J332L045L9m173o71M115K770k551m611L22N251
1689B330J859l748m294K007M054O11l549k950K845L845r91m227o8L382J577k743
1705f0k367J562L654o40m411r80L710K990k454m343l9M918J916l586l106J618
1721a618M153N00l617k157K736L545j962l974J71L632R89k893k814J794L703o20
1737A568l511r96L327K517j235l722J56L831J582l165k660J435L215n7l633j692
1753c040K700K711j973l473O22L441J293k549k202J700L633J29l441j457K629
1768G23K507j775l383l73L699Q79l449k271K235K839n88l000p77L125K779k191
$$ plain form
1657 3685 1258 -3461 -3151 2119 4680 564 -4497 -2536 3233 3848 -265 -3665 -1161 2880 2753 -1863
1673 -1863 -2780 367 2247 268 -2538 -1206 1839 1878 -2295 -2966 1149 3919 1368 -3243 -2921 2330
1689 2330 4189 441 -3853 -1846 2208 2819 -730 -3680 -835 3010 2019 -2208 -2276 1106 2683 -60
1705 -60 -2427 -865 2789 2149 -2262 -3242 468 3458 1004 -3339 -3378 1540 3456 -130 -3236 -1618
1721 -1618 2535 3035 -582 -2739 -3 3542 1580 -2394 -2223 1409 2398 -495 -3309 -1515 2188 1568
1737 1568 -1943 -2939 388 2905 1670 -2052 -1896 1935 3517 352 -2308 -873 2342 2285 -1348 -3040
1753 -3040 -340 2371 398 -3075 -2453 988 2281 -268 -2470 -770 2863 2992 -449 -1906 723
1768 723 3230 1455 -1928 -2301 1398 2277 -1172 -3443 -1208 1631 1043 -1957 -2734 391 3170 979
1784I79l205N67L835J586l032l418J517L908o78l430j655K786K176j739k817J019
1800a601K884N19k127j815J894K910p14l514q19L699K112l005l260M77L790J260
1816B690l115k965J758L303J75k413j087J797K209j076k658L97L192j05l384j595
1832b877K970K343j593l865j14L789K253k629l082R30L790J467k497k994J397
1847g12L239j88k817j108J456J714k062k172J254K807r13k686m32K833K719j223
1863A709l455m96L647K706k531l442J09L066J911l485k795J565K327m58k202J57
1879a667J847O63j468j004J780K498r01k648j107K807K896j868m226m30L494K068
1895B734k279l295L36L226J047k167j449J131J734j75j134m72J820O95j404k337
$$ plain form
1784 979 -2226 -1659 2176 3762 730 -2688 -1171 2737 2059 -1371 -3026 -240 1936 197 -2620 -1601
1800 -1601 1283 1802 -325 -2140 -246 2664 1950 -1564 -2383 1316 3428 423 -2837 -2360 1430 2690
1816 2690 -425 -3390 -1632 1671 1846 -567 -1654 143 2352 1276 -1382 -985 2207 2102 -1282 -2877
1832 -2877 93 2436 843 -3022 -3136 653 2906 277 -2805 -1875 1915 3382 885 -2109 -712
1847 -712 2527 2339 -478 -1586 -130 1584 -478 -2650 -1396 1411 498 -2188 -2620 213 2932 1709
1863 1709 -1746 -2242 1405 4111 1580 -1862 -1753 1313 3224 -261 -3056 -1491 836 378 -1824 -1667
1879 -1667 180 843 -625 -1629 151 2649 1748 -900 -2007 800 3696 1828 -2398 -2828 666 2734
1895 2734 455 -2840 -2504 722 1769 -398 -1847 -716 1018 843 -291 -763 1057 1752 348 -1989
1911a989J624K533m61l525j284L097K488j282l774j9K845K346j761k262J52K498
1927A226R90j945j703J360J247q73j627OK110O41k573j508K353K812j140l249
1943a873l77K751K483j325k946j05J997J724j265k660k8K260O35k071j186J504
1959d82J587j119j765J084K402M4j994j624K032K480j115k406j010J654K132o71
1975A229l019p69K813J442j573k087Q30K341q9j965o0J900J274j688j775O02K261
1992A667l9j848j770J049K670k78k704j416K360K320j215k528K36K351P74j348
2008B81j409J040J647n36j894m19J602J376j525k148M53K142R35k183j321J509
2024d50K370o02k188q05K057J258p71k241J08K120L92j656j428J140J740K0k314
$$ plain form
1911 -1989 -365 2168 1707 -1818 -3102 -5 2483 1201 -2573 -2592 253 2599 838 -1424 -1272 1226
1927 1226 2216 271 -1432 -72 1175 302 -1325 -1319 791 1432 -1141 -2649 -296 2516 1376 -1873
1943 -1873 -2250 501 2984 1659 -1287 -1392 605 2329 1064 -1596 -1624 636 1271 -800 -1986 -482
1959 -482 1105 -14 -1779 -695 1707 1751 -243 -1867 165 2645 1530 -876 -1886 -232 1900 1229
1975 1229 -1790 -2559 254 1696 123 -1964 -1134 1207 1118 -847 -907 993 2267 579 -1196 -594 1667
1992 1667 1628 -220 -1990 -941 1729 1451 -1253 -2669 -309 2011 796 -1732 -1496 855 1629 281
2008 281 -1128 -88 1559 1023 -871 -1290 312 1688 163 -1985 -1532 610 1545 -638 -1959 -450
2024 -450 1920 1318 -870 -1675 382 1640 869 -1372 -1264 856 1248 -408 -1836 -696 1044 1064 -1250
2041a250k3J638J369j585j606O66K204N00k163j019J025J545L6k330p83J853J570
2058A647j413j991N38K358J81j700j113J118K347j075j787q5J374J168r93k067
2074a493M84J937O63k189j194J165J972n14k235l3K144Q78j537j142P56J589J78
2091A429j821r03R30J677n88j803p77J765J383q37k023L01K276j12j194j099J216
2108a80J305l38j745pJ420R01j198j271Q08J540N00k381j054J534J812m43k484
2125a281l07J823J057r69j644O29J305L85q38r34P40J054n01j588K03J634M01
2142A169j422j208R95J846k42k173j018J717J716o18j812j68J263J317q37j394
$$ plain form
2041 -1250 -1273 365 1734 149 -1457 -791 1413 1913 -250 -1269 -244 1301 1337 -993 -1776 77 1647
2058 1647 234 -1757 -1219 1139 1320 -380 -1493 -375 1972 897 -890 -975 399 1567 574 -1493
2074 -1493 -1009 928 1591 -598 -1792 -627 1345 831 -1404 -1437 707 1585 48 -1094 -338 1251 1429
2091 1429 -392 -1295 -365 1312 724 -1079 -1856 -91 1292 455 -1568 -1267 1009 897 -297 -1396 -180
2108 -180 1125 787 -958 -965 455 1356 158 -1113 -305 1235 1735 -646 -1700 -166 1646 1203 -1281
2125 -1281 -1588 235 1292 323 -1321 -692 613 998 160 -774 -34 1020 519 -1069 -866 768 1169
2142 1169 -253 -1461 -466 1380 1138 -1035 -2053 -336 1380 762 -1050 -1218 45 1362 525 -869
$$ [...]
8191A14
##END NTUPLES=NMR FID
##END=
