##TITLE=1H_CA-8562-1
 CDCl3, 8 sc, 
 10.4.2019
##JCAMPDX= 6.0         $$ Bruker NMR JCAMP-DX V2.0
##DATA TYPE= NMR FID
##DATA CLASS= NTUPLES
##ORIGIN= UXNMR, Bruker Analytische Messtechnik GmbH
##OWNER= root
$$ XWIN-NMR		Version 3.5
$$ Wed Apr 10 14:27:49 2019 Russian Standard Time (UT+4h)  she@DPX200
##.OBSERVE FREQUENCY= 200.1315
##.OBSERVE NUCLEUS= ^1H
##.DELAY= (6, 6)
##.ACQUISITION MODE= SIMULTANEOUS
##.ACQUISITION SCHEME= undefined
##.AVERAGES= 8
##.DIGITISER RES= 18
##SPECTROMETER/DATA SYSTEM= spect
##.PULSE SEQUENCE= zg30
##.SOLVENT NAME= CDCl3
##.SHIFT REFERENCE= (INTERNAL, CDCl3, 0, 15.7039)
##AUDIT TRAIL= $$ (NUMBER, WHEN, WHO, WHERE, WHAT)
$$ ##TITLE= Audit trail, XWIN-NMR		Version 3.5
$$ ##JCAMPDX= 5.01
$$ ##ORIGIN= Bruker BioSpin GmbH
$$ ##OWNER= she
$$ F:/spectra/data/she/nmr/H-F/1/audita.txt
$$ ##AUDIT TRAIL=  $$ (NUMBER, WHEN, WHO, WHERE, WHAT)
(   1,<2019-04-10 14:26:38.34 +0400>,<she>,<DPX200>,
      <created by zg, POWCHK disabled, PULCHK disabled
       configuration hash MD5:
       00 E9 B6 7A A2 85 ED C7 34 08 36 98 17 FE 4E 26
       data hash MD5: 16K
       11 87 61 25 B8 86 08 5F 5E 37 B7 59 30 CA 9F B3>)
$$ ##END=
$$ 
$$ hash MD5
$$ 0E 4F 83 C6 0B 99 96 E4 D5 6B 7A 32 71 E7 44 9D
##$RELAX= 
##$RELAX= 
##$RELAX= 
##$RELAX= 
##$RELAX= 
##$RELAX= 
$$ Bruker specific parameters
$$ --------------------------
##$DU= <F:/spectra>
##$EXPNO= 1
##$NAME= <H-F>
##$PROCNO= 1
##$TYPE= <nmr>
##$USER= <she>
##$AMP= (0..31)
100 100 100 100 100 100 100 100 100 100 100 100 100 100 100 100 100 100 
100 100 100 100 100 100 100 100 100 100 100 100 100 100 
##$AQSEQ= 0
##$AQ_mod= 1
##$AUNM= <au_zg>
##$AUTOPOS= <>
##$BF1= 200.13
##$BF2= 200.13
##$BF3= 200.13
##$BF4= 200.13
##$BF5= 200.13
##$BF6= 200.13
##$BF7= 200.13
##$BF8= 200.13
##$BYTORDA= 1
##$CFDGTYP= 0
##$CFRGTYP= 5
##$CHEMSTR= <none>
##$CNST= (0..31)
1 1 145 1 1 1 1 1 1 1 1 1 1 1 1 1 1 1 1 1 1 1 1 1 1 1 1 1 1 1 1 1 
##$CPDPRG= <>
##$CPDPRG1= <>
##$CPDPRG2= <>
##$CPDPRG3= <>
##$CPDPRG4= <mlev>
##$CPDPRG5= <mlev>
##$CPDPRG6= <mlev>
##$CPDPRG7= <mlev>
##$CPDPRG8= <mlev>
##$CPDPRGB= <>
##$CPDPRGT= <>
##$D= (0..31)
0 1.2 0 0 0 0 0 0 0 0 0 0.03 0 0 0 0 0 0 0 0 0 0 0 0 0 0 0 0 0 0 0 0 
##$DATE= 1554891997
##$DBL= (0..7)
120 120 120 120 120 120 120 120 
##$DBP= (0..7)
150 150 150 150 150 150 150 150 
##$DBP07= 0
##$DBPNAM0= <>
##$DBPNAM1= <>
##$DBPNAM2= <>
##$DBPNAM3= <>
##$DBPNAM4= <>
##$DBPNAM5= <>
##$DBPNAM6= <>
##$DBPNAM7= <>
##$DBPOAL= (0..7)
0.5 0.5 0.5 0.5 0.5 0.5 0.5 0.5 
##$DBPOFFS= (0..7)
0 0 0 0 0 0 0 0 
##$DE= 6
##$DECBNUC= <off>
##$DECIM= 24
##$DECNUC= <off>
##$DECSTAT= 4
##$DIGMOD= 1
##$DIGTYP= 9
##$DL= (0..7)
0 120 120 120 120 120 120 120 
##$DP= (0..7)
150 150 150 150 150 150 150 150 
##$DP07= 0
##$DPNAME0= <>
##$DPNAME1= <>
##$DPNAME2= <>
##$DPNAME3= <>
##$DPNAME4= <>
##$DPNAME5= <>
##$DPNAME6= <>
##$DPNAME7= <>
##$DPOAL= (0..7)
0.5 0.5 0.5 0.5 0.5 0.5 0.5 0.5 
##$DPOFFS= (0..7)
0 0 0 0 0 0 0 0 
##$DQDMODE= 0
##$DR= 18
##$DS= 0
##$DSLIST= <SSSSSSSSSSSSSSS>
##$DSPFIRM= 0
$$ [...]
##$SUBNAM2= <"">
##$SUBNAM3= <"">
##$SUBNAM4= <"">
##$SUBNAM5= <"">
##$SUBNAM6= <"">
##$SUBNAM7= <"">
##$SUBNAM8= <"">
##$SUBNAM9= <"">
##$SW= 24.9337058887773
##$SWIBOX= (0..15)
0 0 2 0 0 0 0 0 0 0 0 0 0 0 0 0 
##$SW_h= 4990.01996007984
##$TD= 16384
##$TD0= 1
##$TE= 0
##$TE2= 300
##$TE3= 300
##$TEG= 300
##$TL= (0..7)
0 120 120 120 120 120 120 120 
##$TP= (0..7)
150 150 150 150 150 150 150 150 
##$TP07= 0
##$TPNAME0= <>
##$TPNAME1= <>
##$TPNAME2= <>
##$TPNAME3= <>
##$TPNAME4= <>
##$TPNAME5= <>
##$TPNAME6= <>
##$TPNAME7= <>
##$TPOAL= (0..7)
0.5 0.5 0.5 0.5 0.5 0.5 0.5 0.5 
##$TPOFFS= (0..7)
0 0 0 0 0 0 0 0 
##$TUNHIN= 0
##$TUNHOUT= 0
##$TUNXOUT= 0
##$USERA1= <user>
##$USERA2= <user>
##$USERA3= <user>
##$USERA4= <user>
##$USERA5= <user>
##$V9= 5
##$VALIST= <valist>
##$VCLIST= <CCCCCCCCCCCCCCC>
##$VD= 0
##$VDLIST= <DDDDDDDDDDDDDDD>
##$VPLIST= <PPPPPPPPPPPPPPP>
##$VTLIST= <TTTTTTTTTTTTTTT>
##$WBST= 1024
##$WBSW= 4
##$XGAIN= (0..3)
0 0 0 0 
##$XL= 0
##$YL= 0
##$YMAX_a= 204829
##$YMIN_a= -299307
##$ZGOPTNS= <>
##$ZL1= 120
##$ZL2= 120
##$ZL3= 120
##$ZL4= 120
##$ABSF1= 10
##$ABSF2= 0
##$ABSG= 5
##$ABSL= 3
##$ALPHA= 0
##$AQORDER= 0
##$ASSFAC= 0
##$ASSFACI= 0
##$ASSFACX= 0
##$ASSWID= 0
##$AUNMP= <proc_1d>
##$AZFE= 0.1
##$AZFW= 0.1
##$BCFW= 1
##$BC_mod= 2
##$BYTORDP= 1
##$COROFFS= 0
##$CY= 11.3945322036743
##$DATMOD= 1
##$DC= 2
##$DFILT= <>
##$DTYPP= 0
##$F1P= 18.9103706918063
##$F2P= -1.10871071338519
##$FCOR= 0.5
##$FTSIZE= 0
##$FT_mod= 4
##$GAMMA= 1
##$GB= 0.15
##$INTBC= 1
##$INTSCL= 1
##$ISEN= 128
##$LB= 0.24
##$LEV0= 0
##$LPBIN= 0
##$MAXI= 10000
##$MC2= 0
##$MEAN= 0
##$ME_mod= 0
##$MI= 1.114404
##$NCOEF= 0
##$NC_proc= 0
##$NLEV= 6
##$NOISF1= 3.799351
##$NOISF2= 2.8
##$NSP= 1
##$NTH_PI= 0
##$NZP= 0
##$OFFSET= 15.70392
##$PC= 1
##$PHC0= -8857.749
##$PHC1= 21.20026
##$PH_mod= 1
##$PKNL= yes
##$PPARMOD= 0
##$PSCAL= 0
##$PSIGN= 0
##$REVERSE= no
##$SF= 200.130013532006
##$SI= 16384
##$SIGF1= 3
##$SIGF2= 2
##$SINO= 400
##$SIOLD= 16384
##$SREGLST= <1H.CDCl3>
##$SSB= 0
##$STSI= 0
##$STSR= 0
##$SW_p= 3612.71676300578
##$SYMM= 0
##$S_DEV= 0
##$TDeff= 0
##$TDoff= 0
##$TI= <>
##$TILT= no
##$TM1= 0
##$TM2= 0
##$TOPLEV= 0
##$USERP1= <user>
##$USERP2= <user>
##$USERP3= <user>
##$USERP4= <user>
##$USERP5= <user>
##$WDW= 1
##$XDIM= 8192
##$YMAX_p= 0
##$YMIN_p= 0
$$ End of Bruker specific parameters
$$ ---------------------------------
##NTUPLES= NMR FID
##VAR_NAME=  TIME,          FID/REAL,        FID/IMAG
##SYMBOL=    X,             R,               I
##VAR_TYPE=  INDEPENDENT,   DEPENDENT,       DEPENDENT
##VAR_FORM=  AFFN,          ASDF,            ASDF
##VAR_DIM=   8192,          8192,            8192
##UNITS=     SECONDS,       ARBITRARY UNITS, ARBITRARY UNITS
##FACTOR=    0.0002004,     1,               1
##FIRST=     0,             0,               0
##LAST=      1.6414764,     0,               0
##MIN=       0,             -299307,         0
##MAX=       1.6414764,     204829,          0
$$ Real data points
##PAGE= N=1
##DATA TABLE= (X++(R..R)), XYDATA
$$ [...]
$$ plain form
1991 604 297 -856 242 731 95 -81 301 -523 -17 665 104 18 -296 53 -297 311 984 275 -846
2010 -846 374 918 640 62 -167 -520 -187 1005 289 -816 -387 447 282 80 291 -408 64 639 225
2029 225 -609 -58 -150 -255 5 289 -243 -500 -158 64 187 654 122 -847 71 405 226 -232 131 -55
2049 -55 -526 232 140 -814 -399 177 15 -209 -238 -377 -545 234 -186 -619 -429 273 -182 -422 96 -361 -686
2070 -686 -96 44 55 182 182 -403 -433 379 335 -407 -361 198 31 265 455 -460 -506 203 197 -175 -231 220 -434
2093 -434 -157 -165 -34 -421 228 -189 -492 50 462 -197 -313 574 -156 172 342 28 -572 -156 573 -188 -137
2114 -137 135 -70 -182 771 -228 -212 102 371 -271 -230 444 -48 -67 270 61 -214 -22 137 -516 -430 209
2135 209 196 -398 -287 221 -172 429 244 -375 -143 385 -26 -238 139 141 -181 184 287 -467 -77 385 187
$$ packed form
1991F04l07j153J098M89o36j76L82q24N06O82n61q6l14L49l50O08O73p09j121
2010h46J220N44k78n78k29l53L33J192p16j105M29Q34j65k02K11o99M72N75m14
2029B25q34N51r2j05K60K84n32k57L42K22J23M67n32r69R18L34j79m58L63j86
2049e5m71P58r2r54M15N76j62k24k9j39j68P79m20m33J90P02m55k40N18m57l25
2070f86N90J40J1J27%n85l0Q12m4p42M6N59j67K34J90r15m6P09ol72n6M51o54
2093d34K77qJ31l87O49m17l03N42M12o59j16Q87p30L28J70l14o00M16P29p61N1
2114a37K72k05j12R53r99J6L14K69o42M1O74m92j9L37k09k75J92J59o53Q6O39
2135B09j3n94J11N08l93O01j85o19K32N28m11k12L77Kl22L65J03p54L90M62j98
$$ plain form
2156 187 -574 -87 290 -439 -82 157 -23 -416 151 -344 -464 320 323 -686 -187 145 -82 -96 301 -607 -394
2177 -394 222 227 -508 -129 -60 -241 -214 -234 39 -370 -31 95 -187 -311 257 -427 -467 245 48 -36 99 -346
2199 -346 -827 124 626 -278 -734 -82 250 -73 20 -236 -286 213 610 38 -305 -137 -60 -19 -29 -181 -319 20
2221 20 313 -205 -193 356 -114 -486 224 557 437 -456 50 -338 107 616 -316 -742 -265 635 595 131 -308
2242 -308 -239 -367 696 239 -363 -170 -118 -114 266 271 122 -5 -138 130 65 212 153 -548 111 367 31 -287
2264 -287 -75 -13 346 587 213 -751 -108 514 787 -454 -581 -99 -149 603 247 -260 76 163 -153 -41 704
2285 704 -11 -581 -248 698 51 -182 -92 -205 -148 677 98 -500 -281 -163 110 343 307 -932 -527 478
2305 478 753 -183 -220 -19 56 146 457 -154 -849 -124 177 22 205 77 -564 -632 373 5 -270 -281 -351 -284
$$ packed form
2156A87p61M87L77p29L57K39j80l93N67m95j20P84Lj009M99L32k27j4L97r08K13
2177c94O16Np35L79O9j81K7k0K73m09L39J26k82j24N68o84m0P12j97q4J35m45
2199c46m81R51N02r04m56O52L32l23R3k56n0M99L97n72l43J68P7M1j0j52j38L39
2221B0K93n18J2N49m70l72P10L33j20q93N06l88M45N09r32m26M77R00m0m64m39
2242c08O9j28J063m57o02J93N2ML80Nj49j27j33K68o5J47n9p01O59K56l36l18
2264b87K12O2L59K41l74r64O43O22K73j241j27M82n0P52l56n07L36Q7l16J12P45
2285G04p15n70L33R46o47k33R0j13N7Q25n79n98K19J18K73K33l6j239M05J005
2305D78K75r36l7K01P5R0L11o11o95P25L01j55J83j28o41o8J005l68k75j1p0O7
$$ plain form
2327 -284 333 910 -402 -756 184 441 217 36 -395 -307 653 428 -151 -224 -43 -69 45 490 155 -887
2347 -887 -254 334 166 -35 -62 -269 -355 282 394 -171 -360 -6 250 391 441 -626 -445 194 523 41 -58
2368 -58 -59 -237 220 607 440 -492 -154 340 400 462 501 -160 -373 564 -52 46 204 147 -89 248 539 83 -331
2391 -331 26 302 404 400 -185 -373 -111 604 154 -96 110 -250 27 581 171 -489 -192 211 543 -99 263
2412 263 -50 -46 263 247 -144 312 315 -111 13 370 342 -301 -38 326 -80 -13 181 -339 -355 226 490 -341 -493
2435 -493 18 -208 587 124 -303 -116 99 373 -103 292 -11 -182 -62 159 -233 -172 429 240 -270 152
2455 152 328 -188 -390 309 340 -35 90 -424 -210 321 714 -371 -364 398 204 -150 157 325 -403 219 473
2476 473 -262 -361 -121 281 -229 155 525 51 428 104 -218 180 418 -36 -387 207 97 256 295 306 -160
$$ packed form
2327b84O17N77j312l54R40K57k24j81m31Q8R60k25n79p3J81k6J14M45l35j042
2347h87O33N88j68k01k7k07q6O37J12n65j89L54K56J41N0j067J81O39L29m82r9
2368e8jj78M57L87j67r32L38M94O0O2L9o61k13R37o16R8J58n7k36L37K91m56m14
2391c31L57K76J02mn85j88K62P15m50k50K06l60K77N54m10o60K97M03L32o42L62
2412B63l13ML09j6l91M56Lm26J24L57k8o43K63L64m06O7J94n20j6N81K64q31j52
2435d93N11k26P95m63m27J87K15K74m76L95l03j71J20K21l92O1O01j89n10M22
2455A52J76n16k02O99L1l75J25n14K14N31L93j085PP62j94l54L07J68p28O22K54
2476D73p35r9K40M02n10L84L70m74L77l24l22L98K38m54l51N94j10J59L9J1m66
$$ plain form
2497 -160 -47 446 365 -309 523 502 -166 103 85 208 94 446 48 -234 737 384 -390 -242 281 -19 132
2518 132 467 -279 9 206 329 -7 -131 69 120 270 694 -8 -210 420 487 -395 158 706 74 -478 262
2539 262 234 -9 160 264 237 464 413 -287 -53 194 232 106 240 -76 -577 44 579 -439 -380 101 -31
2560 -31 -4 -37 240 -110 -119 -103 -167 118 238 -377 -184 192 142 -371 60 249 -320 -248 528 -223 -469 222 521
2583 521 -99 -357 -295 -148 158 478 -359 -411 59 366 169 -10 -166 -38 -57 477 210 -199 -59 -61 -216 30
2605 30 286 -226 -411 288 155 64 190 102 -243 -241 712 189 -224 274 346 -9 496 372 -615 -75 906 598
2627 598 -299 201 -107 -59 752 442 -591 -98 280 -43 -179 584 50 -760 91 308 -107 21 16 -191 10
2648 10 726 268 -324 -195 -28 76 182 410 -473 -408 489 54 -214 -145 90 18 166 450 -320 -626 -56
$$ packed form
2497a60J13M93q1o74Q32k1o68K69j8J23j14L52l98k82R71l53p74J48N23l00J51
2518A32L35p46K88J97J23l36j24K00N1J50M24p02k02O30O7q82N53N48o32n52P40
2539B62k8k43J69J04k7K27n1p00K34K47L8j26J34l16n01O21N35j018N9M81j32
2560c1K7l3K77l50rJ6o4K85J20o15J93L76n0n13M31J89n69P2P76p51k46O91K99
2583E21o20k58O2J47L06L20q37n2M70L07j97j79j56J28j9N34k67m09J40kj55K46
2605C0K56n12j85O99j33r1J26q8l45KR53n23m13M98P2l55N05j24r87N40R81l08
2627E98q97N00l08M8Q11l10j033M93L78l23j36P63n34q10Q51K17m15J28nk07K01
2648A0P16m58n92J29J67J04J06K28q83O5Q97m35k68O9K35p2J48K84p70l06N70
$$ plain form
2669 -56 9 -182 302 175 -611 164 586 211 -259 -296 54 -338 655 159 -649 -693 75 169 103 -97 -136 -349
2691 -349 194 652 -131 -459 62 -28 -85 25 -180 -523 -110 79 -295 142 276 -521 -396 159 -6 -376 -417
2712 -417 63 -141 143 349 -493 -716 -15 402 54 -170 -378 -444 296 238 -649 -593 -176 -292 -111 -157 338
2733 338 -379 -299 -177 167 -316 -55 -94 -691 193 306 -258 -501 19 136 137 230 -43 -535 -37 444 193 -501
2755 -501 -95 -563 127 247 -102 -348 -220 165 29 -74 -6 -98 -210 44 81 -264 -164 -281 -550 189 570
2776 570 81 -308 -312 201 122 -297 -72 -287 -144 407 -197 -194 -209 -198 28 -215 44 -242 -83 168 85 -423 96
2799 96 251 -332 -60 121 27 -173 227 -271 -350 355 1 -509 -296 132 -374 -411 -22 -134 -516 83 0 -743
2821 -743 -16 -87 -421 -63 -32 79 -197 -105 272 -224 -34 -1 -412 -387 26 -211 -590 -70 -107 -404 -141 -302
$$ packed form
2669e6O5j91M84j27p86P75M22l75m70l7L50l92R93m96q08m4P68R4o6k00l9k13
2691c49N43M58p83l28N21r0n7J10k05l43M13J89l74M37J34p97J25N55j65l70m1
2712d17M80k04K84K06q42k23P01M17l48k24k08o6P40n8q87N6M17j16J81m6M95
2733C38p17Q0J22L44m83K61l9n97Q84J13n64k43N20J17JR3k73m92M98M81k51o94
2755e01M06m68O90J20l49k46J28L85j36j03O8r2j12K54L7l45J00j17k69P39L81
2776E70m89l89mN13p9m19K25k15J43N51o04Lj5J1K26k43K59k86J59K51q3n08N19
2799I6J55n83K72J81r4k00M00m98p9P05l54n10K13M28n06l7L89j12l82N99q3p43
2821g43P27p1l34L58L1J11k76R2L77m96J90L3m11K5M13k37l79N20l7k97K63j61
$$ plain form
2843 -302 21 -389 256 -54 -435 -345 -382 -306 80 -94 -182 -290 -194 119 -357 -132 85 -188 21 -309 -503 -144
2865 -144 350 152 -541 -103 -74 -159 -350 84 -244 -96 168 146 -402 83 333 85 68 -186 -161 -98 84 -160
2887 -160 -371 90 258 -149 -306 73 -130 -227 268 -20 -170 58 215 -567 -138 278 98 -286 171 -321
2907 -321 -125 176 85 -451 -319 -181 -178 -60 -82 122 -109 -223 -47 -69 -204 -37 -135 -23 37 22 -432 -501 -298
2930 -298 -352 -107 -72 -553 -586 50 162 -247 -10 165 -90 -99 28 -208 -689 337 3 -429 -218 325 -243
2951 -243 -443 86 -86 -199 222 33 -186 69 -147 -388 -454 -118 202 -159 -125 -230 -514 -3 304 -349 -571
2972 -571 -203 -195 -409 -206 -91 -849 -55 245 -196 -442 -99 -40 -235 -180 -209 -416 -224 107 -493 -365 348 -36
2994 -36 -590 106 186 -111 -40 222 -299 31 431 -31 -394 36 390 -529 392 -274 -510 -75 358 99 -540
$$ packed form
2843c02L23m10O45l10l81R0l7P6L86j74q8j08R6L13m76K25K17k73K09l30j94L59
2865a44M94j98o93M38K9q5j91M34l28J48K64k2n48M85K50k48j7k54K5O3J82k44
2887a60k11M61J68m07j57L79k03r7M95k88j50K28J57p82M29M16j80l84M57m92
2907c21J96L01r1n36J32J38LJ18k2K04k31j14J76k2j35J67r8J12O0j5m54o9K03
2930b98n4K45L5m81l3O36J12m09K37J75k55rJ27k36m81J026l34m32K11N43n68
2951b43k00N29j72j13M21j89k19K55k16k41o6L36L20l61L4j05k84N11L07o53k22
2972e71L68Qk14K03J15p58P94L00m41k46L43N9j95N5k9k07J92L31o00J28P13l84
2994c6n54O96Q0k97P1K62n21L30M00m62l63M30L54r19R21o66k36M35M33k59o39
$$ plain form
3015 -540 7 169 -230 76 103 112 -94 -76 -91 -392 182 166 -181 131 557 238 -305 -299 81 253 278 -120 -636
3038 -636 2 172 -104 159 -13 -371 -16 -23 345 -241 -218 6 -249 -155 75 -113 -570 87 39 -182 -122 235
3060 235 -452 93 273 274 -298 -127 88 -133 44 75 -135 -314 208 230 -193 -305 -303 -270 -18 -79 -108 -386 98
3083 98 -140 -346 -184 182 -592 -363 74 304 -235 26 184 -407 -38 -147 -399 -441 128 -52 125 -125 -14
3104 -14 -282 86 384 -278 -424 189 4 -187 261 87 -303 -52 81 -148 -374 289 -297 -32 194 184 -207
3125 -207 6 121 291 7 -111 -111 -111 -24 217 242 179 177 87 20 270 -111 -112 62 100 -46 174 -164 41 110 194
3150 194 -75 -460 263 -93 -362 36 369 -156 -289 121 -164 -286 1 58 -132 222 171 280 -211 -182 -409
3171 -409 124 188 69 -164 -11 220 -123 -26 100 -553 -431 2 499 -78 -100 -133 -230 -140 201 -117 101 -47
$$ packed form
3015e40N47J62l99L06K7Rk06J8j5l01N74j6l47L12M26l19n43OL80J72K5l98n16
3038f36O38J70k76K63j72l58L55pL68n86K3K24k55R4K30j88m57O57m8k21O0L57
3060B35o87N45J80Jn72J71K15k21J77L1k10j79N22K2m23j12KL3K52o1k9k78M84
3083I8k38k06J62L66p74K29M37K30n39K61J58n91L69j09k52m2N69j80J77k50J11
3104a4k68L68K98o62j46O13j85j91M48j74l90K51J33k29k26O63n86K65K26j0l91
3125b07K13J15J70k84j18%%Q7K41K5o3kr0o7K50l81jJ74L8j46K20l38K05O9Q4
3150A94k69l85P23l56k69L98L33n25j33M10k85j22K87N7j90L54n1J09m91K9k27
3171d09N33O4j19k33J53K31l43R7J26o53J22M33M97n77k2l3r7R0L41l18K18j48
$$ plain form
3193 -47 103 -70 261 414 -126 104 229 187 -234 83 197 -135 -52 -212 -292 -269 313 174 -203 63 169 -85
3215 -85 31 74 -265 -204 275 209 -395 104 344 -156 -118 -145 -15 -33 333 -158 -223 294 192 -83 152 -48 -206
3238 -206 123 241 -171 -85 35 280 -119 48 140 379 85 302 -11 -354 335 -74 -296 -62 593 16 -174
3259 -174 262 217 -38 231 -5 73 270 330 131 -101 26 18 -83 -87 -15 35 223 359 30 -317 371 83 189
3282 189 -57 70 65 2 136 -207 -34 467 168 -283 -48 335 218 -6 128 34 -265 413 431 -17 -96 -18
3304 -18 282 -109 217 -20 -44 192 16 85 46 333 -66 -29 33 115 28 -160 -73 47 -100 368 -178 -314 -200
3327 -200 0 44 -17 -53 -370 78 99 130 -365 82 307 204 -123 20 -192 -174 -12 342 -125 -109 -206 -277 -81
3350 -81 305 69 -108 12 -261 143 143 -243 -407 -179 183 -106 -86 -66 178 -78 59 -306 198 167 180 -449
$$ packed form
3193d7J50j73L31J53n40K30J25m2m21L17J14l32Q3j60q0K3N82j39l77K66J06k54
3215h5J16M3l39O1M79o6o04M99K40n00L8k7J30j8L66m91o5N17j02k75K35k00j58
3238b06L29J18m12Q6J20K45l99J67R2K39k94K17l13l43O89m09k22K34O55n77j90
3259a74M36m5k55K69k36P8J97O0j99k32J27qj01mP2N0J88J36l29l47O88k88J06
3282A89k46J27no3J34l43J73N01k99m51K35L83j17k24J34r4k99O78J8m48p9P8
3304a8L00l91L26k37k4K36j76O9l9K87l99L7O2Q2q7j88Q7J20j47M68n46j36J14
3327b00K00M4o1l6l17M48K1L1m95M47K25j03l27J43k12J8J62L54m67J6r7p1J96
3350h1L86k36j77J20k73M04%l86j64K28L62k89K0K0K44k56J37l65N04l1J3o29
$$ plain form
3372 -449 -84 440 -45 -532 343 281 -15 136 -211 -42 250 387 -207 -172 -96 110 23 308 84 -343 14
3393 14 376 30 -41 233 494 69 -132 48 -273 6 9 -83 -74 191 -33 -173 50 36 137 30 -62 -160 139
3416 139 274 205 -271 -164 112 16 20 33 -218 -249 264 11 -294 -191 -99 112 -11 380 -127 38 103 155 210
3439 210 106 -173 -351 -3 126 26 -3 -178 -101 -285 160 306 -187 -216 116 -30 132 -109 -23 -119 69 10
3461 10 40 -94 65 -35 133 30 50 0 285 148 -13 42 -109 -162 -173 135 -45 -11 -38 -106 -87 90 -117 -173
3485 -173 -372 70 457 -8 -242 157 -169 -40 -126 129 -341 52 -377 -157 138 -59 -268 -7 394 -155
3505 -155 -254 -161 464 -134 12 193 101 -152 -178 -75 113 330 -35 -280 -80 264 95 -40 -57 -94 -213 201
3527 201 4 -380 -18 -54 -175 9 -75 248 105 187 -108 71 42 -193 -144 190 161 181 -78 -97 201 100 98
$$ packed form
3372d49L65N24m85m87Q75o2k96J51l47J69K92J37n94L5P6K06q7K85k24m27L57
3393A4L62l46p1K74K61m25k01J80l21K79Lr2RK65k24j40K23j4J01j07r2r8K99
3416A39J35o9m76J07K76r6MJ3k51l1N13k53l05J03R2K11j23L91n07J65O5N2N5
3439B10j04k79j78L48J29j00k9j75P7j84M45J46m93k9L32j46J62k41Q6r6J88n9
3461A0L0j34J59j00J68j03K0n0K85j37j61N5j51n3j1L08j80L4k7o8J9J77k07n6
3485a73j99M42L87m65k34L99l26J29q6K55m70L93m29K20K95j97k09K61M01n49
3505a55r9R3O25n98J46J81r2k53k6J03J88K17l65k45K00L44j69j35j7l7j19M14
3527B01j97l84L62l6j21J84q4L23j43Q2k95J79k9k35M9L34k9K0k59j9K98j01k
$$ plain form
3550 98 125 -73 106 12 -133 -73 15 134 -5 226 -385 -262 152 26 -175 -307 12 101 -47 -190 23 111
3572 111 -87 124 45 -52 114 21 -5 -2 18 -31 -2 212 -30 -137 91 -257 -459 46 290 -126 55 -32 -207
3595 -207 -89 256 146 -5 -329 272 -46 124 93 -105 157 -239 43 -45 -97 355 -183 -238 -23 173 -28
3616 -28 33 26 -22 9 393 -192 -117 211 -42 -70 -43 209 -162 217 68 -281 -76 -14 -108 -349 -180 8 99 -77
3640 -77 309 173 -349 300 -169 -325 109 -115 47 40 -107 -295 51 33 -90 -70 21 176 -157 -24 63 103 -111
3663 -111 152 -327 -58 310 -193 122 -48 -89 18 -123 -141 110 -115 -13 -355 -47 185 158 -29 6 -140
3684 -140 182 -107 -51 120 -13 402 221 -35 -268 17 30 -269 -37 -91 -89 184 51 77 -82 276 349 -252
3706 -252 -100 168 53 111 -192 -67 57 191 -198 -218 -38 -170 151 -6 -69 -197 -116 -138 36 -306 -24 139
$$ packed form
3550I8K7j98J79r4j45O0Q8J19j39K31o11J23M14j26k01j32L19Q9j48j43K13Q8
3572A11j98K11p9r7J66r3k6LK0m9K9K14k42j07K28l48k02N05K44m16J81q7j75
3595b07J18L45j10j51l24O01l18J70l1j98K62l96K82q8n2M52n38n5K15J96k01
3616b8O1pm8L1L84n85P5L28k53k8K7K52l71L79j49l49K05O2r4k41J69J88R1j76
3640g7L86j36n22O49m69j56M34k24J62pj47j88L46j8j23K0R1J55l33J33Q7M0k14
3663a11K63m79K69L68n03L15j70m1J07j41j8K51k25J02l42L08K32k7j87L5j46
3684a40L22k89N6J71j33M15j81k56k33K85J3k99K32n4KK73j33K6j59L58P3o01
3706b52J52K68j15N8l03J25J24J34l89k0J80j32L21j57o3j28Q1k2J74l42K82J63
$$ plain form
3728 139 55 -174 69 -24 -81 -36 -54 -68 -64 -74 -49 56 -198 334 206 245 46 78 229 77 -205 -102 268 61
3752 61 -21 237 124 68 84 161 -195 -6 256 -83 205 11 240 146 -11 98 -39 82 24 -66 -247 -205 274
3775 274 -142 -88 -81 143 56 -7 77 -179 88 129 207 323 -59 -22 7 10 -301 13 143 296 -71 58 326 -152
3799 -152 -183 -45 -314 128 168 -53 40 214 106 -79 -178 -108 53 161 -108 56 18 75 42 153 -179 348 35
3822 35 -243 -172 289 204 -129 168 -265 -150 12 -4 -55 45 -72 -39 50 -202 -172 26 201 39 -103 -169 385
3845 385 229 295 245 -132 -151 222 -55 230 188 67 45 78 199 -40 36 -142 263 -126 10 78 -154 -443 -250
3868 -250 -78 0 -347 -96 -245 95 151 -266 -31 143 179 222 121 -8 26 257 6 -374 -51 293 -18 -7
3890 -7 33 26 273 100 1 -146 108 231 -121 -207 -37 168 318 405 94 -308 34 514 40 -142 76 -136 -377
$$ packed form
3728A39q4k29K43r3n7M5j8j4Mj0K5J05k54N32j28L9j99L2J51j52k82J03L70k07
3752F1q2K58j13n6J6P7l56J89K62l39K88j94K29r4j57J09j37J21n8r0j81M2M79
3775B74m16N4PK24q7o3Q4k56K67M1P8J16l82L7K9Ll11L14J30J53l67J29K68m78
3799a52l1J38k69M42M0k21R3J74j08j85r9P0J61J08k69J64l8N7l3J11l32N27l13
3822C5k78P1M61q5l33K97m33J15J62j6n1J00j17L3Q9k52L0J98J75j62j42o6N54
3845C85j56O6n0l77j9L73k77K85m2j21k2L3J21k39P6j78M05l89J36O8k32k89J93
3868b50J72P8l47K51j49L40N6m17K35J74L6M3j01j29L4K31k51l80L23L44l11J1
3890gM0pK47j73r9j47K54J23l52q6J70K05J50Q7l11m02L42M80m74j82K18k12k41
$$ plain form
3913 -377 82 176 -388 152 243 47 -110 298 -106 -149 67 306 -278 81 -91 -242 -55 28 123 -34 84 64
3935 64 127 82 -235 -60 108 72 -15 -176 237 -71 -20 -72 26 135 265 261 33 -24 77 37 214 124 -67 -24 -42
3960 -42 37 231 -9 294 88 -155 -19 221 -20 -134 71 47 -75 85 -181 147 113 63 124 -177 125 -46
3982 -46 -112 -125 197 -212 -46 172 -46 -167 -119 156 126 -144 107 20 134 173 -140 -88 166 193 167 -19 109
4005 109 377 20 109 -249 -203 273 74 14 44 294 -319 -56 204 -190 -45 182 -97 -135 -36 352 -162 48
4027 48 66 -19 -175 -2 334 -171 -20 431 -158 57 -74 55 144 236 53 -288 91 395 378 -162 -91 -152 41
4050 41 61 480 -12 146 308 -50 -296 -69 52 -56 111 174 71 -59 -181 -310 47 -39 -1 174 202 491
4072 491 -230 10 135 312 -113 194 237 65 -49 -231 -61 111 164 95 117 76 -107 -73 264 63 258 -76
$$ packed form
3913c77M59R4n64N40R1j96j57M08m04m3K16K39n84L59j72j51J87Q3R5j57J18k0
3935F4O3m5l17J75J68l6q7j61M13l08N1n2R8J09J30mk28n7J01m0J77r0j91M3j8
3960d2P9J94k40L03k06k43J36K40k41j14K05k4j22J60k66L28l4n0O1l01L02j71
3982d6o6j3L22m09J66K18k18j21M8K75l0k70K51q7J14L9l13N2K54K7k6j86J28
4005A09K68l57Q9l58M6M76j99o0L0K50o13K63K60l94J45K27k79l8R9L88n14K10
4027D8J8q5j56J73L36n05J51M51n89K15j31J29Q9R2j83l41L79L04j7n40P1o1J93
4050D1K0M19m92J58J62l58k46K27J21j08J67O3j03j30j22j29L57q6L8J75K8K89
4072D91p21K40J25J77m25L07M3j72j14j82J70J72N3o9K2m1j83L4L37k01J95l34
$$ plain form
4094 -76 195 -58 -187 144 146 -122 322 82 -8 48 -84 117 -258 166 -411 -232 89 -27 -117 -201 316 -43
4116 -43 -225 148 9 106 78 7 -153 13 411 192 112 338 -175 59 112 -30 150 -49 355 -208 -254 -66
4138 -66 -85 7 444 -149 179 -31 7 205 112 166 454 -180 -80 298 -55 -245 -187 18 -31 -151 -491 -213 16
4161 16 -9 -92 34 86 -108 144 -17 -14 -211 -121 329 31 -19 -224 -17 169 298 -196 82 -200 43 -178 311
4184 311 -43 92 -22 -101 353 1 276 -206 -14 -138 36 -163 -18 170 23 -99 75 23 -84 25 112
4205 112 214 46 215 -41 -209 -235 63 -260 64 109 87 -192 -190 -138 4 70 -199 247 -145 100 -415 14
4227 14 98 -45 -149 57 -10 39 85 121 24 11 -109 170 107 -74 -159 260 -23 72 35 -343 29 100 -128 -206 115
4252 115 94 -162 -133 -58 -95 334 137 -92 -176 -111 -259 135 27 -239 20 1 15 -10 145 155 -73 319 0
$$ packed form
4094g6K71k53j29L31Kk68M44k40r0N6j32K01l75M24n77J79L21j16r0q4N17l59
4116d3j82L73j39R7k8p1j60J66L98k19q0K26n13K34N3j42J80j99M04n63m6J88
4138f6j9R2M37n93L28k10L8J98r3N4K88o34J00L78l53j90N8K05m9j20l40K78K29
4161A6k5q3J26N2j94K52j61Lj97R0M50k98n0k05K07J86J29m94K78k82K43k21M89
4184C11l54J35j14p9M54l52K75m82J92j24J74j99J45J88j47j22J74n2j07J09Q7
4205A12J02j68J69k56j68k6K98l23L24M5k2k79KN2J42O6k69M46l92K45n15M29
4227A4Q4j43j04K06o7M9M6L6r7j3j20K79o3j81q5M19k83R5l7l78L72P1k28p8L21
4252A15k1k56K9P5l7M29j97k29q4O5j48L94j08k66K59j9J4k5J55J0k28L92l19
$$ plain form
4275 0 -83 -154 179 173 224 232 -38 136 169 151 -101 30 61 -108 108 193 -70 57 82 11 -217 272 -85 -234 -365
4300 -365 -60 184 -88 210 -46 -249 -111 -115 138 -90 160 43 -162 -15 67 483 7 -9 -75 -40 248 193
4322 193 39 -175 290 -84 -223 -63 -145 -104 -189 126 -160 -316 73 19 34 214 154 -96 5 -213 -151 -423
4344 -423 151 -63 8 16 -77 160 -146 -187 -333 27 -226 -111 -93 33 144 -92 401 14 136 -149 -64 -99 -205
4367 -205 282 125 -37 -47 47 -208 77 235 -288 61 116 133 180 132 66 309 364 -129 79 144 112 130 13 121
4391 121 -231 -50 -83 51 -228 -43 -156 94 91 12 58 -21 -96 63 22 41 113 30 -61 -253 -98 111 -155 -98
4415 -98 373 287 156 -19 -72 297 179 -111 -249 78 293 -157 29 -37 -40 130 213 122 -82 136 203 65 -67
4438 -67 -81 103 128 97 88 -34 -37 -34 143 109 -76 -1 75 -282 169 57 283 147 133 18 -119 7 25 -26 113
$$ packed form
4275@q3p1L33oN1Qk70J74L3j8k52J31L1j69K16Q5k63J27K5p1k28M89l57j49j31
4300c65L05K44k72K98k56k03J38mK53k28K50j17k05J47Q2M16m76j6o6L5K88n5
4322A93j54k14M65l74j39J60q2M1q5L15k86j56L89n4J5J80o0k50J01k18O2k72
4344d23N74k14P1Qr3K37l06m1j46L60k53J15J8J26J11k36M93l87J22k85Q5l5j06
4367b05M87j57j62j0R4k55K85J58n23L49N5J7M7m8o6K43N5m93K08O5l2J8j17J08
4391A21l52J81l3J34k79J85j13K50lp9M6p9p5J59m1J9P2q3r1j92J55K09k66N7
4415i8M71q6j31j75n3L69j18k90j38L27K15m50J86o6lJ70Q3r1k04K18O7j38j32
4438f7j4J84K5l1rj22lLJ77l4j85P5P6l57M51j12K26j36j4j15j37J26J8n1J39
$$ plain form
4463 113 49 -37 225 -271 -35 -152 -45 142 20 197 -195 -70 90 90 62 106 -123 -67 -255 94 -160 -41
4485 -41 -41 -75 -99 -123 -194 37 -10 -222 311 110 -19 20 -200 -44 166 -103 53 -308 -112 230 109 73 -79
4508 -79 200 -39 -14 110 -16 24 -82 -42 -178 15 141 -20 66 -41 35 149 48 53 79 -119 -203 -32 252
4531 252 44 403 138 -11 51 -200 -75 -47 -274 119 130 -47 216 103 -137 -221 199 33 195 100 80 16
4553 16 -227 -137 23 -258 53 99 22 72 193 131 319 -19 -44 -178 -61 -57 -151 -235 123 248 -449 -138 -144 -66 144
4578 144 69 146 71 -35 39 228 67 216 151 -114 295 80 -166 -172 -198 -12 -41 401 83 -191 377 -186 -161
4601 -161 -21 82 -169 8 15 178 483 238 -78 -65 135 -302 -294 196 -185 -254 -76 82 -167 108 2 51
4623 51 135 96 193 -213 76 -142 39 38 71 10 -45 172 -174 94 54 92 -85 -110 68 191 -176 -125 -168 -236 49
$$ packed form
4463A13o4q6K62m96K36j17J07J87j22J77l92J25J60%k8M4k29N6j88L49k54J19
4485d1%l4k4k4p1K31m7k12N33k01j29L9k20J56K10k69J56l61J96L42j21l6j52
4508g9K79k39K5J24j26M0j06M0j36J93J26j61Q6j07P6J14j01NK6j98q4J71K84
4531B52k08L59k65j49O2k51J25K8k27L93J1j77K63j13k40q4M20j66J62r5k0o4
4553A6k43R0J60k81L11M6p7N0J21o2J88l38k5j34J17Mr4q4L58J25o97L11oP8K10
4578A44p5P7p5j06P4J89j61J49o5k65M09k15k46ok6J86k9M42l18k74N68n63K5
4601a61J40J03k51J77PJ63L05k45l16J3K00m37QM90l81o9J78J58k49K75j06M9
4623E1Q4l9R7m06K89k18J81jL3o1n5K17l46K68m0L8j77k5J78J23l67N1m3o8K85
$$ plain form
4648 49 31 -105 -54 386 -66 -285 172 282 -42 44 -69 -110 117 455 -134 -218 114 111 -144 -202 27 -237 175
4671 175 177 42 -90 -61 274 168 47 76 63 74 -116 219 101 411 -313 -26 286 65 72 251 272 178 227 127
4695 127 30 120 37 140 -146 199 133 34 -193 -121 201 -16 -219 104 -308 117 65 95 -39 140 121 -90 27
4718 27 -206 254 -123 41 104 -18 -71 118 -74 -30 218 -178 -262 53 98 107 82 4 20 -59 99 -207 -50 40
4742 40 133 -111 -72 -163 3 113 132 284 -147 31 -64 131 -32 31 -129 -271 359 -218 -83 12 -393 -58 -99
4765 -99 85 366 114 204 -166 -50 -58 136 -124 -127 87 -64 -27 -59 -144 56 50 136 144 111 80 -19 162 45 376 -2
4791 -2 232 206 -224 83 24 90 96 -221 -65 -230 -95 260 -106 214 260 149 172 116 113 -83 145 -29 -40 -158
4815 -158 87 -9 65 -148 324 -269 -35 -20 -180 221 295 91 -90 -30 93 344 74 3 63 103 191 -8 113
$$ packed form
4648D9j8j36N1M40m52k19M57J10l24Q6j13m1K27L38n89q4L32lk55n8K29k64M12
4671A75Kj35j32K9L35j06j21K9j3J1j90L35j18L10p24K87L12k21PJ79K1r4M9j00
4695A27r7R0q3J03k86L45o6r9k27P2L22k17k03L23m12M25n2L0j34J79j9k11J17
4718B7k33M60l77J64O3j22n3J89j92M4K48l96q4L15M5Rk5p8J6p9J58l06J57R0
4742D0R3k44L9r1J66J10J9J52m31J78r5J95j63O3j60j42O30n77J35R5m05L35m1
4765i9J84K81k52R0l70J16qJ94k60lK14j51L7l2q5K00oQ6Ql3l1r9J81j17L31l78
4791bK34k6m30L07n9O6Ol17J56j65J35L55l66L20M6j11K3n6lj96K28j74j1j18
4815a58K45r6P4k13M72n93K34J5j60M01P4k04j81O0J23K51k70p1O0M0Q8j99J21
$$ plain form
4838 113 -171 -92 -60 -24 158 -300 -3 52 389 -52 -148 195 -309 -78 89 36 134 132 35 -197 234 355 -385
4861 -385 -220 346 -329 183 110 -112 44 -56 -86 -70 -80 104 -29 85 -136 -160 16 18 251 -96 64 67 -70
4884 -70 -285 74 -11 -91 -63 -12 273 76 -24 132 -153 301 138 -384 56 -120 432 130 18 -85 -32 -148
4906 -148 128 -271 -89 229 260 -162 -296 69 -193 368 286 -62 -86 175 246 -208 -8 -223 -25 212 146 62
4928 62 293 -50 -131 1 -53 47 253 60 -1 -315 -39 -47 -203 -1 134 38 -6 138 -122 -265 256 334 -33
4951 -33 -251 89 -213 -150 272 -141 -225 75 59 -184 -67 -9 -126 -332 -40 0 128 46 59 76 -8 210 140 -247
4975 -247 -100 -105 -139 107 -220 -206 18 -103 97 -90 254 100 -246 -100 272 90 -19 -132 -160 -298 152 -475
4997 -475 -73 -91 -53 -157 230 -110 -79 -19 134 216 -142 167 98 152 19 -182 -18 154 16 84 142 9 -29
$$ packed form
4838A13k84P9L2L6J82m58K97N5L37m41r6L43n04K31J67n3R8kr7k32M31J21p40
4861c85J65N66o75N12p3k22J56j00l0J6j0J84j33J14k21k4J76KK33l47J60Lj37
4884g0k15L59q5q0K8N1K85j97j00J56k85M54j63n22M40j76N52l02j12j03N3j16
4906a48K76l99J82L18L1m22j34L65k62N61q2l48k4K61P1m54K00k15J98K37o6q4
4928F2K31l43q1J32n4J00K06j93o1l14K76qj56K02J35r6m4J44k60j43N21P8l67
4951c3k18L40l02O3M22m13q4L00j6k43J17N8j17k06K92M0J28q2J3J7q4K18p0l87
4975b47J47nl4K46l27J4K24j21K00j87L44j54l46J46L72j82j09j13k8j38M50o27
4997d75M02j8L8j04L87l40L1O0J53Q2l58L09o9N4j33k01J64J72j38O8N8j33l8
$$ plain form
5020 -29 109 -241 29 123 -310 -8 -369 -89 -220 233 -396 -69 -48 -103 -207 -63 -137 -176 111 42 -88 49
5042 49 76 191 -103 -123 398 -127 42 270 204 -95 189 -277 -184 -364 -47 172 -179 135 107 -158 -119 415
5064 415 -161 -37 -16 -49 -37 -68 -103 -2 -99 -188 21 69 395 -3 -210 123 -168 52 25 10 -142 145 -136
5087 -136 -3 210 237 -60 -173 339 -164 103 -5 -139 -133 249 -139 -190 -183 219 65 -10 4 116 103 15 98 -23
5111 -23 -204 54 -79 -131 -72 -196 237 138 -139 -70 -182 -105 72 23 -3 -233 -79 -58 104 -92 249 -146 7
5134 7 -105 -50 -1 -55 -107 -36 -151 -22 74 -58 -250 246 1 -1 85 193 369 -360 120 -118 -225 470 -73 -92
5158 -92 261 109 -120 64 219 469 122 203 -348 69 186 -151 -204 -384 -59 -181 -245 209 138 -20 314 178
5180 178 236 -102 -60 -139 -97 -69 -209 31 -86 6 61 -483 153 -68 -110 61 -189 347 -123 74 -39 -186 83
$$ packed form
5020b9J38l50K70R4m33L02l61K80j31M53o29L27K1n5j04J44p4l9K87o9j30J37
5042D9K7J15k94k0N21n25J69K28o6k99K84m66R3j80L17K19l51L14k8k65L9N34
5064D15n76J24K1l3J2l1l5J01r7q9K09M8L26l98k07L33k91K20k7j5j52K87k81
5087a36J33K13K7k97j13N12n03K67j08j34OL82l88n1PM02j54p5J4J12j3q8Q3j21
5111b3j81K58j33n2N9j24M33r9k77O9j12P7J77m9k6k30J54K1J62j96L41l95J53
5134Gj12N5M9n4n2P1j15J29R6j32j92M96k45kQ6J08J76p29M80k38j07O95n43j9
5158i2L53j52k29J84J55K50l47Q1n51M17J17l37n3j80L25j22o4M54p1j58L34j36
5180A78N8l38M2p9M2K8j40K40j17R2N5n44O36k21m2J71k50N36m70J97j13j47K69
$$ plain form
5203 83 57 -246 -177 50 131 -139 66 478 -153 129 446 144 -137 -190 75 120 122 98 -28 33 92 -92 -2 -124
5227 -124 -17 -349 -306 -7 138 146 168 224 95 79 26 186 318 -117 72 -106 -65 12 -63 -107 -113 -42 -17 188 -156
5252 -156 85 -3 -72 47 130 -162 -225 39 146 -92 -48 -155 -207 268 190 -114 -242 102 -107 -80 -189 91 188
5275 188 -89 -84 -149 153 -98 27 -282 17 -244 -28 93 250 -123 6 -33 49 165 -64 -238 -103 -243 57
5297 57 56 42 -22 -4 -39 110 136 -160 4 26 -34 -1 290 -12 -182 -50 -185 -141 -205 48 -78 -26 -132 235 51
5322 51 -103 218 -175 63 -135 -57 -53 -224 -34 125 -145 -76 -98 -10 -302 -41 -108 1 -117 25 -82 -127 -196
5345 -196 106 185 -137 34 -215 -85 -76 -22 185 328 -183 14 -86 -22 48 144 -451 -250 -164 129 -147 -42 181
5368 181 289 105 190 22 24 209 56 -72 -444 86 -167 -152 21 -251 -56 153 -129 -166 -419 364 47 185
$$ packed form
5203H3k6l03O9K27Q1k70K05M12o31K82L17l02k81n3K65M5Kk4j26O1N9j84R0j22
5227a24J07l32M3K99J45QK2N6j29j6n3J60J32m35J89j78M1P7p5m4oP1K5K05l44
5252a56K41q8o9J19Q3k92o3K64J07k38M4j07n2M75p8l04j28L44k09K7j09K80R7
5275A88k77No5L02k51J25l09K99k61K16J21J57l73J29l9Q2J16k29j74J35j40L00
5297E7jj4o4J8l5J49K6k96J64K2o0L3K91l02j70J32j35M4o4K53j26N2j06L67j84
5322E1j54L21l93K38j98P8Mj71J90J59k70O9k2Q8k92K61o7J09j18J42j07m5o9
5345a96L02P9l22J71k49J30RN4K07J43n11J97j00O4P0R6n95K01Q6K93k76J05K23
5368A81J08j84Q5j68KJ85j53j28l72N30k53J5J73k72J95K09k82l7k53P83l17J38
$$ plain form
5390 185 -176 -139 86 -56 -109 63 200 147 -96 -41 248 -1 74 -57 2 135 424 -36 -264 -338 165 -215
5412 -215 52 -11 0 -11 314 -59 -184 -102 82 189 -38 76 -113 213 225 57 247 24 -76 -30 -212 192
5434 192 53 186 -247 140 137 -138 8 -102 -268 -16 -35 -300 -71 82 -415 124 233 -69 146 298 -226
5455 -226 63 -58 9 84 235 -270 159 28 276 -9 -143 153 -58 -427 263 -51 -286 -154 218 -2 0
5476 0 180 199 33 212 178 -162 -44 116 178 -177 37 -78 -29 -93 120 238 175 -59 153 98 138 -154 57
5499 57 193 0 -175 -220 2 242 -86 280 127 -71 -17 20 -78 -101 144 -199 -196 223 -144 -160 149 -207 -343
5522 -343 57 195 143 -152 20 331 28 48 -340 -321 112 -102 -161 32 10 296 -233 -128 166 320 -240 -84
5544 -84 188 -248 192 -125 71 213 186 -208 65 -120 -65 -40 -137 248 161 326 -264 63 9 179 -60 267
$$ packed form
5390A85l61L7K25j42n3J72J37n3k43N5K89k49P5j31N9J33K89m60k28p4N03l80
5412b15K67o3J1j1L25l73j25Q2J84J07k27J14j89L26J2j68J90k23j00M6j82M04
5434A92j39J33m33L87lk75J46j10j66K52j9k65K29J53m97N39J09l02K15J52n24
5455b26K89j21O7P5J51n05M29j31K48k85j34K96k11l69O90l14k35J32L72k20K
5476@J80J9j66J79l4l40J18J60O2l55K14j15M9o4K13J18o3k34K12n5M0k92K11
5499E7J36j93j75m5K22K40l28L66j53j98N4L7r8k3K45l43LM19l67j6L09l56j36
5522c43M00J38n2k95J72L11l03K0l88J9M33k14n9J93k2K86n29J05K94J54n60J56
5544h4K72m36M40l17J96J42k7l94K73j85N5K5r7L85q7J65n90L27n4J70k39L27
$$ plain form
5566 267 120 -164 -254 -63 89 -135 18 -5 37 -118 358 -81 -185 107 139 -232 14 -57 -150 11 -196 104
5588 104 -53 -196 307 -100 -40 -96 139 -120 100 83 132 -199 -28 -113 137 -25 142 -207 -69 -105 -4 84
5610 84 -107 -99 -16 75 120 -160 98 72 62 224 -59 410 -53 -71 116 -29 -46 -5 -23 -166 243 19 -236 94
5634 94 220 158 -260 295 -107 230 -25 -179 -165 -94 -207 -162 151 339 -194 87 24 363 153 -52 -259 -272
5656 -272 53 -99 150 120 -156 -409 -150 292 174 -320 30 -109 163 -187 -106 -84 -15 172 13 101 195 13
5678 13 -39 60 31 -255 -40 -62 6 436 61 150 23 21 158 207 -342 -85 18 -98 -126 252 -24 -116 -331 -100
5702 -100 191 -14 123 -164 200 149 69 -316 64 -127 48 98 111 281 457 232 -14 -125 -29 47 109 -52
5724 -52 64 261 -21 117 41 348 -63 309 86 -6 -59 19 338 -128 -62 -50 66 -22 155 -68 116 4 -14
$$ packed form
5566B67j47k84r0J91J52k24J53k3M2j55M76m39j04K92L2l71K46p1r3J61k07L00
5588A04j57j43N03m07O0n6K35k59K20j7M9l31J71q5K50j62J67l49J38l6J01Q8
5610H4j91QQ3R1M5k80K58k6j0J62k83M69m63j8J87j45j7M1j8j43M09k24k55L30
5634I4J26o2m18N55m02L37k55j54J4P1j13M5L13J88n33K81o3L39k10k05k07j3
5656b72L25j52K49l0k76k53K59M42j18m94L50j39K72l50Q1K2O9J87j59Q8R4j82
5678A3n2R9k9k86K15k2O8M30l75Q9j27kJ37M9n49K57J03j16k8L78k76r2k15K31
5702a00K91k05J37k87L64n1q0l85L80j91J75N0J3J70J76k25k46j11R6P6O2j61
5724e2J16J97k82J38p6L07m11L72k23r2n3P8L19m66O6J2J16q8J77k23J84j12j8
$$ plain form
5747 -14 -210 -62 119 214 195 38 -366 47 -56 -418 459 -147 -190 261 -115 -17 -263 228 44 -143 14 280
5769 280 -17 56 25 -57 -282 144 78 -37 -275 -218 183 83 -240 -65 -373 107 -199 -130 -171 -232 -235 -363 -13
5792 -13 17 177 65 -167 94 -64 -148 0 -47 201 -3 -46 189 83 -120 -41 -400 160 267 70 43 -195
5814 -195 7 48 148 -6 102 -14 32 357 -3 265 -10 84 -157 -108 34 73 186 183 -140 -179 39 -3 -125
5837 -125 -21 171 -42 45 -50 15 96 -24 -324 89 116 -137 -35 177 50 -115 221 -229 -93 192 -37 128
5859 128 -252 142 -127 -9 19 124 75 -79 -56 -76 164 71 -191 32 103 -134 198 -128 162 -124 -61 -127 0
5882 0 -303 -51 -179 86 67 125 43 28 -234 116 -70 -110 -186 71 46 106 243 73 117 95 -357 -55 -75 -351
5906 -351 -138 416 -21 -61 73 250 11 138 -74 -102 -60 263 -1 109 45 -127 82 151 218 93 -240 32
$$ packed form
5747a4j96J48J81R5j9j57m04M13j03l62Q77o06m3M51l76R8k46M91j84j87J57K66
5769B80k97P3l1q2k25M26o6j15k38N7M01j00l23J75l08M80l06O9m1o1lj28L50
5792a3L0J60j12k32K61j58q4J48m7K48k04m3K35j06k03P9l59N60J07j97k7k38
5814a95K02M1J00j54J08j16M6L25l60K68k75R4k41M9J42L9J13ll23l9K18m2j22
5837a25J04J92k13Q7r5O5Q1j20l00M13K7k53J02K12j27j65L36m50J36K85k29J65
5859A28l80L94k69J18K8J05m9j54K3k0K40r3k62K23P1k37L32l26K90k86O3o6J27
5882@l03K52j28K65j9N8q2j5k62L50j86m0p6K57k5O0J37j70M4k2m52L02k0k76
5906c51K13N54m37m0J34J77k39J27k12k8M2L23k64J10o4j72K09O9O7j25l33K72
$$ plain form
5928 32 97 -54 136 -83 -52 102 136 105 -256 -96 -1 -438 -234 24 -146 153 -27 -332 -53 367 1 95
5950 95 -138 21 -68 -285 -91 52 -12 -65 -259 47 0 85 121 80 188 -142 159 197 -11 -98 175 195 -35 -174
5974 -174 159 -130 36 -136 150 -41 -86 241 -16 -126 -119 -264 13 -345 154 41 -115 8 100 -117 288
5995 288 -86 -47 114 -147 148 -15 107 171 6 -61 0 60 61 334 24 69 160 61 -113 -130 -21 130 -48 15
6019 15 -158 -85 -18 -141 -9 88 36 -208 21 -234 34 -87 -322 -65 143 -101 -116 10 128 -320 -157 141
6041 141 181 23 143 355 1 -132 72 28 -163 -6 43 -142 -43 47 382 -180 -276 -232 25 -47 162 68 161
6064 161 -20 203 157 -156 -122 -57 -21 48 58 -298 -15 -112 67 98 44 -375 112 -93 -297 89 -68 262 374
6087 374 -71 -143 -14 -99 -99 -39 -84 323 2 -145 63 9 124 4 152 158 -236 -78 240 -246 26 -128 134
$$ packed form
5928C2O5j51J90k19L1J54L4l1l61J60R5m37K04K58j70K99j80l05K79M20l66R4
5950I5k33J59q9k17J94J43o4n3j94L06m7Q5L6m1J08l30L01L8k08q7K73K0k30j39
5974a74L33k89J66j72K86j91m5L27k57j10Pj45K77l58M99j13j56J23R2k17M05
5995B88l74L9J61k61K95j63J22O4j65o7O1O0JK73l10M5R1r9j74j7J09J51j78O3
6019A5j73P3O7j23J32R7n2k44K29k55K68j21k35K57K08k44j5J26J18m48J63K98
6041A41M0j58J20K12l54j33K04m4j91J57M9j85R9R0L35n62r6M4K57p2K09r4R3
6064A61j81K23m6l13L4O5L6O9J0l56K83r7J79L1n4m19M87k05k04L86j57L30J12
6087C74m45p2J29q5%O0m5M07l21j47K08n4J15j20J48Ol94J58L18m86K72j54K62
$$ plain form
6110 134 45 128 87 -125 171 213 136 78 317 -20 -46 -93 194 -65 435 105 -85 211 30 -33 -139 405 57
6133 57 -184 -74 -42 -191 450 59 149 313 -37 -69 218 182 63 80 63 45 -129 -117 -19 235 78 214 -130
6156 -130 120 308 -306 -3 -49 -113 -24 -337 79 277 122 -110 -77 -46 28 400 152 124 27 -118 329 -191 158
6179 158 73 -233 285 57 80 4 110 -158 -35 25 95 -170 -32 42 200 -29 -194 -135 183 83 69 70 153 38
6203 38 -421 205 -223 -5 213 164 -325 -110 274 7 -137 81 324 -229 -55 105 -249 -216 291 6 74
6224 74 -47 271 -151 177 30 66 -91 122 -144 239 -20 196 15 -215 253 25 -22 13 -63 -104 164 -206
6246 -206 395 -33 7 5 108 -79 57 72 -241 121 -162 230 -68 332 41 -41 77 -184 201 256 28 21 339
6269 339 147 6 119 322 -16 227 186 158 2 -109 -23 -158 -2 274 160 -134 -31 183 103 -136 71
$$ packed form
6110A34q9Q3m1k12K96M2p7n8K39l37k6m7K87k59N00l30j90K96j81o3j06N44l48
6133E7k41J10L2j49O41l91R0J64l50l2K87l6j19J7j7j8j74J2R8K54j57J36l44
6156a30K50J88o14L03m6o4Q9l13M16J98j55k32L3L1P4L72k48k8r7j45M47n20L49
6179A58q5l06N18k28K3p6J06k68J23O0P0k65J38P4J58k29j65N9L18j00j4JQ3j15
6203C8m59O26m28K18K18m9m89K15L84k67j44K18K43n53J74J60l54L3N07k85O8
6224G4j21L18m22L28j47L6j57K13k66L83k59K16j81k30M68k28m7L5p6m1K68l70
6246b06O01m28M0kJ03j87J36J5l13L62k83L92k98M00k91q2J18k61L85N5k28pL18
6269C39j92j41J13K03l38K43m1k8j56j11Q6j35J56K76j14k94J03K14q0k39K07
$$ plain form
6290 71 -179 -10 -121 -210 -178 -5 88 -51 50 139 -135 192 87 23 -91 32 -254 -46 -209 62 -142 128
6312 128 4 73 182 -29 191 -152 248 -100 -1 -173 18 -139 -137 165 276 239 128 -166 124 -21 316 198
6334 198 45 -152 94 164 179 361 -13 -247 -13 118 59 5 185 104 11 264 -138 24 146 117 -59 -52 -116
6357 -116 119 290 10 -101 -208 154 4 74 -85 -13 123 125 250 102 -86 -37 137 -324 -247 108 -108 30
6379 30 -137 237 175 -100 -133 -281 -127 121 129 -93 -17 -90 76 109 86 -66 303 -117 -67 40 33 -154 84 94
6403 94 162 120 149 326 -6 15 107 5 242 31 -56 -195 22 264 -43 49 419 170 61 -17 5 118 25 277
6427 277 3 -34 -4 30 -159 114 -31 -177 74 57 176 -78 -80 219 -18 72 154 -51 345 106 36 -425 -106
6450 -106 -414 -154 147 60 -139 -5 -59 41 126 29 -44 -31 277 -256 -95 130 74 28 83 169 55 188 -325
$$ packed form
6290G1k50J69j11q9L2J73R3j39J01Q9k74L27j05o4j14J23k86K08j63K71k04K70
6312A28j24O9J09k11K20l43M00l48R9j72J91j57KL02J11l7j11k94K90j45L37j18
6334A98j53j97K46P0J5J82l74k34K34J31n9n4J80q1r3K53m02J62J22k9j76Po4
6357a16K35J71k80j11j07L62j50P0j59P2J36KJ25j48j88M9J74m61P7L55k16J38
6379C0j67L74o2k75l3j48J54K48Qk22P6p3J66L3k3j52L69m20N0J07pj87K38J0
6403I4O8m2K9J77l32K1R2j02K37k11q7j39K17K42l07R2L70k49j09p8K2J13r3K52
6427B77k74l7L0L4j89K73j45j46K51j7J19k54kK99k37R0Q2k05L96k39p0m61L19
6450a06l08K60L01q7j99J34n4J00Q5r7p3J3L08n33J61K25n6m6N5Q6j14J33n13
$$ plain form
6473 -325 -184 -21 190 -370 153 -55 -185 102 230 -1 -44 4 -65 284 187 88 82 230 23 29 162 -194 -25
6496 -25 408 403 56 18 -59 166 64 -11 301 -300 32 89 -343 -357 -116 -57 -124 46 -52 -3 -366 174 98 93 116
6521 116 102 36 -46 229 14 49 -257 -108 -227 34 -198 104 27 -300 62 -33 -420 -102 8 -270 -129 47
6543 47 174 -71 -79 -86 -59 -71 375 2 73 -355 -315 -240 152 245 -343 211 -101 -221 35 -195 -231 -118 -71 46
6567 46 -34 197 -4 -116 -323 211 -19 163 103 -81 93 34 -57 21 -79 -146 -94 -42 38 435 -171 116 242
6590 242 -4 -5 51 -74 -103 226 201 -65 -11 68 -78 -143 -115 101 -87 -14 72 -153 -16 -62 -7 -318 307 -136
6614 -136 -160 -267 23 78 -159 122 -205 188 -24 -162 142 -107 299 -5 441 21 32 59 -130 -145 154 8
6636 8 82 -113 -358 -139 49 152 -282 34 -131 139 415 1 199 -61 286 -59 -117 274 56 103 -3 -208
$$ packed form
6473c25J41J63K11n60N23k08j30K87J28k31m3M8o9L49r7r9oJ48k07OJ33l56J69
6496b5M33nl47l8p7K25j02p5L12o01L32N7m32j4K41N9o7J70r8M9l63N40p6nK3
6521A16j4o6q2K75k15L5l06J49j19K61k32L02p7l27L62r5l87L18J10k78J41J76
6543D7J27k45qpK7j2M46l73P1m28M0P5L92R3n88N54l12j20K56k30l6J13M7J17
6567D6q0K31k01j12k07N34k30J82o0j84J74n9r1P8j00o7N2N2Q0L97o06K87J26
6590B42k46jN6j25k9L29k5k66N4P9j46o5K8K16j88P3Q6k25J37m6N5l11O25m43
6614a36k4j07K90N5k37K81l27L93k12j38L04k49M06l04M46m20J1K7j89j5K99j46
6636HP4j95k45K19J88J03m34L16j65K70K76m14J98k60L47l45n8L91k18M7j06k05
$$ plain form
6658 -208 -129 -101 184 36 -154 317 158 -212 155 36 268 4 76 240 18 -42 -23 49 49 -377 158 6 -170
6681 -170 -14 -163 -169 101 2 120 270 117 47 178 -17 21 -182 34 267 236 -231 -3 64 -246 161 -160
6703 -160 -269 163 120 363 -14 -254 -485 -98 -77 -61 -120 328 7 -109 75 -123 -97 -226 -20 239 -246 168
6725 168 159 407 213 -388 -256 -246 -238 142 -221 -101 295 -34 168 113 133 69 417 4 -201 -5 -133 -79 -185
6748 -185 244 213 -80 -250 -92 39 105 54 -185 -80 -230 252 -176 -146 11 191 54 -261 260 -82 -155 -509
6770 -509 130 -293 43 -123 -263 -58 180 -65 11 341 -123 108 73 118 -181 -226 82 208 26 116 -37 -219
6792 -219 238 -11 -141 -120 -62 -32 135 -63 22 343 -111 27 -151 -403 -324 -135 143 -246 -73 109 18 -87
6814 -87 -84 428 5 49 -13 82 1 297 -147 10 56 -18 190 67 -175 100 151 103 164 154 -21 -190 -101 102 -110
$$ packed form
6658b08P9K8K85j48j90M71j59l70L67j19K32k64P2J64k22o0J9P2%m26N35j52j76
6681a70J56j49oK70r9J18J50j53p0J31j95L8k03K16K33l1m67K28O7l10M07l21
6703a60j09M32m3K43l77k40k31L87K1J6n9M48l21j16J84j98K6j29K06K59m85M14
6725A68rK48j94o01J32J0QL80l63J20L96l29K02n5K0o4L48m13k05J96j28N4j06
6748a85M29l1k93j70J58J31O6n1k39J05j50M82m28L0J57J80j37l15N21l42p3l54
6770e09O39m23L36j66j40K05K38k45P6L30m64K31l5M5k99m5L08J26j82R0j53j82
6792b19M57k49j30K1N8L0J67j98Q5L21m54J38j78k52P9J89K78l89J73J82r1j05
6814h7LN12m23M4o2R5q1K96m44J57M6p4K08j23k42K75N1m8O1j0j75j69Q9K03k12
$$ plain form
6839 -110 73 271 46 110 83 56 -55 141 219 233 -13 -51 53 24 -30 -8 -18 15 -48 61 -62 -25 278 102
6863 102 203 -108 53 -241 9 -97 163 -134 27 -232 -238 -64 -63 291 -144 100 393 86 -136 26 -134
6884 -134 -41 29 -49 -161 338 -123 26 -245 -190 176 -115 -72 -367 -286 61 129 43 109 -25 56 169 -11 27 -76
6908 -76 -45 -432 107 4 -34 70 59 -140 -167 53 -200 344 23 -141 -70 -147 22 -293 204 -25 184 414
6930 414 -23 206 26 -90 -126 69 -160 -67 -174 102 79 179 76 -38 157 54 158 139 -204 -114 -70 -65 -214
6953 -214 -82 6 -24 -119 -110 -322 253 -56 -101 313 205 226 -57 -131 -141 -42 -105 116 71 81 -260 -37 -274 164
6977 164 -396 -173 61 28 124 -144 179 187 -259 75 83 -151 -181 -162 -157 117 -297 169 -85 -119 -308 -289 173 132
7001 132 -25 69 169 174 -1 100 19 -106 -270 -258 81 -29 -133 -167 13 -97 -124 127 185 -138 -56 -20 190
$$ packed form
6839a10J83J98k25O4k7k7j11J96P8J4k46l8J04k9n4K2j0L3o3J09j23L7L03j76
6863A02J01l11J61k94K50j06K60k97J61k59oJ74JL54m35K44K93l07k22J62j60
6884a34R3P0p8j12M99m61J49k71N5L66k91M3k95Q1L47O8q6O6j34Q1J13j80L8j03
6908g6L1l87N39j03l8J04j1j99k7K20k53N44l21j64P1p7J69l15M97k29K09K30
6930D14m37K29j80j16l6J95k29R3j07K76k3J00j03j14J95j03J04j9l43R0M4Nj49
6953b14J32Q8l0r5Rk12N75l09m5M14j08K1k83p4j0R9o3K21m5J0l41K23k37M38
6977A64n60K23K34l3R6k68L23Qm46L34Qk34l0J9NK74m14M66k54l4j89J9M62m1
7001A32j57R4J00Nj75J01q1j25j64J2L39j10j04l4J80j10k7K51N8l23Q2L6K10
$$ plain form
7024 190 410 115 -75 37 92 69 -5 -30 11 -108 -1 247 7 229 -285 -179 42 -163 12 -295 22 -125
7046 -125 -55 123 -73 -4 -72 -212 54 374 218 171 -117 -160 -301 -285 51 -261 28 -279 -89 24 47 -8 61
7069 61 556 562 -47 104 45 184 265 123 271 -226 -99 -71 -79 37 16 123 -137 -243 -148 -442 -59 30 -119 100
7093 100 -47 -19 -117 97 287 -239 -130 130 153 -55 32 -191 -116 355 -81 -320 -82 -219 198 51 332 -48
7115 -48 -168 87 124 -69 17 187 -257 -71 -37 31 -81 158 62 31 -283 175 25 -140 171 -113 75 272
7137 272 161 273 29 153 -30 73 116 44 -46 95 -116 189 162 117 384 208 69 -168 40 48 -88 -279
7159 -279 62 42 -278 -200 384 -125 -237 69 42 310 213 49 66 -115 -53 410 30 -284 54 -32 -14 -78 -106
7182 -106 -35 22 -11 -7 237 -118 -65 -35 -52 85 -217 76 237 -164 -84 47 -201 -254 -114 291 30 158 222 -77
$$ packed form
7024A90K20k95j90J12N5k3p4k5M1j19J07K48k40K22n14J06K21k05J75l07L17j47
7046a25P0J78j96O9o8j40K66L20j56m7k88m3j41J6L36l12K89l07J90J13K3n5O9
7069F1M95Oo09J51n9J39Q1j42J48m97J27K8qJ16k1J07k60j06R5k94L83Q9j49K19
7093A00j47K8r8K14J90n26J09K60K3k08Q7k23P5M71m36k39K38j37M17j47K81l80
7115d8j20K55L7j93Q6J70m44J86L4O8j12K39r6l1l14M58j50j65L11k84J88J97
7137B72j11J12k44J24j83J03M3p2r0J41k11L05k7m5K67j76j39k37K08Qj36j91
7159b79L41k0l20P8N84n09j12L06k7K68r7j64J7j81O2M63l80l14L38q6J8o4k8
7182a06P1N7l3MK44l55N3L0j7J37l02K93J61m01Q0J31k48n3J40M05k61J28O4k99
$$ plain form
7206 -77 52 -241 -143 -89 136 181 66 95 250 150 105 109 -412 -33 -183 249 -62 114 34 93 -64 -122 -3 225
7230 225 -112 204 -74 -31 278 -121 -169 40 -208 -30 -144 -34 -198 -193 -12 49 151 39 -293 -153 -87 5
7252 5 265 188 8 35 -108 -38 -46 -188 -9 -9 -27 60 280 -241 -224 82 127 20 -24 37 -311 59 -295 -26 73
7277 73 -73 123 -197 1 415 285 -64 301 119 222 48 -123 158 257 45 225 100 285 18 -217 -73
7298 -73 166 -107 69 83 85 -142 -375 122 31 -185 88 -153 51 -243 -199 -20 100 342 -81 -90 -247 133 -431
7321 -431 -16 84 132 -87 -180 -90 296 76 92 -5 204 -89 -133 -174 98 -192 330 79 45 -42 -71 -301 8
7344 8 -114 198 153 -5 27 -206 -38 -105 211 100 -481 -137 -84 -43 -95 -355 44 -2 42 72 -15 -110 152 -107
7368 -107 329 -46 160 -1 -157 98 -70 4 109 6 -63 -17 -44 78 -166 -225 -25 -51 -35 -17 132 58 -271
$$ packed form
7206g7J29k93R8N4K25M5j15K9J55j00m5Mn21L79j50M32l11J76q0N9j57n8J19K28
7230B25l37L16k78M3L09l99m8K09k48J78j14J10j64NJ81O1J02j12l32J40O6R2
7252EK60p7j80K7j43P0qj42J79%j8Q7K20n21J7L06M5j07m4O1l48L70l54K69R9
7277G3j46J96l20J98M14j30l49L65j82J03j74j71K81R9k12J80j25J85k67k35J44
7298g3K39k73J76J4Kk27k33M97r1k16K73k41K04k94M4J79J20K42m23rj57L80n64
7321d31M15J00M8k19r3R0L86k20J6r7K09k93m4m1K72k90N22k51l4q7k9k30L09
7344Hj22L12m5j58L2k33J68o7L16j11n81L44N3M1n2k60L99m6M4L0q7r5K62k59
7368a07M36l75K06j61j56K55j68P4J05j03o9M6k7J22k44n9K00k6J6J8J49p4l29
$$ plain form
7391 -271 67 408 -223 143 -305 43 -205 -73 64 21 -121 -8 -139 -289 80 5 42 -244 -165 -222 281 116
7413 116 120 34 58 5 66 155 -4 125 -258 -300 133 103 -134 30 -65 196 -186 -22 397 148 -90 -139 -91 -319
7437 -319 458 201 -85 40 196 -167 116 -409 179 257 -52 -95 114 420 170 90 274 -64 101 88 47 138
7459 138 -66 -207 -12 -31 55 -235 122 128 89 -18 -51 178 -51 102 -207 -403 161 -92 407 170 -118 -236
7481 -236 -169 -157 -97 217 -1 159 -392 -78 210 -79 151 19 87 -127 -45 122 48 238 178 41 128 47 253
7504 253 58 408 7 40 -341 147 100 532 111 -108 128 7 39 -71 87 254 -130 -44 -206 -142 93 120
7526 120 96 -42 -102 117 -99 -14 -114 -338 76 -365 -243 34 4 -176 -71 -11 233 2 157 -51 102 90
7548 90 -35 60 -126 -124 34 81 94 -120 50 187 -19 -186 -64 79 -167 -69 56 135 82 -128 77 -4 -436
$$ packed form
7391b71L38L41o31L66m48L48k48J32J37m3j42J13j31j50L69p5L7k86P9n7N03j65
7413A16Mq6K4n3O1Q9j59J29l83m2M33l0k37J64r5K61l82J64M19k49k38m9M8k28
7437c19P77k57k86J25J56l63K83n25N88P8l09m3K09L06k50q0J84l38J65j3m1R1
7459A38k04j41J95j9Q6k90L57Ol9j07l3K29k29J53l09j96N64k53M99k37k88j18
7481b36O7J2O0L14k18J60n51L14K88k89K30j32O8k14Q2J67p4J90o0j37Q7q1K06
7504B53j95L50m01L3l81M88m7M32m21k19K36j21L2j10J58J67l84Q6j62O4K35K7
7526A20k4j38o0K19k16Q5j00k24M14m41J22K77l0j80J05O0K44k31J55k08J53j2
7548I0j25R5j86KJ58M7J3k14J70J37k06j67J22J43k46R8J25P9n3k10K05q1m32
$$ plain form
7571 -436 155 -184 162 85 257 157 39 -99 244 112 -182 119 -3 112 109 221 32 415 28 -156 94
7592 94 -75 -117 -170 -129 -74 -431 -277 48 39 -125 56 87 -31 -202 -173 51 -261 85 -143 185 53 32 -20 76
7616 76 60 -10 -115 -229 154 73 149 -215 80 162 121 107 -56 -237 -140 -153 234 -401 -114 214 65 -131 8
7639 8 6 -109 223 376 138 -88 21 50 -63 219 -89 12 -190 -116 30 -335 -37 -202 -5 -146 113 58
7661 58 -162 190 -163 113 132 232 27 -312 129 -35 -190 -257 -207 -36 123 -61 -23 7 108 -44 -152 151
7683 151 215 92 431 -234 -9 -27 80 -427 -23 205 -143 -282 -217 -20 158 -273 52 -16 -123 -339 88
7704 88 62 -125 489 312 111 185 135 148 -282 4 -1 293 23 -12 -35 -58 -318 95 23 -133 -127 19 -424 -16
7728 -16 -250 63 14 -420 114 -250 -250 53 174 -145 -187 43 -164 -44 90 -62 -118 236 -314 131 -54 47
$$ packed form
7571d36N91l39L46p7J72j00j18j38L43j32k94L01j22J15lJ12j89L83l87j84K50
7592I4j69m2n3M1N5l57J54L25rj64J81L1j18j71K9K24l12L46k28L28j32k1n2R6
7616G6j6p0j05j14L83q1P6l64K95Q2m1j4j63j81R7j3L87o35K87L28j49j96J39
7639Hkj15L32J53k38k26J09K9j13K82l08J01k02P4J46l65K98j65J97j41K59n5
7661E8k20L52l53K76J9J00k05l39M41j64j55o7N0J71J59j84L8L0J01j52j08L03
7683A51O4j23L39o65K25j8J07n07M04K28l48j39O5J97J78m31L25o8j07k16M27
7704H8k6j87O14j77k01P4n0J3m30K86nK94k70l5k3k3k60M13p2j56OJ46m43M08
7728a6k34L13m9m34N34l64%L03J21l19m2K30k07J20J34j52n6L54n50M45j85J01
$$ plain form
7750 47 131 112 52 -73 -112 16 89 96 -33 -26 -57 134 68 -149 -63 -52 -153 -122 92 91 248 -138 -29 194 90 157
7776 157 -162 114 -192 18 -88 272 266 2 -32 142 29 27 -54 41 54 182 -30 -100 -72 108 235 -52 169
7799 169 -60 7 236 -125 -114 -133 -68 -81 55 12 -273 -240 187 126 -79 -111 -93 5 78 -65 -87 69 408 63
7823 63 -93 213 31 -152 256 28 185 -32 -175 -408 -134 -144 -6 -344 141 60 5 -127 26 109 27 33 8
7846 8 37 -46 7 -140 -102 -97 -55 210 147 -142 98 -52 367 62 44 34 120 -81 -71 71 245 41 27 -159 113
7871 113 -271 53 63 98 69 -192 112 -148 121 124 -112 273 -475 3 90 101 -84 -62 173 6 268 -83 536
7894 536 -224 -213 -410 -147 -114 143 -18 106 33 -94 -22 180 101 -39 -64 404 -166 -138 274 -99 157 -3
7916 -3 7 187 36 162 120 79 -209 -215 -221 85 27 178 -13 -73 -145 155 -183 62 -231 -1 -178 -89 72 -59
$$ packed form
7750D7Q4j9o0j25l9J28P3Pj29Pl1J91o6k17Q6J1j01L1K14jJ57l86J09K23j04O7
7776A57l19K76l06K10j06L60ok64l4J74j13kq1R5J3J28k12p0K8J80J27k87K21
7799A69k29O7K29l61J1j9O5j3J36m3k85L3M27o1k05l2J8R8P3j43k2J56L39l45
7823F3j56L06j82j83M08k28J57k17j43k33K74j0J38l38M85q1n5j32J53Q3q2Ok5
7846HK9q3N3j47L8NM2K65o3k89K40j50M19l05j8j0Q6k01J0J42J74k04j4j86K72
7871A13l84L24J0L5k9k61L04k60K69Lk36L85p48M78Q7J1j85K2K35j67K62l51O19
7894E36p60J1j97K63L3K57j61J24p3j27P2K02p9j40k5M68n70K8M12l73K56j60
7916cJ0J80j51J26m2m1k88ooL06n8J51j91o0p2L00l38K45k93K30j77Q9J61j31
$$ plain form
7940 -59 -204 -29 -178 -209 23 152 269 -29 237 -9 -132 28 -79 6 -328 35 134 -78 -69 -57 81 142 243
7963 243 65 -126 294 -122 77 159 159 -205 -108 9 -20 -165 91 140 23 -161 -190 190 -172 158 -16 244
7985 244 49 -26 -292 5 127 113 40 244 51 1 -52 47 -36 -55 -1 -201 43 93 237 -203 -89 -327 42
8008 42 278 136 -20 -54 45 30 154 -74 82 49 -19 111 95 153 59 -15 -81 -84 -57 -77 -33 215 -107 115 191 -74
8034 -74 87 -384 -100 171 125 -4 -64 -75 441 -111 -36 -118 -63 -49 -215 33 -66 -108 182 4 -297 65 -77
8057 -77 -109 -189 -243 -175 169 153 -219 -273 46 70 40 43 -178 -140 97 -131 -416 -52 21 83 152 5 35 -34 146 170
8083 170 99 -295 -52 -8 299 124 -150 129 -170 -161 -180 127 -177 179 -516 -32 0 -196 -66 56 155 38
8105 38 144 26 -36 71 273 -37 198 335 -11 50 -101 -220 -125 178 -250 1 -337 36 -79 -253 -371
$$ packed form
7940e9j45J75j49l1K32J29J17k98K66k46j23J60j07Q5l34L63R9k12RJ2J38O1J01
7963B43j78j91M20m16J99Q2%l64R7J17k9j45K56M9j17j84k9L80l62L30j74K60
7985B44j95p5k66K97J22j4p3K04j93n0n3R9q3j9N4k00K44N0J44m40J14k38L69
8008D2K36j42j56l4R9j5J24k28J56l3o8J30j6N8r4p4o6lK7k0M4K48l22K22P6k65
8034g4J61m71K84K71m6j29o0j1N16n52P5q2N5J4j66K48r9m2K90j78l01L62j42
8057g7l2q0n4O8L44j6l72n4L19K4l0Lk21L8K37k28k85L64P3O2O9j47L0o9J80K4
8083A70p1l94K43M4L07j75k74K79k99Rj9L07l04L56o95M84L2j96J30J22R9j17
8105C8J06j18o2J07K02l10K35J37l46O1j51j19R5L03m28K51l38L73j15j74j18
$$ plain form
8126 -371 -118 -97 -1 57 170 -12 -68 174 50 64 51 -73 158 -104 -42 -201 -61 305 -34 31 28 -37 18 43
8150 43 265 -43 -28 21 70 -19 137 73 246 1 111 138 -204 -92 154 -9 -83 -371 72 163 -175 11 -173
8173 -173 -203 -28 -252 176 -122 -33 -93 -232 169 277 -282 76 -100 143 -110 -105 63 95
$$ packed form
8126c71K53K1R6N8J13j82n6K42j24J4j3j24K31k62O2j59J40L66l39O5lo5N5K5
8150D3K22l08J5M9M9q9J56o4J73k45J10K7l42J12K46j63p4k88M43R1l38J86j84
8173a73l0J75k24M28k98Q9o0j39M01J08n59L58j76K43k53NJ68L2
8191I5
$$ Imaginary data points
##PAGE= N=2
##DATA TABLE= (X++(I..I)), XYDATA
$$ plain form
0 0 0 0 0 0 0 0 0 0 -8 8 -8 8 -9 16 -16 21 -24 29 -33 40 -47 54 -63 72 -83 94 -109 121 -139 157 -174 197
32 197 -221 247 -274 306 -340 377 -418 463 -513 567 -627 695 -770 854 -951 1060 -1188 1336
50 1336 -1512 1724 -1989 2329 -2779 3408 -4355 5932 -9051 17578 -87846 -299307 -145653
63 -145653 -10672 -47555 -140066 -125729 -86385 -66383 -64878 -38349 -5843 -9114 -59114 -57853
75 -57853 -5239 -13789 -85804 -98785 -73438 -85576 -95780 -76806 -102145 -130645 -75599 -16496
87 -16496 -51724 -95374 -61429 -3198 12528 -17635 -63792 -62963 -12713 5196 -24544 -41448 -58927
100 -58927 -87973 -53989 20866 7231 -65887 -58822 1600 11220 -628 11470 10933 -6191 -5232
113 -5232 10124 24689 19726 -23218 -48604 1873 42503 -11564 -61762 -25475 12254 -564
$$ packed form
0@%%%%%%%%qJ6j6J6j7K5l2L7m5N3o2P3q7J01j17J35j55J77k03K30k60K96l31L71
32A97m18M68n21N80o46P17p95Q81r76J080j194J322j465J624j805K011k248K524
50A336k848L236l713M318n108O187p763J0287j4983K6629j05424k11461J53654
63a45653J34981l6883r2511J4337L9344K0002J505K6529L2506l271n0000J261
75e7853N2614q550p2015j2981K5347j2138j0204J8974k5339k8500N5046N9103
87a6496l5228m3650L3945N8231J5726l0163m6157Q29N0250J7909k9740j6904j7479
100e8927k9046L3984P4855j3635p3118P065O0422R620j1848J2098n37j7124R59
113e232J5356J4565m963m2944k5386N0477M0630n4067n0198L6287L7729j2818
$$ plain form
125 -564 -8890 -11769 -30738 -21899 10799 729 -35652 -43643 -34125 -23230 -9935 -28298 -71024
138 -71024 -70029 -37936 -38046 -46464 -37964 -55231 -79356 -51387 -19248 -39568 -62662 -56924 -57520 -52334
152 -52334 -29094 -39746 -76039 -69289 -37253 -37223 -51003 -57170 -66454 -54553 -21594 -26186 -58514
165 -58514 -53895 -34379 -38973 -34011 -20630 -41205 -58552 -30814 -13238 -33133 -40223 -32651 -38601
178 -38601 -33312 -13417 -20331 -36701 -27150 -21045 -26092 -15110 -10067 -30347 -29325 -6220 -12638 -28887
192 -28887 -16354 -12463 -26167 -13823 -619 -25949 -40193 -11761 3162 -12750 -24175 -28440
204 -28440 -27264 -8822 -4258 -28603 -32289 -16107 -26109 -37926 -16689 -13466 -43661 -44479 -22009
217 -22009 -29125 -42179 -31906 -32035 -46153 -42612 -35692 -40993 -37625 -38302 -54125 -49155 -30962 -44354
$$ packed form
125e64q326k879j8969Q839L2698j0070l6381p991R518J0895J3295j8363m2726
138g1024R95L2093j10q418Q500j7267k4125K7969L2139k0320k3094N738n96N186
152e2334K3240j0652l6293O750L2036L0j3780o167r284J1901L2959m592l2328
165e8514M619J9516m594M962J3381k0575j7347K7738J7576j9895p090P572n950
178c8601N289J9895o914j6370R551O105n047J0982N043k0280J022K3105o418j6249
192b8887J2533L891j3704J2344J3204k5330j4244K8432J4923j5912j1425m265
204b8440J176J8442M564k4345l686J6182j0002j1817K1237L223l0195q18K2470
217b2009p116j3054J0273j29j4118L541O920n301L368o77j5823M970J8193j3392
$$ plain form
231 -44354 -58017 -35006 -26318 -54460 -59108 -35332 -33515 -40344 -32355 -38272 -50701 -37310 -22117
244 -22117 -30049 -34975 -32092 -35565 -27529 -13717 -28477 -40657 -16820 -6804 -31517 -32602 -9209
257 -9209 -11885 -26174 -18177 -13661 -20994 -14999 -10356 -19592 -16262 -8650 -20734 -24768 -6490 -4490
271 -4490 -17311 -16430 -18480 -27917 -9408 11519 -12464 -39182 -20894 411 -5887 -14493 -18145 -21934
285 -21934 -10347 -1274 -16935 -24240 -7116 -7252 -21472 -13136 -4701 -18120 -20597 -7267 -11609 -18443
299 -18443 -10347 -14097 -25859 -13294 -549 -16864 -29603 -20920 -14804 -9694 -4318 -22431 -41062
312 -41062 -20902 2317 -10954 -27501 -24175 -22429 -18000 -5028 -13388 -32001 -23284 -7500 -14350
325 -14350 -18098 -11314 -19474 -25951 -9079 -1258 -13778 -17351 -15596 -20053 -8247 7781 -7824 -28973
$$ packed form
231d4354j3663K3011Q688k8142m648K3776J817o829P989n917j2429J3391J5193
244b2117p932m926K883l473Q036J3812j4760j2180K3837J0016k4713j085K3393
257i209k676j4289P997M516p333N995M643r236L330P612j2084m034J8278K000
271d490j2821Q81k050r437J8509K0927k3983k6718J8288K1305o298q606l652l789
285b1934J1587R073j5661p305J7124j36j4220Q336Q435j3419k477J3330m342o834
299a8443Q096l750j1762J2565J2745j6315j2739Q683O116N110N376j8113j8631
312d1062K0160K3219j3271j6547L326J746M429J2972q360j8613Q717J5784o850
325a4350l748O784q160o477J6872P821j2520l573J755m457J1806J6028j5605k1149
$$ plain form
339 -28973 -17829 -163 -508 -2701 -11761 -26237 -13525 12588 4422 -20349 -18998 -7039 -4292
352 -4292 2201 112 -18695 -20573 -642 2910 -6030 -6463 -11127 -17535 -3063 10637 -4531 -16793
366 -16793 -9046 -4376 -2371 9080 2349 -19698 -13812 9857 12240 166 -6066 -11005 -3224 18105
380 18105 16405 -9155 -11734 5490 10693 10679 10499 -4232 -12052 8909 22721 7149 -3598 -184
394 -184 -427 6268 17789 7984 -9486 -3958 6897 6975 10467 6991 -11215 -11627 12565 18172 -460
409 -460 -8714 -6561 -1743 13026 16877 -7015 -19256 543 14761 8573 1782 -6223 -11265 3828
423 3828 19232 6744 -7641 -2331 2358 3250 13273 12317 -6397 -7985 8084 13371 9701 7434
437 7434 -2994 -7319 12036 23923 6830 -5593 895 7587 14515 18915 4710 -9231 5668
$$ packed form
339b8973J1144J7666l45k193r060j4476J2712K6113q166k4771J351J1959K747
352d292O493k089j8807j878J9931L552q940m33m664o408J4472J3700j5168j2262
366a6793P747M670K005J1451o731k2047N886K3669K383j2074o232m939P781K1329
380A8105j700k5560k579J7224N203j4j80j4731p820K0961J3812j5572j0747L414
394a84k43O695J1521r805j7470N528J0855P8L492l476j8206m12K4192N607j8632
409d60q254K153M818J4769L851k3892j2241J9799J4218o188o791q005n042J5093
423C828J5404j2488j4385N310M689Q92J0023r56j8714j588J6069N287l670k267
437G434j0428m325J9355J1887j7093j2423O488O692O928M400j4205j3941J4899
$$ plain form
450 5668 22922 15591 5048 4604 2506 8483 23283 18489 810 3540 14502 14571 16475 18531 7675
465 7675 1570 16518 23981 15766 12544 9885 5127 15939 29149 16728 63 6849 17738 18087
479 18087 18962 12348 -1082 4996 23413 20008 4171 3338 6454 8039 15766 14419 -574 -2576
493 -2576 10115 10995 5491 8845 4827 -4544 3539 15074 8969 1153 2288 1164 4185 16390 12691
508 12691 -3793 -1526 12229 13635 10920 9609 2066 2540 18254 20804 6356 4983 14370 14707
522 14707 14525 18617 12364 7675 17151 21260 14219 15575 19127 12458 12658 23869 23073 13444 14917
537 14917 17773 16307 22782 25516 13285 9630 21861 24912 18247 16887 16098 13549 20935 26053 14724
552 14724 9255 19621 21911 15021 16559 17491 11747 14966 20056 13986 11216 17176 13840 7543 14769
$$ packed form
450E668J7254p331j0543m44k098N977J4800m794j7679K730J0962O9J904K056j0856
465G675o105J4948P463q215l222k659m758J0812J3210j2421j6665O786J0889L49
479A8087Q75o614j3430O078J8417l405j5837q33L116J585P727j347j4993k002
493b576J2691Q80n504L354m018r371Q083J1535o105p816J135j124L021J2205l699
508A2691j6484K267J3755J406k715j311p543M74J5714K550j4448j373R387L37
522A4707j82M092o253m689R476M109p041J356L552o669K00J1211p96r629J473
537A4917K856j466O475K734j2231l655J2231L051o665j360p89k549P386N118j1329
552A4724n469J0366K290o890J538R32n744L219N090o070k770N960l336o297P226
$$ plain form
567 14769 18525 9297 6522 11972 9942 9922 14093 8387 550 8420 14984 7866 3733 6854 5007
582 5007 5750 11369 6391 -645 6740 11250 3025 2978 9979 7282 3442 8212 8396 5178 9916 11395
598 11395 4251 6893 14773 11657 7024 11767 12157 8743 14748 16487 8276 9654 18916 15932 10009
613 10009 14038 16310 13132 16057 16571 11498 13737 19278 13442 9396 17761 18408 10443 11325 15954 13066
629 13066 13577 17336 11680 7089 14558 17391 11286 10264 11857 9234 12101 16145 9213 5706 13901
644 13901 14408 6007 8485 14798 9572 5895 10720 10899 7682 9935 9058 5375 9480 12338 5798 4564
660 4564 9894 8285 6515 10697 7098 -447 6672 16047 8722 626 4971 8366 7303 9625 8606
675 8606 4090 6533 9622 6942 8385 11906 6464 2878 11908 14911 6684 6621 11797 8475 7497 14816
$$ packed form
567A4769L756r228k775N450k030k0M171n706p837P870O564p118m133L121j847
582E007P43N619m978p036P385M510q225m7P001k697l840M770J84l218M738J479
598A1395p144K642P880l116m633M743L90l414O005J739q211J378R262k984n923
613A0009M029K272l178K925N14n073K239N541n836m046Q365O47p965Q82M629k888
629A3066N11L759n656m591P469K833o105j022J593k623K867M044o932l507Q195
644A3901N07q401K478O313n226l677M825J79l217K253q77l683M105K858o540j234
660D564N330j609j770M182l599p545P119R375p325q096M345L395j063K322j019
675H606m516K443L089k680J443L521n442l586R030L003q227o3N176l322r78P319
$$ plain form
691 14816 13881 5949 6721 12681 13765 13017 9301 4393 10215 19009 13084 3994 8701 12510 9355 11636
707 11636 14431 6166 2396 11171 14168 8282 6628 7053 5352 7268 10557 6808 4718 5966 3488
722 3488 4197 11483 9427 -3168 -1626 10490 9759 2472 1841 1879 1744 7238 8690 1249 -1403 3174
738 3174 5260 6099 6276 -445 -2838 6517 10437 2100 92 4565 2105 711 8385 8604 190 -1141
754 -1141 3634 5372 7248 6359 -801 -2118 7010 9587 4336 1578 726 967 7774 12253 1976 -4747
770 -4747 4481 11321 6518 3900 3321 1493 4272 10530 7880 2755 4107 3963 4081 9885 10275 1455
786 1455 -663 5940 8261 7754 7978 2026 -2931 5629 13899 6400 -1719 413 4395 6897 8292 3423
802 3423 -3138 1431 7464 5147 1669 1706 -1014 572 7180 5738 -1991 -1426 2696 1247 2406 6210
$$ packed form
691A4816r35p932P72N960J084p48l716m908N822Q794n925r090M707L809l155K281
707A1636K795q265l770Q775K997n886j654M25j701J916L289l749k090J248k478
722C488P09P286k056j2595J542J2116p31p287o31L8j35N494J452p441k652M577
738C174K086Q39J77o721k393R355L920q337k008M473k460j394P674K19q414j331
754a141M775J738J876q89p160j317R128K577n251k758q52K41O807M479j0277o723
770d747R228O840m803k618n79j828K779O258k650n125J352j44J18N804L90q820
786A455k118O603K321n07K24n952m957Q560Q270p499q119K132L982K502J395m869
802C423o561M569O033k317l478L7k720J586O608j442p729N65M122j449J159L804
$$ plain form
818 6210 1625 -5237 -220 6456 5186 1121 -2427 -3830 2652 9321 3133 -4338 -1625 2126 3159
833 3159 5322 3337 -5208 -4027 6575 6506 -1284 -1536 667 -345 1596 3956 434 -1874 72 161
849 161 1556 4435 -497 -7153 -905 7121 2759 -3432 -1886 -1542 -1540 4521 4839 -4439 -6636 651 4707
866 4707 3136 -599 -4891 -3311 4267 4567 -1776 -2283 568 -2049 -814 5391 2308 -5119 -3396 2757
882 2757 1712 223 651 -2377 -2365 2176 2403 -1552 -2204 -2013 -1812 3195 3519 -4981 -6995 2241 4674
899 4674 -1556 -2930 -1640 -3045 -443 3500 61 -4264 -2212 -302 171 2376 508 -4684 -2481
914 -2481 2530 563 -1137 832 -1166 -4496 568 4734 -425 -4403 -991 718 1030 1423 -2314 -4953
930 -4953 183 3389 -557 -2529 -1247 -2070 -1582 2370 364 -5152 -2273 1307 -509 -1953 -157 -2112
$$ packed form
818F210m585o862N017O676j270m065l548j403O482O669o188p471K713L751J033
833C159K163j985q545J181J0602o9p790k52K203j012J941K360l522k308J946Q9
849A61J395K879m932o656O248Q026m362o191J546L44KO061L18r278k197P287M056
866D707j571l735m292J580P578L00o343n07K851k617J235O205l083p427J723O153
882B757j045j489M28l028J2M541K27l955o52J91K01N007L24q500k014R236K433
899D674o230j374J290j405K602L943l439m325K052J910M73K205j868n192K203
914b481N011j967j700J969j998l330N064M166n159l978L412J709L12L93l737k639
930d953N136L206l946j972J282q23M88L952k006n516K879L580j816j444J796j955
$$ plain form
946 -2112 -3481 469 880 -2564 -1419 -1040 -3472 -1848 2468 -481 -4904 -2317 149 -1194 -189 -638
962 -638 -4151 -2132 2550 -287 -4515 -1624 -55 -2025 -546 213 -3501 -3425 746 -99 -3901 -1655
978 -1655 -670 -3321 -1952 -566 -2915 -2215 -755 -2992 -4073 286 -114 -5297 -3853 536 -1351 -3591
994 -3591 -1988 -2178 -4143 -1195 -613 -3889 -2888 -775 -1987 -2630 -996 -3153 -3587 -66 213 -4853
1010 -4853 -2753 1408 -1860 -4834 -1120 -125 -2440 -2178 -1854 -2782 -1135 -46 -2804 -3706 -543 -1709
1026 -1709 -3069 -274 -877 -4271 -2127 1145 -2156 -4350 -614 222 -3489 -2989 -500 -365 -1289 -2006
1042 -2006 -3299 -1536 1846 -878 -4347 -1360 1134 -1860 -1158 806 -2451 -3898 858 1390 -2729
1057 -2729 -2568 221 -450 -1053 -324 -2255 -1422 -86 -1211 -2296 644 66 -4450 -2922 2348 248
$$ packed form
946b112j369L950M11l444J145L79k432J624M316k949m423K587K466j343J005m49
962f38l513K019M682k837m228K891J569j970J479P59l714P6M171q45l802K246
978a655R85k651J369J386k349P00J460k237j081M359m00n183J444M389j887k240
994c591J603j90j965K948N82l276J001K113j212o43J634k157m34L521K79n066
1010d853K100M161l268k974L714R95k315K62L24r28J647J089k758r02L163j166
1026a709j360K795o03l394K144L272l301k194L736Q36l711N00K489J35r24p17
1042b006j293J763L382k724l469K987K494k994P02J964l257j447M756N32m119
1057b729J61K789o71o03P29j931Q33J336j125j085K940n78m516J528N270k100
$$ plain form
1073 248 -3829 -2459 -1118 -1982 -153 459 -3282 -4263 -380 232 -1003 -1899 -3869 -3390 1110 1432 -3622
1090 -3622 -4069 -158 -1134 -2820 -107 -209 -4162 -3044 322 -391 -1693 -1571 -3176 -2857 491 168 -3502
1107 -3502 -3447 -1480 -1922 180 657 -4079 -6262 -241 2170 -2174 -4316 -3041 -2998 -1069 899 -2296
1123 -2296 -5316 -2758 -660 -1389 -1054 -1662 -4965 -3548 677 -305 -2914 -2332 -2551 -3724 -560 1754
1139 1754 -2650 -5664 -2042 220 170 -295 -2936 -4638 -562 2792 -324 -3822 -2479 -1495 -673 1641
1155 1641 -243 -5244 -2913 1441 134 -1576 -982 -2323 -2724 366 1708 -1632 -2918 -2078 -1300 398
1171 398 1836 -1959 -4891 -1734 1738 618 -966 -1785 -3647 -1536 3223 1403 -3997 -3477 110 1007
1187 1007 993 -457 -3252 -2698 1169 1571 -1114 -1800 -1553 -2346 281 2288 -1364 -3928 -1719 -28 -310
$$ packed form
1073B48m077J370J341q64J829O12l741r81L883O12j235q96j970M79M500L22n054
1090c622m47L911r76j686K713j02l953J118L366p13j302J22j605L19L348l23l670
1107c502N5J967m42K102M77m736k183O021K411m344k142J275M3J929J968l195
1123b296l020K558K098p29L35o08l303J417M225r82k609N82k19j173L164K314
1139A754m404l014L622K262n0m65k641j702M076L354l116l498J343R84Q22K314
1155A641j884n001K331M354j307j710N94j341m01L090J342l340j286Q40P78J698
1171C98J438l795k932L157L472j120j584q19j862K111M759j820n400N20L587Q97
1187A007j4j450k795N54L867M02k685o86K47p93K627K007l652k564K209J691k82
$$ plain form
1204 -310 801 -925 -4336 -2856 1695 1434 -2099 -3001 -2811 -1582 2110 1094 -4226 -4289 246 865 -280
1221 -280 -907 -2887 -3550 27 2097 -1226 -3173 -1799 -1288 -673 1280 -327 -3392 -1941 298 253 41
1238 41 -10 -3102 -3291 1796 2320 -2145 -3227 -1470 -941 1331 1189 -2902 -4188 -142 1861 -769 -1991
1255 -1991 -1845 -2459 -322 1720 -1332 -3288 -1364 -91 -1001 -299 61 -2958 -2630 332 370 -1009 -985
1272 -985 -1993 -2853 664 2272 -1136 -3618 -1068 -15 55 310 -1882 -3356 -858 1990 -592 -2435
1288 -2435 -1334 -819 -630 697 -326 -2989 -1590 587 -622 -1031 176 -1239 -2393 -6 1156 -516
1304 -516 -1514 -542 -1479 -194 2137 -221 -2713 -797 1638 424 149 -405 -1417 -587 2191 1041 -2119
1321 -2119 -488 844 56 378 485 -718 -653 1147 525 -814 361 862 -1284 -506 1254 184 -1165
$$ packed form
1204c10J111j726l411J480M551k61l533r02J90J229L692j016n320o3M535O19j145
1221b80o27j980o63L577K070l323j947J374N11O15J953j607l065J451K239m5k12
1238D1n1l092j89N087N24m465j082J757N29K272j42m091j286M046K003k630j222
1255a991J46o14K137K042l052j956J924J273r10P02L60l019L28K962L8j379K4
1272i85j008q60L517J608l408k482K550J053P0K55k192j474K498K848k582j843
1288b435J101N15J89J327j023k663J399K177j209m09J207j415j154K387J162j672
1304e16r98R72r37J285K331k358k492J916K435j214k75n54j012Q30K778j150l160
1321b119J631J332p88L22J07j203O5J800o22j339J175N01k146P78J760j070j349
$$ plain form
1338 -1165 -21 84 -120 1043 501 -1932 -1010 1474 200 -1307 -392 -628 -1072 818 571 -1847 -1501
1355 -1501 1007 -262 -1197 -413 -602 -1215 -379 -171 -1543 -712 545 -615 -1638 246 72 -1776 -556
1372 -556 104 -1119 -738 37 -1106 -1549 447 148 -1446 -804 281 -762 -692 454 -929 -1331 910
1389 910 410 -1807 -860 818 -482 -757 -327 -1100 -847 1177 516 -1565 -728 562 -259 -291 511 -744
1407 -744 -1064 828 1027 -878 -132 429 -705 -721 977 421 -900 260 435 -568 468 819 -1030
1424 -1030 -911 1373 669 -1019 -298 -90 -393 1088 943 -1260 -1575 886 1011 -169 -212 -611 -1302 655
1442 655 1845 -762 -1526 143 430 -425 806 632 -1292 -432 925 111 151 576 -572 -1368 1380 1443
1460 1443 -1128 -1313 251 180 996 949 -1068 -1896 624 1927 258 -1097 -433 -664 482 1620 -495
$$ packed form
1338a165J144J05k04J163n42k433R22K484j274j507R15k36m44J890k47k418L46
1355a501K508j269r35P84j89o13Q36K08j372Q31J257j160j023J884j74j848J220
1372e56O60j223L81P75j143m43J996k99j594O42J085j043P0J146j383m02K241
1389I10n00k217R47J678j300k75M30p73K53K024o61k081Q37J290q21l2Q02j255
1407g44l20J892J99j905P46N61j134j6J698n56j321J160J75j003J036L51j849
1424a030J19K284p04j688P21K08l03J481j45k203l15K461J25j180m3l99o91J957
1442F55J190k607p64J669K87q55J231j74j924Q60J357q14M0M25j148p96K748O3
1460A443k571j85J564p1Q16m7k017q28K520J303j669j355O64k31J146J138k115
$$ plain form
1477 -495 -1828 -329 1029 -88 63 523 -1374 -1368 536 1131 -250 -566 -769 -1311 663 2028 -292
1494 -292 -2316 -456 1069 546 336 -790 -2156 107 2362 735 -1694 -1103 117 282 745 -140 -1666
1511 -1666 -996 778 442 -461 50 -784 -1429 491 1306 -237 -1377 -728 -220 216 1322 -320 -2321
1528 -2321 -1317 1281 771 -146 -1103 -1908 -125 1938 637 -2370 -1375 722 759 478 179 -1134 -1133 641
1546 641 1334 -143 -406 -313 -1146 192 1966 253 -1526 -511 287 507 998 259 -1992 -1257 2167 1350
1564 1350 -857 -1211 -592 22 1467 1217 -1311 -1113 849 1002 -84 399 -254 -1132 381 1746 78
1581 78 -919 92 -243 286 1468 909 -1264 -902 794 1047 904 266 -1330 -866 1883 1933 -594 -1254
1599 -1254 325 507 1032 984 -389 -1489 473 1196 279 59 -51 -619 6 1318 223 -1205 -247 386
$$ packed form
1477d95j333J499J358j117J51M60j897OJ904N95j381l16k03n42J974J365k320
1494b92k024J860J525n23k10j126j366K263K255j627k429N91J220J65M63q85j526
1511a666O70J774l36r03N11q34o45J920Q15j543j140O49N08M36J106j642k001
1528b321J004K598n10r17r57q05J783K063j301l007R95K097L7k81k99j313JJ774
1546F41O93j477k63R3q33J338J774j713j779J015P98K20M91p39k251P35L424q17
1564A350k207l54O19O14J445k50k528J98J962J53j086M83o53q78J513J365j668
1581G8r97J011l35N29J182n59k173L62J696K53j43o38j596M64K749N0k527o60
1599a254J579J82N25m8j373j100J962P23r17k20j10n68O25J312j095j428R58O33
$$ plain form
1617 386 70 692 606 -1203 -1391 560 956 -380 -760 -909 -759 862 1404 -710 -1708 -313 194 20
1635 20 456 -258 -2039 -312 1282 96 -1004 -522 -452 -374 351 205 -985 -880 278 -387 -140 322 -432
1654 -432 -1474 215 961 -542 -874 6 -163 -292 947 417 -1155 -570 858 544 111 -88 -1086 -392
1672 -392 1268 542 -1003 -3 991 -8 22 789 -320 -591 275 725 266 299 266 -852 210 930 328
1691 328 -286 344 208 -315 1118 988 -1124 -626 1001 637 -939 -358 258 -118 166 421 -398 -429 570
1710 570 22 -212 372 142 -977 183 361 -716 -530 553 -69 -1193 130 541 -500 -592 -34 -77
1728 -77 418 269 -691 -748 638 191 -580 48 220 -595 -166 398 -231 -769 195 319 -563 -669 628 280
1748 280 -528 -166 -525 173 700 -203 -1175 -256 426 -338 -583 391 -211 -808 82 142 -908 -673 392 -211
$$ packed form
1617C86l16O22q6j809j88J951L96j336l80j49J50J621N42k114r98J395N07j74
1635B0M36p14j781J727J594j186j100M82P0P8P25j46j190J05J158o65K47M62p54
1654d32j042J689P46j503l32Q80j69j29J239n30j572N85J428l14m33j99r98O94
1672c92J660p26j545J000R94r99L0P67j109k71Q66M50m59L3l3j118J062P20o02
1691C28o14O30j36n23J433j30k112M98J627l64j576N81O16l76K84K55q19l1R99
1710E70n48k34N84k30j119J160J78j077J86J083o22j124J323M11j041r2N58m3
1728g7M95j49r60n7J386m47p71O28J72q15M29N64o29n38R64J24q82j06J297l48
1748B80q08L62l59O98N27r03r72R19O82p64k45R74o02n97Q90O0j050K35J065o03
$$ plain form
1768 -211 -589 -220 377 -620 -582 -254 -409 503 261 -1327 -1061 830 547 -1190 -429 -47 -580 -253 383
1787 383 -1161 -1097 52 238 -613 -683 -681 -539 -179 77 -686 -870 218 -382 -1046 268 275 -1196 -934 67
1807 67 -157 -651 -347 -750 -1055 134 520 -360 -1112 -323 -143 231 192 -530 -1171 399 868 -596 -976 516
1827 516 228 -353 413 39 -593 -315 249 -104 19 208 -810 -436 670 544 -312 -339 -193 -759 355
1846 355 823 -512 -1505 -93 1029 224 -217 -572 -581 188 869 -326 -821 -416 -186 -52 185 101 -511 -782
1866 -782 478 -32 -306 -81 -274 -1299 -187 850 -164 -748 -466 -553 44 419 -797 -1619 -532 598
1884 598 -392 -756 -559 -903 -739 870 143 -1177 -997 260 93 -284 -182 -412 -647 -13 130 -397 -296
1903 -296 -779 -1221 -325 849 82 -1224 -214 -101 82 303 -244 -695 -1361 980 296 -798 -731 -686 -95
$$ packed form
1768b11l78L69N97r97L8L28j55R12k42j588K66J891k83j737P61L82n33L27O36
1787C83j544O4J149J86q51p0KJ42L60K56p63j84J088o00o64J314Pj471K62J001
1807F7k24m94L04m03l05J189L86q80p52P89J80L74l9p22o41J570M69j464l80J492
1827E16k88n81P66l74o32K78N64l53J23J89j018L74J106j26q56k7J46n66J114
1846C55M68j335r93J412J122q05m41l55rP69O81j195m95M05K30J34K37q4o12k71
1866g82J260n10k74K25j93j025J112J037j014n84K82q7N97L75j216q22J087J130
1884E98r90l64J97l44J64J609p27j320J80J257j67l77J02k30k35O34J43n27J01
1903b96m83m42Q96J174p67j306J010J13J83K21n47m51o66K341o84j094O7M5N91
$$ plain form
1922 -95 698 224 -1084 -954 194 210 -217 -42 -573 -960 -229 707 -29 -646 -341 -330 -275 598 92 -877 -695
1943 -695 92 318 260 -55 -790 -1031 423 705 -855 -1047 -6 -34 162 22 -397 -1033 -46 784 41 -340
1963 -340 131 -570 -224 766 273 -738 -83 317 -322 135 442 -414 -815 471 609 55 -314 -428 -744
1982 -744 417 679 -439 -609 127 454 119 -140 -265 -691 211 826 115 -573 26 -222 -234 362 216 -380
2002 -380 -324 -105 -235 24 352 -38 -844 30 741 -156 -526 -504 -674 214 585 -392 -1165 -404 342 -9 -460
2023 -460 -84 -825 -637 504 258 -560 -359 -24 -325 202 317 -300 -664 -15 150 -329 84 132 -821 -496
2043 -496 612 435 -470 -150 189 -132 217 12 -662 -370 533 338 -318 -64 -51 -549 89 414 -528 -127
2063 -127 196 -123 -133 495 56 -426 30 301 -140 16 175 -554 -557 383 629 -304 -144 73 32 356 509
$$ packed form
1922i5P93m74j308J30J148J6m27J75n31l87P31R36p36o17L05J1N5Q73n06r69J82
1943f95P87K26n8l15p35k41J454K82j560j92J041k8J96j40m19o36R87Q30p43l81
1963c40M71p01L46R90m93j011O55M00o39M57L07q56m01J286J38n54l69j14l16
1982g44J161K62j118j70P36L27l35k59j25m26R02O15p11o88N99k48j2N96j46n96
2002c80N6K19j30K59L28l90q06Q74P11q97l70K2j70Q88L71r77p73P61P46l51m51
2023d60L76p41J88J141k46q18K01L35l01N27J15o17l64O49J65m79M13M8r53L25
2043d96J108j77r05L20L39l21L49k05o74K92R03j95o56K54J3m98O38L25r42M01
2063a27L23l19j0O28m39m82M56K71m41J56J59p29lR40K46r33J60K17m1L24J53
$$ plain form
2084 509 -199 -349 528 550 -162 106 238 -218 -339 496 -269 -176 719 268 -685 -43 171 -233 -108 483 285
2105 285 -88 415 -84 -554 423 896 -93 -122 313 122 -329 602 141 -213 348 535 56 -217 100 160 -226
2126 -226 300 22 -85 331 243 87 -224 460 280 -579 28 254 -29 231 439 65 -479 607 136 -350
2146 -350 3 360 -146 -41 497 -14 -175 432 -30 -226 67 49 -351 -478 434 208 -336 184 -42 -17 376
2167 376 328 -120 92 568 239 200 63 -113 -289 499 498 -223 13 341 -100 -150 530 380 -242 233 372 -38
2189 -38 150 670 -45 -63 657 407 194 330 336 -77 502 898 -202 -575 233 909 153 256 22 -127 198
2210 198 670 313 -62 239 517 279 459 765 -40 195 626 236 241 644 525 -271 383 939 502 87 496
2231 496 26 768 812 121 -604 204 867 327 126 56 -352 353 883 931 -187 72 745 459 356 452 144
$$ packed form
2084E09p08j50Q77K2p12K68J32m56j21Q35p65R3Q95m51r53O42K14m04J25N91j98
2105B85l73N03m99m70R77M73r89k9M35j91m51R31m61l54N61J87m79k73L17O0l86
2126b26N26k78j07M16q8j56l11O84j80q59O07K26k83K60K08l74n44J086m71m86
2146c50L53L57n06J05N38n11j61O07m62j96K93j8m00j27R12k26n44N20k26K5L93
2167C76m8m48K12M76l29l9j37j76j76P88jp21K36L28m41n0O80j50o22M75J39m10
2189c8J88N20p15j8P20k50k13J36Om13N79L96j100l73Q08O76p56J03k34j49L25
2210A98M72l57l75L01K78k38J80L06q05K35M31l90NM03j19p96O54N56m37m15M09
2231D96m70P42M4o91p25Q08O63n40k01p0m08P05N30M8j118K59O73k86j03R6l08
$$ plain form
2252 144 28 377 751 559 476 131 -547 159 1146 484 -413 41 568 290 479 483 -411 117 1004 609 -163
2273 -163 -333 101 420 675 571 -312 3 526 248 106 192 54 -387 404 683 349 -112 -32 -292 29 491
2294 491 533 -505 -80 447 607 648 144 -65 -239 512 785 -196 -304 441 336 395 355 19 -166 191 536
2315 536 374 165 363 -129 279 619 677 -42 59 528 -63 653 571 -45 -305 519 916 451 70 -135 -57
2336 -57 1028 815 -76 -26 434 727 360 440 501 -134 300 875 223 -2 266 21 -119 551 575 351 101
2357 101 162 262 853 649 -12 -189 373 1056 147 -242 279 78 387 784 253 -452 246 583 597 191 112
2378 112 -64 166 754 308 -169 326 406 103 429 662 461 -453 114 442 105 106 250 -462 -39 975 243
2399 243 -248 69 -97 158 624 250 -334 -19 531 320 -90 279 272 165 327 562 -73 -85 98 134 227 457
$$ packed form
2252A44j16L49L74j92q3l45o78P06R87o62q97M54N27k78J89Mq94N28Q87l95p72
2273a63j70M34L19K55j04q83L15N23k78j42Q6j38m41P91K79l34m61Q0k60L21M62
2294D91M2j038M25N27J60M1n04k09j74P51K73r81j08P45j05N9m0l36j85L57L45
2315E36j62k09J98m92M08L40N8p19J01M69n91P16q2o16k60Q24L97m65l81k05P8
2336e7J085k13q91N0M60K93l67Q0O1o35M34N75o52k25K68k45j40O70K4k24k50
2357A01O1J00N91k04o61j77N62O83r09l89N21k01L09L97n31p05O98L37J4m06p9
2378A12j76K30N88m46m77M95Q0l03L26K33k01r14N67L28l37JJ44p12M23J014p32
2399B43m91L17j66K55M66l74n84L15N50k11m10L69pj07J62K35o35j2J83L6R3K30
$$ plain form
2421 457 179 -304 146 684 227 245 322 34 -428 668 541 -313 -198 268 508 228 100 31 -30 286 613
2442 613 126 -1 187 125 86 410 -27 -152 231 144 -80 292 640 161 70 506 -2 321 29 -8 -42 868
2464 868 475 -319 -351 201 516 -213 178 430 -277 690 658 73 266 778 464 -141 427 509 64 105 127 -130
2486 -130 30 647 212 -387 215 312 356 -195 569 109 -24 678 231 -414 361 202 162 -94 -259 84 309
2507 309 360 -32 -398 189 418 -203 -201 399 89 -205 168 294 -269 278 465 33 -88 353 -172 8 381
2528 381 -111 -59 65 267 -314 141 331 -70 -157 14 178 -486 -79 -8 -245 176 250 -293 31 53 276 10
2550 10 48 90 45 -60 489 -113 -462 129 368 -376 -187 -307 -223 89 262 10 -532 -374 67 -211 117 94
2572 94 -188 48 345 281 -371 345 -265 -336 163 480 249 -62 -15 155 233 248 -183 -644 298 485 -54 -133
$$ packed form
2421D57k78m83M50N38m57J8P7k88m62J096j27q54J15M66K40k80j28o9o1L16L27
2442F13m87j27J88o2l9L24m37j25L83q7k24L72L48m79r1M36n08L23k92l7l4R10
2464H68l93p94l2N52L15p29L91K52p07R67l2n85J93N12l14o05N68Q2m45M1K2k57
2486a30J60O17m35n99O02R7M4n51P64m60j33P02m47o45P75j59m0k56j65L43K25
2507C09N1l92l66N87K29o21KO00l10k94L73J26n63N47J87m32j21M41n25J80L73
2528C81m92N2J24K02n81M55J90m01q7J71J64o64M07P1k37M21P4n43L24K2K23k66
2550A0L8M2m5j05N49o02l49N91K39p44J89j20Q4L12J73k52n42J58M41k78L28k3
2572I4k82K36K97o4o52P16o10p1M99L17k31l11M7J70P8J5m31m61R42J87n39p9
$$ plain form
2594 -133 -96 -288 53 193 205 -154 -17 526 -139 -88 208 -6 -450 349 377 58 40 -10 -633 -99 789 165
2616 165 -256 -265 266 135 115 26 -286 241 501 16 -539 29 -159 -3 -175 -47 -243 -267 173 218 -410 7
2638 7 -160 -468 105 368 211 -526 -212 -227 65 367 -77 -646 -272 672 -137 60 -6 -501 -555 458 268
2659 268 -326 49 -151 -21 90 71 -367 -657 -121 184 -228 -33 -408 -203 -329 428 11 -193 -347 -266 130
2680 130 136 165 -458 -246 463 391 -99 -6 -212 -361 198 378 -364 -821 -310 202 -233 -194 -176 -587 42 -5 -109
2703 -109 -442 7 -246 -307 274 -33 -367 -394 189 298 173 -116 -481 -170 311 519 -111 -386 -109 -117 -54 466
2725 466 -296 -558 -34 215 -232 -59 73 -20 -152 254 215 -199 -175 118 -116 -5 635 -327 -375 273 355 190
2747 190 85 -65 -473 66 368 -51 -415 231 223 19 -136 3 -356 -62 406 -25 -198 -174 38 -226 140
$$ packed form
2594a33L7j92L41J40J2l59J37N43o65N1K96k14m44P99K8l19j8n0o23N34Q88o24
2616A65m21rN31j31k0q9l12N27K60m85n55N68j88J56j72J28j96k4M40M5o28M17
2638Gj67l08N73K63j57p37L14j5K92L02m44n69L74R44q09J97o6m95n4J013j90
2659B68n94L75k00J30J11j9m38k90N36L05m12J95l75K05j26P57m17k04j54Q1L96
2680A30OK9o23K12P09p2m90R3k06j49N59J80p42m57N11N12m35L9J8m11O29m7j04
2703a09l33M49k53o1N81l07l34k7N83J09j25k89l65L11M81K08o30k75K77qO3N20
2725D66p62k62N24K49m47J73J32r3j32M06l9m14K4K93k34J11O40r62m8O48Q2j65
2747A90j05j50m08N39L02m19l64O46qk04j55J39l59K94M68m31j73K4K12k64L66
$$ plain form
2768 140 195 -463 -294 -104 -451 -198 518 -59 -510 91 162 357 -220 -297 -339 -43 412 -125 -641 -32 -14 317
2790 317 42 85 -193 -72 167 -97 -159 -52 219 -154 62 274 -409 -129 -322 247 -137 315 226 -157 -164 110
2812 110 37 -243 41 -28 -39 -55 122 -513 -235 48 217 -6 189 -52 -197 100 172 -374 -158 401 -49 -211
2834 -211 125 26 -227 209 -20 -321 82 144 -52 -8 137 84 -157 119 -67 208 62 216 -195 -338 8
2855 8 164 -225 76 82 -7 16 353 24 15 -90 192 -88 181 491 -90 30 349 92 27 427 42 -145 -72
2878 -72 432 168 -333 65 -212 38 299 52 38 329 279 -76 37 185 196 -270 101 9 -14 0 392 -373
2900 -373 164 42 301 -51 159 173 84 56 448 -324 -43 471 227 -208 -214 231 -154 23 -108 -197 -60 495
2922 495 310 -171 398 287 -364 -333 23 -81 120 266 -285 -102 11 468 -274 -239 155 108 -107 -11 -274
$$ packed form
2768A40N5o58J69J90l47K53P16n77m51O01P1J95n77p7m2K96M55n37n16O09J8L31
2790C17k75M3k78J21K39k64o2J07K71l73K16K12o83K80j93N69l84M52q9l83pK74
2812A10p3k80K84o9j1j6J77o35K78K83J69k23J95k41j45K97P2n46K16N59m50j62
2834b11L36r9k53M36k29l01M03O2j96M4J45n3k41K76j86K75j46J54m11j43L46
2855HJ56l89L01Oq9K3L37l29rj05K82k80K69L10n81J20L19k57o5M00l85j87P3
2878g2N04k64n01L98k77K50K61k47j4K91n0l55J13J48J1m66L71r2k3J4L92p65
2900c73N37j22K59l52K10J4q9k8L92p72K81N14k44m35oM45l85J77j31q9J37N55
2922D95j85m81N69j11o51L1L56j04K01J46n51J83J13M57p42L5L94m7k15R6k63
$$ plain form
2943 -274 -293 470 243 8 37 112 -208 -180 178 136 -271 99 330 -230 267 13 19 9 17 155 333 -57 -57 -285
2967 -285 -8 513 -261 -404 194 207 119 -68 34 -364 505 455 -61 -356 32 545 149 69 223 42 88 455
2989 455 251 110 408 303 157 135 560 146 0 98 -119 146 229 261 -646 -151 400 75 222 186 6 122
3011 122 259 246 -162 95 501 -37 -415 -169 -70 223 79 67 -126 -236 125 -179 -211 614 -323 -281 -153 246
3033 246 -199 521 -147 -172 -183 281 163 -283 86 205 82 246 159 8 -30 -18 -248 -227 187 -87 -262 -27
3055 -27 -40 302 216 0 -60 -348 546 151 -255 -393 200 239 -90 250 -173 -344 665 407 -62 56 195
3076 195 260 361 156 27 -471 227 351 -163 274 144 -192 -351 567 139 -96 99 -93 206 191 199 71
3097 71 -192 189 330 -58 282 84 -324 -175 322 248 -220 415 96 8 140 270 17 154 189 -520 -146
$$ packed form
2943b74j9P63k27k35K9P5l20K8L58m2m07L70K31n60M97k54Oj0QJ38J78l90%k28
2967b85K77N21p74j43N98J3q8j87J02l98Q69n0n16k95L88N13l96q0J54j81M6L67
2989D55k04j41K98j05j46k2M25m14j46R8k17K65Q3L2r07M95N51l25J47l6j80J16
3011A22J37j3m08K57M06n38l78K46R9K93j44j2j93j10L61l04l2Q25r37M2J28L99
3033B46m45P20o68k5j1M64j18m46L69J19j23J64q7j51l8J2k30K1M14k74j75K35
3055b7j3L42q6k16o0k88Q94l95m06j38N93L9l29L40m23j71J009k58m69J18J39
3076A95O5J01k05j29m98O98J24n14M37j30l36j59R18m28k35J95j92K99j5Qj28
3097G1k63L81J41l88L40j98m08J49M97p4m68O35l19q8J32J30k53J37L5p09L74
$$ plain form
3118 -146 255 186 -242 370 90 -225 125 -44 -127 80 107 253 -220 24 162 -120 118 115 71 44 106 -186 -448
3141 -448 -194 291 -6 -77 -301 -192 -101 309 168 -11 71 -154 -61 160 307 -200 -56 57 -16 12 115 -84
3163 -84 -196 238 104 292 49 -111 -247 -75 315 39 -384 -113 130 44 -427 -331 237 -413 34 106 -267
3184 -267 255 -166 -64 -377 127 187 -203 15 176 98 15 311 -128 -96 291 190 -204 19 353 -212 -52
3205 -52 240 -25 -148 229 -147 -220 -205 221 -43 -108 106 -186 -91 109 269 -197 147 262 -183 -194 101 16
3227 16 272 281 -52 -199 8 59 -147 -150 13 76 79 254 124 -122 358 279 -147 -212 330 -4 -185 95 331 -177
3251 -177 -20 304 -351 51 170 -116 -173 217 124 -108 45 -164 -396 267 73 -60 245 -203 17 -43 -358
3272 -358 -33 -381 -432 -1 52 -81 232 -77 -265 -113 -31 -88 -191 81 -60 20 43 -1 -222 -263 -48 -281 -14
$$ packed form
3118a46M01o9m28O12k80l15L50j69q3K07K7J46m73K44J38k82K38lm4k7O2k92k62
3141d48K54M85k97p1k24J09R1M10j41j79Q2k25R3K21J47n07J44J13p3K8J03j99
3163h4j12M34j34J88k43j60j36J72L90k76m23K71K43q6m71R6N68o50M47P2l73
3184b67N22m21J02l13N04O0l90K18J61p8q3K96m39L2L87j01l94K23L34n65J60
3205e2K92k65j23L77l76p3J5M26k64o5K14k92R5K00J60m66L44J15m45j1K95q5
3227A6K56Rl33j47K07N1k06lJ63O3LJ75j30k46M80p9m26o5N42l34j81K80K36n08
3251a77J57L24o55M02J19k86n7L90r3k32J53k09k32O63j94j33L05m48K20o0l15
3272c58L25l48n1M31N3j33L13l09j88J52Q2n7j03K72j41Q0K3m4k21m1K15k33K67
$$ plain form
3295 -14 -276 -11 -112 -149 231 -550 -62 -15 88 -297 -238 -35 152 -31 -198 -300 154 200 -245 -386 158 171
3317 171 -373 -96 -84 -199 103 80 -172 -229 -61 154 -79 -148 -311 -258 122 -70 -84 -90 -46 -366 -427 -62 79
3340 79 -157 -15 107 -79 -113 99 -174 -354 151 138 -161 -146 -16 -127 -88 292 -124 -91 17 242 -2 -107
3362 -107 -71 183 407 59 26 -232 -82 -206 -109 -189 44 -171 -296 113 280 -319 -112 35 -671 165 -38
3383 -38 -166 -245 -153 178 76 -170 35 -15 315 298 -114 -202 19 36 -174 -287 -187 -258 7 -63 150 -76 216
3406 216 -118 -98 97 148 -272 -343 8 -300 328 -169 15 -356 -61 -3 194 5 -332 -508 -121 -29 -110 21
3428 21 -408 109 77 34 8 -418 -398 42 -206 -71 -82 130 -232 -240 66 -320 58 -348 -224 -389 -132 121 -2
3451 -2 -356 -196 207 15 -291 -299 -499 -50 132 -254 -398 -88 -70 -243 -265 58 -160 -469 -131 67 -116 -56
$$ packed form
3295a4k62K65j01l7L80p81M88M7J03l85N9K03J87j83j67j02M54M6m45j41N44J3
3317A71n44K77J2j15L02k3k52n7J68K15k33o9j63N3L80j92j4oM4l20o1L65J41
3340G9k36J42J22j86l4K12k73j80N05j3k99J5J30j11L9L80m16L3J08K25k44j05
3362a07L6K54K24l48l3k58J50j24R7q0K33k15j25M09J67n99K07J47p06Q36k03
3383c8j28p9R2L31j02k46K05n0L30j7m12q8K21J7k10j13J00p1K65p0K13k26K92
3406B16l34K0J95N1m20p1L51l08O28m97J84l71K95N8J97j89l37j76L87R2q1J31
3428B1m29N17l2m3k6m26K0M40k48J35j1K12l62qL06l86L78m06J24j65K57K53j23
3451bl54J60M03j92l06qk00M49J82l86j44L10J8j73k2L23k18l09L38J98j83O0
$$ plain form
3473 -56 -209 6 -245 -248 -262 -85 -167 -7 -85 -67 297 -306 83 278 -154 -15 -101 -240 -26 75 233 -340 26
3496 26 162 155 143 -224 -165 -200 186 -27 -109 325 -36 -208 118 74 112 -356 -31 6 -92 310 -31 -206 -22 -57
3520 -57 -39 169 10 -61 -211 -11 -120 -403 -78 107 137 -242 -109 -5 -15 -159 345 4 48 27 -106 -55 -73
3543 -73 232 -214 -43 197 -52 -52 -29 -136 -269 -91 -125 -118 -155 -155 -8 -167 118 -335 -86 142 -115 -1 -56 -28
3567 -28 121 -12 119 -260 -338 -286 61 -120 -9 -11 -100 263 37 -129 -86 253 -328 135 199 191 -154 -115 325 -422
3591 -422 -225 23 -315 -255 -99 -293 -317 94 285 -107 -96 166 12 180 317 -83 -98 -203 76 -168 -169 67
3613 67 396 -80 -11 362 -272 147 4 13 -52 159 126 -102 -151 -224 97 358 58 420 -130 -112 369 36 30 201
3637 201 -35 193 48 -518 84 -34 -95 -362 -55 325 210 14 39 -103 298 122 -14 -161 66 56 57 57
$$ packed form
3473e6j53K15k51lj4J77q2J60p8J8L64o03L89J95m32J39q6j39K14J01J58n73L66
3496B6J36pj2l67N9l5L86k13q2M34l61j72L26m4L8m68L25L7r8M02l41j75J84l5
3520e7J8K08j59p1j50K00j09k83L25J85L0l79J33J04j0j44N04l41M4k1j33N1j8
3543g3L05m46J71K40k49%K3j07j33J78l4Pl7%J47j59K85m53K49K28k57J14n5K8
3567b8J49j33J31l79p8N2L47j81J11kq9L63k26j66M3L39n81M63O4ql45L9M40p47
3591d22J97K48l38O0J56j94k4M11J91l92J1K62j54J68J37m00j5j05K79k44jK36
3613F7L29m76O9L73o34M19j43Ro5K11l3k28m9p3L21K61l00L62n50J8M81l33oJ71
3637B01k36K28j45n66O02j18o1k67L07L80j15j96K5j42M01j76j36j47K27j0J%
$$ plain form
3659 57 -125 -87 80 107 -184 -283 -157 -113 -256 -89 322 100 -150 -148 108 10 -145 61 -238 142 401 6 -162
3682 -162 -279 80 -88 -118 130 -23 217 -284 -172 -213 196 156 -218 -103 358 98 -301 -95 -327 -199 -76
3703 -76 308 132 -193 3 43 97 131 48 135 27 -4 -370 -32 78 123 -48 317 31 -85 132 117 -100 117
3726 117 82 19 103 -250 -26 71 144 53 287 12 120 -267 -75 75 -31 -78 97 -106 -215 342 128 -92
3748 -92 -149 -138 290 146 -92 40 -309 -57 -66 -54 90 64 220 -41 123 -222 201 -64 51 -144 -43 73
3770 73 50 -64 -158 160 -23 -83 -107 -19 -176 393 -322 -47 -132 52 243 14 338 -92 -34 -156 -569 44 302
3793 302 14 54 114 278 258 -51 216 149 -291 -102 25 -341 140 168 201 -153 -215 -108 -54 -49 6 19 121 231
3817 231 -102 160 -165 -66 -211 17 47 45 -106 148 167 159 -100 -43 -387 -93 156 98 -42 -77 -71 105 234 -51
$$ packed form
3659E7j82L8J67K7k91r9J26M4j43J67M11k22k50KK56r8j55K06k99L80K59l95j68
3682a62j17L59j68l0K48j53K40n01J12m1M09m0l74J15M61k60l99K06k32J28J23
3703g6L84j76l25J96M0N4L4q3Q7j08l1l66L38J10M5j71L65k86j16K17j5k17K17
3726A17l5o3Q4l53K24R7P3r1K34k75J08l87J92J50j06m7J75k03j09N57k14k20
3748i2n7J1M28j44k38J32l49K52rJ2J44k6J56k61J64l45M23k65J15j95J01J16
3770G3k3j14r4L18j83o0k4Q8j57N69p15K75q5J84J91k29L24m30N8j22m13O13K58
3793C02k88M0O0J64k0l09K67o7m40J89J27l66M81K8L3l54o2J07N4NN5J3J02J10
3817B31l33K62l25R9j45K28L0kj51K54J9qk59N7l44K94K49n8j40l5OJ76J29k85
$$ plain form
3841 -51 262 -152 146 134 238 149 53 86 12 85 131 0 157 -122 42 -113 47 26 203 -92 -83 -67 315 -19
3865 -19 231 -10 -13 -67 218 13 81 223 416 11 -40 -107 -36 -169 0 73 -211 111 -61 258 15 -220 -73
3888 -73 30 77 -40 60 255 166 127 292 324 -46 -36 28 -128 -73 170 237 -164 160 261 -128 -48 58 -69
3911 -69 14 49 425 48 6 -6 202 -162 -221 233 -134 -197 -49 -87 -131 -148 -15 -365 203 43 -121 186 -196
3934 -196 152 -352 -170 -281 -48 324 -241 -90 -106 244 142 -24 -142 77 -246 -204 154 -4 102 -62 -107
3955 -107 -110 -53 -117 169 82 214 -21 -135 145 -63 -344 -27 172 -81 1 -45 -166 -61 92 -56 105 -37
3977 -37 -167 -119 -8 -18 109 -54 181 -521 286 158 -48 -187 134 224 -177 66 130 -144 139 305 -13 -4
3999 -4 25 -64 -142 -207 236 -79 3 -139 -72 44 19 -149 -180 291 -114 255 48 86 -134 -14 -126 259 118 37
$$ packed form
3841e1L13m14K98j2J04q9r6L3p4P3M6j31J57k79J64j55J60k1J77k95RJ6L82l34
3865a9K50k41ln4K85k05O8J42J93m05n1o7P1j33J69P3k84L22j72L19k43k35J47
3888g3J03M7j17J00J95q9l9J65L2l70J0O4j56N5K43O7m01L24J01l89Q0J06j27
3911f9Q3L5L76l77m2j2K08l64n9M54l67o3J48l8m4j7J33l50N68j60j64L07l82
3934a96L48n04J82j11K33L72n65J51j6L50j02j66j18K19l23M2L58j58J06j64m5
3955a07lN7o4K86q7J32k35j14K80k08k81L17J99k53Q2m6j21J05J53j48J61j42
3977c7j30M8J11j0J27j63K35p02Q07j28k06j39L21R0m01K43O4k74K83J66l18R
3999dK9q9p8o5M43l15Q2j42O7J16k5j68l1M71m05L69k07L8k20J20j12L85j41q1
$$ plain form
4023 37 -151 -329 -307 -150 -111 221 -100 -83 -323 -24 132 189 109 -9 -85 45 -127 257 -9 -124 48 -47 79
4046 79 155 263 -69 383 -85 -257 -296 87 21 -26 254 250 17 316 163 262 136 -54 -223 549 487 -309 -154
4069 -154 -90 47 -300 84 24 -243 -70 440 2 32 129 106 74 86 115 -280 287 170 55 -299 394 230 -76
4092 -76 328 -130 103 88 71 -359 237 57 41 -178 -2 152 122 171 104 -116 -300 258 160 146 -2 -35 124
4115 124 -99 163 197 -16 -29 -43 -114 192 -1 -253 128 -153 33 -187 98 95 -163 181 387 -139 -128 160
4137 160 -66 -248 -178 43 -57 62 206 207 -23 34 22 -44 141 305 34 39 -76 102 49 -63 -10 -95 198 -88
4161 -88 -124 79 70 -242 241 -38 -267 -87 -390 -46 6 -91 -250 -3 52 121 269 33 103 66 -383 -56 -133 -341
4185 -341 301 -108 -464 -132 -128 314 -317 -41 389 34 -12 -375 243 -76 -210 -290 323 -105 20 -141 -118 77
$$ packed form
4023C7j88j78K2J57L9L32l21J7k40K99J56N7q0j18p6J30j72L84k66j15J72r5J26
4046G9P6J08l32M52m68j72l9L83o6m7K80mk33K99j53R9j26j90j69P72o2p96J55
4069a54O4J37l47L84o0k67J73N10m38L0R7k3l2J2K9l95N67j17j15l54O93j64l06
4092g6M04m58K33j5j7m30N96j80j6k19J76J54l0M9o7k20j84N58r8j4j48l3J59
4115A24k23K62L4k13j3j4p1L06j93k52L81k81J86k20K85lk58L44K06n26J1K88
4137A60k26j82P0K21j00J19J44Jk30N7j2o6J85J64k71Nj15J78n3j12N3q5K93k86
4161h8l6K03rl12M83k79k29J80l03L44N2r7j59K47N5O9J48k36P0l7m49L27p7k08
4185c41O42m09l56L32MM42o31K76M30l55m6l63O18l19j34q0O13m28J25j61K3J95
$$ plain form
4207 77 -191 -79 42 41 -25 -17 -206 -269 -36 -146 -76 127 -147 329 63 -19 -89 -259 8 244 -84 -202 -41
4230 -41 42 -339 33 223 -587 -187 -13 -98 -286 -136 -77 -213 195 258 243 -199 131 -127 -123 5 -58 -122 191
4253 191 -236 72 112 -205 382 32 7 -172 -34 266 22 175 6 -100 -76 -329 -1 -134 -85 74 383
4274 383 151 -78 -14 232 176 -279 -262 -40 -102 7 1 -52 113 -21 194 -135 54 10 -462 198 37 -421 20
4297 20 437 20 160 221 -99 -564 -32 274 140 218 -77 -309 -37 5 127 -209 207 116 -81 -151 -195 -78
4319 -78 -49 208 -131 81 -256 19 -88 -85 -420 22 176 -32 -402 239 -202 -2 118 -102 274 -98 43
4340 43 -119 210 -323 -125 -248 -180 -136 5 -21 -128 16 -74 -107 362 138 24 176 -107 336 185 64 136
4362 136 62 41 6 -177 144 -223 -68 339 117 35 -248 -10 -44 -226 126 236 -297 -60 164 12 155 232
$$ packed form
4207G7k68J12J21jo6Qj89o3K33j10P0K03k74M76k66q2p0j70K67K36l28j18J61
4230d1Q3l81L72J90q10M00J74q5j88J50N9j36M08O3j5m42L30k58MJ28o3o4L13
4253A91m27L08M0l17N87l50k5j79J38L00k44J53j69j06K4k53L28j33M9J59L09
4274C83k32k29O4K46n6m55J7K22o2J09on3J65j34K15l29J89m4m72O60j61m58M41
4297B0M17m17J40O1l20m65N32L06j34P8k95k32K72M2J22l36M16r1j97p0m4J17
4319g8K9K57l39K12l37K75j07Ll35M42J54k08l70O41m41K00J20k20L76l72J41
4340D3j62L29n33J98j23O8M4J41k6j07J44r0l3M69k24j14J52k83M43j51j21P2
4362A36p4k1l5j83L21l67J55M07k22q2k83K38l4j82L52J10n33K37K24j52J43P7
$$ plain form
4384 232 -239 -211 317 315 -194 207 31 -238 -147 132 64 9 56 324 -151 43 36 158 258 408 294 154 25
4407 25 132 308 -46 393 26 -41 228 51 -62 -132 124 47 -144 9 -118 -287 -53 -100 243 -133 -104 -173
4429 -173 -206 83 -46 22 22 88 -355 -146 102 -122 -72 123 -166 49 -41 -140 -125 4 -162 -11 14 0 322 311
4453 311 -124 -147 -25 -102 107 257 -91 118 -27 112 78 15 59 189 548 -38 -105 -105 66 235 -301 -21 206
4476 206 27 -26 -85 42 259 208 -341 -95 271 177 63 98 -173 -98 -28 -218 -183 129 -161 22 301 -22 -224
4499 -224 80 172 49 -157 -325 -202 261 152 120 -65 -204 -165 -129 372 -30 95 -93 -7 47 60 230 -79
4521 -79 -162 -130 -123 -206 38 -76 56 14 -209 154 291 -75 116 -49 -246 -154 -143 -370 -200 -144 294 -19 44 -272
4545 -272 -128 -65 9 -183 134 200 126 225 10 174 8 223 54 1 109 -154 -84 -40 -82 105 -324 109 -372
$$ packed form
4384B32m71K8N28kn09M01j76k69R1K79o8n5M7K68m75J94pJ22J00J50j14j40j29
4407B5J07J76l54M39l67o7K69j77j13p0K56p7j91J53j27j69K34m7L43l76K9o9
4429a73l3K89j29O8%O6m43K09K48k24N0J95k89K15r0r9J5J29j66J51K5j4L22j1
4453C11m35k3J22p7K09J50l48K09j45J39l4o3M4J30L59n86o7%J71J69n36K80K27
4476B06j79n3n9J27K17n1n49K46L66r4j14L5k71P5P0j90L5L12k90J83K79l23k02
4499b24L04R2j23k06j68J23M63j09l2j85j39L9L6N01m02J25j88Q6N4J3J70l09
4521g9q3L2Pq3K44j14J32m2k23L63J37l66J91j65j97R2J1k27J70N6M38l13O3l16
4545b72J44O3P4j92L17O6p4R9k15J64j66K15j69n3J08k63P0M4m2J87m29M33m81
$$ plain form
4568 -372 -46 -327 210 155 -250 12 3 235 -138 32 -129 -160 107 188 -309 6 162 -14 -65 352 -81 -484
4590 -484 101 130 38 -3 167 -181 85 26 117 -163 -197 146 -133 110 23 -162 -39 108 81 98 81 -31 -77 -281
4614 -281 82 -69 -254 96 298 -2 45 187 1 -220 124 64 -171 -62 190 165 191 184 -71 135 3 5 -141
4637 -141 69 -36 -116 130 28 203 -168 164 27 -133 -200 -95 176 131 219 -54 -19 353 15 -30 13 113
4659 113 8 -103 43 20 53 -156 247 -223 133 -20 -53 184 75 57 156 405 98 -99 87 29 -75 82
4681 82 9 -195 155 211 254 -285 -6 -70 -105 271 253 -140 -88 252 26 -6 195 310 -36 -193 90 261 85
4704 85 10 49 -160 164 -52 -314 -11 134 -167 -11 263 34 24 -83 -4 -55 96 -18 -116 -170 364 49 70
4727 70 381 -412 -99 294 -93 18 -181 190 -137 -119 125 78 -174 110 -20 -182 127 -279 90 -42 108
$$ packed form
4568c72L26k81N37n5m05K62rK32l73J70j61l1K67Q1m97L15J56j76n1M17m33m03
4590d84N85K9r2m1J70l48K66n9R1k80l4L43k79K43q7j85J23J47k7J7j7j12m6k04
4614b81L63j51j85L50K02l00M7J42j86k21L44o0k35J09K52k5K6pk55K06j32Kj46
4637a41K10j05q0K46j02J75l71L32j37j60o7J05K71m5Q8k73L5L72l38m5M3J00
4659A13j05j11J46k3L3k09M03m70L56j53l3K37j09j8R9K49l07j97J86n8j04J57
4681H2p3k04L50N6M3n39K79o4l5L76j8l93N2L40k26l2K01J15l46j57K83J71j76
4704H5p5L9k09L24k16k62L03J45l01J56K74k29j0j07P9n1J51j14r8n4N34l15K1
4727G0L11p93L13L93l87J11j99L71l27J8K44m7k52K84j30j62L09m06L69j32J50
$$ plain form
4748 108 106 31 -239 69 42 -45 -17 -95 161 74 31 -22 69 202 124 257 -2 372 -176 145 28 -18 -69 -315 -308
4773 -308 -8 466 -9 81 141 246 -215 205 190 -97 -57 237 69 -171 244 -248 -45 185 44 -74 -40 -200
4795 -200 -9 -260 -164 379 58 145 -66 -193 -245 62 -41 -135 -161 -180 -111 -202 379 -3 -276 -69 165 173 41
4818 41 38 125 27 160 -254 -6 -5 19 -139 -202 -109 -297 156 128 -212 -168 149 -236 -215 108 216 163 -206 42 92
4843 92 -101 109 -138 2 269 34 180 -35 -236 190 -106 218 95 174 -25 308 -183 71 179 -233 -97
4864 -97 43 139 -154 109 187 17 6 -37 82 -150 286 115 154 113 240 -94 -360 -31 45 -6 64 -16 48 -218
4888 -218 186 -102 223 109 131 78 64 -165 -308 -215 -192 -40 -92 37 -127 149 39 90 -124 -31 181 -113 -140
4911 -140 173 -181 -154 160 151 -34 105 211 -58 -2 96 -332 15 333 40 -93 30 6 -99 184 28 223
$$ packed form
4748A08kp5k70L08k7q7K8p8K56q7m3n3R1J33p8J33k59L74n48L21j17m6n1k46P
4773c08L00M74m75R0O0J05m61M20j5k87M0K94j68k40M15m92K03K30j41j18L4j60
4795b00J91k51R6N43l21Q7k11j27n2L07j03r4k6j9O9r1N81l82k73K07K34Qj32
4818D1lQ7r8J33m14K48JK4j58o3R3j88M53k8l40M4L17l85K1L23J08n3l69K48N0
4843I2j93K10k47J40K67k35J46k15k01M26k96L24j23P9j99L33m91K54J08m12J36
4864i7J40R6k93K63P8j70j1m3J19k32M36j71L9m1J27l34k66L29P6n1P0q0O4k66
4888b18M04k88L25j14K2n3j4k29j43R3K3J52n2J29j64K76j10N1k14R3K12k94k7
4911a40L13l54K7L14rj85J39J06k69N6R8m28L47L18k93j33J23k4j05K83j56J95
$$ plain form
4933 223 -392 -168 26 -177 130 323 188 -60 475 -15 92 13 -167 -107 93 1 85 -205 -162 -72 -4 191
4955 191 -148 -32 -102 109 109 188 -14 -38 -416 -6 104 179 -42 -279 -30 -29 -42 -281 259 109 -112 3 134
4978 134 -379 143 -56 -40 -163 31 43 170 39 -92 -113 -60 -34 -255 -78 114 -301 -152 3 -12 -4 -101 37
5001 37 -146 -134 39 375 183 48 48 155 129 -105 -128 99 -93 128 24 21 95 156 -163 108 -36 -442 297
5024 297 181 31 112 -243 80 33 -75 -264 -89 -43 -127 336 -89 -52 13 74 174 233 -241 1 -284 191 0
5047 0 -142 -165 -221 11 68 11 63 62 259 -42 -23 -283 104 -3 -10 226 157 145 206 174 121 74 -113 -158 -93 -148 -416
5074 -416 183 -134 35 128 -47 176 -117 -73 -209 110 243 476 145 -48 142 -53 -79 32 -127 -1 72
5095 72 -157 -272 167 71 138 -67 -196 88 124 290 343 -154 70 396 82 -129 106 -155 -44 -154 142 42
$$ packed form
4933B23o15K24J94k03L07J93j35k48N35m90J07p9j80O0K00r2Q4k90M3R0O8J95
4955A91l39J16p0K11%P9k02k4l78M10J10P5k21k37K49Jj3k39N40j50k21J15J31
4978A34n13N22j99J6j23J94J2J27j31j31k1N3K6k21J77J92m15J49J55j5Qr7J38
5001C7j83J2J73L36j92j35%J07k6k34k3K27j92K21j04lP4O1l19K71j44m06P39
5024B97j16j50Q1l55L23m7j08j89J75M6q4M63m25L7O5O1J00N9m74K42k85M75j91
5047@j42k3n6K32N7n7N2jJ97l01J9k60L87j07pK36o9j2O1l2n3m7j87m5O5n5k68
5074d16N99l17J69R3j75K23k93M4j36L19J33K33l31j93J90j95k6J11j59J26P3
5095G2k29j15M39r6O7k05j29K84L6J66N3m97K24L26l14k11K35k61J11j10K96j00
$$ plain form
5117 42 -122 -12 -23 -210 -46 -51 -157 211 224 308 -201 -49 -311 -211 101 39 -159 -58 -12 254 80 -93 5
5140 5 -295 -264 -41 266 192 -108 12 235 -73 170 -108 -13 163 -85 -58 80 -130 -83 77 -198 83 70 104
5163 104 90 5 -182 -70 -124 -122 191 -7 -5 -152 198 287 14 -99 -148 -78 -182 -88 -4 -115 89 91 -116 -207 37
5188 37 8 163 53 376 136 21 -234 137 154 -429 68 2 -237 114 70 -258 0 13 37 281 -60 272
5210 272 -68 19 -94 40 -135 264 -22 156 -157 -1 -188 -104 -30 -116 20 -202 -81 104 -143 10 -133
5231 -133 -81 196 -54 -274 -125 98 240 -72 -11 -7 -190 402 231 -89 79 33 187 84 101 36 51 41 300
5254 300 70 -21 -147 -183 93 83 -185 -61 42 213 99 -70 -142 -34 306 -15 -151 135 -1 132 34 -52
5276 -52 443 -3 -248 43 -127 -58 -169 131 -120 -67 -230 -58 -138 -32 92 69 -156 -146 -90 -41 -168 66 129
$$ packed form
5117D2j64J10j1j87J64nj06L68J3Q4n09J52k62J00L12o2j98J01M6K66j74j73R8
5140El00L1K23L07p4l00J20K23l08K43k78R5J76k48K7J38k10M7J60k75K81j3L4
5163A04j4q5j87J12n4KL13j98Kj47L50Q9k73j13m9P0j04R4Q4j11K04Kk07r1K44
5188C7k9J55j10L23k40j15k55L71J7n83M97o6k39L51m4l28K58J3K4K44l41L32
5210B72l40Q7j13J34j75L99k86J78l13J56j87Q4P4q6J36k22J21J85k47J53j43
5231a33N2K77k50k20J49K23J42l12O1Mj83N92j71l20J68m6J54j03J7o5J5j0K59
5254C00k30r1j26l6K76j0k68J24J03J71j14j69p2J08L40l21j36K86j36J33r8q6
5276e2M95m46k45K91j70O9j11L00k51N3j63J72q0J06J24k3k25J0N6M9j27K34O3
$$ plain form
5299 129 75 83 62 -213 -232 100 -18 58 -157 42 336 73 -4 -50 -63 180 -45 -93 -309 -71 69 125 -85 91
5323 91 -145 -181 145 -119 126 26 49 -12 15 -272 -77 4 -320 16 -46 15 78 28 -336 -166 100 -22 277
5346 277 23 8 -163 56 123 408 124 104 -250 -52 -170 306 357 -67 -311 -145 -117 6 335 -159 196 120
5368 120 -102 -113 46 191 96 -48 -67 145 47 27 27 242 -147 -250 28 -201 -101 21 213 -8 32 -77 -187
5391 -187 -50 106 311 -26 213 76 180 -50 -2 -215 -8 115 -198 -65 -134 116 25 -11 -38 -97 162 -91
5413 -91 227 -32 164 -272 22 239 282 -35 21 177 310 142 -75 -1 -24 -183 -264 -118 -19 51 112 212 265
5436 265 -34 134 133 -34 -109 -32 -19 259 33 60 254 108 -29 -205 139 -183 118 136 9 -58 119 -52 -9
5459 -9 99 186 70 -68 58 -107 87 17 70 -112 -7 -125 204 26 -127 68 154 126 11 131 14 -362
$$ packed form
5299A29n4Qk1k75j9L32j18P6k15J99K94k63p7m6j3K43k25m8k16K38J40N6k10J76
5323I1k36l6L26k64K45j00K3o1K7k87J95Q1l24L36o2O1O3n0l64J70K66j22K99
5346B77k54j5j71K19O7K85k84k0l54J98j18M76N1m24k44J66K8J23L29m94L55p6
5368A20k22j1J59J45r5j44j9K12r8k0%K15l89j03K78k29J00J22J92k21M0j09j10
5391a87J37J56K05l37K39j37J04k30M8k13K07J23l13J33o9K50r1l6k7n9K59k53
5413i1L18k59J96m36K94K17M3l17N6J56J33j68k17P4k3j59q1J46R9P0O1J00N3
5436B65k99J68jj67p5P7J3K78k26K7J94j46j37j76L44l22L01J8j27o7J77j71M3
5459iJ08Q7j16j38J26j65J94p0N3j82J05j18L29j78j53J95Q6k8j15J20j17l76
$$ plain form
5481 -362 227 -89 -204 273 -7 -258 -182 -75 190 -8 -291 157 -72 -119 -93 -327 1 -101 9 -58 -105 128
5503 128 143 -72 221 2 -85 167 39 189 43 222 -47 -277 133 161 -359 351 -105 76 -47 207 61
5524 61 34 -199 169 -61 269 -90 106 -105 -119 148 -147 -72 173 -115 -40 -346 -72 31 -117 127 56 -31
5546 -31 103 65 -99 198 96 141 -96 -173 -40 -170 112 -124 38 22 237 156 141 -346 -92 -77 -117 -33 -341
5569 -341 61 280 204 263 -31 -167 111 100 183 -6 125 -57 -124 23 10 -415 -151 0 -133 -31 77 -104
5591 -104 119 17 11 126 -44 -80 -146 -143 -5 -114 62 96 159 -294 -256 -376 113 -7 -223 -106 -109 -121 -45 -303
5615 -303 -15 -289 -24 -80 -84 19 -49 -176 206 -170 -412 1 -66 34 166 -136 83 85 232 -78 34 188
$$ packed form
5481c62N89l16j15M77k80k51P6J07K65j98k83M48k29m7K6k34L28j02J10o7m7K33
5503A28J5k15K93k19q7K52j28J50j46J79k69k30M10K8n20P10m56J81j23K54j46
5524F1k7k33L68k30L30l59J96k11j4K67k95P5K45k88P5l06K74J03j48K44p1q7
5546c1J34l8j64K97j02M5k37p7J33j30K82k36J62j6K15q1j5m87K54J5m0Q4l08
5569c41M02K19p6N9k94j36K78j1Q3j89J31j82o7J47j3m25K64J51j33J02J08j81
5591a04K23j02oJ15j70l6o6LJ38j09J76L4O3m53L8j20M89j20k16J17lj2P6k58
5615c03K88k74K65n6mJ03o8j27L82l76k42M13o7J00J32l02K19KJ47l10J12J54
$$ [...]
8191C27
##END NTUPLES=NMR FID
##END=
