##TITLE=1H_CA-8561
 CDCl3, 8 sc, 
 6.2.2019
##JCAMPDX= 6.0         $$ Bruker NMR JCAMP-DX V2.0
##DATA TYPE= NMR FID
##DATA CLASS= NTUPLES
##ORIGIN= UXNMR, Bruker Analytische Messtechnik GmbH
##OWNER= root
$$ XWIN-NMR		Version 3.5
$$ Wed Feb  6 13:51:44 2019 Russian Standard Time (UT+4h)  she@DPX200
##.OBSERVE FREQUENCY= 200.1313
##.OBSERVE NUCLEUS= ^1H
##.DELAY= (6, 6)
##.ACQUISITION MODE= SIMULTANEOUS
##.ACQUISITION SCHEME= undefined
##.AVERAGES= 8
##.DIGITISER RES= 18
##SPECTROMETER/DATA SYSTEM= spect
##.PULSE SEQUENCE= zg30
##.SOLVENT NAME= CDCl3
##.SHIFT REFERENCE= (INTERNAL, CDCl3, 0, 15.7039)
##AUDIT TRAIL= $$ (NUMBER, WHEN, WHO, WHERE, WHAT)
$$ ##TITLE= Audit trail, XWIN-NMR		Version 3.5
$$ ##JCAMPDX= 5.01
$$ ##ORIGIN= Bruker BioSpin GmbH
$$ ##OWNER= she
$$ F:/spectra/data/she/nmr/H-F/1/audita.txt
$$ ##AUDIT TRAIL=  $$ (NUMBER, WHEN, WHO, WHERE, WHAT)
(   1,<2019-02-06 13:50:28.87 +0400>,<she>,<DPX200>,
      <created by zg, POWCHK disabled, PULCHK disabled
       configuration hash MD5:
       00 E9 B6 7A A2 85 ED C7 34 08 36 98 17 FE 4E 26
       data hash MD5: 16K
       FD 29 A4 6D 8B C4 FD 84 BF 84 24 83 5B 84 2B E2>)
$$ ##END=
$$ 
$$ hash MD5
$$ CF EF 33 9E BA A8 98 D4 49 2A F6 74 AF BA 3F B0
##$RELAX= 
##$RELAX= 
##$RELAX= 
##$RELAX= 
##$RELAX= 
##$RELAX= 
$$ Bruker specific parameters
$$ --------------------------
##$DU= <F:/spectra>
##$EXPNO= 1
##$NAME= <H-F>
##$PROCNO= 1
##$TYPE= <nmr>
##$USER= <she>
##$AMP= (0..31)
100 100 100 100 100 100 100 100 100 100 100 100 100 100 100 100 100 100 
100 100 100 100 100 100 100 100 100 100 100 100 100 100 
##$AQSEQ= 0
##$AQ_mod= 1
##$AUNM= <au_zg>
##$AUTOPOS= <>
##$BF1= 200.13
##$BF2= 200.13
##$BF3= 200.13
##$BF4= 200.13
##$BF5= 200.13
##$BF6= 200.13
##$BF7= 200.13
##$BF8= 200.13
##$BYTORDA= 1
##$CFDGTYP= 0
##$CFRGTYP= 5
##$CHEMSTR= <none>
##$CNST= (0..31)
1 1 145 1 1 1 1 1 1 1 1 1 1 1 1 1 1 1 1 1 1 1 1 1 1 1 1 1 1 1 1 1 
##$CPDPRG= <>
##$CPDPRG1= <>
##$CPDPRG2= <>
##$CPDPRG3= <>
##$CPDPRG4= <mlev>
##$CPDPRG5= <mlev>
##$CPDPRG6= <mlev>
##$CPDPRG7= <mlev>
##$CPDPRG8= <mlev>
##$CPDPRGB= <>
##$CPDPRGT= <>
##$D= (0..31)
0 1.2 0 0 0 0 0 0 0 0 0 0.03 0 0 0 0 0 0 0 0 0 0 0 0 0 0 0 0 0 0 0 0 
##$DATE= 1549446628
##$DBL= (0..7)
120 120 120 120 120 120 120 120 
##$DBP= (0..7)
150 150 150 150 150 150 150 150 
##$DBP07= 0
##$DBPNAM0= <>
##$DBPNAM1= <>
##$DBPNAM2= <>
##$DBPNAM3= <>
##$DBPNAM4= <>
##$DBPNAM5= <>
##$DBPNAM6= <>
##$DBPNAM7= <>
##$DBPOAL= (0..7)
0.5 0.5 0.5 0.5 0.5 0.5 0.5 0.5 
##$DBPOFFS= (0..7)
0 0 0 0 0 0 0 0 
##$DE= 6
##$DECBNUC= <off>
##$DECIM= 32
##$DECNUC= <off>
##$DECSTAT= 4
##$DIGMOD= 1
##$DIGTYP= 9
##$DL= (0..7)
0 120 120 120 120 120 120 120 
##$DP= (0..7)
150 150 150 150 150 150 150 150 
##$DP07= 0
##$DPNAME0= <>
##$DPNAME1= <>
##$DPNAME2= <>
##$DPNAME3= <>
##$DPNAME4= <>
##$DPNAME5= <>
##$DPNAME6= <>
##$DPNAME7= <>
##$DPOAL= (0..7)
0.5 0.5 0.5 0.5 0.5 0.5 0.5 0.5 
##$DPOFFS= (0..7)
0 0 0 0 0 0 0 0 
##$DQDMODE= 0
##$DR= 18
##$DS= 0
##$DSLIST= <SSSSSSSSSSSSSSS>
##$DSPFIRM= 0
$$ [...]
##$SUBNAM2= <"">
##$SUBNAM3= <"">
##$SUBNAM4= <"">
##$SUBNAM5= <"">
##$SUBNAM6= <"">
##$SUBNAM7= <"">
##$SUBNAM8= <"">
##$SUBNAM9= <"">
##$SW= 20.0189088683792
##$SWIBOX= (0..15)
0 0 2 0 0 0 0 0 0 0 0 0 0 0 0 0 
##$SW_h= 4006.41025641026
##$TD= 16384
##$TD0= 1
##$TE= 0
##$TE2= 300
##$TE3= 300
##$TEG= 300
##$TL= (0..7)
0 120 120 120 120 120 120 120 
##$TP= (0..7)
150 150 150 150 150 150 150 150 
##$TP07= 0
##$TPNAME0= <>
##$TPNAME1= <>
##$TPNAME2= <>
##$TPNAME3= <>
##$TPNAME4= <>
##$TPNAME5= <>
##$TPNAME6= <>
##$TPNAME7= <>
##$TPOAL= (0..7)
0.5 0.5 0.5 0.5 0.5 0.5 0.5 0.5 
##$TPOFFS= (0..7)
0 0 0 0 0 0 0 0 
##$TUNHIN= 0
##$TUNHOUT= 0
##$TUNXOUT= 0
##$USERA1= <user>
##$USERA2= <user>
##$USERA3= <user>
##$USERA4= <user>
##$USERA5= <user>
##$V9= 5
##$VALIST= <valist>
##$VCLIST= <CCCCCCCCCCCCCCC>
##$VD= 0
##$VDLIST= <DDDDDDDDDDDDDDD>
##$VPLIST= <PPPPPPPPPPPPPPP>
##$VTLIST= <TTTTTTTTTTTTTTT>
##$WBST= 1024
##$WBSW= 4
##$XGAIN= (0..3)
0 0 0 0 
##$XL= 0
##$YL= 0
##$YMAX_a= 382304
##$YMIN_a= -236631
##$ZGOPTNS= <>
##$ZL1= 120
##$ZL2= 120
##$ZL3= 120
##$ZL4= 120
##$ABSF1= 10
##$ABSF2= 0
##$ABSG= 5
##$ABSL= 3
##$ALPHA= 0
##$AQORDER= 0
##$ASSFAC= 0
##$ASSFACI= 0
##$ASSFACX= 0
##$ASSWID= 0
##$AUNMP= <proc_1d>
##$AZFE= 0.1
##$AZFW= 0.1
##$BCFW= 1
##$BC_mod= 2
##$BYTORDP= 1
##$COROFFS= 0
##$CY= 11.3945322036743
##$DATMOD= 1
##$DC= 2
##$DFILT= <>
##$DTYPP= 0
##$F1P= 18.9103706918063
##$F2P= -1.10871071338519
##$FCOR= 0.5
##$FTSIZE= 0
##$FT_mod= 4
##$GAMMA= 1
##$GB= 0.15
##$INTBC= 1
##$INTSCL= 1
##$ISEN= 128
##$LB= 0.24
##$LEV0= 0
##$LPBIN= 0
##$MAXI= 10000
##$MC2= 0
##$MEAN= 0
##$ME_mod= 0
##$MI= 1.114404
##$NCOEF= 0
##$NC_proc= 0
##$NLEV= 6
##$NOISF1= 3.799351
##$NOISF2= 2.8
##$NSP= 1
##$NTH_PI= 0
##$NZP= 0
##$OFFSET= 15.70392
##$PC= 1
##$PHC0= -9036.06
##$PHC1= 14.00004
##$PH_mod= 1
##$PKNL= yes
##$PPARMOD= 0
##$PSCAL= 0
##$PSIGN= 0
##$REVERSE= no
##$SF= 200.130013532006
##$SI= 16384
##$SIGF1= 3
##$SIGF2= 2
##$SINO= 400
##$SIOLD= 16384
##$SREGLST= <1H.CDCl3>
##$SSB= 0
##$STSI= 0
##$STSR= 0
##$SW_p= 3612.71676300578
##$SYMM= 0
##$S_DEV= 0
##$TDeff= 0
##$TDoff= 0
##$TI= <>
##$TILT= no
##$TM1= 0
##$TM2= 0
##$TOPLEV= 0
##$USERP1= <user>
##$USERP2= <user>
##$USERP3= <user>
##$USERP4= <user>
##$USERP5= <user>
##$WDW= 1
##$XDIM= 8192
##$YMAX_p= 0
##$YMIN_p= 0
$$ End of Bruker specific parameters
$$ ---------------------------------
##NTUPLES= NMR FID
##VAR_NAME=  TIME,          FID/REAL,        FID/IMAG
##SYMBOL=    X,             R,               I
##VAR_TYPE=  INDEPENDENT,   DEPENDENT,       DEPENDENT
##VAR_FORM=  AFFN,          ASDF,            ASDF
##VAR_DIM=   8192,          8192,            8192
##UNITS=     SECONDS,       ARBITRARY UNITS, ARBITRARY UNITS
##FACTOR=    0.0002496,     1,               1
##FIRST=     0,             0,               0
##LAST=      2.0444736,     0,               0
##MIN=       0,             -236631,         0
##MAX=       2.0444736,     382304,          0
$$ Real data points
##PAGE= N=1
##DATA TABLE= (X++(R..R)), XYDATA
$$ [...]
2037C69k85l3J73m3l63L0k14m90M05kJ66J98J27N03j17l89L5Q6l10j60J94j24
$$ 369 84 51 224 181 -182 -152 -366 -856 -451 -453 -287 -89 38 541 424 35 70 156 -154 -314 -120 -244
2059b44J9L46L10n17J36p0l78l27o8O16j85O65q8K53J43l1l0o88K9M7k36j19j82
$$ -244 -225 121 431 -86 50 -20 -398 -725 -793 -177 -362 303 215 468 611 580 550 -138 -109 -62 -298 -417 -599
2082e99O84J3o8M36k13j00j75m99J23o7J74j09M73K80J70k72J00J13o52j37n13
$$ -599 85 98 30 466 253 153 -22 -521 -398 -465 -291 -400 73 353 523 251 351 464 -188 -325 -838
2103h38J14M49P3K3L7P26j54nO1N6o53J69j60q6m1J30J59M29o2k76j52k47j61
$$ -838 -724 -275 -202 -179 -142 584 430 425 486 542 -111 58 -102 -188 -229 -99 60 489 427 151 -1 -248 -409
2126d09J6N8q1N81j7R5K65J5j37l47O9l88q9j64N25r3O8J37j42Mk49M85n50m26
$$ -409 -393 -335 -416 165 148 243 508 523 386 39 108 -280 -369 -533 -8 -101 -33 104 -38 -34 -283 202 -348 -774
2150g74J82M56J9L57%P06l46l60J12k09m58k61R4j08k90P30M79L18l91l0K1j80
$$ -774 -592 -136 -117 240 240 946 600 240 352 143 -315 -576 -482 -590 -880 -150 329 647 256 226 247 67
2172F7o9m64L58j02O47kj63K52J23k70k40m12p3rp9j6K06N13R4J97j78N1j17j24
$$ 67 -2 -466 -108 -210 437 435 272 524 647 377 137 -275 -348 -357 -436 -452 -246 267 361 558 380 431 314 190
2196A90j08k74N2k5J54J88J86k91j61j41m4L49j06j71r5L95J20o4j68m5K17J09
$$ 190 82 -192 -140 -165 -11 177 363 72 -89 -230 -274 75 -31 -202 -297 98 218 154 -14 -59 158 267
2218B67o88J30K69k94K40k5M53l82L58r8j93l8l19j44L98p3q0L10J89K2K09l11
$$ 267 -421 -291 -22 -316 -76 -101 352 -30 328 230 37 -1 -320 -464 -66 -139 -219 91 280 302 511 200
2240B00j6m82k3J9k54m3K10L81J96J04m6L86k77n37m1l1J77R1r3n6M61k26J34
$$ 200 184 -298 -321 -302 -556 -599 -389 -8 188 292 246 632 355 -182 -223 -254 -77 14 -79 -135 326 100 234
2263B34K03l82m38J34k93J38J99J48J26J89j41L70j85l53P8j41R0P0L5J27K4R7
$$ 234 437 55 -383 -249 -542 -404 -205 -57 69 258 117 487 302 -51 27 -114 -24 46 81 208 232 329
2285C29j55L3m40M04l74k46R3J9K89J37k6J27n1J31l12J0j71J47l50O31j94p8
$$ 329 174 207 -233 171 -203 -449 -356 -337 -48 89 63 190 139 270 -42 -32 -203 -56 -406 225 31 -47
2307d7J38K5n4o4M0n09j10L8J56J70K62K65o8%K11p6j92q7r6m90J83K9L08J89
$$ -47 91 116 62 -2 38 -471 -581 -543 -387 -217 45 310 242 242 453 377 185 98 2 -488 -305 -276 32 221
2331B21q5j4r6J98m17p5m22K12L26M8K41J36J81j51J39j68n0j86l93L78j25J9
$$ 221 136 122 26 224 -193 -268 -690 -478 -152 -104 137 273 454 303 442 274 224 38 -355 23 -102 -83
2353h3j27L65l3j91J82k81J03k33J80J24L45m05L03j81j57L39O1J20p07J40k89
$$ -83 -210 155 122 -69 113 -168 -65 -298 -118 6 351 -54 249 68 -89 250 311 431 -276 -136 -425
2374d25K1K30M01P0r1J93n03J60j33j64L5J14J36j80L73N1l84L26m46R9J3k94
$$ -425 -404 -174 227 297 206 399 -104 56 -77 -241 -206 -92 44 -136 237 288 -96 230 -216 -117 -104 -398
2396c98K9O6N8J52J30N90m81J81k16k2k44q7k48L34o3J21j2M1M45qm77O6K27l35
$$ -398 -369 -303 -245 -93 37 627 146 327 111 89 -155 -242 -490 -156 -219 -98 -110 -69 376 368 -109 -43 184 -151
2420a51o4k20N08j77O86j76m60M28k48l52L27n84L33q2L49k75K66J12K06k95j85
$$ -151 -215 -435 73 -104 582 406 -54 374 126 -226 101 -483 -150 -232 117 -158 108 220 426 131 -54
2441e4j25k81O00m42nL59Q9j10lJ43R1k95J32m06J94p9L4K75J75q1P1k87kl05
$$ -54 -179 -460 140 -302 -307 52 141 31 28 171 262 -33 99 -307 -113 -192 -158 117 292 211 282 -5 -7 -312
2465c12O3O7J77k32M66N9M0k79L71M1m53k48K26j90L5J37J35J78j26p7O2j27j72
$$ -312 -249 -182 -5 -237 229 288 328 49 420 461 8 -240 -14 -204 -169 -32 103 281 155 78 140 13 -159
2488a59P4k36O3P7J89j59J92J81r2J4N2o9j41k35K06oj53K91J72k11j16L08l45
$$ -159 -85 -321 -258 -181 8 -151 41 222 130 144 196 127 -14 -249 -43 -49 -202 89 261 50 -66 242 -103
2511a03j13J77j58k85m7K35K59M6L90j15J46m25r9J35j95N1L38j90pJ31j57P7
$$ -103 -216 -39 -197 -482 -529 -294 -35 11 401 286 432 7 -92 43 -152 -101 237 47 40 171 14 91
2533I1k19q1J6J01m2j60L5O42j97m0J11j73J38k9j38j95n7J56L6L76o9r2J77p2
$$ 91 -128 -209 -193 -92 -134 -294 -259 383 186 146 257 84 222 193 55 -140 -197 -41 -5 371 302 210 387 315
2557C15k3m72l3k72N75k43jK23R4J25j82Q7l8l10M7j26K51m18M48q7J47L56j40
$$ 315 292 -180 -213 -485 90 -153 -154 69 163 288 106 193 155 -155 -108 -234 17 -401 47 -40 107 463 323
2580C23l9o4m09K29j91K20j66R7K12p1N0m8j78J53m62J09j38J68K83j25K58j28
$$ 323 284 220 -189 40 -151 69 -97 0 212 141 191 143 -35 118 -344 -235 -373 -205 78 -47 211 83
2602H3L91rl77j60M3j64K05k39P3L92M6l23K8J17n8k94L33l79J75o4J59J87j42
$$ 83 474 465 88 -72 -29 -193 12 -227 -154 238 284 -39 -11 106 48 -246 87 -292 -117 -181 -22 165 23
2625B3L67l5j14n08J75K99o70K67k70K61O8J61j09L62j98k64j61M30L8k75O7L28
$$ 23 390 355 241 -267 -92 207 -463 -196 -466 -205 -137 24 -85 277 79 -185 -346 84 122 -153 -86 242
2647B42l09K37M7O2k57M20q8k81o5k46L21j5j41J17J10j15M5k12O5k88J17L4J70
$$ 242 -67 170 217 279 22 442 354 73 8 -238 83 68 -73 44 154 39 84 -128 -63 -351 -234 -200 -30
2670c0K29j44rk20J38j25j09R7J19k92M40q9j7K01N3m60j44K95j40K22j59J53
$$ -30 199 55 46 -174 -36 -161 -270 -173 -54 -346 94 5 -12 189 242 -218 -362 -67 -207 15 -144 9
2692Ij91L52K48j49Q5k48J18k37k51J07J74j12lN9J63MOj04k46J22j34L25l95
$$ 9 -182 170 418 269 354 106 224 -13 -264 -157 17 -95 -98 -39 124 128 134 30 -216 -94 -228 97 -298
2715b98M56j57Rj9O34m88J14j17l8k85m9j50K79Q7m7M54n72L82m14L28k81M04
$$ -298 158 1 10 -9 625 137 251 134 96 -189 -238 -388 -109 -22 -69 385 -187 195 -219 109 -172 232
2737B32k13j42l68K90L99M5j6k17K21j06QK6j90J89k62M0L18k27L38l25N9k47
$$ 232 19 -123 -491 -201 198 243 227 10 231 125 133 159 -31 158 -104 -64 254 27 365 40 99 -148
2759a48j36K39J80k88K25K57p8q6m30K4K69k56Q4k41N11k16mL39L7J75k90j67
$$ -148 -284 -45 135 -153 72 329 251 165 -265 -241 28 -228 -144 -385 126 -90 -94 245 282 457 167 0
2781@M5k20O5j93K52K45j31j0j65J59p2%k2l13M28R5k09L96j4J71k12J1N8l11
$$ 0 45 -175 -110 -303 -51 194 63 53 -112 47 -25 -25 -47 -360 68 163 -46 350 336 507 295 306 364 53
2805E3k62P5J64j22j8Q0m1O3L61j5k64j99K9L9j02K94j17k3K62j47pJ96J42m68
$$ 53 -209 -134 30 -92 -110 -30 -71 -8 353 338 74 -125 -96 -57 -159 135 18 -5 257 110 103 299 441 -27
2829b7j41J0p6j53J86K8J11j23K39m80N36n17L91L02l78K30j4J82m67L90k45J99
$$ -27 -168 -158 -234 -387 -201 -173 -62 -185 54 -426 110 -407 -16 286 -92 138 124 306 -161 229 -16 183
2851A83N5l65m3j35J31R7J54K21l36N19l98k02J54l50J79m5J75J23J7j15R8No0
$$ 183 238 -127 -170 -305 -174 -77 77 298 -38 481 83 -119 35 -315 -136 -181 -6 117 134 19 117 122 62
2874F2l76J38R8l66J95r0M90j58J49O2K4m25J65k51J46k9o5P6J21j39K91k5M0
$$ 62 -314 -176 -78 -444 -249 -339 151 -7 142 204 228 -197 -32 -283 -137 -166 -231 -155 -34 -173 118 93 133
2897A33k37K19k17p9K16k72K9L23J02J07Rl66j19j43k52O06J56N1k86L67j44k23
$$ 133 -104 115 -102 -181 35 -237 -208 115 217 324 333 -33 -152 -295 -547 59 215 266 -20 347 203 -20
2919b0L24l85q8k87M45k0j76L52j21K38j18j05j16L0K47j25L71l60m1l0p0L3j10
$$ -20 304 -81 -169 -456 -11 -31 -207 145 24 262 144 39 -77 -47 200 75 446 86 45 15 -55 -22 -132
2942a32J07rj09k36J7L67j99J09L32m50K55r7J22J01k63Q9L5k83L21O7k4O8p8
$$ -132 -25 -34 -143 -379 -362 5 -194 -85 247 -203 52 -45 77 178 -85 4 39 -244 77 144 120 188 110
2965A10j73M6K41k35R4p7k89K31l8r1J49N2q7j10Q4l04Q7M56l50J49K06k08R8
$$ 110 -63 -17 224 -11 83 6 -283 -52 -90 -181 -32 20 -67 -177 -93 -397 -310 146 -204 -55 151 -57 41
2988D1M10n22O6P4J13l79J54J18k5k0J07l63L25N8k23N22n89m3k49L81j41K0j46
$$ 41 451 -71 -5 69 182 -197 -43 75 50 30 137 -226 99 157 -66 456 -133 -176 -425 -44 -185 -165 -311
3011c11P12j18m67qK21j9Q5L0k3j16N3K86n03J18K64k4K3k54j06j01K23j18j4
$$ -311 401 283 -184 -192 29 10 95 125 102 -14 39 325 -178 -60 204 180 203 -51 -157 -258 -35 -153 -167
3034a67mJ56l7j01K46k79M37m87M8J81P2L31l16K3Kk45J44J53j91M2k46M12l5
$$ -167 -171 -15 -52 -153 93 -186 251 -236 -188 -7 65 396 80 103 105 -140 4 157 -34 8 -238 174 139
3057A39k21J74L7k56K22r4J34l14L9O4n2J01J61Kk1j84j86K18r9K51k14Q1k97
$$ 139 -82 92 129 -127 95 1 135 -179 -140 -76 -128 -27 134 136 115 -69 -255 -37 -136 115 -99 -18 -315
3080c15M90Mp5k47J34p0J0j41J26j84J35M69k96nN7r9J41QR6l93j13K50J37J65
$$ -315 175 179 104 -143 -9 -79 -69 -210 -84 -268 -133 336 40 35 92 -7 134 142 238 -155 -268 -18 119 284
3104B84l54k36L93Ml01M05K3l15q2j33R1K34j1Q7M9n3m24J70P0j51K18P2o2J75
$$ 284 -70 -306 87 91 -210 195 218 -97 -179 -312 -221 13 2 89 138 85 -339 -169 -99 -250 -32 40 -22 153
3128A53j09j51l3K34L0j72J50k77K89j61K35l79L63j10M9j02k9K39l69J57j26
$$ 153 44 -107 -140 94 124 -48 102 -175 114 -47 188 -191 172 62 111 9 -20 219 -150 7 -119
3149a19J31j76L21k19L1l2k04J62l81K56J12k41K07K34J41o54M38l7n4lM8j87
$$ -119 12 -164 157 -62 -31 -63 -267 -105 -486 -230 -118 -359 -152 82 223 -431 7 -30 -84 -87 -39 -226
3171b26L74N5j08l02NL68K5O3l66K12k52J30j84r5K12K59k42J41Q3l67Q7K09k63
$$ -226 148 203 95 -207 -202 166 191 254 -112 100 -152 -22 -206 -301 -89 170 -72 69 152 -215 -128 81 -182
3194a82L95k31M26l22J99r1k51j54M77k54l48J30K38J17j92J51n0k98N19j4l95
$$ -182 213 -18 408 86 285 194 -57 -211 266 12 -336 -206 32 149 -43 108 58 -240 279 265 -130
3215a30M2L73m07J21K74j76j55J08J37J6k27o0R2l39J29R2K24m5m3J38k03l0Q8
$$ -130 -88 285 -122 -1 273 97 -58 50 187 203 -24 -84 8 -331 -202 -110 114 69 26 164 -39 -69 19
3238A9k94L65k45L4o3J51k00J40j26n4J90Q8O7o0J1Qk2K7k1O0j46L50j43k65j
$$ 19 -275 90 -155 -121 -184 -33 -233 -93 -219 -273 -83 5 72 12 23 31 9 36 15 75 -71 279 136 -129 -130
3263a30j2K19m01M00j96k8J49K45l24N2L5j90p7N93m14j45N02m91J50K00M08l47
$$ -130 -142 77 -324 76 -120 -148 1 246 -78 -26 9 -181 -258 335 -79 -224 278 -213 -63 137 545 198
3285A98l51N1q4J56k0l1K75q6J06J76l13J29m42J66l4K34l5k90J83o4P4o3O2j02
$$ 198 -153 -102 -186 -30 -50 -81 194 108 214 390 77 206 -236 -70 -104 130 95 -195 -12 -76 -2 -65 -3 -105
3309a05o7K41l12K20r5K63J00J4k84K93J34n50J38q2J53J45J84n95J56l23L92
$$ -105 -172 69 -243 -23 -118 145 245 259 -25 268 402 -148 -10 -92 61 206 390 -205 -49 -372 20
3330B0J98j19n1j40j02k2M1J75k15K01K22J01q1j81l59L43mM4k50nJ14J86J14
$$ 20 218 99 48 -92 -194 -216 -175 0 -215 -14 208 309 228 47 -312 31 27 71 -179 -184 -70 116 230
3353B30k17k78R1q3K86j10m7j41M54j36J2J18k23j44r1O7J60J96k04m5J87l1l62
$$ 230 13 -265 -174 -257 29 -81 -128 -269 185 49 61 179 -44 -188 -279 -212 -52 144 -60 -105 82 51 -311
3376c11K43K53l11j92L49k13K89k6K47l35K20m13M48k04J79n59K64L2O0n1O2k16
$$ -311 -68 185 -126 -318 31 -182 107 81 328 -7 213 -200 248 44 223 -336 -72 -40 20 -31 31 -185
3398a85M72l9l70l14J91K66n33O46r1M3j09J93j44K91k96J80j45j70P5j01K29
$$ -185 287 248 -122 -436 -245 21 -512 134 43 86 -23 170 26 317 21 201 56 -114 -39 -140 89
3419H9l48J05L46l00L4Q4L19j51j68J03p01P07l85Q7M10l57K05k15L0P4N9m04
$$ 89 -259 -154 192 -108 -74 10 329 178 10 113 -588 119 -266 -179 231 -126 79 -136 -106 -32 27 -377
3441c77N94l79J99K04k9j87k32l3Q1M6J65k80M43k92J10J51Q6j19J05k25L01l66
$$ -377 217 -162 37 241 212 25 -207 -240 -159 -113 52 -228 215 -77 33 184 270 151 256 31 332 -34
3463c4n4o8P4N6l7L76J05k58j58l71J97J34J88o2J6k62m7J63j5J39o0m4j48J34
$$ -34 -88 -156 -82 -26 -63 313 418 160 2 -369 -172 -38 150 88 104 -158 -205 -42 -57 82 22 -22 -170 -36
3487c6l2J60o2J46r2L0p0J51l9j24m1l0J68p0r5JQ5M3O2m26j1M41k34j8L95k96
$$ -36 -68 92 30 176 84 114 44 195 156 32 -9 -39 129 59 -36 -35 50 93 155 -271 -282 159 -75 -93 302 6
3513Fk64M60J59m03j0n6J14m11Q0K05J25j41Q5k7P2o2j55L47J29l5j68o0k2L9
$$ 6 -258 202 361 -42 -52 -108 6 -405 -325 -120 5 -136 -51 -78 -6 -68 -223 124 253 218 50 -10 -32 7
3537GJ33k26J42J66l28j1K4r4J65M1m1R5j64J73q2q5K30j70P7p9j92Q0N19m74
$$ 7 140 -86 56 222 -106 -117 -93 -187 -22 19 -22 73 -91 82 0 -85 145 -25 52 -27 -219 -139 380 -94
3561i4O5j29O7P3K47j57j94L2K03k14J06j20J63j9P6K67k50m2K0j44M9lj59J23
$$ -94 -29 -158 -91 -18 229 72 -122 -90 113 -101 5 -115 48 29 105 372 122 80 100 -44 5 2 -157 -34
3585c4j37j32N43m20N1J90J37l12J51J5O7k89L1K93j9j77k6O0q4L47m12j55M57
$$ -34 -171 -303 240 -180 -129 61 198 -114 37 52 119 -170 -139 154 135 -42 -68 -8 -92 255 -157 -312 145
3608A45q6K46l30P2j80Q0J1m9j60J12M64m12K22k49J8J16j96n5K84J5o3k02L21
$$ 145 59 305 -25 47 -133 -53 -42 -91 -251 -139 325 -87 135 -114 -96 20 -176 -231 53 68 5 -197 124
3631A24o1K60k43j89K97j21K06k64j64J78j40j24K09J78p9j00Q6k57J59q4P5m9
$$ 124 63 323 80 -109 188 67 273 9 -155 23 -117 -241 -32 146 67 -33 53 -204 -45 -129 -54 -103
3653a03K50k32J69n8Q9j80J47L7k39K43m40P1L03j25r4K18j31K87l20J34m72J44
$$ -103 147 -85 84 26 115 -65 82 119 -120 123 -317 -246 57 -68 -162 56 -75 212 -108 26 -446 -302
3675c02J96J45j86L3L73k88M7J5k8M6j23M4J13N01m94r5J9k85R2K8Q2j1q8k6K00
$$ -302 -106 39 -147 -114 259 -29 18 33 5 51 -72 -28 85 586 92 -3 16 -269 -177 -149 -67 -78 -166 -192 8
3700Hl25J67p4L94J2r3M7j71J52q9j87OL34o2P2n0n55L20K95j65l05J31J03j38
$$ 8 -317 -150 -224 170 182 89 136 -35 117 28 -159 -153 181 119 191 141 -414 -94 201 36 -269 -138 -35 -173
3724a73Q6l2N2r7J7Q0R6J44l00J40j64K03q1l11M36J41q6j81o1p4m1n1K13K67
$$ -173 -87 -119 -67 -164 -147 -67 29 173 -127 13 -151 52 -29 -340 96 237 151 -30 -91 -165 -206 -257 -44 223
3748B23j07J54l29P7Q3l64K75n8n0L33J03k00j11J10m45J95p9L2K62j90K3Q1K47
$$ 223 116 270 -59 18 101 -263 12 -46 -96 237 340 140 29 139 -306 -111 -190 -158 104 -86 -63 18 265
3771B65n64K88j78L44k06l6J67j01J12o5r0J03J18l71K87l50L13J41k7k47N9L88
$$ 265 -299 -11 -189 155 -51 -87 80 -21 91 26 -64 39 157 -214 73 -277 36 177 150 -97 -38 350
3793C50l05M1J81K4L27l82n36M71k07l17N08l21K96J95l09QJ47J1k05k99L40L18
$$ 350 45 86 267 291 618 236 -300 171 -36 -353 155 -166 130 325 16 24 171 182 -23 -322 18 336
3815C36n08J89j54M0k4O2K2j32M6M8Q3q2j10P8J59m6n28N53m14L99P0k16n6M27
$$ 336 -172 17 -137 -97 -121 -59 -37 -169 -123 -75 8 -74 -184 -106 53 7 -521 32 -382 17 87 -129 -185 242
3839B42k78J2J69l31L82k69J97j2o6N0n00M89j85J39J3r3p6lL41l16q9L15j65
$$ 242 -36 -24 145 -186 196 -73 124 112 46 96 -404 85 -100 39 52 -41 -117 -120 221 -95 -184 131 -34
3862c4P6Q6j49l0n6K07k12K76q9m35M0L43K28j90k24q3o0J82j39K79j8K9j97K27
$$ -34 42 128 -21 -51 -107 100 -112 164 75 -360 -320 23 251 61 -163 -246 -306 -124 -263 16 -2 27 -170 57
3886E7j00l9L29l03r4L59k80j9j53K2K96N6k64K82p4j86P7L7J53k59J38k70o1
$$ 57 -43 -82 247 -56 -150 209 -71 -90 -243 -221 75 131 -133 149 75 -111 -34 3 156 -103 35 -235 -296
3909b96K60j77kJ86L2Q7j04J45n7j78q0Q0K98j66J03k91n0j4l3L25p3M2m15N36
$$ -296 -36 -213 -215 -29 3 90 -14 131 74 -104 -184 -104 194 28 131 -160 -210 -224 -257 68 -5 37 -378 158
3933A58l66J39J40j45J27j88J05%k06J21K32j2o2j09k26M90l75J51q6m0Q7R4J9
$$ 158 -208 -69 71 -74 53 -135 -30 -30 -236 -115 117 105 43 -66 -292 198 -177 -26 -112 -152 -65 29 48
3956D8k0Q6o4J88l75j3P0J97Nl08N1J10q1j57L22J9l09J8M0j9J37J86p1j27j1
$$ 48 28 114 50 238 -137 -150 -80 117 122 -186 -135 -25 -106 -263 59 78 -231 -213 -173 -192 -55 131 60 -67 -78
3981g8P8k99L46k52J19L1M98r3l63J02j30j18K07o3l6k14K42K50l13O0J45r8j29
$$ -78 0 -299 47 -205 -86 -55 443 350 -13 89 -41 -159 48 -15 -51 -265 -23 227 -86 -26 119 21 -108
4004a08K5J34J58k53J53N9n5J2k73J63J22j70L16k86r4K3J32j93J10p4M8j36P5
$$ -108 -83 51 209 -44 109 168 113 125 -148 15 137 -33 283 -3 -97 -74 58 -135 -25 -99 -51 -187 -112
4027a12j42K36O2K72k81K07k61J2J37j70J31j64J9K60k75N3J11j46j2M62l89m2
$$ -112 -254 -18 44 316 35 242 -19 -7 130 -40 91 -73 -54 206 -69 -16 95 -51 -63 399 10 -32
4049c2M1K09j79j98k00QN14m5k64J56rj9J7k70J81o8M1j7L77j50l16L37n1M2J89
$$ -32 9 218 39 -159 -359 -351 163 118 -146 10 1 -18 -1 -271 -90 -158 -117 -134 243 93 -223 114 63 105 294
4074B94n51M72q0j78M9N3RJ52k80k27M86j68r9j73K78J9k23L79j21j02J00q1j66
$$ 294 -257 215 135 -43 6 59 68 220 -60 -287 199 31 -68 -241 37 56 -167 212 91 -11 89 8 -158
4097a58K54rk50J78k12J40n6L57l72K02k2J50o0k09J63L5L2L6j06k68K70r3j79
$$ -158 96 87 -163 15 -197 -57 -113 244 -128 74 52 202 142 -67 96 131 163 199 93 -175 95 2 -177
4120a77J82R3k95K5j82K11L15J1l54J21M00o98K83J64O6j20j77L44m2l46J51j33
$$ -177 5 98 -197 -172 -354 -143 172 183 -171 -50 350 -348 -65 99 165 45 -132 212 170 -176 -25 -158
4142a58J22j2L60j31j05j47r2J15j53K48r3L91k43J3l9j9J21j49o5q1K34J5k87
$$ -158 -36 -48 312 181 76 -71 -163 -48 -201 47 -46 345 102 115 76 57 178 29 -36 -117 117 132 -155
4165a55J30R9r1K65M1k71k1k49R8Q8J95m0j8jk83M51k38J53j79o7r5K03r8p8R8
$$ -155 -25 74 -17 248 289 18 -3 -252 -154 -66 129 89 71 70 -213 238 0 153 -26 -93 -188 15 -83 -161 -63
4190f3j59Q4K03P2J21k44K74m12j7J75j10j05J42r7r7K24r3J66k14J66k52K77
$$ -63 -222 -138 65 137 258 14 288 -124 -141 34 -76 -181 -39 -136 -233 -9 -102 64 -150 16 -236 41
4212D1j60j46kJ33J04J13l23M41r2j2q3j60J45O0O5j51k31J23j06J31j16L20J38
$$ 41 -119 -265 -267 -134 -30 83 -240 201 109 97 14 -146 -1 59 124 -27 -258 -135 -241 -110 -226 94 232
4235B32m55L5M38j10j92R1k7R1m0J04j79o5j37kJ30J0K4k15K81k27j1J58L26q2
$$ 232 -223 -188 250 140 -52 39 12 103 63 167 -12 -77 -214 -216 -86 -76 -52 -267 14 -213 -224 -66 260 178
4259A78r8j98K52k29rM43m74K21j07J94m85L91k07K1O1j94K7K8J92j43j56J64
$$ 178 80 -118 134 -95 -104 339 -135 86 -21 173 -312 79 -128 -107 -46 -240 -213 -185 7 -136 -292 -128
4281a28J90K8k51J96l4J24j00r0J32J41j67j70p1J01J73J44k24K91l73K8jl51
$$ -128 62 90 -161 35 1 125 25 -65 67 208 41 -129 -200 -99 74 218 -6 285 -88 -60 -61 -412
4303d12K01K22K0r8M3k01K41k81O6K72k46L13mN6j40k22L1o8K20J33N6j26j39
$$ -412 -211 11 31 -67 -24 -225 16 -265 -199 73 -173 140 136 192 52 -170 -139 -207 13 146 202 76 -63
4326f3n0J86o5o8J40K27k07l53K33M0R0j67L5J35k94L90j45J39j91j35Q2J11K02
$$ -63 -113 73 8 -60 80 307 100 -253 -20 20 110 -57 -22 113 -181 209 64 203 12 -123 -41 70 272
4349B72k88K78k96j75J7N72l88J29j69k16M52j22l37J22n0N1j04J11K38J98k20
$$ 272 -16 262 -34 -209 -192 380 -8 121 -48 -264 188 66 -271 -149 -199 -148 -252 -141 97 295 75
4370G5Q0l58R7J02L4l40N65k31l99L66J68k46j70J22N5M8L89j22k41K7j04n3K35
$$ 75 155 -203 -106 -4 30 -310 255 24 -375 -9 159 -87 -257 -135 -80 -32 357 235 -6 21 -83 -136 99
4393I9m85L32J58k70K02J26j72p7J87k02K3J62J1Q7l03Nj24J44N3j66K14k29M48
$$ 99 -386 -54 104 -166 36 162 -10 -87 100 -102 -79 83 94 181 -122 -117 -241 -97 -44 -210 4 -225 223
4416B23k23j92M98j29l44Q7K74j3q4j00K62m38K85k51L96j06j27J30j63J81j27
$$ 223 0 -192 306 177 -167 -80 194 181 97 -3 259 -179 106 -145 251 145 18 148 -15 166 39
4437C9k17K25j8k2p2P1J33j13J95m98K17j26J13Q0k82J17L89m9k90L27l59P6J25
$$ 39 -178 47 29 7 -65 6 139 26 221 -277 -60 -186 -73 7 -275 -158 231 182 -108 219 -140 -64 61
4460F1L1k22L28k53J73j62M1j41L25j68j62n2n0L39k55K79j61o6K62q6j79K65
$$ 61 92 -130 198 -55 118 -44 -3 -144 181 13 -149 -201 -251 88 -167 112 -49 -115 147 61 -118 147
4482A47m23J85J35Q1m1k39K56K3m03L19K25j68J0m41M02O0j64J96l55L41l6j70
$$ 147 -276 -91 44 125 84 -155 101 124 -279 40 265 97 107 -334 68 128 -36 160 -195 146 110 -60
4504f0J37l57P16l63j29M93m75o5K05N0j68o9J11l3J08o8O9j59J9N3l8N9l2J92
$$ -60 77 -280 436 73 -56 437 -38 -103 102 152 -16 -85 26 -7 101 33 102 -57 -38 15 -23 36 4 196
4528A96j86M7j17J70J61k60O0l55M32j56j45j25K86m19M43J23j59K69m12rj07
$$ 196 10 57 -60 110 271 11 71 -284 148 -8 -153 -278 8 -411 32 155 -4 265 -147 -156 -263
4549b63K29L07l11l9J38j83N08k59j16j6J10j89JJ4P6J50k39K19k47M1L4J7JQ0
$$ -263 -34 273 -38 -77 61 -122 386 127 11 -5 105 -84 -83 -69 7 157 -82 137 -110 -69 -35 -18 -17 63
4573F3m13M77k95K86J77m28Q9O5m23K85L3k56K95M8M3j53j12M09m1j85l21P5M27
$$ 63 -350 127 -168 118 295 -133 -44 21 -402 -117 -84 -340 -45 3 46 -107 -219 190 149 -36 -357 -282 145
4596A45k40LJ56k57J95J05k6p4p4k86K36J74j19j84J13K03j77J74O1J07k58k00
$$ 145 -95 -92 64 -193 2 107 81 7 -67 -353 -117 57 -62 -246 -133 70 -107 67 128 235 -23 -223
4618b23J69J15J0J05m49K05n0P8r7L08J39k40K04l95j17J69l13K81J61k55K34
$$ -223 -54 61 71 176 -273 -68 -118 -40 -137 171 310 70 274 -121 -238 -69 -382 -101 60 -195 39
4639C9J06l08J22j26K02j9l19L39M4n42M81R2j41J27K66m46K74j35r9p0j82K84
$$ 39 145 -163 -41 -167 35 16 -303 36 80 -462 19 111 -30 97 363 -83 191 56 -43 -113 -295 -11
4661a1j00J63J3j32R1J04K30n28L55p7j94n9J65k20J72k5R0j54K46j45J4r1k21
$$ -11 -111 52 65 -67 24 128 358 -170 185 108 -86 -145 20 -200 -28 -53 37 -117 129 -16 -2 -93 -314
4684c14L66k73j81K84K22pJ7j50L02l34J72j36K23m93K36j48K94j40J42j08K27
$$ -314 52 -221 -402 -118 104 97 114 -36 266 -68 104 -32 191 -302 -66 -214 80 -60 82 -26 201
4705B01k27j43L36k97m6M98l75K66j46j18P4J92k70L09j92k10M22l1m54J30k1
$$ 201 -26 -169 167 -130 -176 322 -53 213 67 -51 23 215 -55 254 62 -148 274 243 -211 -81 -102
4726a02J66j55N9J33J39j02j65R1J40n87M55P2j30n9k52L23n7J55r8J69k49K03
$$ -102 64 -91 -32 101 240 138 -27 64 204 -383 72 144 14 -45 -297 26 -31 124 26 195 -54 149
4748A49j76l2M16k96j44j34L48j51J13k4N9J42j88m0k60L96k65o5K59J29l11m6
$$ 149 -27 -59 357 61 -83 -217 131 -20 93 69 128 270 82 42 -218 178 -87 -152 107 236 -75 -121
4770a21K77m22r7N66m7l81L55n40M62J92l88M01k64r7J76M3j81p8K54n27L82L9
$$ -121 156 -266 -363 203 156 -225 130 -410 52 244 -144 257 -7 -104 72 115 -66 -144 110 -417 -35 4
4792DJ43j72j8Q3j36Q2K7j48N8k05J69j55L17p5J98n7o06O41r9Ql92J98L5j4j23
$$ 4 147 -25 -43 40 -96 -14 13 -135 -77 -282 -113 -268 49 -26 172 115 -491 150 51 59 -333 -135 -100 -114 -237
4817b37M8j57M41n3K72m25K09L38l19o6J72J26k68L0l03L93j09k76K99Qm99R1
$$ -237 -189 -346 95 42 314 -111 98 436 117 51 223 349 81 111 -192 201 92 -184 115 123 -376 -285
4839b85O1J20J26k4K8k92L51l17K45q2M17k96O1l56J81n3M0M34m30L12k2o7n3
$$ -285 -224 -104 22 -2 26 -266 85 -232 13 -69 348 52 113 -243 -62 -115 -75 359 -71 241 219 152 99
4862I9k07k6j5j95K43J10L7k55P5J19P6n3n8K36m03K73Rk84p4L54j15P2P2K13
$$ 99 -108 -134 -149 -344 -101 9 46 -209 -134 -15 61 8 -50 186 -217 56 65 -219 -293 61 -54 18 90 303
4886C03l54K3k00P4L58k43J15l84K90P9l27Q1R8K43J50k67p3k6J71N6k66k85M56
$$ 303 -51 -28 -228 -154 204 -39 76 -308 -18 61 -266 -185 -87 156 306 39 -34 -60 111 167 -99 -384 72
4909G2Q5m18K39J55k67J89l8O9k39P7J02j49K54J27q1j08J77k92j63J87K58k56
$$ 72 157 -261 -22 133 -134 55 17 86 -153 -76 26 -123 131 258 177 69 246 -46 -209 -22 236 -20
4931b0L68j69n41K44L33J04m02K3MJ5K6j89J48P1q7J19k78l3O44l21K7Q3k45j46
$$ -20 348 179 -362 -118 215 319 -83 -60 -56 -41 -15 -204 -56 15 -72 47 -231 -264 380 59 86 169 -76 -222
4955b22R4K81O9l22N5j04J87l40L40J66l05K74k79R0P3M7k45j70N4K91J04j78
$$ -222 -128 153 222 -100 -45 -149 38 -302 38 204 -101 173 -106 -16 57 104 -141 -311 -257 34 138 -40
4977d0J84k49L1J0n0L71j03j62j77K15J81J07l30P5J27k99m7j88K12L6j17L76
$$ -40 144 -105 -74 -64 -114 257 154 -8 -185 30 211 318 -12 63 190 -109 -156 -344 -132 -96 -213 163
4999A63n5l31N6J39l2J12m1j08QN2Q1k62J24P0j59J70K57n18K92J74l10Rl9L8
$$ 163 108 -223 -167 -28 -60 52 11 -97 -89 -37 44 -218 -94 -24 -183 -13 244 -274 18 192 -118 -109 -148 -110
5023a10l24M83p4J63j29K0J40l50L35j45M5j08K67j60r9p9k3L99o7l95N08j00
$$ -110 -434 49 -25 138 9 29 169 -181 154 9 54 -54 213 53 -46 -125 -148 251 184 -211 297 197
5045A97m10J00j37O1K02L61j81j38r3K3j16J07J97j84n3J86L7n0N0o4J2J42l29
$$ 197 -213 -113 -250 -189 13 374 193 55 -38 -15 -131 -24 173 -11 -64 122 159 109 159 95 107 249 -80
5068h0J73j28j50L29j42K31m25L67l12j29J37L07N7m63J20r1K61k24L73K6r9l74
$$ -80 93 -35 -185 144 2 233 -192 175 -137 -266 -129 178 235 -228 -108 -199 62 -162 211 237 138 -236
5090b36K26K2Q7k51j23O31m38K98j36j09j47M03k56M6l41L12J05l10J61J3N16
$$ -236 -10 12 99 -152 -275 356 -82 216 80 -29 -176 227 -29 17 -324 -12 93 -217 -56 -43 473
5111D73p23L25Q0p3nJ19k56j64M7N9J66q4K98j58j75J5j78j40J94K10j51L18k0
$$ 473 -250 75 155 82 77 196 -60 -224 -177 -118 48 -36 262 104 -71 -56 -234 -374 -180 30 -121 197 177
5134A77m35K01k01K60K19n35K44J02j21J46p6R7k45j16N11n2K08m23L0L24j09
$$ 177 -258 -57 -258 2 221 -314 -70 32 -89 57 -19 78 -167 -283 228 176 384 -39 -9 315 206
5155B06l17K99r7m0J12m47J77J70m3l7J68k65J53m33L03m1K0K64oK37n39K17k60
$$ 206 -111 188 91 51 163 -284 -107 63 20 -17 151 -114 39 -394 -91 -132 -112 152 146 383 -156 61 -199
5178a99M84k30M4j35K54L1j39m3j57Q8J75j49k22J79j36M00k48J55L88l18m6k22
$$ -199 285 55 99 -36 218 249 110 67 -90 -2 173 24 -198 -19 -155 245 -3 152 540 222 176 -46
5200d6n0J39K22l42K1K99k72J66j33j78Q0L0P3K03l61L08Nl15N19l14j60j90k1
$$ -46 -96 43 265 -77 -56 243 -29 137 4 -174 -94 -64 9 212 -149 159 164 -151 368 54 -106 -296 -317
5223c17L17o6rK24j04O1j07P3k75L88l19K78l4J32l89M51j62k85l7K79l0kk10
$$ -317 0 -66 -75 149 45 106 -1 72 -203 185 -134 144 110 242 -147 304 142 -143 -180 99 69 67 -143
5246a43L38m00L29K1r5K45J9o4p2l29k60L80P2k38J42j0L18j34J1m6j56j11O0
$$ -143 195 -205 124 145 50 295 314 250 178 -151 -411 -31 41 -197 -55 -65 253 119 130 84 -72 -183 -123
5269a23j62K22M29m51J76k26K19l8J23k32j9O4K10k4q6p7j43K30l44j4J60J26
$$ -123 -285 -63 366 -85 91 -135 84 46 169 -63 -82 -18 192 168 82 5 -138 92 -252 -266 -106 20
5291B0j43m8k61M34O1r9o6q2J36L2M2k50J65Q1j54Q5K25k42P7k57K28k21L76l01
$$ 20 -123 -171 -432 2 63 -36 -102 -184 -48 -16 26 -224 -59 22 -132 -47 178 -64 13 -244 -16 -237 139 -162
5315a62K54kn0J60k89j3Q5J59o1l35N46k19n58L69J19J8M3J71L1Mm02K42P3j57
$$ -162 92 90 40 200 -89 -102 -17 142 81 -254 292 73 -485 -116 3 21 64 235 266 270 -132 110 183 26
5339B6j12M87m60J65K08l45J80j22l28J43J97k60J16j0M72j99j01N2k23J31k0
$$ 26 -86 401 -59 106 314 -31 149 27 -301 -158 39 -221 -105 -115 357 158 57 109 -114 17 -3
5360ck03K52rm4j15j42L99k69J26K4M7j53Oo5K04j97P1q6M19r5K1Mj50J0k60L30
$$ -3 -206 46 37 -7 -122 -264 135 -134 -8 16 63 -90 -84 -149 55 -142 -71 -157 262 167 188 192 42 52 -208 122
5386A22j65JL12k01j58n7L23M7P8l55J66n1J02j54K18l96Q5n2L32k79Q1j17L03
$$ 122 -43 -42 270 69 -89 -146 177 224 302 -53 113 62 164 10 228 -168 -83 -135 197 -82 -1 -118 185
5409A85k1k25J98M3j61k41Q7J70J70j93m1j33K11LJ5J04j5k41k9J78j06p8KK36
$$ 185 164 -61 137 180 19 -222 -135 35 205 12 -29 -162 49 52 67 171 156 -85 -114 64 -42 -120 -118 118
5433A18p2K2J82j5j07k3P1m19M52k7l18o4L88k76M53j52J14k75k5J60k85J09K41
$$ 118 46 68 250 235 128 105 176 -243 209 182 -136 -200 188 -88 365 213 327 52 27 187 -98 11 252
5456B52j56l83L75jJ66k45p9O2j07J93j09l2K04j9k43J5M82l99J02jk75K23J8
$$ 252 96 -287 88 87 253 8 -71 -9 -116 77 -32 -64 140 121 -122 -107 375 -24 78 77 -198 25 43
5479D3l7L4J46l48j8J50K77m6P5k66N9k4k42J37KK4j68L13m45K30J93j86k1m1
$$ 43 6 40 186 -162 -180 -30 247 201 276 10 69 45 -197 -60 -58 -34 -202 111 -334 -104 89 -97 -118 -159
5503a59J91R5J19j29K5j24m0p8p5P1K9J30m3M9l12R4pL59j51j25K3J64o5L59j45
$$ -159 32 127 246 117 142 18 -22 -100 -175 -104 -75 55 12 61 -251 -157 -164 195 44 -81 -58 106 41 400 255
5528B55m8q8j87J25k77J66J45J13l1l83p5K69r9j21L21k56J56K39k56l9J53j67
$$ 255 207 119 -68 57 -220 -54 91 204 173 -210 -285 -16 -115 -236 85 -171 -15 224 -32 -71 82 -85
5550h5K20k88k6Q8qJ36J01l3j3j46l2L68J33l99q7N7k8r1M5j63k31N87j1Kr9L45
$$ -85 135 -153 -179 -91 -99 37 138 105 92 -54 -86 282 415 16 -71 -14 -42 -133 -88 -251 -482 105 94 96 -3 342
5576C42l67K2J91J26n11K85j07mo8m4J33J81k67O6k0K44k24K30J35n44N0J64J88
$$ 342 -25 -3 188 314 -197 88 -19 -23 -91 -135 -2 179 -88 -22 -42 202 -22 208 343 -201 -151 13 201
5599B01l77M27k97K15m3m78M41Qj67K96j58k7l26J85J46j43k08M67l16J31L89
$$ 201 -176 251 -46 169 126 -352 89 97 -70 226 68 41 -285 -100 46 -97 -305 162 -154 -23 366
5620C66n23L4K49l35N5K20JL8k62K24j77J58j7j65R9M46r1j24m46L14j06J60l97
$$ 366 -157 -123 126 -209 -154 66 67 105 -157 67 -110 48 31 -134 -35 411 320 196 -250 64 -42 118 -279
5643b79N82k46K15j58j57m2j17N33p9m52K8K34k0J25k07M7l35K98l6Q2o0J71j08
$$ -279 303 57 272 114 -43 -85 -202 331 252 -200 -172 62 42 167 -40 7 -328 -30 -66 16 -44 127 19
5666A9o3J91J76j27N1j80K0J31l54M15n12L91l12L3mJ71k16J62J66l07k02L76
$$ 19 -44 147 323 196 247 67 87 218 -136 279 -233 158 -154 -121 -125 46 -170 -8 158 -149 -351 25
5688B5j54J63r5j08J23J44J5Q3l48L32n7l12J72J18J70j12L1j33LN4j00k6J39
$$ 25 -129 34 -61 -169 -46 98 113 196 -152 180 123 -189 -17 101 271 159 190 57 60 114 14 -12 127
5711A27n4j3j94J12N1o2q9q9M07nj04K61l04o5J5j74L29o9k35K75k29p4M2L03
$$ 127 73 60 -134 -22 29 -33 -122 -211 196 191 87 348 44 -21 -6 -180 149 80 -155 120 -109 -183 -141 162
5735A62l58J31J26N9l7j27j67L15P0J87l57l5j83M95m66J5L58J71m66K9j04n7
$$ 162 -196 -65 61 120 83 -44 -211 104 174 361 4 -31 -214 281 -185 -170 188 359 -107 -78 -182 -239
5757b39O6K30M08n44j37L43l1n2k46K81j04k04K12k10L71l39l0L92Q5k33J23j54
$$ -239 -173 57 465 -79 -216 127 96 44 -202 79 -25 -229 -17 -227 144 -195 -225 167 252 19 142 -12
5779a2J30j99p6K82q3O6k35L83k76j54K92n4l75M8K60J88k20r2J83j42R1k5N7
$$ -12 118 -81 -157 125 42 108 -127 256 -20 -174 118 64 -311 -263 -3 185 -35 -127 56 -86 5 -20 37
5802C7J9j63J94p0MJ00k53K91L9k56R6k42J19K11N6n3m91K04k21K05J26Jj37J21
$$ 37 56 -107 87 17 21 121 -132 159 198 -58 38 -204 -85 126 182 129 -362 -158 -379 -174 -48 -47 -184 -63
5826f3J16j06M62l82m7k15M76j09j9l13J89j86J51K16j38j38J58o7R4k73J7o4
$$ -63 53 -53 409 27 -20 -235 241 132 113 -200 -11 -197 -46 170 32 -106 52 -15 79 -194 -177 -241
5848b41J65P9J6j02j61L05q5l3o6L1J64K03l77m22L73J08J2J5K05j38l1j8k46
$$ -241 -76 3 19 -83 -244 61 -24 -57 -123 -92 72 275 -102 -524 -151 -43 -31 -16 189 51 20 2 -244
5871b44L28n6J96j94LK7m11K38j34M31k97J77K31k83k02N52j13o25K23L58j09
$$ -244 84 28 224 30 33 60 -351 -113 -247 184 -113 64 295 12 -190 362 249 -376 -153 205 96
5892I6Jj4j84j28L04j87J65o6j39l8J67L40j81l07l0L45p8o2j02J30m9N8K18O0
$$ 96 97 83 -101 -229 75 -112 53 -13 -152 -190 -23 317 136 -171 -201 144 66 4 -98 32 -17 41 259 319
5916C19k44j3k55J01j01J84j6J4j84K66J41oj91k72L98k65J36k56P47o90O2J71
$$ 319 75 62 -193 -92 -193 -9 -25 -11 -195 71 212 206 15 -257 141 -124 12 -244 503 -187 -125 46
5938D6m9k99L03K36l21O1J6j59L01j74J75j90j25K46l65O1L04K7o5k69P4K34j7
$$ 46 -3 -302 1 237 -84 -23 -7 -166 135 -39 136 -54 -179 67 -298 -237 67 94 29 -240 -166 68 51
5961E1q5j1lj7j61K34R8j62M50l74M60o46M36k27K8m5J71Ql06j82LN11l56LOL24
$$ 51 -34 -45 -48 -65 -226 8 106 -56 394 20 480 -166 270 43 71 26 197 205 -101 -283 -280 231 -125 -122 -116 208
5987B08l92L01k57J71o6q1K44j09j09l6J35J58rn43L76k41M03r9k44J66j2L14
$$ 208 -184 117 -140 31 -35 -116 128 19 -90 -126 9 167 158 -385 -9 -250 153 54 -190 -24 -36 278
6009B78l25J37j68j79J63Q3MQ2l12K09K38k82Q8k7K49j24m83K40K75l16q3J48
$$ 278 -47 90 -78 -257 -94 -11 -7 75 -237 -28 210 -72 16 -11 238 114 -369 -129 146 -170 -253 -105
6031a05K98l38J90j03K72j17l0j36LK1K24r4q6q6j75K12pl3O6j89K53j01l0j21
$$ -105 193 -145 45 -58 214 97 67 -69 -66 -45 179 85 -1 -87 -262 -50 -57 -90 -24 -213 40 -61 -91 -212
6055b12M42Q6k63l4p9Q5K05m46L3L9J44j9PN3R1l9q8k31n9L48j83L22o1j31p3
$$ -212 230 316 53 19 -60 25 230 -216 -183 -144 0 -19 -12 41 132 93 5 -226 -285 63 -120 202 141 10 -63
6080f3L51j36m63L31j11O5J87k7j66K73o1j64L4k22J03j10L92Q9m43M14l40j52
$$ -63 288 152 -311 20 -91 -26 161 134 -32 241 180 16 50 -172 -69 -179 213 302 -141 273 -67 -219
6102b19Q2K3n6L58k02l16J46J66j31K19k08J73j15J68k71L18K6j24J87j54j90
$$ -219 -137 -114 -170 188 -14 -330 -184 -18 -149 70 -138 35 -80 88 -183 135 161 37 224 70 -120
6123a20J93r3k34J53m30O39k36J12J42j36L71k62o0j68J57k84n6M08J27j23j74
$$ -120 73 -20 -254 -101 -531 108 -128 -16 126 -10 361 99 39 -129 28 -256 -312 96 223 100 -74
6144g4J95j75k12J85j37J4J26K53Q3k84l0l5j76M06k53p0P1Q4R8j11n93Q81k45
$$ -74 121 -54 -266 -81 -218 -204 -78 175 258 -26 -56 -91 -267 139 -114 -184 -113 -29 69 -42 -635 246 1
6167AK1P5k26L13k00j1n3J29q1l8j33N03m49M02m14K40k4l1q3J67j48k2J10l1
$$ 1 22 97 -129 184 -16 -27 -80 49 -32 -70 -203 300 -149 253 -161 79 55 24 -59 108 -40 -62 48 17
6191A7o6k9J47J02K30m88K7r3J2L35l7J82j31o3j13j1j14M9p2m9L21k31K92j85
$$ 17 -49 -78 69 171 401 -87 -60 -153 -141 194 157 339 208 145 32 21 -93 -44 -116 -165 156 -75 217 32
6215C2j99J45Q6k2o8j4K5J10o8k27p4K49j35L12J14m07K43k89j34K19J69l6N9
$$ 32 -167 -22 64 42 -26 -40 -15 95 27 -200 -274 -25 -160 152 266 -141 102 -187 -321 -102 67 31 90
6238I0Kl93P5K11K31k87l9K69j15l90R0J39L4p1K24q1m03L76K84J74n84R4p7J17
$$ 90 92 -301 -226 -15 216 -71 -110 159 44 -346 -256 -117 -83 -154 70 -11 -414 -38 246 420 -164 -70 -147 -30
6262c0J58r8j29J21K48j06k27Q3j65J09O7j82L59l11J31o0K11l84L37j02n5L9
$$ -30 128 30 -99 22 270 164 -63 20 -145 -36 31 -151 208 -103 28 -32 179 -205 132 30 -25 14
6284A4k87M34o0k94K67j50k9o6K54p4l7rJ68m68L92j15J16k48J16K41k72K33j2
$$ 14 -273 161 101 -193 74 -76 -105 -171 83 9 -28 -37 131 -337 55 -60 56 -192 -76 165 -107 126 114
6307A14P4k7j97k62N86m61K28K65k50l6l1K4J29j98K39m12K39j50J88R2l81L49
$$ 114 188 161 -36 -298 288 -173 55 320 70 34 3 27 156 -42 197 -215 24 -126 62 154 -227 122
6329A22j07k6q7M7j8m7KO9n9k51M86j95M4J49k25M0K36r5j1j12N9kl6n8J55l20
$$ 122 15 -11 -98 -51 -69 -116 -114 -45 -104 -355 131 -64 -20 129 -96 -56 180 85 74 -38 21 19 -17 -75 80 -240
6355b40LL39k56J8L49J4n9m47K94R9k90K62Pk10j12J87j47L80lk69J6J7J55N7
$$ -240 -237 102 -154 -136 213 227 168 -279 15 114 -176 86 93 -117 -229 -42 -189 191 188 -81 -65 -48 107 164
6379A64l89L20L5R9m16l3k92M85MO4l02N21j97j82N48k93pk90r6L44O5k37Q4r6
$$ 164 -225 95 130 229 -187 -220 -512 -27 -23 41 -261 260 63 -119 429 136 129 -161 -257 87 152 -85 -1 -97
6403i7J74l60M07j29j15K97j37j3j53K18J65p1k27n0L00k37j30L55l4j86m5l5
$$ -97 77 -283 124 -5 -120 177 40 27 -126 92 257 186 -41 -91 209 -28 -158 197 163 -23 -68 -103
6425a03m6L34k56J04k25n2O1K73k04mJ40l0j72r4K09J00l62L37J83j66K8j01k1
$$ -103 -149 185 -71 33 -192 -244 -183 90 -114 -118 22 -8 -180 -274 -65 35 -327 10 193 27 55 -46 -67
6448f7R5p5o9J66J0K59n20L62qr6RP0j43j58j53L0L05k80k9J41N72m20j81L0n5
$$ -67 28 -47 -116 50 60 319 -201 161 153 57 66 136 -7 -165 -318 -288 17 -263 -292 -151 421 1 -180 -150 -205
6473b05L2K77J24j84O9j51k27K65Q5n9J32j64M5k68L61j28j26K00l57J05K18l7
$$ -205 -173 104 228 44 113 -38 -265 0 85 26 158 -6 39 -229 132 4 -122 78 -279 -174 44 7
6495GN3k00J5K33m06m9J70K76m63M49m4JJ01J34k00j08K07j92J59j74r9p5J09
$$ 7 60 -140 -125 108 -298 -347 -177 99 -364 85 41 42 143 277 77 -31 176 -16 143 -31 -130 -205 -96
6518i6J10j04J27l22L61k53n2J67M2K03m30K71N5j1j83L3M8J03j95L31j44k45
$$ -96 14 -90 37 -285 76 -177 -229 -62 -20 183 -247 24 79 68 -115 -82 -34 69 -126 205 61 -184
6540a84J08j01M92j76J23k15N5m46K55J87k97M98l08r5L7k37K34n8R8K6p0N5j41
$$ -184 -76 -177 315 139 262 47 102 -344 -89 98 -199 299 -9 -104 -67 -304 -70 -128 -30 -4 -74 -19 -160
6563a60K49J2K82m77K63k69M2K7l4L2J91j5l5J11k17l7kL4q8j51N14m37j45J04
$$ -160 89 101 383 -94 169 -100 -58 -31 -65 -33 158 143 108 219 2 -35 -37 -3 -91 -242 272 -165 -310 -206
6587b06K33k11K24O7j13j36k00J75lK40j84j94N17l78Q7k2J64j4j16J0K23k37
$$ -206 27 -184 40 107 -6 -142 -342 -167 -170 70 -114 -308 209 -169 -82 -104 60 46 -70 -60 163 -74
6609g4J53M9R9n73M61J43m80L80j93J73k9j02p0M53k93n6j02k26J26M40l19K23
$$ -74 79 128 227 -346 115 258 -222 158 -35 138 109 7 -63 390 97 41 -61 -287 -161 279 -40 183
6631A83j38J01k07o7m5L73k10k11J98J7K10m17K12M17l11M2j90K39r5m2K1q9P
$$ 183 45 146 -61 -128 -173 200 -10 -221 -23 -6 204 -213 -1 416 105 147 -43 196 101 59 80 -9 -2
6654bJ50n4m87J12K36P8p2k86L04lJ40j17n5J66r8K44j71k8j70K0L11j74JJ44
$$ -2 148 94 -393 -281 -45 33 -39 -325 -21 -24 116 -1 -56 110 12 256 85 57 -113 -93 218 44 45 189
6678A89j4o4m38L63J15k20m3J33M3j62qL33l16J03N7q1p5P6J00j74L88k18m0L55
$$ 189 175 111 -327 36 151 -69 -112 21 64 -98 -106 227 -89 14 71 -10 -85 -9 91 -83 305 87 47 402
6702D02P3n46j30L24L04k92%k23m8K48j40M4O2p1o3N5J23K14n66J69J68O9o9k97
$$ 402 475 -71 -201 123 427 135 135 -88 -136 112 -28 16 78 7 -56 -1 122 336 -230 -61 107 176 107 -190
6726a90J8N5k7J71mo8j44J93N4k23p4M39j52j52L32j38j35J71Jl4k16J48M0j80
$$ -190 -172 -117 -144 27 23 -45 -189 4 58 -165 -239 200 48 -104 228 90 -45 126 127 93 -123 25 65 -115
6750a15r1K86RK86j73k72J71m46L13j74N6L97j10o9m6k30M12j40k42L45k53J1
$$ -115 -206 80 89 375 202 -70 101 -345 -32 -206 -150 247 137 68 22 -208 204 64 -178 167 -86 -75
6772g5M56k72K17n41L16J86n36QK28J80K9r5pj93N4J18J99k57J8k96M06k34Pp5
$$ -75 381 109 326 -215 101 287 -249 -241 -13 167 196 101 94 -99 -45 73 272 15 33 -263 143 -91 -84 -159
6796a59j3L52j20p9j15o3M3L5K08J5m14J19K61k03R2L02l51O8OJ4j42r9K60j39
$$ -159 -172 180 60 -19 -134 -197 -154 -119 89 104 -310 -191 70 -133 -41 261 -90 -22 -16 -2 -144 -243 17 -122
6820a22K69O4j88P7l2J57j05m7j00J13j79L7q6qJ52Q1j0j24K80k33n6R0N6l0j39
$$ -122 147 211 23 100 68 225 120 73 -27 86 -93 -56 -142 -150 2 83 73 -51 229 -4 -60 30 86 56 -83
6845h3J94k23M25j56k51J25j95r7J38R0N13m05j42r1K00L7j1l12J06J75J2L92
$$ -83 111 -112 313 157 -94 31 -164 -261 -123 -33 480 75 -67 -158 42 79 68 -244 -138 37 49 441
6867D41o34N0Q4k1p2Q4J3J04N5mN7k24j10J12kJ26J89o9J17k51k70N61k83l4Q8
$$ 441 -193 -143 -59 -80 -152 -68 -55 49 104 100 157 -67 -177 -65 -67 59 248 179 296 45 -225 336 53 19 107
6892A07Q4N2l77k15M85l6K01k99L5m7Nm3m7K72k34P5j14K15l01p2M1r0R6K54l51
$$ 107 191 243 -134 -349 136 100 301 2 37 -10 -5 -48 -95 177 -57 18 -96 119 -182 -254 -213 -303 -207 47 -304
6917c04J46L33J01l37l3J87j89K43l09J61K0K9m2N3J72l9r4K31l17j85K57k34
$$ -304 -158 175 276 -61 -94 93 -96 147 -162 -1 19 48 6 59 231 192 98 329 12 -173 84 -150
6939a50k1J43j69K24J05J09k53J12j25j47M05j57q3j55O2P7P3j59J55k04L78j05
$$ -150 -171 -28 -197 27 132 241 -12 100 -25 -172 233 76 -7 -162 -100 -23 50 -109 46 -158 220 115
6961A15l55J91j7KK56j30K2j05J63j31K10L1k9j47j31K03k22M20P6m12J92l09
$$ 115 -240 -49 -66 -64 192 62 84 -21 142 11 221 252 223 76 -55 148 -74 346 422 10 202 -107
6983a07J74P6r7J2J59j38k65N33l83K17Q0m36J45K3K35l17m2L12k15L6k94M43
$$ -107 67 143 46 58 217 79 -186 347 -36 181 261 -175 -30 -7 228 -89 -131 181 -34 2 -292 151
7005A51r4L3k90K55P7m2L4j41r1j20L24l00L37%j84j44L34N1k84K52N7k08k04
$$ 151 57 90 -200 55 132 90 124 -17 -108 -228 96 -204 133 133 -51 -195 139 190 -94 158 215 7 -197
7028a97J04M36k43q4K85k16R3j0j18N5k19K52l00J43L24l48j31L97J28j59J76
$$ -197 -93 343 100 16 301 85 178 168 50 105 -114 138 -162 -19 305 -43 -174 223 351 192 368
7049C68l42l9r7K50P1l37M1Q7K39l35j53QK06j66j52J95M12k45r0J22Qk95J71
$$ 368 26 -13 -110 140 211 -126 -85 2 241 -94 -247 -239 -33 -199 -351 -156 256 11 -79 43 51 -244 -73
7072g3K49k15j85K42O6j06%Q0L8J29p2k48L46r1k76j20J28J73j27Q8J22k12N2
$$ -73 176 -39 -224 18 84 -22 -22 58 96 225 153 -95 251 160 -116 -236 -108 65 -62 26 148 -64 -12
7095a2J41k86P2j16p7qK21J39j11J38j01l4J93k80M13k53L8m7j20P6J6M9K65k19
$$ -12 129 -157 -85 -201 -278 -286 -65 74 -37 101 0 -34 159 -121 292 39 77 30 -90 -14 2 51 316 97
7119I7R4j90q7O7K01m8j60J65j54P0J14l98L15l4q8l28N3L5K24n7K01m2l1L6N8
$$ 97 191 1 -86 -19 182 134 -26 139 -15 55 169 -229 86 52 -36 -364 -311 -276 -52 -109 92 50 19 55 113
7144A13l7k25K08K4Ok2J29j03j90L03k05j06N5JJ39l42J75k21J65J18l44L74K06
$$ 113 76 -149 59 83 89 67 196 93 -97 206 1 -105 -50 -49 90 -252 -77 -298 -133 -15 -359 15 221
7167B21l19J40r9J2j25L75m63O8K89k64L49j87K12k0k85J73n5r0J68j52J45j40
$$ 221 -98 42 -57 -45 -170 205 -258 -190 99 -165 184 -3 209 189 -96 77 22 -68 100 -52 93 -47
7189d7J99l36K40L05m27K48j93j51l0K84k8k57K58l24L65N4r8k79m1K06kN3j23
$$ -47 152 -184 56 361 -66 182 -11 -162 -192 92 64 -193 65 -259 106 160 62 -217 -258 -52 -54 -1 -124
7212a24P0j09k39L12l7J83j19m9L88J66m40j42J48n3L4n2L57j47j8p3M2j52L29
$$ -124 -54 -163 -402 -90 -127 56 -63 -112 276 442 2 -140 8 -45 -11 -63 294 147 129 56 98 -54 275
7235B75k17k56K04l36M07Nj89L51J55k06l65J52J92j15m4j63R7k28M0J84L5K39
$$ 275 58 -198 6 -330 77 82 -107 244 399 193 -172 -20 172 57 13 -150 -53 -281 -241 -57 -22 217
7257B17k02O8J75m12r0K79J2j78P9K76r4j47O5j27QM2O9k94L25r8j12L17k42J08
$$ 217 15 83 258 -154 -244 35 47 -131 -52 224 130 -17 48 -79 -71 -29 40 -254 71 -27 -139 178 -64 44
7281D4k49L72J49k97J81j46j11R4O2k65rP0J70k8j55J14r4%O3q2j46K5l4O51l67
$$ 44 -205 167 316 19 200 54 -57 37 99 -166 -175 -105 65 37 -118 -4 -98 -98 -35 -117 -263 -238 -272 379 12
7306A2o1L73Pl66K90j23R6j30M2k32J17J1K9Q1j07k7K48k70J98m92K02R4lJ11
$$ 12 -49 324 331 -35 255 132 228 98 140 -92 25 36 65 146 39 12 260 -10 188 -304 -102 -8 -11 100
7330A00k6R7m37J79J55j7o7o7L95m76l7R5J72j16RK46m28K92j46J2K89k73L43
$$ 100 74 171 -266 -87 68 51 -16 -83 312 -164 -201 -106 66 -50 -41 205 -223 69 -77 -65 224 -49 294
7353B94l60K27N8j11J0J62j70k41J27p8K77l33K91N0j00j84j02K34j09k15M65
$$ 294 -66 161 219 108 118 280 110 -131 -4 -82 195 -138 153 203 103 -81 -183 51 -58 -273 192
7374A92j49k19J75N7QJ19l72J48J0k82M44r9l52J59O9J98k29N6P3lj84K22L0p9
$$ 192 43 -176 -1 56 64 183 -189 -41 -31 -313 131 32 -320 -161 -92 106 -123 -67 6 3 -181 41 71 -8
7398hJ7j04qr4K65n19K41L16l7l34J0K16L27l52J92J07k24j3M2J17k54R5K1l7
$$ -8 9 -95 -103 -197 68 -451 -210 106 69 -265 -255 -39 288 -64 128 235 11 -2 40 157 -97 -2 19 -18
7422a8J39q2p8M25l69r9J59r7J19k13J02nJ12j88J26Mn1J19k95J58O8j3P8k65
$$ -18 121 39 -39 386 17 -82 77 -20 99 -114 -12 -17 95 -93 33 37 -14 105 -190 -32 36 23 101 -164
7446a64k06K31O1J06Q9k11j44L94l24K45J22K2j15p8K0o6k87J7J92K08J8k24k88
$$ -164 -370 -139 -78 28 117 -94 -238 156 -168 77 199 221 106 28 48 -18 -305 -288 -96 112 130 -94 -382
7469c82N75j37pJ2j01Q2o4M04l41LJ38rk38n2P7k86K19j19R8J14j38J27l4K97
$$ -382 193 56 49 61 -40 42 -22 382 41 44 182 173 -65 -117 -40 -326 -107 -226 -128 -14 -152 -25 -59 238
7493B38K1j39q3K7k50R3p9K63j40j1J98L09m43j22J97j42j02k52L34J74l8j38
$$ 238 259 120 37 64 -186 -93 -172 91 -49 -60 138 447 4 -118 79 -63 -165 -417 -83 91 53 -85
7515h5o5l4P2j91L84M4O8Jk17j84K0K78l24P2M00k64J83j4j09k19L18J73j72J40
$$ -85 -150 -184 -112 -303 81 125 193 194 -23 -207 -187 91 -233 -161 239 -25 158 144 35 -184 134 307 135 275
7539B75J8o17L78K7k17L14m09M31l97J89p2n6J54k5Kl02K02J63N8j92k55K75J99
$$ 275 293 -324 54 81 -136 178 -231 200 -197 -8 -80 -136 18 -7 -5 -307 -105 58 116 -76 -331 -56 143
7562A43m81K61l4K97N1q9%k72J02Ll31K68J79n1k77J40Nj43L82j83J43O7q1j70
$$ 143 -338 -77 -111 186 237 148 148 -124 -22 -19 -350 -82 97 46 -231 -91 -86 -229 153 -30 113 180 99 -71
7586g1m2q0J62o8J23K8J6j24O2Q4k7kj36J07J34k6j4M6k67R5M3K02j75j46J93
$$ -71 -113 -193 -31 -99 24 52 68 -56 6 90 63 61 -75 32 166 140 126 172 -95 0 43 245 70 -76 117
7611A17j57k5P4j68J80l21J03q8N2M8M44m05k09J70J10p8J82M3J01q6lK9q8k57
$$ 117 -40 -65 9 -159 21 -300 -197 -285 -233 -185 259 -146 -355 -185 -75 -153 29 72 173 87 84 113 25 -232
7635b32L00K16k95J88n7k91J17L95m82J14K72k19j80L09j82K42k31k09q0L92j62
$$ -232 68 284 -11 177 120 -171 -54 341 -141 -27 245 26 -154 155 -27 215 -16 -225 -305 87 -75
7656g5R7P0k34J32J4%n1J8j9p9K80r7M4j39J15j37Q3j66J7J63m02J77J03Q2M3
$$ -75 22 92 -142 -10 4 4 -47 -29 -48 -127 153 56 100 -39 76 -61 22 -144 -127 36 -366 -189 -86 -4 39
7681C9l4n3J47Q9k66j77N0N05l12MJ54k81L29m26J61j52k5L92k90j97K92J80k36
$$ 39 5 -48 99 188 -78 -255 -205 300 -12 -8 146 -135 194 -232 -71 -223 -248 144 -146 -343 -51 129 -107
7704a07J50k44P6K7O3N0O7j85J96R5J12j08k59Q1%J04l96L66k8l37J55L32j84
$$ -107 43 -201 -125 -98 -35 15 82 -103 93 188 300 192 -67 14 14 118 -278 88 60 -277 -122 210 26
7727B6j21L52j62j49L61m12R6l6r9J41n1O3l9j22K52K21k07m18M67j71K35k74
$$ 26 -95 257 95 -54 307 -105 -9 -45 -144 -3 -54 9 -30 -152 100 321 114 -304 163 -8 227 -47
7749d7k6J36R8j69R4j07N2L0o8J84j56K11k67L3j84K92l89L23o4K06j09j0K63
$$ -47 -73 63 161 -8 86 -21 31 61 -7 177 21 232 -35 -2 -186 106 -283 40 -24 182 73 63 326
7772C26n66K87M4j79N6O5j54J01l0p2K32J78j01r8pk28K05oK52k33J27j85N2j60
$$ 326 -240 47 91 -88 -32 33 -121 -20 -50 -122 110 288 187 89 82 -146 59 53 305 72 199 14 66 -94
7796i4J27k3J41L0k98j29mL26j54J18J2j97N4K63l33L57n57M86r3k38L64k8l18
$$ -94 33 10 151 181 -117 -246 -250 76 -78 40 52 -145 -91 172 -161 196 -361 125 32 -206 158 130 -188
7819a88r9Q0Nj16P7L36k80J66j72K66k67J37J3k13J71l5N2J64K17m74P2K02J2
$$ -188 -287 -207 -202 -318 -241 95 -185 -19 -191 75 -192 -55 -42 -255 -84 -119 -67 97 314 -160 -88 114 126
7842A26K12l25J93k35j03j16M27p6m5n1N1K5P7j36J74j68k29J86j17K51l58L20
$$ 126 338 13 206 -29 -132 -248 179 103 58 7 58 83 160 24 198 30 -199 -13 -130 121 -237 83
7864H3q4p0j52L0j1%K30j4J66l18M31q3j40j75J90J69k51j40K81Q0l47J34k68
$$ 83 -1 -71 -223 -193 -204 -204 26 12 178 -140 291 208 68 -107 83 252 1 -139 142 222 -125 9 -259
7887b59L27k05r6K13m3K61j41q1J18j02q9j46L46n4J20j24j06N08m38N0k89J65
$$ -259 68 -137 -233 -20 -63 198 57 -24 94 -8 -97 -243 103 49 169 45 -61 447 9 59 -230 -65
7909f5j7J86M8K11k27j87k4l6K47r4nk58O08k94j5p6l8o4k58L33J14o1P9m55L63
$$ -65 -82 104 152 363 136 -51 -75 -111 136 42 37 -221 387 93 78 2 -36 -100 -358 -25 89 28 107 -348 15
7934A5j0j46M00o7j48Q4j59j45K71j23R4P3j14k32O6K04o9J4l0j30n7J72N1J8
$$ 15 5 -141 259 192 44 128 -31 -176 95 -28 66 139 25 -207 -141 63 -6 8 -22 -152 -209 -37 14 32
7958C2lR4l10L61n0l18K06k04k0%J34J20j55J7j6L27k34j30K80J77k48p3M26j53
$$ 32 29 123 -187 174 124 -194 12 -192 -212 -212 -78 42 -113 -96 -112 215 -19 -149 131 308 60 -13 413 260
7982B60n78O02l66J39j39Q4j31k7J94P6m7j68J95l05K30M3m99O69j86O3k01j06
$$ 260 -318 284 -82 57 -82 2 -129 -156 38 114 67 -101 94 -211 19 62 -437 232 46 109 -92 -198
8004a98K70k77Q4k17M35n4q5j97K03k24M08l25K79k3J43k55m7n0Q5J18k0j73J26
$$ -198 72 -205 -121 -338 97 43 -42 -239 -36 -260 148 -177 102 79 222 -33 -80 -130 -45 73 53 -120 6
8027Fk15N40j44j42K24k59o7K23m8N9k57J09L14o18L60n7o9m3o5L2K40j89K90
$$ 6 -209 331 187 45 269 10 -57 166 118 177 -80 29 343 -275 85 28 -41 -84 -149 -117 123 -66 224
8050B24k38K03j35mJ29k0k78NM08m44R5n0R3o7q6P6j1L2L06j94k22k85J98N88
$$ 224 -14 189 54 50 179 159 -119 -114 294 -150 -55 -105 -12 -79 -165 -89 -100 -68 238 44 -178 -463 -265 323
8074C23l49j5K8j66Q7R7qj35l2K99k25J54J32n66K09j37N34j3m12J18k31J99P4
$$ 323 -26 -41 -13 -179 -92 5 -3 -138 -170 129 -96 58 190 -376 -167 -304 230 217 -195 -77 -308 -109 -35
8097c5p3o7L42k37J01n68O08q2J04l7j14J74k05k12K70J24j81K44o6o6qM5M4q2
$$ -35 -108 -175 167 -70 31 -537 71 -11 93 56 -58 116 -89 -301 -31 93 -88 156 90 24 16 61 105 23
8121B3K52rk89K60k09j23Q1p1K95k22p9J26j74K55j98p3J24k60R6J85J3O3j18
$$ 23 275 266 -23 237 28 -95 -14 -85 210 -12 -91 35 -139 116 -82 -155 -31 -291 -195 -10 3 66 -52
8144e2J90j03j60K19J76k80L1m53N10r2J11j66J95o4j59J73l20J85q2L60m86K08
$$ -52 138 35 -125 94 270 -10 21 -432 78 -14 97 -69 126 62 -97 76 -244 -59 -141 219 -267 -59
8166e9O4J2K8k26m9J2ML9K41j52J13r6K96k54k02J34J81j68K14k75o5K33k6J70
$$ -59 5 17 45 -181 -230 -218 -214 -175 66 -86 27 -69 227 -27 -229 -95 86 -82 132 -143 -208 25 -1 169
8190A69J89
$$ 169 358
8191C58
$$ Imaginary data points
##PAGE= N=2
##DATA TABLE= (X++(I..I)), XYDATA
0@%%%%%%%%%%%%%qJ6j6J6j6K0k8L2l2M0n2O0p2Q5r3J06j25J45j66J89k13K39k71
$$ 0 0 0 0 0 0 0 0 0 0 0 0 0 0 -8 8 -8 8 -8 12 -16 16 -16 24 -28 32 -40 45 -48 58 -67 78 -88 101 -112 127 -144
36a44L05l43L85m29M79n32N90o54P23p99Q83r75J074j183J303j436J583j746J928
$$ -144 161 -182 203 -226 253 -279 311 -343 380 -419 464 -511 563 -620 683 -753 830 -916 1012
55A012k133K365k630K936l294L723m245M896n734O859q461J0948j5366K5625r6661
$$ 1012 -1121 1244 -1386 1550 -1744 1979 -2266 2630 -3104 3755 -4706 6242 -9124 16501 -80160
70h0160l8323J47405R3122R5417M7203J6293m2925o1585r8365r7336q2170m8155
$$ -80160 -118483 28922 122044 217461 264664 280957 238032 176447 78082 -19254 -101424 -149579
82a49579j9567K5039L8144M8449N0183L2161n226j6633l0726l6297j9755Q616
$$ -149579 -169146 -144107 -105963 -57514 -7331 24830 19604 2971 -27755 -64052 -83807 -75191
94g5191K6931N8005P6436O6539M6583K0514k7302o4883q7741j02549r4637n8090
$$ -75191 -48260 9745 86181 152720 199303 219817 192515 127632 39891 -62658 -157295 -215385
106b15385k1246J8085N9212P7978Q1230P6144M5257Q928q274k8559m4195l1675
$$ -215385 -236631 -218546 -159334 -81356 -126 76018 121275 130203 121929 93370 49175 17500
118A7500j6287q848Q844K1118J0550J16j0765k9976l7897l4896l0441q143J9156
$$ 17500 1213 -7635 1209 22327 32877 32993 22228 -7748 -45645 -80541 -110982 -119125 -99969
131i9969L2632M6928N5778M1581K1623P987j6682l6785l2638k7028k0658L86J2860
$$ -99969 -67337 -20409 35369 76950 98573 106560 89878 53093 20455 -6573 -27231 -26845 -13985
144a3985J3332J5817O633j4970k4978k8835l3435j9231K738K0421M5012O1455
$$ -13985 -653 15164 21797 6827 -18151 -46986 -80421 -99652 -96914 -76493 -31481 29974
156B9974N4453M1417K2528j2644m1200n5231o7928o1557l0718m274J9836M9311
$$ 29974 84427 125844 148372 135728 94528 39297 -28631 -90188 -120906 -125180 -105344 -56033
168e6033N9187N0014L4517O927k5032m2293m9638m8219k5602J757K4603N0170
$$ -56033 3154 53168 87685 94612 69580 27287 -22351 -70570 -96172 -94415 -69812 -19642
180a9642O1368M5896K9306Q287k6897n0637n6625n8316m3828j1691J2522L3141
$$ -19642 41726 87622 116928 125215 98318 47681 -8944 -67260 -111088 -122779 -110257 -77116
192g7116N2845N3902M0244K3872k840k7577l5023l9302l7677j6935L417J6152
$$ -77116 -24271 29631 69875 93747 90907 63330 28307 -10995 -48672 -65607 -62190 -46038
204d6038L2466L4991K1891J2596K90j9943k7779k4616k3248j1969N988J2686J6867
$$ -46038 -13572 21419 43310 55906 56196 36253 8474 -16142 -39390 -51359 -45371 -32685 -15818
217a5818K3323J6747N627j020j1003j5247r399p773l304R550J2795Q251R547L097
$$ -15818 7505 24252 29879 28859 17856 2609 -6790 -14563 -17867 -8317 4478 12729 22276 25373
231B5373j0855j2499j2533j5159p297M630R148J6053J9063J0696L363k193j4103
$$ 25373 14518 2019 -10514 -25673 -32970 -28340 -19192 -3139 15924 26620 29983 27790 13687
244A3687j8298j4243j2470m325J0999J5298J6828K0342J3279k7o845j6126k4724
$$ 13687 -4611 -18854 -31324 -35649 -24650 -9352 7476 27818 41097 41070 34225 18099 -6625
257f625j9450j2807p974N974J7978J9410K1560J7738M267m703j0819k0522k0063
$$ -6625 -26075 -38882 -46856 -40882 -22904 -3494 18066 35804 40071 35368 24549 4027 -16036
270a6036j1692o240L750J5063J5242J2770J3697L623q439j0055j3192j4702n789
$$ -16036 -27728 -33968 -30218 -15155 87 12857 26554 30177 21738 11683 -1509 -16211 -22000
283b2000N48L926J0757J3118Q542N522j118r647r601q372j0287l539O829P439
$$ -22000 -21452 -17526 -6769 6349 14891 20413 19295 9648 47 -8325 -18612 -22151 -15322 -7883
297g883R802J2433M320j400k688j0140j3477o822k562J439J0888J2011R343Q909
$$ -7883 1919 14352 18672 17272 14584 4444 -9033 -15855 -18417 -16978 -6090 5921 15264 24173
311B4173J839q880j1961j4729j5124p788J34M592J4069K0428J3948J0601N866
$$ 24173 26012 17132 5171 -9558 -24682 -32470 -32336 -27744 -13675 6753 20701 31302 37168
324C7168p279j3345j3668j6553j3601k000N106J0152J6107J3670P923L090o155
$$ 37168 29889 16544 2876 -13677 -27278 -29278 -24172 -14020 2087 15757 23680 26770 20615
337B0615j4698j4145j3303r872J304R331J1125J7251J6898O963L08n800j3963
$$ 20615 5917 -8228 -21531 -31403 -30099 -20768 -9643 7608 24506 31469 31777 25977 12014
350A2014j5502j1561r944k432P400R845J1727J2392N438j331l911j0525j3554
$$ 12014 -3488 -15049 -24993 -27425 -20025 -10180 1547 13939 19377 18046 14135 3610 -9944
363i944p685k962J046J0066J2662R834J0422M322o269j0334j2336j4618r950j448
$$ -9944 -17629 -20591 -19545 -9479 3183 13017 23439 27761 21492 11158 -1178 -15796 -25746 -27194
377b7194K314R621J5152J2262Q885N131l920q993r702j2367j0446q49L158O040
$$ -27194 -24880 -15259 -107 12155 21040 26171 22251 13258 3556 -8811 -19257 -20106 -16948 -10908
391a0908J1818J0326N118L086k390r934j0891q929q495j566M750O716J1354J2460
$$ -10908 910 11236 16354 19440 17050 7116 -3775 -12704 -21199 -22765 -18015 -11299 55 12515
405A2515N829K596M07o374p835o470p994n101J260J317Q23L803K481j79J160q2
$$ 12515 18344 20940 21347 14973 7138 668 -7326 -12427 -11167 -9850 -9027 -5224 -2743 -2922 -1762 -1844
421a844j724K016L011K055M086L175K46k70j667o251n412k385l470o7L982K217
$$ -1844 -3568 -1552 1459 3514 7600 10775 11021 10751 9084 2833 -2579 -4964 -8434 -8501 -4519 -2302
437b302K348M168k010n359l692n433m059J478M908P612J2419J1402P080L474l383
$$ -2302 46 4214 2204 -3155 -6847 -12280 -16339 -14861 -9953 -2341 10078 21480 28560 32034 28651
452B8651j1020j2307j4034j5363p699m15L345J0035J3764J0830R002N841k435
$$ 28651 17631 5324 -8710 -24073 -31772 -32187 -28842 -18807 -5043 5787 14789 20630 18195
465A8195o661o500q162n862M04L580O267R597P262R33j789p857j2499j1689r882
$$ 18195 11534 5034 -3128 -8990 -8586 -5006 1261 10858 18120 19053 17264 9407 -3092 -14781 -24663
480b4663p754J230Q002R777J3405J3630P911L884K25o337q238o200n870l447P65
$$ -24663 -32417 -31187 -23185 -13408 -3 13627 21538 25422 25647 19310 11072 4872 -998 -4445 -3680
495c680R70J231J720k628o168n294n996m414J886O649R345J4510J4426Q337M148
$$ -3680 -2710 -1479 241 -2387 -8555 -13849 -19845 -24259 -22373 -15724 -6379 8131 22557 30894 35042
510C5042k095j0090j2639j3912j3213o702J035L923Q082J0310O494K425j660q047
$$ 35042 32947 22857 10218 -3694 -16907 -23609 -22574 -18651 -10569 -259 6235 8660 7000 -1047
524a047j0409o848m414R77J0169J4817J5977J7360J0183k5q030j6074k3534k2767
$$ -1047 -11456 -18304 -22718 -21741 -11572 3245 19222 36582 46765 46740 38710 22636 -898 -23665
538b3665j7849j1390J272J1242J6968K0724K0423J2143M660k962j1762j4439j0875
$$ -23665 -41514 -52904 -51632 -40390 -23422 -2698 17725 29868 34528 31566 19804 5365 -5510
551e510q491k202O326R988J1090J0737L918m391r114j4500j7392j3409p675p51
$$ -5510 -14001 -16203 -9877 111 11201 21938 25856 21465 12351 -2149 -19541 -32950 -40625 -41376
565d1376R296J5332J6728J7666J4135N607j409o839j2470j2934r444p388k878
$$ -41376 -32080 -16748 -20 17646 31781 37388 35979 29140 16670 3736 -5708 -13096 -15974
578a5974L450M491M031M032J47l472l507l801l683J106M203O205R714Q416M446
$$ -15974 -12524 -8033 -4002 30 177 -3295 -6802 -10603 -14286 -13180 -8977 -2772 6942 15358 19804
593A9804K412j944p463q799p612p215l193J720L025M991O290K800m83k849n809
$$ 19804 22216 20272 12809 4010 -3602 -10817 -14010 -12290 -9265 -4274 2016 4816 4333 1484 -4325
608d325n741k505m80L182P864R572P476P352J700n119p058r950j2155q292l854
$$ -4325 -10066 -12571 -13051 -9869 -2005 7567 15043 22395 24095 18976 11918 1968 -10187 -18479 -22333
623b2333k13N606R802R194Q730O653J05m553o537r004q172l682r71L084P893Q405
$$ -22333 -22546 -16940 -7138 2056 10786 17439 17544 12991 6454 -2550 -10722 -14404 -15375 -12291 -4398 4007
639D007O819N690L40l965n252p700q823m939j093R13M438O889N406M818L189p01
$$ 4007 10826 16516 16856 12891 7639 -61 -8884 -13823 -14916 -14003 -9565 -2676 2730 7548 10737 10036
655A0036k595l494m698l279p66j161R66L737K757J673J883l03j661j427j287k548
$$ 10036 7441 3947 -751 -4030 -4796 -5957 -4991 -1254 1503 3176 5059 4756 3095 1668 381 -2167
671b167n94n2m78J05M73q63R6J169L98K059L519K004K468J609j218k604k320n089
$$ -2167 -2761 -2813 -3291 -3186 -2713 -3576 -3480 -2311 -1913 146 3665 5669 8137 9746 8528 5924 3604 -1485
689a485n062k789j425J07L228M183L746M480K526q11j268l412m287j852r26l9
$$ -1485 -6547 -9336 -10761 -10654 -7426 -3243 503 4983 7509 6698 5430 2018 -2269 -4121 -5047 -5086
705e086L540M883L435K985J335k609m234n152o501n372k163M28K700O094N813
$$ -5086 -1546 3337 6772 9757 11092 8483 4249 -903 -7404 -12776 -14939 -14511 -11811 -5717 96
720I6N145M947J873j195k492l451m407k029j159j298J852K617K46P09k49l277
$$ 96 5241 10188 12061 10866 8374 4923 516 -1513 -2672 -3970 -2118 499 745 1454 1205 -2072
736b072k121j674j869q3K939L408L491L851J980M47m63l037l606k062j387j070
$$ -2072 -4193 -5867 -7736 -7819 -4880 -1472 2019 5870 7850 8297 7834 4797 1191 -871 -2258 -3328
752c328J293J398J115J821J4k901j920k642k995k31J733K703M636N214L842J855
$$ -3328 -2035 -637 478 2299 2313 -588 -2508 -5150 -8145 -8376 -6643 -3940 696 5910 9752 11607
768A1607j60l181m543m828n702l755N50J731L214N719M043K448O47j229m521m230
$$ 11607 11447 8266 3723 -1105 -6807 -10562 -10012 -8281 -5067 652 4695 7143 7790 6561 2040 -2190
784b190l301k948O29K385L607M977M419J984P8j913m283n176m072l619p09K628
$$ -2190 -5491 -8439 -7810 -5425 -1818 3159 7578 9562 9640 7727 3444 -1732 -5804 -9423 -10132 -7504
800g504L152M118M854L147L55r93k814n051l065j742j455K034K832K643L137J935
$$ -7504 -4352 -234 4620 7767 8122 7129 4315 -736 -3801 -5543 -6998 -4964 -2132 511 3648 5583
816E583n86j421k413l545j899m04m03K372L208K307J436J378q58k698k055k774
$$ 5583 4997 3576 1163 -2382 -4281 -4685 -5088 -2716 492 2799 4235 5613 4755 2057 2 -2772
832b772k415K17J212J836K746K398J244m9j290k978k209j761j677Q67K384K154
$$ -2772 -5187 -4970 -3758 -1922 824 3222 4466 4417 3127 149 -2060 -3821 -5498 -4631 -2247 -93
848i3K982K806j4j092j535l287k927j707j411Q39K753L129J922K578L48j201j865
$$ -93 2889 5695 5681 4589 3054 -233 -3160 -4867 -6278 -5439 -2686 443 2365 4943 5291 4090 2225
865B225k846l256j254K80M44K571L241K196J998L32k426k448j822k873j529P12
$$ 2225 -621 -3877 -5131 -4851 -4407 -1836 1405 3601 5599 5931 3505 1057 -765 -3638 -5167 -4455
881d455J098K638K773J800K11J43j996k988k412j178j122J381K345K363K941K108
$$ -4455 -3357 -719 2054 3854 4065 4208 2212 -776 -3188 -4366 -5488 -4107 -1762 601 3542 5650
897E650l09q21k140l184k911j168p82J211L127K440K324K517n21k189k680l414
$$ 5650 5341 4520 2380 -804 -3715 -4883 -5665 -4454 -1327 1113 3437 5954 5433 3244 564 -2850
913b850k629r17l5J957L916L236K730K237k22k725k959l215l312j875Q75J383
$$ -2850 -5479 -6396 -6431 -4474 -558 2678 5408 7645 7423 4698 1739 -1476 -4788 -6663 -5788 -4405
929d405K674L663K002J814Q8k731l325k371k656j718J191K160L072M091K848L47
$$ -4405 -1731 1932 3934 5748 5836 3105 -220 -2591 -5247 -6965 -5774 -3614 -542 3549 6397 6744
945F744j94j883l798k810k745k119J118K166K407L101K365O6o02j589l015k814
$$ 6744 6550 4667 869 -1941 -4686 -6805 -5687 -3521 -1114 1987 4352 4418 3816 2227 -788 -3602
961c602j052k38Q08L398K751K067K220j93k008k152l437l745j144J02J032L401
$$ -3602 -4654 -4892 -4084 -686 2065 4132 6352 6159 4151 1999 -1438 -5183 -6327 -6225 -5193 -1792
977a792L363K165K278L19k090l011k669l120r93Q85J442K553L482K048J131jk832
$$ -1792 1571 3736 6014 6333 4243 1232 -1437 -4557 -5550 -4665 -3223 -670 2812 4860 5991 5990 3158
994C158l497k772k765j838R78K294K889M220L145J297J90j847l533l332k661k224
$$ 3158 -339 -3111 -5876 -7714 -6736 -4442 -1553 2667 5812 7109 7299 5452 1919 -1413 -4074 -6298
1010f298L5K005J881K934L169R30k98j053l263k554j247j180K94K369K263K300
$$ -6298 -6263 -4258 -2377 557 3726 4656 4358 3305 42 -2512 -3759 -4939 -4645 -2276 -13 2287
1026B287K915N49l48j386k369l232j809j194p74J482J757J470K052J213l57p67
$$ 2287 5202 5751 5403 4017 1648 -1584 -3393 -4587 -5361 -3879 -2122 -652 1400 2613 2256 1489
1042A489j114j688o58L94L68J397K188P48J25K78j954j536j188j714j327O89J133
$$ 1489 375 -1313 -1971 -1577 -1209 188 2376 3124 3249 3527 1573 37 -1151 -2865 -4192 -3503 -2370
1059b370P59K154J319J6j01o90j408q92k70k77Q95J661J323J024Q51l52j305j952
$$ -2370 -1611 543 1862 1878 1777 1087 -321 -1213 -1483 -1760 -865 796 2119 3143 3994 3642 2337 385
1077C85j957k013n51J30N58J792J960J533O60J0o82o53j414j176m04L40R05Q37
$$ 385 -1572 -3585 -4136 -4006 -3448 -1656 304 1837 2497 2507 1825 1172 -242 -1418 -1822 -1482 -577 260
1095B60J478P68O15j84j715j551j299r68q86K09P11J187J625J218K70K81n15j025
$$ 260 1738 2506 3121 2937 1222 -329 -1628 -2596 -3482 -3273 -2562 -1375 250 1468 1738 2019 1504 479
1113D79n21k96j97Q15Q03J68R09k18r02j088q10j582o57J35M22Q13J396J396O67
$$ 479 -42 -338 -535 280 1083 1251 2160 1942 1040 -48 -858 -2440 -3097 -2962 -2540 -1727 -331 1065 1732
1132A732K85m21r96n45o84o50O51J120L21J503M52o38m09j528k234j463m58n64
$$ 1732 2017 1596 600 55 -629 -1279 -628 492 813 2316 2768 2130 1721 193 -2041 -3504 -3962 -4526
1150d526J011J933J839J943J638J95m51q28k088j752j115l38L26Q43J365O08J491
$$ -4526 -3515 -1582 257 2200 3838 4033 3582 2754 666 -1086 -2201 -2539 -2213 -1370 -5 603 2094
1167B094q3r91j267j529j397o08K03Q72K361K262J477J107M81j393k002j626k214
$$ 2094 2011 1020 -247 -1776 -3173 -3781 -3578 -2706 -345 1917 3394 4501 4982 3589 1587 -39 -2253
1184b253j250K37M29M80J903J141P18L63l99j569j046r4m61M41J234J301J373
$$ -2253 -3503 -3266 -2837 -2357 -454 687 1405 1768 1369 -200 -1246 -1340 -1801 -1360 -126 1175 2548
1201B548J413j93l10j630k166j670j710r00O76J066J643J695J204O96n6p92j369
$$ 2548 3961 3768 3458 1828 -338 -2008 -3718 -4618 -3942 -2876 -1233 462 1666 2362 2306 1514 145
1218A45r94m57J68J65J597J196R72M94n97j468j371j598j829m98K9R86J694K008
$$ 145 -849 -1306 -1138 -973 624 1820 2792 3286 2689 1221 -150 -1748 -3577 -4075 -4046 -3060 -1366 642
1236F42J456J035K49q38j398j020j269o33J55M86J370J234R33k00l39j235j675
$$ 642 2098 3133 3382 2544 1146 126 -1143 -1776 -1621 -1135 235 1469 2402 2202 1863 628 -1047
1253a047j356q04o29Q58J260J352J966J539l26l3p02j636j112j033l05J85J194
$$ -1047 -2403 -3207 -3836 -2978 -1718 -366 1600 3139 2813 2780 2078 442 -670 -1703 -2008 -1823 -629
1270f29O72Q63J037J95r01r13j326j169l89L09L62J086J921N91J189N2j283q94
$$ -629 43 906 1943 2138 1237 324 -1002 -2171 -2560 -2251 -1889 -803 1118 1709 2898 2950 1667 773
1288G73j444r36n35L42K39J455J178N58M21j96j088j247r15p24r53J276Q32N86
$$ 773 -671 -1607 -2142 -1800 -1561 -106 1072 1630 2051 1855 767 -480 -1395 -2119 -3072 -1796 -964 -378
1306c78J816P47K22m25j130j369m83j315J7N26J252J010Q06O72j00n11p84j420
$$ -378 1438 2185 2407 1982 852 -517 -1000 -2315 -2298 -1772 -520 490 1296 1968 1868 1357 573 -847
1324h47r61p3k21Q35J384P59M95P25k47r12q12j445r29K1O86K56J374J185P54
$$ -847 -1808 -1881 -2102 -1267 117 876 1371 2096 1849 937 125 -1320 -2249 -2228 -1542 -1286 88 1273 2027
1343B027L29n66j190j001q88q71m7O79M87J324J413M29j40m33r06j740p04m64
$$ 2027 2356 1790 600 -401 -1289 -2160 -2207 -1528 -1041 283 1696 2125 1985 1552 646 -1094 -1798 -2262
1361b262j79O70J263R55J407L90m0l26j016j414r98m74J15M03J351Q44Q08Q66
$$ -2262 -2441 -1771 -508 447 1854 2244 2204 1878 862 -552 -1550 -2024 -1909 -1506 -155 689 1497 2363
1379B363k76j155n66j713r16J31j9P81J531Q46Q63M16n69o53r07r48r46j06N40
$$ 2363 2087 932 366 -1347 -2263 -2132 -2151 -1370 161 1007 1870 2286 1717 1064 157 -791 -1737 -1843 -1303
1398a303M91Q07J361M05m0q2j059j081q81l86j28M00J004N61R30O70M26p46o86
$$ -1303 -812 -5 1356 1761 1721 1639 580 -501 -1382 -1768 -1896 -1496 -492 69 999 1669 2095 1349 663
1417F63q46j088k36j20N64P84Q09Q48L35l57o01m72j099r52r2N39K59Q04J154
$$ 663 -183 -1271 -1507 -1627 -1063 -279 530 1378 1713 1356 755 283 -816 -1768 -1860 -1321 -1062 -258 896
1436H96N30L56n67k74p90j094n63NK96M39J443O03J5K17o08p23r01n54k69m52
$$ 896 1426 1782 1215 941 151 -943 -1506 -1501 -1205 -766 677 1280 1295 1512 904 181 -720 -1274 -1543 -1995
1456a995R68M82P22Q85L99K6j42j029q75k91m13j4P00M07P22K93K06O5p43n00
$$ -1995 -1027 -545 177 1062 1461 1487 1345 316 -559 -850 -1263 -1277 -577 -170 552 845 1051 1116 373 -127
1476a27q59m85K4J63Q94P36K30L50L43l35l92n90p93k01J61M4M43J123J37K7M10
$$ -127 -986 -1471 -1447 -1284 -390 346 576 926 1269 934 542 -48 -841 -1042 -881 -837 -394 729 866 893 1303
1497A303m98r08m76o31J24j86L84Q58N00O26J9o3l00q04p86l18l75P07M54K19
$$ 1303 805 -103 -579 -1210 -1086 -1272 -888 -30 470 1096 1115 1052 752 -52 -838 -1156 -1531 -824 -370 -151
1517a51N64O10J61J12q69q54l82J09k29j1Q05R01L4L21k59p01j43n11n84n81O85
$$ -151 413 1023 1184 1296 427 -427 -809 -700 -929 -940 -135 766 800 1121 862 161 18 -493 -1077 -1658 -973
1538i73L25Q86L76N96L5j37n0q89m14p12N4K62L27M33N49N87n87n13j15p66r62
$$ -973 -648 238 614 1210 1245 1108 1058 169 -245 -957 -903 -641 -314 119 668 1255 668 155 40 -726 -1688
1559a688O4K16O17Q78Q01O15M70j65l54q37r76n64qm12J95N67K13R86M94j25l26
$$ -1688 -1624 -1408 -791 87 888 1503 1973 1808 1454 617 -359 -923 -931 -1343 -1148 -581 -368 618 1112 987 661
1580F61m30p81n96qK72J75Q03R11P0N05j47n83q69p28m18k63J80J30N63M01O72
$$ 661 231 -550 -1146 -1154 -882 -707 96 1007 1077 1582 1435 852 -17 -745 -1163 -1426 -1246 -1116 -553 -152 520
1601E20K88j03k49l41j96m45K69k27N82L01N11k01n12M69k38r03m89J67p16N64
$$ 520 808 705 456 115 -81 -526 -257 -484 98 399 910 709 197 666 428 -475 -964 -797 -1513 -949
1621i49N75N77N11N64k40k86l10n60p92J69J68J81M93M81nN32m34n34n27o70j67
$$ -949 -374 203 714 1278 1038 752 442 -118 -910 -741 -573 -392 101 582 577 1109 675 141 -386 -1056 -1223
1642a223M48M95J60O07M69Q7K07l20o40m17o75l61k98K80N54N90L87N46L21n85
$$ -1223 -775 -280 -120 487 956 1043 1250 930 290 -127 -802 -1163 -1461 -1181 -627 -37 350 896 1217 632
1662F32j16o47m98m3q3n3O90M85L98L59m02L35o67o33o81j37k68L10M63P42N80
$$ 632 516 -131 -629 -672 -755 -808 -118 367 765 1124 722 1057 390 -243 -924 -1061 -1329 -1019 -556 186 766
1683G66K43k01p8j10n05q69J84K24J76Q0L66k31L72j67o15J72k54p04L98O34J56
$$ 766 1009 808 730 620 115 -754 -570 -346 -170 -90 276 45 417 250 -365 -193 -447 -1151 -753 -119 37
1704C7R5O34l19M01j48m44o56k29J1j50M78J09O63J63O4L0o82k74m91l69N3L32
$$ 37 132 766 447 848 700 256 -400 -629 -618 -768 -290 -181 482 645 709 739 57 -217 -708 -1077 -1024 -692
1726f92L12P95N85J2R1l32p72j77m39o00j9M01P16O19L6O06Rl74l92k89l86p92
$$ -692 -380 415 1000 1012 1103 771 -1 -178 -617 -1217 -1236 -835 -119 500 536 1142 1151 777 385 96 -290 -1082
1748a082K55M8K06O39O31j31J87m8p67j60m96k76R2K27N64L86L83L21K0l85j24
$$ -1082 -827 -779 -573 66 697 566 753 705 -62 -222 -718 -994 -902 -675 -111 275 658 979 999 614 490
1769D90p68J78m33l4j39N17L75J7L72m39O7q1m64m6j84K66M92K39M1J17J24n70
$$ 490 -278 -100 -533 -567 -706 -189 186 203 575 136 203 122 -342 -388 -572 -306 186 425 466 583 707 137
1791A37l34O6l54K23j99J1N72k91P38k31K32l42j54n65r6j33J3O83J94O98K33
$$ 137 -197 -131 -485 -262 -461 -450 122 -169 569 338 570 228 74 -491 -587 -720 -707 -24 170 868 1101
1812A101k96K67n30p32o19O1k46j18N36O54J54M93q0Q0m12k69j93m77L63l27K01
$$ 1101 805 1072 542 -190 -809 -748 -994 -1112 -576 78 232 725 645 725 313 44 -149 -626 -263 -590 -389
1833c89L02K18O87q0k17ll43p10j48k58J59K46N86J95K59r0K04k09l34l69k18
$$ -389 -87 131 818 738 521 518 175 -535 -683 -941 -782 -536 50 245 504 414 618 409 75 -294 -512
1854e12K27j49J27O03N4J45j07m03N8k38j58r7K73q8R7M84J84N4k34p7l90k27
$$ -512 -285 -434 -307 296 350 495 388 -15 43 -195 -353 -450 -177 -265 -168 316 500 554 320 243 -147 -374
1876c74m2j03K12L11j30K64R9K13m39R9l08k02j21r7K80J47N11L36n6p4j41l66
$$ -374 -416 -519 -307 4 -126 138 237 450 11 110 -198 -400 -521 -618 -338 -191 320 656 600 526 385 19
1898A9m19m2L2k38m7N38K32L85M3qJ9n26j68q3l64R1N97K5N15k1J6j91k11o88
$$ 19 -400 -442 -410 -648 -695 -157 75 460 503 495 514 -12 -180 -263 -627 -536 61 86 601 580 596 405 194 -494
1922d94K11j33m69N1K59M68L36p1K10q6L3k98l7j09l7j13L00K81j2K5l0j5n04
$$ -494 -283 -416 -885 -834 -575 -107 229 158 368 282 315 17 -20 -129 -166 -279 21 302 290 315 285 270 -234
1945b34no57L09O4L67J81N2M41q8k09K77J87o21n27O9K24j53K23O52K10l01j10
$$ -234 -239 -896 -587 -523 -156 25 77 518 430 221 498 685 64 -463 -394 -170 -323 -100 552 762 461 351
1967C51m29m7o2m29J37M9M88j22N59K25j27j74m29q4j78j75OK9O8M04L2L54P1
$$ 351 -78 -125 -187 -616 -479 -430 58 -64 495 720 593 419 -10 -94 -272 -447 -441 -412 -344 60 92 446 517
1990E17k04j35k02k70l92K34L49k09N00L2M53o3l5n97k51R1l36j19L30J1N47K79
$$ 517 313 178 -24 -294 -686 -452 -103 -312 188 220 673 610 575 -22 -273 -182 -518 -637 -307 -296 251 530
2012E30R0j60rj82k34o53K81J4K15j13N04L2k9l19q3k49l83j28M66M03L7J49J68
$$ 530 620 460 451 269 35 -618 -337 -323 -108 -221 283 315 286 -33 -116 -365 -748 -876 -410 -7 30 179 347
2035C47K15j21M96l88m39o13J67k41R4L59R3l0O53m60J8l95O4m80L8J57L33J29
$$ 347 562 441 937 549 110 -503 -336 -577 -483 -124 -31 -61 592 132 150 -245 -181 -661 -623 -466 -133 -4
2057dM55J52J17L6l54l82j05m49j13Q0K33m7N47Kl3L30k25l73J93j30j55L85O7
$$ -4 451 603 720 756 402 20 -85 -534 -647 -567 -334 -381 166 168 135 465 240 -133 60 -70 -225 160 227
2080B27l65K55K51n9j38k97j49l48N94n22R1L90n2L70j53nJ43j0j12j55K28m56
$$ 227 -138 117 368 309 171 -126 -275 -623 -29 -551 -460 -70 -122 248 95 90 233 223 111 -44 184 -272
2102b72N05l33L21Mpj90p3j50k8m49M76J43J13K8M72%j39n7k81k24m24J65k09
$$ -272 233 -100 221 225 218 28 -45 -195 -223 -672 -196 -53 60 88 560 560 421 364 83 -141 -565 -400 -609
2125f09L06R4L8M09J94Q4j84k73k06j03K10l39L63m5L36k05M88o9l86J6k76l99
$$ -609 -303 -209 -171 238 432 516 332 59 -147 -250 -40 -379 -16 -61 275 70 558 489 103 119 -157 -556
2147e56n5L12p3J5J81L49O3nR1J29m11J56k37J15j34K00q5J4l80r2o1Q0j34O9
$$ -556 -611 -299 -372 -357 -176 173 236 231 322 451 40 196 -41 74 -60 140 55 69 -311 -403 -464 -384 -518 -449
2171d49o2L66p2J51L71Q9j21J30m18l87J64M2J10K00K08J4J56Q9p88J28l1m93
$$ -449 -511 -145 -217 -66 305 394 273 403 -15 -402 -238 -196 -86 114 322 336 492 581 -207 -79 -110 -603
2193f03J63j35O0N68L30j25n3L40j17l46J73l33n64K65P9M6M68J76j65k7j6j51
$$ -603 -440 -575 -515 53 383 258 205 545 428 82 255 -78 -642 -377 -298 -252 216 392 227 200 184 33
2215C3j8k99l20M00J86j23M35j82j71J44J85j01k12J78m82j26P63j89M4J25P0
$$ 33 15 -284 -604 -204 -18 -141 294 112 -59 85 270 169 -43 135 -347 -473 290 101 145 270 340
2236C40q5L9j75o4l47P7O7K6K71k0M34l11M6n66M01o71J07K73K0J31J82j92K66
$$ 340 255 294 119 55 -292 -215 -148 -122 149 129 563 252 298 -268 133 -538 -431 -158 -138 -7 175 -17 249
2259B49k12K0j55k26j29K42k4J32J71N1L00o3r1k34k84j66J67o5Q1J20J86N4K96
$$ 249 37 57 -98 -324 -453 -211 -235 -103 68 119 419 356 265 31 -253 -419 -252 -317 -236 -116 70 124 420
2282D20N8k61j45k64Q4l0l69K22k5K56k7N37M8l51L4k03l13j56r0J34J04J41L95
$$ 420 478 217 72 -192 -108 -138 -507 -285 -310 -54 -81 456 504 153 187 -16 -329 -485 -575 -441 -337 -196 199
2305A99OK73n3l63J31k51nm20J37L92j45J77j2nk1Q7m23K16l72K59K24N5O3K86
$$ 199 205 478 425 62 193 -58 -63 -483 -346 46 -99 78 66 61 40 127 -296 -80 -452 -193 31 86 149 435
2329D35j52J71l10k58M8r8J24j38L08k8P1R4l86M23p29J74J99J00M0r1K42J53
$$ 435 283 454 144 -114 -66 -164 -40 -178 130 102 173 267 -119 304 -425 -251 -52 48 88 -3 239 392
2351C92k3j57O6k84k01j04k21K51K2k29O52p9j03K97J8k45n40KJ01J38J22J94
$$ 392 369 212 278 -6 -207 -311 -532 -281 -259 -488 164 85 -18 279 297 52 -488 -486 -385 -247 -125 69
2373F9K36k09o8n3M19nm46K85l09k28P1K06O6P3l8J87J34o0n11J55p7r1j52L6
$$ 69 305 96 28 -25 394 389 -57 228 -81 -309 -238 -32 34 107 69 256 390 330 -181 -26 -103 -194 -346 -310
2397c10K81J84K2J6j16l5p8k16j73K62J1J52J47R0O1r2n7k22N0k35k00L65N0J82
$$ -310 -29 155 177 193 77 42 -36 -252 -425 -163 -152 0 147 237 298 206 149 -73 -23 -258 -458 -93 -43 139
2421A39M08l86O7j69k4k38N5j19r0O4L18k0J36J86lm60J22j70J50l59n7M2L48
$$ 139 547 161 228 59 35 -203 -148 -267 -357 -293 25 5 141 327 324 -136 -14 -184 -34 -393 -450 -408 -60
2444f0L94j31O05m34N2n31j56K92k05l09J3J85J36M29j53J65m80M68p57J00L75
$$ -60 334 203 808 374 426 -105 -261 31 -174 -483 -470 -285 -149 280 127 292 -188 280 -477 -377 -2
2465bn8p2J75L7J0P1J33k27j79j75J02J41q7J05m2K12l43K88rj85K7j37m5q6M04
$$ -2 -60 -132 43 80 90 161 294 67 -112 -287 -185 -44 -131 -26 -68 144 -199 89 80 -105 -78 -215 -260 -346 58
2490E8r8K33QK22n29R6J00k68j32J45q0L22k57J92L1Q3L3j32p7n55L89L2l26N04
$$ 58 -40 193 201 423 -106 -10 90 -178 -310 -165 -245 77 -180 12 43 126 159 27 -50 -605 -216 -184 -510 -6
2514fJ8l2L33l13p7o1Q7J69M4m82Om7J10P7J46L73N4l62J50j68k45M21k67M6R0
$$ -6 12 -20 313 0 -77 -138 -51 118 162 -320 -314 -361 -251 -174 -28 345 399 37 187 19 -226 195 -72 -26 64
2539F4J06O4N8j66k0j19J0l8J05j7j05N00l48lj25j11K11j22J67j45L6J29k03
$$ 64 170 234 292 126 106 -13 -3 -41 64 47 -58 442 94 91 -34 -145 66 -56 111 -34 2 131 -72
2562g2n7J94K92l53m08K54n9J31j30L88O5Oj38m0J94o6l10K50k27j92L28l99K00
$$ -72 -129 65 357 4 -404 -150 -209 -78 -208 180 245 251 113 73 267 201 -109 141 -86 -278 50 -349 -149
2585a49L72K26p82P18j46M6m02J23qJ20r5K71m44K55j1Pj32j14Q9j07J11l33J99
$$ -149 223 449 -333 385 239 285 -117 6 -2 118 23 294 -150 105 94 101 -31 -145 -56 -163 -52 -385 -186
2608a86J45L86j65j52J46j18l98J18j69o6J25K52J23k42K66j20j8K3J73k7m20
$$ -186 -41 345 180 28 174 56 -342 -224 -393 -459 -334 -82 41 -201 65 -55 -73 -50 123 96 -324
2629c24J68M73k68K33M8j98r1M45o51j63K03r6N7j42J50K06J32O8k78K86k74k98
$$ -324 -156 317 49 282 330 132 41 486 -165 -328 -125 -221 -164 -306 -156 50 182 250 -28 258 -16 -314
2651c14j23r2P61k67K14J88j58j20p5l15K90l7k00J86p0l3K74P5Om7K07l48J13
$$ -314 -437 -529 232 -35 179 367 209 89 14 -301 -11 -48 -248 -62 -132 -165 109 184 190 143 350 2 115
2674A15l02l54J81K77K19l9j01K48j52R4j31j34m60K94r7K87L6L33L50n81j0M5
$$ 115 -187 -541 -360 -83 136 97 -4 244 92 186 55 -79 -539 -245 -342 -55 -19 314 664 83 73 118
2696A18j4l76L64j34J2L74k67M7J55r3k43J14k66r3M81n2l53l4K85l7p4J33J49
$$ 118 104 -272 92 -42 -30 344 77 124 279 186 -57 57 -209 -302 179 127 -226 -260 25 -12 -86 47 196
2719A96k46K91m06K11j57J30J96R8k88L5j3p4P7j20j98o0K38q2J07K39o8J52J08
$$ 196 -50 241 -165 46 -111 19 215 313 25 60 47 -27 50 -70 -268 -328 -90 -172 -65 174 106 258 366
2742C66j61k28j29K25j45O9J50l2j84K29m2j66k35k81K80k12K96K63k84M60K14
$$ 366 205 -23 -152 73 -72 -3 147 115 -69 160 118 -48 -283 -564 -284 -496 -200 63 -221 239 453
2763D53K1j79l7j43lk50Q8j86J02J04p3J51K1rl92L27j25j7K55j21KJ36K81k39
$$ 453 474 295 258 115 112 -138 -50 -236 -134 -30 -103 48 69 60 -332 -5 -130 -147 108 -13 -11 125 406 167
2787A67K37m03k5J4j5Q7j8k27J26Q8j29O3M51n6l05j56J61L9qJ48kk42K31M8m03
$$ 167 404 1 -24 -10 -25 62 44 -183 -57 31 -98 -35 416 360 55 -101 60 99 91 239 237 -5 226 274 -129
2812a29o9p8q8L6K29j47O3K88j18K60j93K99L19o03k70J21n8l6K03K81J49k68
$$ -129 -198 -276 -364 -328 -99 -246 -183 105 -13 247 54 353 672 69 -201 -80 -138 -174 29 310 459 191
2834A91k11O9j21j63p4J68J79k22L29q2J65j41j40p0L17n57M48l79K18j95N80
$$ 191 -20 49 -72 -235 -309 -141 38 -184 145 63 228 87 -53 -123 194 -363 85 -294 -76 -271 309
2855C09P8j5j27q4j87P5L9Q9j13k74M32l4k15kn4K59m15Q1J13J1l20M90k5k75
$$ 309 387 372 245 161 -26 49 88 177 64 -210 222 188 -27 -29 -83 176 -239 -158 -45 -34 -354 136 111 -164
2879a64L1J58l0q7j52R2J97j66q4J87K39K18j3m07q1L8Nk13M47k80J44j30Mo4
$$ -164 -133 25 -5 -92 -244 -152 45 -121 -205 -18 221 439 426 19 -62 -24 -19 -232 215 -65 79 -51 -47 -111
2903a11J95K8J80o81L03l4j79L81l11M00l1m4K18k89p2Q1j72P8j93J32P3K81j73
$$ -111 84 112 292 -389 -86 -120 -299 82 -229 171 140 96 314 25 -47 34 -138 -60 -253 -121 -48 233 60
2926F0r3K95l9j60k93o1o7K41JL63k58pK71l25k1J3n76O30J7j01J46j03J0J56
$$ 60 -33 262 223 63 -230 -291 -358 -117 -116 247 -11 -18 253 -72 -93 -80 -656 -26 -9 -110 36 -67 -57 99
2950I9Q2k20k59L20L8j41p1J42K8L8J62j53J84Q2k95J93l85K9n6K00o6OO9j0K04
$$ 99 181 -39 -298 22 60 -81 -152 -10 18 56 218 65 249 331 36 229 -156 -127 -183 17 -49 -43 26 16 220
2975B20j05k9Q6n9r3L1j08LR7j2J24j94NJ19J8j71k74K00J78P4k82J38P4p0J15
$$ 220 115 86 172 113 20 51 -57 -54 43 31 155 -39 -34 85 103 -68 -342 -142 36 110 -172 -34 40 -30 85
3000H5n9L8j52K90m13K84Pk47J20K98l79j95M23j86j70k92K52L74M8O1k77Q7j71
$$ 85 26 64 -88 202 -211 73 80 -167 -47 251 -128 -323 100 -86 -256 -548 -296 78 126 187 -90 -3 -174
3023a74J02PJ04rk41K71r2K03n6k23K38j40J65J15m23K44k40O8j80K09L95l52
$$ -174 -72 -65 39 30 -211 60 -32 171 115 -108 130 -10 155 270 -153 91 -149 -81 -261 -52 343 -9
3045iJ58j13l15n3pJ65l3l1N26R0k06J04m75J16j69J57o5M6MJ51j43K42L9m1r9
$$ -9 149 36 -279 -332 -339 -174 -207 -238 288 378 172 276 -199 -83 -252 -95 -160 -114 -110 41 -102 140 179 138 39
3070C9rj14M04j73l64j76N20n35P3K60K57l89j1O7kj74J93J71j82J16k33L44j52
$$ 39 30 -84 320 147 -217 -393 127 -408 -335 -75 182 -207 -218 -151 -153 -327 -134 37 -145 -29 -262 82 -70
3093g0Q1J2n7p7k7j13L40Q6k01L49l0r5k02N2k41m9J8K71K68K7k17M3%nj37k15
$$ -70 11 23 -34 -111 -138 -251 89 175 -26 323 293 198 -4 48 -193 -242 -224 47 315 342 125 168 168 163 26 -189
3119a89J33K66l29M04J1k93M82q4j97l09l25L10r7J26k52j57M63m2K19L8J72m85
$$ -189 -56 210 -119 285 296 3 485 401 204 -105 -430 -120 -217 -91 -343 -500 -37 -79 140 178 350 -135
3141a35K46p1N5m24J14M07j53K86J06j90J34k28k77j8M3j02N3r1M09k55J88K44
$$ -135 111 40 95 -329 -215 192 39 325 431 241 375 147 -130 -148 -105 -207 -154 -245 164 -91 97 341
3163C41k13j27j83j74J33l6K48K44k67J88J02J7l26o3k24K49K6j94J93mJ71P2
$$ 341 128 1 -182 -356 -223 -259 -11 233 -34 154 256 273 -53 -116 -340 -91 -65 -259 -66 -70 101 173
3185A73q3j7R4n86M77q1n7k71L73J86P0m7K99m34k18J73J7k12m8QL06lq6K24l90
$$ 173 90 73 167 -419 58 -23 -80 -351 22 208 278 231 530 96 -122 51 68 -144 -192 -184 122 119 33 257 -133
3210a33L27r6j80p0J62qJ40p7k05L87K63m76r4K07j76l5M2J24o4o2lJ98j33J29
$$ -133 194 98 -82 -152 10 2 142 65 -140 247 510 34 -60 147 -29 -64 -22 102 38 -24 -27 171 38 167
3234A67l18R5J41l76l6L99J7MJ4j19K53l59P8J01l80M69k88J7J45j77N03Pk63
$$ 167 -151 -56 85 -291 -327 72 89 93 107 -12 241 -118 -40 61 -319 150 -138 -121 24 -153 350 357 94
3257I4k29L51l80M62j49j06j82K90k05K57J38r1k32k6j92l0M8L37j22R7n0p4J2
$$ 94 -135 216 -164 298 149 43 -139 151 -54 203 341 250 18 -8 -200 -230 -182 155 33 130 80 6 18
3280A8J21k76p2K56P4J78k62K06j88j87J76k33j4J43J08m64J04J82k49N32j75
$$ 18 139 -137 -209 47 121 299 37 243 55 -132 44 -189 -203 -60 48 -416 -312 -130 -379 153 -22
3301b2K29J02k03k12K19j35o7P9J04j40l1j7r8L27j04K06Rl92k34N17N3p3k49
$$ -22 207 309 106 -106 113 -22 -89 -10 94 -46 -77 -94 -192 135 31 237 246 -146 -380 137 190 117 -132
3324a32K79M1k69N41n13K08l61J69j6j38J40j78K30n2J14j89Jj50L08q1J08k92
$$ -132 147 188 -81 460 -53 155 -206 -37 -53 -191 -51 -229 1 -51 63 -126 -125 -275 33 -48 60 -232
3346b32L19K14j19o2k51K60j88m5J70j66K06j58K78j58n7J19j88m0l72P51k24
$$ -232 87 301 182 120 -131 129 -59 -104 66 -100 106 -52 226 68 11 130 -58 -98 -470 281 57
3367E7l4J10m70M84j51j9J03J06l68M67l80J37J47k69q0k2k7K74O1k30K25l50
$$ 57 23 133 -337 147 -4 -23 80 186 -182 285 -95 42 189 -80 -160 -182 -209 65 126 -104 121 -229
3389b29L90n54N04l20M80j47k3P8k21J45k55M0k90K21K65j22n9q7J76J18K06l15
$$ -229 161 -393 111 -209 271 124 101 179 -42 103 -152 -112 -402 -181 84 -38 -97 -184 -8 110 316 1
3411AN4k3L55l21k31M08k32P1j37J50k4Q4l21q7k20L63k3J88O1j16O3J36l7l41
$$ 1 55 32 387 66 -165 243 11 82 -55 95 71 155 -166 -253 -473 -110 -133 55 116 0 63 199 162 -179
3435a79K88j06p5J97j02Q6J3j24j86K63J08m14J52L7j98m0L60k15L73m4l86K98
$$ -179 109 3 -72 125 23 109 122 -2 -188 75 183 -231 -79 -42 -240 -280 80 -135 238 194 -192 106
3457A06m01N84l60J40k33N1m2M06K37l76j82K04j30k44J15m4J60J17L8l66M91
$$ 106 -295 289 -71 69 -164 -113 -155 251 488 112 -70 134 4 -240 -125 -169 -9 108 146 -220 271
3478B71j11l00L9J19r6p2Nj95M5L69P6J3J55m65N7j03Q3k12K97K8l3J43M2P1k63
$$ 271 160 -140 -101 18 -78 -150 -145 -340 -295 74 150 163 318 -147 -90 -193 -110 -322 -25 3 -30 113 155 226 -37
3503c7R2K18j43%L6k55j08K49j1L24m21K31j57l60M19m8k16K88K4j0j47K35l5
$$ -37 55 273 130 130 166 -89 -197 52 41 365 -56 175 18 -342 77 29 -187 101 125 115 -32 203 168
3526A68j12o6Q8N5k92NJ71J49J00l51J15M0J81m76Q7P8J53k39Q4J52k31J41L98
$$ 168 56 -10 78 133 -159 -154 17 166 266 -85 30 70 251 -225 -138 -60 93 -146 -62 90 -141 0 398
3549C98k59O3k38l4N5j38o3K62K56j15l42M80l41r3L41l13J48P9k23K80R2k17
$$ 398 139 202 -36 -70 -15 -153 -216 46 302 187 -155 325 -16 -109 232 -81 67 146 -77 203 295 78
3571G8l73J47J97k1l27J33N2j8K7q3L41Q3k18k19L61k44J08j61R3j67L88j53j4
$$ 78 -295 -148 49 28 -299 -166 -114 -132 -105 -188 153 236 18 -201 160 -84 24 -137 -44 -211 177 24 10
3594A0KL25j37n35Q7J62L8M8Q6J56k41J14k3l58N6K48k35n2J08M17n07J52K57
$$ 10 12 337 200 -335 -248 -86 -48 0 86 242 1 115 92 -266 -210 38 -197 -249 -141 276 -231 -79 178
3617A78J59n08K29k48Q1j29L33N4m32R5m1K93q6o4M00k46j11j75K44J93j85P7
$$ 178 337 -171 58 -190 -109 -238 95 149 -283 -188 -229 64 -22 -86 314 68 -43 -218 26 219 34 111
3639A11K8q3k02L40k41P5K02k97j4R1j68l7M52l75Q7L0j03n5k3p1L75lm4l61L44
$$ 111 139 56 -146 194 -47 28 230 -67 -81 10 -158 -195 257 -118 -31 -1 -104 -159 -182 -253 122 119 75 -286 58
3664E8k47N8J48J7K66l44rO2j56K83j60J99j65J16r2j42k31L40P3j93J84n2j40
$$ 58 -189 -131 17 34 300 -44 -53 9 -147 136 -24 175 10 126 34 -108 -339 1 74 -119 65 13 -127
3687a27P5M8R3K6J5n1l67L29p2J61l46K11L56j20Jk10l9M0K04O7j31k47K80l42
$$ -127 -52 -4 89 115 130 79 -288 41 -31 130 -216 -5 351 231 232 22 -17 23 227 294 163 -84 196 -146
3711a46j20K31M33l72r7J72k63n0L62q0k53J37O5R7j34k6j91K43o3K13k44J86
$$ -146 -266 -35 398 26 -71 101 -162 -212 150 70 -183 -46 19 116 -18 -44 -235 8 -55 158 -86 100
3733A00k94R7j82J53K18j18J29k33M7J10n6J62p5j20L69m59K57k77K24j57m1o
$$ 100 -194 -97 -279 -126 92 -26 103 -130 -83 27 -29 133 58 -62 307 -152 105 -172 52 -105 -146 -152
3755a52r0LN83l12M5J06K02l14l91K04J03j0J71J10k28q5K27K8j84J78j53m46
$$ -152 -242 -239 344 32 77 183 385 71 -320 -116 -13 -23 148 258 30 -55 172 200 16 194 41 -405
3777d05L64j52M2L28j20K97j62j35N9j80l19N83k68M0jQ2J56k84J75J18j92l5
$$ -405 -41 -193 -151 177 57 354 192 57 116 -64 -383 200 -68 -28 -29 53 209 -75 100 218 26 -9
3799iJ01j68l4M33j92m06J04J88J22m88L05j32J96q4k17L61K2r5N1j56L09QNQ3
$$ -9 92 -76 -110 323 131 -275 -171 17 139 -349 -44 -176 20 -64 -281 80 102 7 58 -98 211 219 224 307
3823C07m98N8K68p3k0j10N17j79l34K03k40J22j78j34M71m26L67P5k84J48m5J25
$$ 307 -191 -133 135 62 42 -68 449 270 -64 139 -101 21 -157 -291 180 -246 121 196 -88 60 15 140
3845A40j04O8r5k48L70K45k26j26l05K85J21r5q1m2K50j28o5l94M81N5l9o6o1
$$ 140 36 104 9 -239 131 376 150 24 -281 4 125 30 -51 -93 157 29 -36 -430 51 106 67 1 -60
3868f0L21l94R0r1K6K63j00k56Q7j66J71N9k83L57J14j16J53j50k7q7R3J4n8o
$$ -60 261 -133 -43 -134 -108 155 55 -201 -114 -280 -109 -50 -333 24 138 22 175 25 -2 -89 4 18 -40 -46
3892d6nn5K82j73QP6j26P2O1k93N3L99j72m17K32j6K67j93J92k10MK18l2n0j29
$$ -46 -51 -106 176 3 11 87 -39 33 94 -199 -146 253 81 -336 -104 -120 147 -46 146 -64 -60 158 126 76 -53
3917e3L5j12J47j64K49k79O9j23O65l83k52J72L8q9K73l95K14J55l86N23r6k36
$$ -53 -18 -130 17 -147 102 -177 -108 -231 434 51 -201 -29 9 -80 193 -202 12 167 -219 304 208 -28
3939b8K60k26l0J6l08O03m21L4l3J27J7o6M65m28L3J36j94K3J57K14m19J33m6
$$ -28 232 6 -24 -8 -316 287 -134 -100 -133 -6 11 -55 410 -18 15 151 -43 -20 137 351 -68 65 19
3962A9m7j78K19j40J9J44J32l44K37o6p9j07J82j14j96RK54k9j08L25J00k03J09
$$ 19 -28 -206 13 -127 -108 36 168 -176 61 -5 -84 -191 -9 -123 -319 -310 -56 -85 -193 132 232 29 138
3985A38l74K0L57l85N04k21k2J72l37K77n8j09N0m2l21K46L08k72Q9O0q4J70l18
$$ 138 -236 -216 141 -244 260 39 17 189 -148 129 71 -38 12 -30 -351 -105 203 -69 20 80 -4 166 -152
4008a52J82k4okJ51j8k52J77n12O00m14J61P2P6Q0J00m41R2N7j20po7P3K8J94
$$ -152 30 6 0 -2 149 131 -121 56 -456 144 -270 -109 -37 39 119 219 -222 -130 -73 -193 -200 -267 -194 -166 28
4033B8M3j31J7k13L08l45Q6J13K43Np4l1L2O1L9M3K0m01L32j43j06k07M65k95
$$ 28 71 -60 -43 -256 52 -293 -207 -94 149 154 80 49 81 142 181 224 244 -157 175 32 -74 -281 184 -111
4057a11pL05l63J09J69q9J59Q2j89OJ6j5J4k62J67J41r2nK25j93r6K18j63J02
$$ -111 -118 187 -176 -67 102 13 172 254 65 71 87 72 86 -176 -9 132 40 35 260 67 -29 189 26 128
4081A28J38l41j57L4J95o5j23OQ7Q6N8j48n0K33l59M71j99K64l75J64l40J74J36
$$ 128 266 -75 -232 -198 -3 -68 -191 -185 -98 -12 46 -102 -152 81 -278 193 -6 258 -117 47 -293 -119 17
4104A7k45K43K28k83L6K2k69K48l50K40J16j92j93N03j10J5K79m65J35k0L4o0
$$ 17 -228 15 243 -40 -4 18 -251 -3 -353 -113 3 -189 -382 121 11 26 305 -160 -25 -45 -11 -71
4126g1K25j93J0Q0Nk08J20J99k39J11j18N0J0p2k80K57j78QP4N6J59K36m56M04
$$ -71 154 -39 -29 51 56 -152 -32 167 -72 39 -79 -29 -19 -91 -371 -114 -292 -284 -210 -154 5 241 -215 189
4150A89k32j2k26K28K47l92J08J22R5J99m42J36P2p7J16j32K07l44l71M46L23
$$ 189 -43 -55 -281 -53 194 -198 -90 32 127 326 -116 20 92 15 131 -1 206 -138 -509 -63 260
4171B60j34k5l45J78P3l06R5L23k09K58m6j51ok12J11j54J22Q3j26K37k36K02
$$ 260 126 101 -244 -66 7 -299 -204 119 -90 168 122 -29 -35 -247 -136 -290 -168 -85 -211 26 -210 -8
4193hr2K27O8m66K25J1l36J4O11j86p5o5K38m17l2M4K33N3l0K14l4qn1k58K27
$$ -8 -100 127 195 -271 -46 -35 -371 -357 254 68 -7 -72 166 -251 -283 -239 -6 47 17 231 197 189 138 -120 107
4218A07l23J63n1l1J77M1l63J77lM09j1k39l6R3j50j53J33J84k3J14k36k1L6P4
$$ 107 -216 -53 -104 -135 42 83 -280 -103 -106 303 292 53 17 110 -40 -193 -60 124 101 215 -21 -42 -6 68
4242F8j37p3l0K73p5q0k5P3K08j10p1k66J67J61l68K03P6M0K67j75j86j02L43
$$ 68 -69 -142 -172 101 26 -54 -79 -6 202 92 21 -245 -78 83 -285 -82 -6 34 301 126 -60 -162 181
4265A81O0k99J79K7k00J04m09M28k93L54J49j73k09J37J98l67p5K37j88k22M27
$$ 181 241 -58 121 148 -52 52 -357 71 -222 132 281 108 -101 36 234 -133 -208 29 -159 -381 46
4286D6N6l05J23K3l5M36p9j36m16M74L3k07n2N5R0k96J30l33J54J17n7m3M10k37
$$ 46 102 -203 -80 -57 -92 344 265 129 -287 187 220 13 -39 16 106 -190 -60 -393 -239 -122 -179 -222 188 -49
4310d9j6K88l48K41j15m66M31Q8q7K34k24J15j8k31L10j31O0j43R2Q2j80J10j3
$$ -49 -65 223 -125 116 1 -465 -34 54 -33 201 -23 92 74 -157 153 22 82 -61 31 113 -67 43 30
4333C0J54m11R2K30K1j67k21M34k59oJ59k5p2n9oM0L54m85k7K39k64K38j64L22
$$ 30 184 -227 -135 95 116 -51 -272 162 -97 -103 56 31 -41 -100 -106 -66 288 -197 -224 15 -249 -11 -175 147
4357A47j2k19j46K06P9Q5o8K9j02K7J21p8O2j38J56k07J59q5j42J43o4l0J8P2
$$ 147 135 -84 -230 -24 55 140 72 101 -1 26 147 69 131 -7 149 -58 101 16 -126 17 -47 -77 -59 13
4381A3m5J13l74M96l40L92n34L44J8o1l8K94j37M5p1j1J09k85L18k77J68O9m34
$$ 13 -32 81 -293 203 -137 255 -279 65 83 22 -16 278 141 186 115 104 213 -72 246 -31 137 206 -228
4404b28L19k11J50j24j14M10J16l01k47R0j98ML00Q7k46K25l0J56k54L16k40o9
$$ -228 91 -120 30 -94 -208 202 318 17 -230 -140 -338 -334 -34 53 -193 32 2 158 -96 220 -20 -89
4426h9r9j98M21L4r8K42j83O8l22K3K60k07J05K5J2j02J70K12k85j58K66K06n60
$$ -89 -188 -386 35 69 -29 213 30 98 -224 -201 59 -148 -43 -18 -6 -108 62 274 -11 -169 97 303 -257
4449b57K74k7J94l18NJ48j54Qo5K9Q7P6k99L94j42J83J90m40K11Q1J8j65J40j04
$$ -257 17 -10 184 -134 -129 19 -135 -127 -192 -163 -76 0 -299 95 -47 136 326 -114 97 178 196 31 171 67
4473F7j08j40Q2o2K9Q9Q4rjj1l29K52O2L6k0op6L18r3k98M01l72k6L9J75l36L09
$$ 67 -41 -181 -99 -161 -132 -43 41 32 31 20 -309 -57 5 41 21 15 -61 257 164 -134 267 -105 -131 -92 83 -253 56
4500E6k80J35J34j81J20k52K91K85m23J85k5K33k88m9J98k63j29P9L56j36J31
$$ 56 -224 -89 45 -136 -16 -268 23 308 -115 70 45 278 -10 -59 139 -124 -253 -174 182 46 177
4521A77j24r9J38rk23j61K00j3j04M41n53L82j79L02Rj32j34k27J94P3J3r0K84
$$ 177 53 -46 92 83 -140 -301 -101 -114 -218 223 -330 52 -127 175 184 52 -82 -309 -115 -42 -29 -119 165
4544A65l18J28K66j96J50j16l52L27Q3J12op4l8L7j70K4L33m40K60j24n1K02j01
$$ 165 -153 -25 241 45 195 79 -273 54 137 249 243 169 131 168 -2 22 355 -85 175 51 0 202 101
4567A01p3j09o5J78J25k18qM6J00k83M10J29l62K58k81m4%M18o96L92P7j14N8
$$ 101 28 -81 -146 32 157 -61 -69 -23 77 -206 204 333 -29 229 -52 -96 -96 322 -374 18 95 -19 39
4590C9n3k29M42k3k16j26P4J41R9m3l05L53k78K53j00J72l86L56k67L34k97r0
$$ 39 -14 -243 199 176 -40 -166 -92 49 148 105 -200 153 -125 128 28 200 -186 170 -97 237 -60 -150
4612a50m8K46k04r1L39j02r7L6L1Jj80l4K29k23J29k72P1M82l37J71p9j5q7K99
$$ -150 -198 48 -156 -247 92 -10 -107 -71 -40 -39 -219 -253 -24 -247 -118 -390 -319 163 -174 -3 -82 -97 -184 115
4636A15k4M1k26J60j32J53K16m98K86M7j57K17k59m0J18J51k07J57Pm37J39j04
$$ 115 91 132 -94 66 -66 87 303 -195 91 138 -19 198 -61 -101 17 168 -39 118 125 -312 -173 -277
4658b77P53m87J30J3k69K45Q6k8j54J3K64k78O2r1n3K65k52r9J55J07l21K73j82
$$ -277 476 -11 119 132 -137 108 194 166 12 25 289 11 73 -18 -71 194 -58 -157 -2 105 -216 57 -125
4681a25J7M23o48L34K3r8K26j41K1j60J47K4q2j7j39M71j70j07o5L5NO0J41m05
$$ -125 -108 315 -333 1 24 -74 152 11 32 -128 19 43 -39 -56 -195 276 106 -1 -66 -31 -26 34 175 -230
4705b30K89m0MJ35l58M54m35l3K52j08J86k05J81p3J14j83j01J85r5l2L53k42
$$ -230 59 19 23 158 -200 254 -181 -214 38 -70 116 -89 92 19 133 -50 -151 34 -61 -93 260 18
4727A8k48L06j38k1J86K33n81L63j03J38J3m3j57jm9R9m7K52l0K6q0J21l61K06
$$ 18 -230 76 -62 -83 103 336 -245 118 15 153 166 123 -34 -35 -84 15 -32 220 190 216 136 257 -104 102
4751A02K66j71k73p3L79k08j14LL86j31k69J85j81J37K42l82K59l66J23J83l84
$$ 102 368 197 -76 -149 230 22 -92 -89 297 166 -103 82 -99 38 280 -102 157 -209 -86 97 -287
4772b87L21l54M67j34M5m2o4J97j23J11k65j51L03l16M17j09K34p2l51M0Nl2R3
$$ -287 34 -320 147 13 58 16 -48 149 26 137 -128 -279 24 -292 125 16 250 178 -173 -133 -128 -160 -67
4795f7J42L1l72L77n66O30j84j66nk53N57k30J43K6l49O9L02j35j63K22K5m4J53
$$ -67 75 106 -266 111 -455 175 -9 -175 -180 -433 124 -106 37 63 -286 -217 85 -50 -213 9 34 -10 143
4818A43Pm03p8L24Oj8J32n0k86K31Q3p3k01P5Q5J37L0j75j09K82j70M1j68M27
$$ 143 150 -253 -331 -7 -1 -19 113 63 -223 8 91 18 -183 -108 -23 114 144 -31 -140 142 -28 13 -155 272
4842B72k22l3k76j06M97k90J84K02K3j36pr8k8l27L98N6M3J47l17jJ99j24k6k68
$$ 272 50 17 -259 -365 132 -158 26 228 251 115 108 10 -18 -345 53 109 152 299 -18 -19 180 56 30 -238
4866b38L80k33m0J0L64l66pP5M14k25K6k79K78j28j65P9M71l50k1l66O61l36k2
$$ -238 142 -91 -131 -121 243 -123 -130 -55 359 134 160 -119 159 31 -134 -55 416 66 45 -321 340 4 -18
4889a8k22J67k32N43m62K06j71J75k60L37j37P3P8J3P0m9L10l76M6j38J85j54
$$ -18 -240 -73 -305 238 -224 -18 -189 -14 -274 63 -74 -1 77 90 160 111 421 45 91 -47 138 -16
4911a6J18Q0k6l64L94kP5j42k77K22j46M37m17K33m3Q6k43J46m5l66N9L34k11
$$ -16 102 182 156 -208 186 184 259 117 -160 62 -84 353 -64 169 126 212 -31 115 70 -296 -237 97 -114
4934a14m7N34m64oj26J9L46J7l49P7N4L13qm22J22q2L18k10K62K8k13J64m51K30
$$ -114 -161 373 -91 -97 -223 -204 142 159 -190 -113 -59 254 246 -176 -54 -136 182 -28 234 262 49 213 -238 -8
4958hJ12O3J37l08J20K07k15k49K62o9j50j66K25j27l2M52l98M24k06j71j29K91
$$ -8 104 167 304 -4 116 323 108 -141 121 52 -98 -264 -39 -166 -198 254 -144 280 74 -97 -226 65
4980F5L6l05K34J51J61k09q2l1J65k18%L13k23j06K53l81J56j76L07q7L7N6R2
$$ 65 101 -204 30 181 342 133 51 20 185 -33 -33 280 57 -49 204 -177 -21 -197 110 23 60 116 208
5003B08r2K85q1l60r8q4M43l03J11j80L21po0K69n51J88%K14k34L57o23o7J84
$$ 208 116 401 320 -40 -138 -222 221 -82 29 -151 170 163 103 372 -179 9 9 223 -11 346 -277 -344 -160
5026a60J93O0J81kk63J09k67L37j02M0k25O3K21j52q9k0L86k44n5L6o8M6Q0k58
$$ -160 33 93 274 272 9 118 -149 188 86 126 -99 -36 185 33 -56 -76 310 66 11 47 -21 25 105 -153
5050a53J60J11k01J82nj61lL01k85O1O9M9k78J28K77k86j45K69Q4k53j33M03k38
$$ -153 7 118 -83 99 94 -67 -70 231 -54 7 76 125 -153 -25 252 -34 -179 90 174 -79 -212 191 -47
5073d7L7l10L31j03P5q7j65K82L73n21M16l62K14o1j3P0m4n27N11q0K73l72K04
$$ -47 -10 -320 11 -92 -17 -104 -269 13 386 -135 281 -81 133 72 59 129 85 -442 69 -11 262 -110 94
5096I4nj66L24j70k16K06K21k13N7k10M5J89k01J93M8J54q4m09p9M8J70M30m08
$$ 94 89 -77 247 77 -139 67 288 75 132 -78 -33 156 -45 148 196 350 266 -143 -222 -174 -4 426 18
5119A8p4J03j08k5K9K47L1m51L11jP6l2j77k36M60k35N1L83m00j32k19O55m57
$$ 18 -56 47 -61 -86 -57 190 221 -230 81 80 156 124 -53 -289 171 -64 -13 370 -30 -162 -381 274 -183
5142a83nL3Q8K54k49J1l9J46n5j77N92m03r6Q9p1J76k20M2l64L47J97k14K88l83
$$ -183 -188 -155 -67 187 -62 -51 -90 56 1 -176 416 13 -83 6 -65 111 -109 -67 -431 -84 113 -101 187 -196
5166a96M02q4j51L4J10j62J19j04N14m96J3J18p8J43N9J6n6k54J3P1P5l06L61
$$ -196 206 122 -29 5 115 -47 72 -32 482 -14 -1 117 39 182 241 257 201 -53 -40 31 106 -200 161
5189A61j99o2M7j46L05l02M8J69j48k00L00j38PM8K05l76J54J49m1K17j08j73
$$ 161 -38 -100 -53 -199 106 -196 -148 21 -127 -327 -27 -165 -158 -110 95 -281 -127 22 -19 198 90 -83
5211h3Mn6J13J40j18J65j62p6k32L09M61l09k53l9L02J64k95o4m5J8J13l32J15
$$ -83 -79 -135 -22 118 0 165 3 -73 -305 4 465 156 -97 -136 166 330 35 -29 -74 -56 57 -275 -160
5234a60j72K69J57k25n5K23L0k80J16J10l35p9L29J29L23l71l78K28K38n9m7k91
$$ -160 -332 -63 94 -131 -186 37 67 -213 -97 13 -322 -401 -72 57 380 9 -369 -141 97 38 -9 -300
5256c00L13M3j4J9k06m6M64l76o0J02q1K43n14K14r7L90j94N9J96k22M30l61K66
$$ -300 13 56 42 61 -145 -191 273 -103 -163 -61 -142 101 -413 -199 -296 94 -100 -41 155 -67 363 2 268
5279B68m80J72l7m7K50j58K3j8O7k74J25J23m5k03K15r8J40Jk41K77J58l8k57
$$ 268 -212 -40 -77 -124 126 -32 -9 -27 40 -234 -109 14 -31 -234 -19 -117 23 24 -217 60 218 180 -77
5302g7N8m9J53n7r4J50l46K73M4q2m1j50M49n23M27K3l42L38k90J03k33K13k40
$$ -77 -19 -68 85 28 -66 84 -262 11 55 -27 -68 -218 231 -292 135 158 -184 154 -136 -33 -266 -53 -293
5325b93m4M97k33J6jr7L05j2q9J87M0n19J95q3j32L4J38P9L57k31n2J83m40J65
$$ -293 -337 160 -73 -57 -58 -155 150 138 49 236 276 -243 -48 -131 -263 -229 -91 -12 345 114 62 245 -195 -30
5349c0n4o9J71J8o6j68J41j40L43l44J03j66J06K32R7jk27J46k35L24k57k35K9
$$ -30 -84 -153 18 36 -30 -198 -57 -197 146 -198 -95 -261 -155 77 174 173 -54 92 -143 181 -76 -311 -282
5372b82N84m15L4K08k53L16j79k26N6K01o1Mm4J41j39j13K28j7J30l01K42q1J65
$$ -282 302 -113 -79 129 -124 192 13 -213 -157 44 -17 -13 -57 84 -55 -168 60 43 173 -128 114 33 198
5395A98j97P1l80K93P9l53L12N9R2j72L2N8j05K49j88l5p0K60k5m43K38K09j21
$$ 198 1 72 -308 -15 64 -289 23 82 174 2 34 92 -13 236 48 13 -57 203 178 -265 -27 182 61
5418F1J1j39J91J26m74J63J77l83M49J17k86L4N0k16j05L2J47j53L95q0J59k8
$$ 61 72 -67 124 250 -224 -61 116 -267 182 299 13 47 97 -119 -224 -192 -45 -198 197 117 276 248
5440B48j04l78M87l61l33L71K2l61M20J8J26R7l49l5P5m1M27k96l64K88K07m03
$$ 248 144 -234 253 -108 -441 -70 -48 -409 11 29 155 252 -97 -132 -57 -98 329 33 -331 -43 164 -239
5462b39M09j12J09O2j09J0l33J82L3K08j46j20J08kK25m42j28M11R7l29M8J3j2
$$ -239 170 58 167 229 120 130 -203 -21 12 220 74 -46 62 60 285 -157 -285 126 223 -106 -58 -45 -57
5485e7J59j91J89N0m2j87L0rj16Q6J52j56J78j91j6J74J30r8j27k17J62J40J85
$$ -57 102 -89 100 150 108 -79 -49 -58 -174 -88 64 -92 86 -105 -121 53 183 85 -42 -259 -97 43 228
5508B28j56J13k4l2p3l41L47nk66K66k25L2L40j46L8r1m00N47k04J73j84K17j14
$$ 228 72 185 161 129 56 -285 62 57 -209 57 -168 -136 204 58 96 5 -395 152 -52 121 -63 154 40
5531D0k43J97k08J78J89j30J77k13K9l5j21J85K15j68k28L74k94R2p1QQ8L21l36
$$ 40 -203 -6 -214 -36 153 23 200 -13 16 -19 -140 45 260 92 -136 238 -56 36 -35 -27 61 382 46
5554D6J21R2l02J58K1j38k43J12L37jm64nJ30J53M18l91m9J14j66M08k43Rj52
$$ 46 167 259 -43 115 136 -2 -245 -133 204 203 -261 -266 -136 17 435 44 -5 109 -57 351 108 117 -35
5577c5J38j23r8L32l48M20j57O0l73K62N0K7l3L0J0j66j59N29m35K71l01J94M4
$$ -35 103 -20 -118 214 -134 286 129 189 -184 78 128 155 122 152 162 -4 -163 366 -69 202 -99 95 139
5600A39r0Q5nN1k82L95k69J3j23J39N5l56L36k45K71J17J3m55j28J63K34J21l5
$$ 139 49 134 129 180 -102 293 24 37 -86 53 108 -248 88 -157 114 231 244 -211 -339 -176 58 179 144
5623A44k08J7K15l25q9L80l19J06M5J95j21P9j18j17J81k53n8M04P7k47J8P2P9
$$ 144 -64 -47 168 -157 -246 134 -185 -79 -34 161 40 119 1 -116 65 -188 -246 158 235 -12 6 78 157
5646A57m9L1j29j00k15J97K4M9J07m4L3j02R6j38q8J53j76%R7J86k46R6J67j48
$$ 157 108 139 10 -90 -305 -108 -84 -35 72 28 61 -41 55 -83 -171 -18 -194 -194 -97 89 -157 -61 106 -42
5670d2L19n7l01J11j60K93j45k49K42K89l51lN32l13j8lR9n17J1L15O7q5J43O2
$$ -42 277 220 -81 30 -130 163 18 -231 11 300 -51 -54 478 165 147 144 243 -274 -263 52 119 34 177 239
5694B39n56P36l06j89J18j1J08o4m9k11M8MK68q8Q2J53j80j25o1j7P8L79k39k33
$$ 239 -317 419 113 -76 42 31 139 75 26 -185 -137 -133 135 47 129 282 102 -23 -84 -101 -23 356 117 -116
5718a16L13l83O2r8l7L02J57j34j26J50J31l2k40q1J89j24N17m73Kk61K1L73L02
$$ -116 197 -186 -124 -222 -259 43 200 66 -60 90 221 189 -51 -132 57 -67 450 -23 -21 -282 -261 112 414
5741D14n97K34m82L95J02M5k25J95J26k79Q6j67J46O1M0j94K43k99K44o7kp6J18
$$ 414 -183 51 -431 -36 66 111 -114 81 207 -72 14 -153 -7 54 94 -100 143 -156 88 21 19 -57 61
5764F1J79j93l8j36P8K43j36j75Q2k26K39K87j41j48j57o7K07J65J72p32N11l0
$$ 61 240 47 9 -127 -49 194 58 -117 -35 -261 -22 265 124 -24 -181 -248 -41 124 296 -436 75 45
5786D5j1L42j90k17L20k75m3p1j79O47j63k98j20J95J33N1l12J3j07j7J53P4k3
$$ 45 34 376 186 -31 289 14 -29 -100 -279 368 205 -93 -213 -18 115 166 -146 -133 -240 -257 -104 -30 -53
5809e3K42J39j66l54K59K43L3m59K30j06L9K16l39J23k5k36J34K0q3K83l08J62
$$ -53 189 328 162 -192 67 310 343 -116 114 8 47 263 -76 47 22 -214 -80 -60 -143 140 -168 -6
5831fJ70k43J31P4j07O8j38m18L22m6K47K60l86P13l58l49j82L96l19J35k4l8
$$ -6 164 -79 52 126 19 87 -51 -469 -147 -193 54 314 -72 641 283 -66 -248 148 -171 -36 -60 -98
5853i8k05K22P1np4L60l50K4N3L9j7k19J34L2J23J27q7j16k70J01K58L51k15k37
$$ -98 -303 -81 -10 -15 -89 271 -79 -55 -2 37 20 -199 -65 -33 90 217 130 14 -256 -155 103 454 239 2
$$ [...]
8191H8
##END NTUPLES=NMR FID
##END=
