##TITLE=1H_CA-8560
 CDCl3, 8 sc, 
 5.2.2019
##JCAMPDX= 6.0         $$ Bruker NMR JCAMP-DX V2.0
##DATA TYPE= NMR FID
##DATA CLASS= NTUPLES
##ORIGIN= UXNMR, Bruker Analytische Messtechnik GmbH
##OWNER= root
$$ XWIN-NMR		Version 3.5
$$ Tue Feb  5 13:54:04 2019 Russian Standard Time (UT+4h)  she@DPX200
##.OBSERVE FREQUENCY= 200.1313
##.OBSERVE NUCLEUS= ^1H
##.DELAY= (6, 6)
##.ACQUISITION MODE= SIMULTANEOUS
##.ACQUISITION SCHEME= undefined
##.AVERAGES= 8
##.DIGITISER RES= 18
##SPECTROMETER/DATA SYSTEM= spect
##.PULSE SEQUENCE= zg30
##.SOLVENT NAME= CDCl3
##.SHIFT REFERENCE= (INTERNAL, CDCl3, 0, 15.7039)
##AUDIT TRAIL= $$ (NUMBER, WHEN, WHO, WHERE, WHAT)
$$ ##TITLE= Audit trail, XWIN-NMR		Version 3.5
$$ ##JCAMPDX= 5.01
$$ ##ORIGIN= Bruker BioSpin GmbH
$$ ##OWNER= she
$$ F:/spectra/data/she/nmr/H-F/1/audita.txt
$$ ##AUDIT TRAIL=  $$ (NUMBER, WHEN, WHO, WHERE, WHAT)
(   1,<2019-02-05 13:53:05.51 +0400>,<she>,<DPX200>,
      <created by zg, POWCHK disabled, PULCHK disabled
       configuration hash MD5:
       00 E9 B6 7A A2 85 ED C7 34 08 36 98 17 FE 4E 26
       data hash MD5: 16K
       05 92 F7 23 3B 2B 8D 1B 04 D2 21 31 F9 08 F4 68>)
$$ ##END=
$$ 
$$ hash MD5
$$ FC AA 58 FC CF 4F B5 46 70 29 C8 7E 53 EA E9 72
##$RELAX= 
##$RELAX= 
##$RELAX= 
##$RELAX= 
##$RELAX= 
##$RELAX= 
$$ Bruker specific parameters
$$ --------------------------
##$DU= <F:/spectra>
##$EXPNO= 1
##$NAME= <H-F>
##$PROCNO= 1
##$TYPE= <nmr>
##$USER= <she>
##$AMP= (0..31)
100 100 100 100 100 100 100 100 100 100 100 100 100 100 100 100 100 100 
100 100 100 100 100 100 100 100 100 100 100 100 100 100 
##$AQSEQ= 0
##$AQ_mod= 1
##$AUNM= <au_zg>
##$AUTOPOS= <>
##$BF1= 200.13
##$BF2= 200.13
##$BF3= 200.13
##$BF4= 200.13
##$BF5= 200.13
##$BF6= 200.13
##$BF7= 200.13
##$BF8= 200.13
##$BYTORDA= 1
##$CFDGTYP= 0
##$CFRGTYP= 5
##$CHEMSTR= <none>
##$CNST= (0..31)
1 1 145 1 1 1 1 1 1 1 1 1 1 1 1 1 1 1 1 1 1 1 1 1 1 1 1 1 1 1 1 1 
##$CPDPRG= <>
##$CPDPRG1= <>
##$CPDPRG2= <>
##$CPDPRG3= <>
##$CPDPRG4= <mlev>
##$CPDPRG5= <mlev>
##$CPDPRG6= <mlev>
##$CPDPRG7= <mlev>
##$CPDPRG8= <mlev>
##$CPDPRGB= <>
##$CPDPRGT= <>
##$D= (0..31)
0 1.2 0 0 0 0 0 0 0 0 0 0.03 0 0 0 0 0 0 0 0 0 0 0 0 0 0 0 0 0 0 0 0 
##$DATE= 1549360385
##$DBL= (0..7)
120 120 120 120 120 120 120 120 
##$DBP= (0..7)
150 150 150 150 150 150 150 150 
##$DBP07= 0
##$DBPNAM0= <>
##$DBPNAM1= <>
##$DBPNAM2= <>
##$DBPNAM3= <>
##$DBPNAM4= <>
##$DBPNAM5= <>
##$DBPNAM6= <>
##$DBPNAM7= <>
##$DBPOAL= (0..7)
0.5 0.5 0.5 0.5 0.5 0.5 0.5 0.5 
##$DBPOFFS= (0..7)
0 0 0 0 0 0 0 0 
##$DE= 6
##$DECBNUC= <off>
##$DECIM= 32
##$DECNUC= <off>
##$DECSTAT= 4
##$DIGMOD= 1
##$DIGTYP= 9
##$DL= (0..7)
0 120 120 120 120 120 120 120 
##$DP= (0..7)
150 150 150 150 150 150 150 150 
##$DP07= 0
##$DPNAME0= <>
##$DPNAME1= <>
##$DPNAME2= <>
##$DPNAME3= <>
##$DPNAME4= <>
##$DPNAME5= <>
##$DPNAME6= <>
##$DPNAME7= <>
##$DPOAL= (0..7)
0.5 0.5 0.5 0.5 0.5 0.5 0.5 0.5 
##$DPOFFS= (0..7)
0 0 0 0 0 0 0 0 
##$DQDMODE= 0
##$DR= 18
##$DS= 0
##$DSLIST= <SSSSSSSSSSSSSSS>
##$DSPFIRM= 0
$$ [...]
##$SUBNAM2= <"">
##$SUBNAM3= <"">
##$SUBNAM4= <"">
##$SUBNAM5= <"">
##$SUBNAM6= <"">
##$SUBNAM7= <"">
##$SUBNAM8= <"">
##$SUBNAM9= <"">
##$SW= 20.0189088683792
##$SWIBOX= (0..15)
0 0 2 0 0 0 0 0 0 0 0 0 0 0 0 0 
##$SW_h= 4006.41025641026
##$TD= 16384
##$TD0= 1
##$TE= 0
##$TE2= 300
##$TE3= 300
##$TEG= 300
##$TL= (0..7)
0 120 120 120 120 120 120 120 
##$TP= (0..7)
150 150 150 150 150 150 150 150 
##$TP07= 0
##$TPNAME0= <>
##$TPNAME1= <>
##$TPNAME2= <>
##$TPNAME3= <>
##$TPNAME4= <>
##$TPNAME5= <>
##$TPNAME6= <>
##$TPNAME7= <>
##$TPOAL= (0..7)
0.5 0.5 0.5 0.5 0.5 0.5 0.5 0.5 
##$TPOFFS= (0..7)
0 0 0 0 0 0 0 0 
##$TUNHIN= 0
##$TUNHOUT= 0
##$TUNXOUT= 0
##$USERA1= <user>
##$USERA2= <user>
##$USERA3= <user>
##$USERA4= <user>
##$USERA5= <user>
##$V9= 5
##$VALIST= <valist>
##$VCLIST= <CCCCCCCCCCCCCCC>
##$VD= 0
##$VDLIST= <DDDDDDDDDDDDDDD>
##$VPLIST= <PPPPPPPPPPPPPPP>
##$VTLIST= <TTTTTTTTTTTTTTT>
##$WBST= 1024
##$WBSW= 4
##$XGAIN= (0..3)
0 0 0 0 
##$XL= 0
##$YL= 0
##$YMAX_a= 216374
##$YMIN_a= -312098
##$ZGOPTNS= <>
##$ZL1= 120
##$ZL2= 120
##$ZL3= 120
##$ZL4= 120
##$ABSF1= 10
##$ABSF2= 0
##$ABSG= 5
##$ABSL= 3
##$ALPHA= 0
##$AQORDER= 0
##$ASSFAC= 0
##$ASSFACI= 0
##$ASSFACX= 0
##$ASSWID= 0
##$AUNMP= <proc_1d>
##$AZFE= 0.1
##$AZFW= 0.1
##$BCFW= 1
##$BC_mod= 2
##$BYTORDP= 1
##$COROFFS= 0
##$CY= 11.3945322036743
##$DATMOD= 1
##$DC= 2
##$DFILT= <>
##$DTYPP= 0
##$F1P= 18.9103706918063
##$F2P= -1.10871071338519
##$FCOR= 0.5
##$FTSIZE= 0
##$FT_mod= 4
##$GAMMA= 1
##$GB= 0.15
##$INTBC= 1
##$INTSCL= 1
##$ISEN= 128
##$LB= 0.24
##$LEV0= 0
##$LPBIN= 0
##$MAXI= 10000
##$MC2= 0
##$MEAN= 0
##$ME_mod= 0
##$MI= 1.114404
##$NCOEF= 0
##$NC_proc= 0
##$NLEV= 6
##$NOISF1= 3.799351
##$NOISF2= 2.8
##$NSP= 1
##$NTH_PI= 0
##$NZP= 0
##$OFFSET= 15.70392
##$PC= 1
##$PHC0= -9033.153
##$PHC1= 4.60004
##$PH_mod= 1
##$PKNL= yes
##$PPARMOD= 0
##$PSCAL= 0
##$PSIGN= 0
##$REVERSE= no
##$SF= 200.130013532006
##$SI= 16384
##$SIGF1= 3
##$SIGF2= 2
##$SINO= 400
##$SIOLD= 16384
##$SREGLST= <1H.CDCl3>
##$SSB= 0
##$STSI= 0
##$STSR= 0
##$SW_p= 3612.71676300578
##$SYMM= 0
##$S_DEV= 0
##$TDeff= 0
##$TDoff= 0
##$TI= <>
##$TILT= no
##$TM1= 0
##$TM2= 0
##$TOPLEV= 0
##$USERP1= <user>
##$USERP2= <user>
##$USERP3= <user>
##$USERP4= <user>
##$USERP5= <user>
##$WDW= 1
##$XDIM= 8192
##$YMAX_p= 0
##$YMIN_p= 0
$$ End of Bruker specific parameters
$$ ---------------------------------
##NTUPLES= NMR FID
##VAR_NAME=  TIME,          FID/REAL,        FID/IMAG
##SYMBOL=    X,             R,               I
##VAR_TYPE=  INDEPENDENT,   DEPENDENT,       DEPENDENT
##VAR_FORM=  AFFN,          ASDF,            ASDF
##VAR_DIM=   8192,          8192,            8192
##UNITS=     SECONDS,       ARBITRARY UNITS, ARBITRARY UNITS
##FACTOR=    0.0002496,     1,               1
##FIRST=     0,             0,               0
##LAST=      2.0444736,     0,               0
##MIN=       0,             -312098,         0
##MAX=       2.0444736,     216374,          0
$$ Real data points
##PAGE= N=1
##DATA TABLE= (X++(R..R)), XYDATA
$$ [...]
2123A237l6r69j335l91O39Q02J016P1o49j220n02J61J529P94j71o12q14l82R3
2142g39J258P98L64j325q82o63L03O27P05P14l73j458m20L03Q50O00N61p47o92
2161b16r00j21J271N53J58N6r32q84J37O86Q55L36j12j046j112L53N35J211M7
2180H75J32j017n12l15N82J036L65k47o79q39o02N27R01N83m40m55q01n3K09N73
2200a77J019N3r94n32k45N58J141L93j59l12q59o45M27P17M27K5p50p57l92J39
2220i23O62P05L3m48q88j80N92P66O80Nn61p82m02K62J079O38k22m66n09q16K72
2241e03M95N48L21p99q38l08K3P47M34O92o22q42l92J77P75Q82Q1k95q00m06K10
2262d20N03O47M51p13q26l43J2L96R87J95m24p96j60j17N71M17K62K31p37q15
$$ plain form
2123 1237 1201 232 -1103 -1494 -855 -53 963 1034 385 -835 -1337 -1176 353 1147 976 364 -450 -832 -739
2142 -739 519 1317 1681 356 -526 -1189 -886 -259 446 1160 787 -671 -1091 -788 62 662 1223 476 -216
2161 -216 -1116 -1237 34 587 745 801 -131 -1015 -878 -192 663 999 887 -159 -1271 -918 -383 828 875
2180 875 1007 -10 -522 -837 -255 781 1146 899 220 -619 -1221 -694 207 790 350 -105 -906 -959 -750 -177
2200 -177 842 895 -99 -631 -876 -318 823 1216 1057 745 -114 -759 -332 385 812 837 87 -670 -1062 -923
2220 -923 -261 444 477 29 -859 -1039 -447 319 999 1004 443 -339 -741 -479 600 1238 1016 550 41 -775 -503
2241 -503 -8 540 861 62 -776 -1084 -1061 -314 120 812 190 -652 -1044 -867 -92 790 871 576 -224 -630 -420
2262 -420 83 730 1181 468 -358 -701 -689 -293 694 889 465 -331 -491 -608 -37 380 642 873 136 -679
2282f79K80N8N36M59k83k36p76k14J23Q57j4J62k39m53o17N64P64J92J25m23n93
2303d07N4J07O92L67K27r22k74l56J56O41J85j4n87l55n91O10K88O91Qm15n66
2324d61k80K82N22M57J99K5q90k15J80K74L86L83m28k76n27J4K46M89j40L9m56
2345a77l66j30O01N32J08j86l88l67j06N36L54J47l79j51k65j57K45L34j9L25
2365D91o70j9k57M04K21J83j62l33K22l41P4M99M53l39l44j54l05K46J82L5L43
2386D29l73l41k36J51j3N28J3k69l23L7J16J34L37J07l04J22m15j02N59K52j43
2407B66p6m33k51M94L5K4K8j78p8k31j20J65N42O1J40l40k77m9M14Q0J66n6p2
2430B54n27j12L06K94j2r8k85j66n9Q0L90J90l12m4k68j34K92M49k9J28j67k50
$$ plain form
2282 -679 -399 -341 195 654 371 135 -641 -855 -732 125 111 273 34 -419 -1036 -472 292 484 609 186 -407
2303 -407 -353 -246 446 813 1040 118 -156 -512 -356 285 470 456 -131 -486 -1077 -467 -179 512 520 105 -461
2324 -461 -741 -459 63 520 719 744 -146 -361 -181 93 479 862 434 158 -369 -355 -109 380 240 279 -177
2345 -177 -543 -673 -72 460 568 382 -6 -373 -479 57 411 558 179 28 -237 -394 -149 185 166 491
2365 491 -179 -198 -455 -51 170 353 191 -142 80 -261 -187 312 765 426 82 -72 -377 -131 51 86 429
2386 429 56 -285 -521 -370 -383 145 158 -111 -434 -397 -281 -147 190 297 -7 115 -300 -402 157 409 266
2407 266 190 -243 -494 0 35 59 87 -91 -169 -400 -520 -355 187 248 388 48 -229 -278 136 216 382 326 254
2430 254 -273 -385 -79 215 203 105 -180 -346 -405 -325 65 255 -57 -101 -369 -503 -211 238 209 337 170 -80
2452h0O0J14R4N8J02k59j14q6J96j50L40m04L4l01k04N72n6L5K26j85l56L65j06
2475a05M1J54N0q1j72L2l3L22K89j70j76l63o5K85j38K12k21J88k60J53k43N02
2497B01Q2k7j30k09L5k43L19J99K01o58r6P4P9J6q8J15P9j27j60j31N12J50j94
2520aL0m3k7k06K90q6M49n25J94J15k80k62L67M0L32n32N0o1j93L37l14J84K55
2543A13l35O2K71n1K8l2k0n9L3L1%r5L33l06m4K71k1j15l15K38n0P2J12K14m11
2568g6J11j05J19Q2j44L69l63K17n72K17k7J48P5LJ3K3Rj41J70j52J72j82K1p1
2592h4R9R3j29n8m9M30j57k50K40j66J3j73J21O3K3M4K5n3l1Mj9k00L30J56k10
2617F2k68K73j06l18M25k42L7n1k92Q8K73L22k6j98J50k75pR2K79QK00m04j64
$$ plain form
2452 -80 -20 94 188 246 348 89 -25 -111 85 -65 275 -129 -95 -396 -600 -28 -84 -49 177 -8 -364 1 -105
2475 -105 -64 90 140 59 -113 -81 -114 208 497 327 151 -212 -277 8 -130 82 -139 49 -211 -58 -301 201
2497 201 283 256 126 -83 -48 -291 28 227 428 -230 -326 -252 -173 -157 -245 -130 -51 -178 -338 -469 43 193 -1
2520 -1 29 -14 -41 -247 43 -43 406 -119 75 190 -90 -352 15 55 387 -145 -95 -156 -349 -12 -326 -142 113
2543 113 -222 -160 111 60 88 56 36 -23 10 41 41 -54 279 -27 -71 200 179 64 -251 -13 -63 9 121 335 -76
2568 -76 35 -70 49 131 -13 356 -7 210 -362 -145 -172 -24 51 54 67 90 99 -42 128 -24 148 -34 -13 -84
2592 -84 15 108 -21 -79 -128 302 145 -105 135 -31 -18 -191 -70 -7 16 60 85 32 1 5 -14 -214 116 272 62
2617 62 -206 67 -39 -357 68 -174 -137 -188 -480 -392 -119 203 177 -21 129 -146 -153 -61 218 226 426 22 -142
2640a42P0J76R8J76j58o0m45p8O11k00P0m0R6m85j60n9M89M7J39l2k58J17L6K74
2664B82J06o6n75Q2oJ31K92j38qN1m41J69J4J96P3k35l9j71R3l9J77K57k64L25
2688B66m00n6K65k9N7K63m82k05j05L69J51J2Q7j19j55j22L1n6K95K48k82m24
2710c91K61K34j2K79J6j48l99k10K2L69J63o0J0p9k65n4K76l4L87k65j58j51j26
2733c35M13K18O5l27r4k22J47K33M32l52j01l40M9j61O7L18N8N1j96j14Q4r8K40
2756C5K30n4l22k18N3K90J23J88j18j37l08J23q9K43M45l03r9k07k35J5L05L70
2778C30j53l02L8m36J97K45R6K63Jm14l17j0N83K67J12k56j75j54M4j8N41k06
2800B76k38j62j74j80N28M7K28j53l03l49K69R6J53K18j72j76l47K14L27J52m0
$$ plain form
2640 -142 -72 104 202 378 220 160 -285 -363 248 48 118 78 174 -311 -471 -530 -41 6 145 113 -145 -28 8 282
2664 282 388 322 -253 -171 -177 -46 246 108 100 151 -290 -121 -107 89 162 -73 -112 -283 -190 -229 -52 205 -59 266
2688 266 -134 -190 75 46 103 366 -116 -321 -426 -57 94 106 193 74 -81 -203 -172 -228 67 315 33 -391
2710 -391 -130 104 92 371 387 239 -160 -370 -348 21 184 124 134 55 -210 -264 12 -22 365 100 -58 -209 -335
2733 -335 78 296 361 34 -60 -282 -135 98 530 178 77 -263 -214 -375 -308 10 68 119 -77 -191 -107 -205 35
2756 35 265 211 -111 -329 -276 14 137 325 207 70 -238 -115 -204 39 484 181 82 -125 -360 -345 -40 330
2778 330 177 -125 -87 -523 -326 -81 15 278 279 -135 -452 -462 121 388 500 244 69 -85 -41 -59 482 276
2800 276 38 -124 -298 -478 50 97 325 172 -131 -480 -211 -115 38 256 84 -92 -439 -225 102 254 214
2821B14J52l47j25l93O61J06K08M4m11m27o4K58L55q3K60k98n77p2K30M16R9J1
2843B17j91l76l3J76L01J96J52O6q26R0J8J79O20J63o29k39j33P2J16M12j10j71
2865G0l67M8R0K27K01nN0m49m32M72P1L49k81n9m14rl5N03L18l5o2l08n50L99
2889b08M5L75J23k14L3j91j33K72L41J96k69l73l88q4K52O26J54m97r3k10j10
2910c53J10K36J11K15j76n88K42p9N82M21k08m97j96J37n39P08O52m87j75n36
2930d20j93J94L74M77l9o03j7j22L07J72L25k5m53Rl4O6M00K57l9n59l6l41n6
2953c56M42j45J14k60l09n22Q5P12N22o6q8l46K0N0N40K14L55l95j85m69n1K75
2975A37M78M9m4j072k51J50J83J60L13j58o55j80L29J42Q28o1J89l98l90J41M23
$$ plain form
2821 214 366 19 -106 -499 162 268 476 520 109 -318 -382 -124 231 148 408 110 -467 -539 -309 107 206 217
2843 217 26 -350 -383 -207 94 290 442 508 -318 -228 -210 -31 589 752 123 -116 -249 -177 -61 351 241 70
2865 70 -297 -249 -159 68 269 264 314 -135 -567 -95 -24 325 44 -15 -429 -438 -473 30 348 313 251 -57 -607 -208
2889 -208 -163 212 335 121 154 -37 -170 102 443 639 370 -3 -391 -475 -223 403 557 60 -33 -243 -353
2910 -353 -243 -7 104 319 143 -445 -203 -282 300 721 513 16 -180 -43 -582 126 778 291 116 -420
2930 -420 -613 -419 -45 432 393 -210 -227 -349 -42 130 455 430 -23 -14 -48 18 418 675 636 77 41 -300 -356
2953 -356 86 -59 55 -205 -514 -1036 -951 -239 283 217 129 -217 -197 -147 393 607 962 567 382 -87 -138 137
2975 137 615 664 620 -452 -703 -553 -370 -210 103 -55 -710 -890 -561 -419 409 348 537 139 -251 -110 313
2996C13K70J13M8n79n09j02L48L26J06j27k70l33k98L34K75K85R6o5n08R5P28
3017E46q0K26J32m30p03J19QK55J53j04l49m24l23J68L78N92J13l65k84k74N84
3038f2M2R02o1L2o35j44J74M92J78o7n66l66n70j67L26M67J50m72j39m17r7O89
3060c11J77O0L71n83m26M64J85P02K60K22o71j92k75M00O26l73R4q65l21j48L62
3081b42K30J15k25j06n02J33L98L31L3J59l53l13k19L95N49M15j55m38m54o4j1
3102c24N67J87j0l59o40O1J49O96K79K11k36p38l29O27J80O25m57j92o54l05L36
3123c26J02O90O8n58n82l75L49M77K11K91l22m61j72L74M2P40M63j22m91j26l21
3144d9O11L16j34m48m33l91k6J66P45J98l36r83j53J52L86N46P7j88l28k63L47
$$ plain form
2996 313 583 696 744 165 -344 -446 -98 228 334 207 -63 -396 -694 -360 -85 200 296 231 -277 -182 546
3017 546 466 692 824 394 -309 -190 -182 73 226 122 -227 -651 -974 -806 -428 164 277 -88 -372 -646 -62
3038 -62 -20 882 821 853 218 74 248 740 918 851 285 -81 -651 -818 -492 -25 125 -347 -486 -903 -1000 -311
3060 -311 -134 -74 297 -286 -712 -248 -63 639 899 1121 450 258 -17 383 1009 636 730 -135 -456 -604 -242
3081 -242 -12 103 -122 -228 -730 -597 -199 132 165 324 -29 -342 -561 -166 383 798 643 205 -249 -313 -324
3102 -324 243 430 420 61 -579 -518 -369 327 606 817 581 -157 -486 141 321 946 489 297 -357 -662 -326
3123 -326 -224 466 534 -24 -606 -981 -632 -155 56 347 25 -436 -608 -234 -192 548 1011 889 398 272 -49
3144 -49 562 878 744 296 -137 -528 -554 -388 357 555 219 -764 -917 -765 -379 167 244 56 -272 -535 -188
3165a88J31O36J49n1n59k96l8L76P2K62Q6n17l77M2R7L79N12j74p67q10J72K59
3187f04P69n9o5l8n91r5O51K35M76k33l56n75Q1K07L30L2L95o92j68n1K21N94
3209D64L19k32m3q25k18K49P17j12q5j97l86l69R8N26M64N6n72m37k14K18J72
3230d07L98N0Q0m63o2K57M89L45K07m68k44r93M42L47M74J49m08l05k43nM26J96
3252B62O5j8m76n35q8O09n0L52K57l45m35lK87N76K87o62j12k32k01K79O46L24
3274G87l46m84j87m18O76K71K29K37r18m84j02Q12o4K24nQ0m95k88K41K66O08
3295F40j94k81m84l92K29P02K40L20l36p83k47J75L72M89J77l77n85k49m4Q26
3315A98N12j88k74l60m12L42P0N51j12J56o75k55j36K92Q86R0n63l04l02J81L29
$$ plain form
3165 -188 -57 579 728 677 118 -178 -216 160 232 494 580 63 -314 -272 -175 204 716 542 -225 -1035 -863 -604
3187 -604 165 106 41 3 -588 -683 -32 203 679 446 90 -485 -404 -197 133 165 560 -132 -300 -351 -130 464
3209 464 783 551 508 -317 -535 -286 431 319 234 37 -349 -718 -620 -94 370 426 -146 -583 -797 -579 -407
3230 -407 -9 41 121 -342 -404 -147 342 687 894 426 182 -811 -369 -22 452 601 193 -112 -355 -360 66 262
3252 262 327 309 -167 -702 -790 -181 -231 121 378 33 -402 -405 -118 458 745 83 -29 -261 -462 -183 463 787
3274 787 441 -43 -230 -648 28 299 528 765 -153 -637 -739 73 9 233 228 308 -187 -475 -234 32 640
3295 640 446 165 -319 -711 -482 220 460 780 444 -339 -586 -411 -39 450 627 250 -335 -584 -628 198
3315 198 710 522 248 -112 -524 -182 -112 439 327 483 -192 -447 -583 -291 595 685 122 -182 -484 -303 26
3336B6M37k6j84j56o94J8M95L49K33l21l30m00M80q4N20o4k03l32m53r2M99N15
3358B33K60j30m40l42L28n15Q34J11K43o01m69L09k92Q70L78k32m95j52l94Q7
3378d09N35K93Q1l93m62m17L77N57J13P3k18o33n1K2O59N77j31n01l01j44J45
3399b28M37N22M5n55m36j66N0K92M98m85K61n76l04O7M08M39L1N8n24%l58N67
3421D3N41j01Q4o19m84NN39N01l13kl59n42J23M43K96rJ57o23k24j03L33O38L68
3444F92k49k31o05O8M04K41M83k44j47j043o7K16L77M61P2o85k83l85K57P07L08
3465C47m9l01n67j47O07O02K53j2n89m07l1M22J70K32K49o21p76j89M91L31N6
3486G1M95n38l25l85K66K86P27O5k33p00l97L58J38M72L79l4o91n99K83J69P68
$$ plain form
3336 26 463 437 253 97 -597 -579 -84 265 498 177 -153 -553 -73 -157 363 299 96 -236 -689 -781 -282 233
3358 233 493 363 -77 -419 -91 -606 228 339 582 -19 -488 -179 -471 399 777 545 50 -102 -496 -409
3378 -409 126 419 500 107 -355 -772 -395 162 275 348 130 -503 -554 -532 127 704 573 72 -229 -373 -228
3399 -228 209 731 776 221 -215 -381 -331 -39 459 -26 235 -341 -645 -578 -170 269 300 358 -166 -166 -524 43
3421 43 584 483 567 -52 -536 -531 8 509 196 194 -165 -707 -584 -141 155 146 303 -320 -544 -647 -314 324 692
3444 692 443 212 -393 -325 79 320 803 559 412 -631 -698 -482 -105 356 428 -257 -540 -925 -668 39 347
3465 347 298 -3 -570 -717 -110 492 745 733 144 -263 -294 128 298 530 779 158 -618 -807 -316 15 71
3486 71 566 28 -297 -682 -416 -130 597 662 429 -271 -668 -310 -172 300 679 645 -46 -645 -362 -193 575
3507E75l1k51q07k46j02R26J58L97j48m77m05J71L24L15N96n90o20m82J08K72
3527c17P32K81p8n88m29l92P07M95j1l56n91r4k11M83K24O93n4o01j98O1L81K22
3549C59L38j34l59p07K60kO66K44J51r76k41j1J44L38M83o57r2q72J64K92O55
3570D3P92l47j13n15k07K38O95J26k55j95l75k31kM04N99N5m39p41Mk26L46L66
3592B2k48k39k5k89k3Q50M02L22l26m42k92J38mO84J30n02j69l48J69L09L87K85
3614G91l68n09o88J19R0R87j33l63j33m67K75N56L61K18J68q66k91k41k6M97N2
3635B9o2l91m43P3O24O11J36k19m11o63J22K17N38K31K74k28q58L74p9P32J82
3656G89M8p26l57m18o9L61j6L35J03q21r4M83K48N53J22j46p09p5k08Q21M79R3
$$ plain form
3507 575 544 293 -514 -760 -862 64 222 619 471 -6 -411 -240 84 399 995 405 -215 -697 -589 -317
3527 -317 415 696 618 30 -399 -791 -84 411 400 44 -547 -641 -852 -369 -145 548 494 -107 -305 -244 137 359
3549 359 697 563 204 -503 -243 -245 421 665 816 -160 -401 -412 -268 70 553 -104 -196 -1068 -904 -612 43
3570 43 835 488 375 -140 -347 -109 586 712 457 262 -113 -344 -346 58 657 712 273 -468 -464 -690 -344 22
3592 22 -226 -465 -490 -779 -802 48 450 772 446 4 -288 -150 -154 530 660 158 -11 -359 -190 119 506 791
3614 791 423 -86 -774 -655 -565 422 289 -74 -207 -674 -399 157 518 736 904 38 -253 -494 -520 -23 29
3635 29 -33 -424 -867 -794 -170 441 577 358 -53 -716 -594 -377 161 392 666 438 -420 -46 -125 607 789
3656 789 837 111 -246 -664 -733 -372 -388 -53 50 -771 -865 -382 -134 419 541 395 -314 -389 -597 224 703 796
3678G96L6o68k45j5O09J91k65j04p12l39l65P00K99J81m4m20r7l0%Q22N7j40m72
3701b25M7n37P55K93Jr6j81r5k08K72L54K69l31n75k58l17N37K82M02n9l00M1
3723G1p30O95M46J91o26l22l61Q4K04K75M37j10k62m21L7L52K30o1j13k09j49
3744c42o9J62N84K45ln8n37j05J76J96L42n12n9m59k45RL54O19mm32q0l69J30
3767d57O98J20j43l28l77r5O3N28N50J81j06m57n01L42j0J87J13l53m65j36J98
3788d48M25N42k8J11o45k45j88M71J97K91l42m95j40J60J85O98O3j34p70k90Q
3809e74M07M15j8j38k17l60q0N97L16L33j74k24o25l33Q21R3L03k47m35k01k1
3830c62M6M04O86k83l92o41l9J93L95L28j27l70K2k00P2M59J58L51n95l63m7J39
$$ plain form
3678 796 832 164 -81 -96 513 704 439 335 -377 -716 -1081 -381 -82 99 55 -365 -462 -492 -492 330 387 247 -225
3701 -225 -178 -715 40 333 334 238 57 -38 -246 26 380 649 318 -257 -515 -832 -295 -13 389 330 30 71
3723 71 -659 36 482 673 47 -275 -636 -552 -348 -73 364 254 -8 -429 -392 -40 190 129 16 -193 -342
3744 -342 -411 -249 335 580 577 519 -18 -123 53 249 591 79 20 -439 -684 -675 -321 298 294 -138 -218 -587 -457
3767 -457 241 361 218 -110 -487 -582 -519 9 559 740 634 177 -324 18 8 195 308 -45 -510 -646 -448
3788 -448 -23 519 491 602 -43 -288 -476 -5 192 483 141 -354 -494 -334 -149 549 612 478 -292 -582 -574
3809 -574 -167 248 230 92 -125 -485 -565 32 348 681 507 283 -342 -675 146 239 542 295 -140 -341 -362
3830 -362 -316 88 774 491 99 -542 -581 -388 7 335 208 -162 -140 -340 -268 191 349 700 105 -258 -305 -166
3852a66L23L91l22j99l21l45K63L87O17j84j11o24n3k4M60K7L75k69l70k27K14
3873a58J86L41M4k87l92m9l18M21P10j43k76k98l18J81J67L69J13j66k83k76M6
3894c86P9N94J96k0m38j69j21J4M83K63k52m49k23N7p9N27J64K73p17k48Q2K17
3916a53M37K09j76j81m31j57M71J96N5J20k10o41p7L56J96L12J70m45l67l19O1
3937e74N20O68j62j20m01l76L01K67O47m37n8m59r7k18N00N07j00k68n83L00l45
3958d88N38M00J41j92p71j52L54L41J32J78k77p10n2Q3N53K84R9k7p59j75J46
3979c54M52M15j27l24k02n10J58O51K78M0j96m46J9p6K38L27P2m92l58j81R8L55
4001a63N8K19L78m66l67J11K02N1O47l31o05o5p3M25J26J80K28l06m60j82N3K04
$$ plain form
3852 -166 157 548 226 27 -294 -639 -376 11 628 444 333 -291 -344 -368 92 119 494 225 -145 -372 -158
3873 -158 28 369 413 126 -266 -315 -633 -212 498 355 79 -219 -537 -356 -189 180 293 127 -156 -432 -386
3894 -386 -307 287 483 463 25 -144 -265 -251 232 495 243 -206 -429 -372 -451 76 240 513 -204 -452 -370 -153
3916 -153 284 493 317 136 -295 -452 19 215 270 390 180 -461 -538 -182 14 326 496 51 -316 -635 -574
3937 -574 -54 614 452 332 -69 -445 -144 123 770 333 275 -184 -281 -499 1 508 408 140 -443 -143 -488
3958 -488 50 450 591 399 -372 -524 -170 171 303 481 204 -506 -558 -475 78 362 461 434 -325 -500 -354
3979 -354 98 513 386 62 -140 -650 -492 159 437 477 281 -165 -146 -222 16 343 415 -77 -435 -616 -518 -163
4001 -163 -105 114 492 26 -341 -230 -28 23 670 339 -266 -331 -404 21 147 327 555 249 -211 -393 -340 -136
4023a36K60J40m31n68J31L50K85L63K31k28n57j95J97M47K02j3k78m21j25k1O63
4044B96J27J17o56R0k55j11M61R2l4j21l01m22M26K79N31rk87pn39m3N88J67N6
4067D45m14o48L54r6L92L88J9j74n96p7M9K15M44J67k17n87lK57K19M44J57k37
4089E01l76o79j90O82L50j98j00l53j86m2P07k0J73K27p06j67pJ39N53J11P0j83
4111C06m45J05J0L00J78j48k70l69r7J34K67R2J12l37p8M3J06L26K18L1l08k80
4133a04N7j74K77M79j64J98o37k10J72J97N00k41o17m13L7j7J45Q41M8n19K97
4154A52m50J09L61K71N3j71l64k71J51K92J88J29j5o20n5m8K18L58J44l95k49
4175b12j60l60K36O31L64p4m97k7J72k6Q5L55n5m07k95j74K4O00L89m45j63j66
$$ plain form
4023 -136 124 264 -167 -735 -604 -254 31 394 625 397 -160 -355 -158 289 491 478 200 -221 -346 -367 296
4044 296 423 540 -116 -26 -281 -392 69 161 127 6 -295 -717 -291 -12 519 510 223 216 -323 -366 222 389 445
4067 445 31 -617 -263 -359 33 421 440 266 -330 -407 -358 -143 301 468 251 -336 -339 -82 137 581 738 501
4089 501 125 -554 -744 -62 288 90 -10 -363 -549 -591 116 96 269 496 -210 -377 -384 -245 308 419 489 306
4111 306 -139 -34 -24 276 454 306 36 -333 -430 -296 -29 63 175 -162 -240 -197 -91 235 453 484 176 -104
4133 -104 -47 -221 56 535 371 569 -68 -278 -106 91 591 350 -267 -680 -643 -660 -515 326 374 -145 152
4154 152 -298 -189 172 443 496 325 -39 -310 -159 133 321 450 435 -185 -240 -288 -70 288 432 37 -212
4175 -212 -372 -732 -496 135 499 425 -72 -99 73 47 132 487 432 25 -270 -444 -420 180 569 124 -39 -205
4197b05q6K42L90q2l20N3m98j1M82R8M73k06k06l90J13N7J98M1J24l24l58r8j58
4220f71O15L53q7J8m12j46j37P05J67k97k9n14M52n4K49L20O0m64k28M2j37K45
4242E0L57l00m0k98n45K37K99K97L90k14l64m84J40K97J45K84m39k13K4P9N65
4263B67K26m4M8m16l70n1K16J81J10O3n78P5MK74J91L49k52j42k76k77J56L99
4285A53r8k5j98k11L3K60N40j23L3m07k95l4J97J66K18m1l92j25K33k8L42N15
4307G13j27l19l77j65j99O22J01J46m63k26p5K03J9M46J46m42l98j88J86P9O24
4328C06j77j71m1n5q5P86m25M94k51m26l82O04k34M01J41o04k46k7J22M33J62
4349C25j50k03k33k27J82L17o0K74n3k30j36R5K36K68k65N2k67k41kJ26M87nj77
$$ plain form
4197 -205 -291 -49 341 259 -61 -8 -506 -517 -35 63 536 330 124 -266 -153 -96 102 143 267 -57 -415 -513 -671
4220 -671 -56 297 210 228 -184 -330 -467 238 405 108 79 -435 17 -37 212 532 592 128 -100 -58 -195 50
4242 50 407 107 67 -231 -776 -539 -240 57 447 233 -131 -615 -475 -178 -33 251 -188 -401 -377 -298 267
4263 267 493 449 497 81 -289 -340 -124 57 167 230 -348 -273 -269 5 196 545 293 151 -125 -402 -246 153
4285 153 55 30 -168 -379 -346 -86 454 331 364 -43 -338 -372 -175 -9 209 168 -224 -349 -116 -144 198 713
4307 713 586 267 -110 -275 -474 148 249 395 -68 -294 -369 -166 -147 299 445 3 -395 -583 -397 -318 306
4328 306 129 -42 -83 -138 -223 563 138 632 381 -45 -427 177 -57 344 485 -119 -365 -392 -270 163 325
4349 325 175 -28 -261 -488 -306 11 -49 225 172 -58 -194 -99 137 405 140 192 -75 -316 -318 -192 295 290 113
4372A13l53j91M8N10L6L6K33o30o2l88M71K51O40k53l50j48q4m9L98K58l91o6
4394B9k56l01K96K69J82L6m03m86M21o5O63O7l5k88k76j70J66O69k18k47N3k51
4416a45l16M79R4j18J44j73m63k24N04K16N2K24j55j47k08L32J04L17j28K91p25
4437d5l01J00K40K28l8j84l81l8k03M83J72J73k96k64r7L12j8M49K86m53p4r0
4459c9j62K78K07J93k07m65k31J70m3N42j71Kk30k04L4K12K18M13j98l24j42q1
4481b28J88M52K0k13l43jk95K90M34Q8j59m02k68J55R6K66J09K37o44o7Q8K15
4503A8K90K94m11K45l54n23M07k03O49q1p74J69j48k5K08N55K76n07k11K43k49
4524a32J32M01k8m37J57l81J88L13K55K0n04j17l66L80Q8J79j24k10j12k66K38
$$ plain form
4372 113 -240 -431 -383 127 163 199 432 -198 -260 -648 -177 74 714 461 111 -37 -121 -170 228 486 95 29
4394 29 -227 -528 -232 37 219 255 -148 -634 -213 -278 385 452 417 129 -147 -317 -151 518 300 53 106 -145
4416 -145 -461 18 112 -6 138 -35 -498 -722 -218 -2 50 274 119 -28 -236 96 200 517 389 680 -45
4437 -45 -346 -246 -6 222 184 0 -381 -419 -622 -139 33 206 -90 -354 -451 -139 -157 292 578 125 51 -39
4459 -39 -201 77 284 477 270 -195 -426 -256 -299 243 72 74 -156 -360 -326 -114 104 517 319 -5 -147 -228
4481 -228 -40 412 432 219 -124 -125 -420 -130 304 392 233 -169 -437 -282 -186 80 189 426 -218 -285 -197 18
4503 18 308 602 191 436 82 -441 -34 -237 412 331 -443 -274 -422 -447 -239 316 592 85 -126 117 -132
4524 -132 0 401 373 -64 93 -288 -100 213 468 488 -16 -133 -499 -119 -31 148 24 -186 -298 -564 -326
4545c26M00L10Q1k85n64K06j00M17J61o6Q2o86J29nM23r5K53j14o32L23k05p1
4567c64J87N66l12L2l75O9L79O7J17q1p16J69k2K33J51N6p1l34J32j41K06M13
4589C61o3k18j31m14K29J09M39K5k13q2l8l35M93J39l50K81k07l70j83L02Q6L01
4611A61J57l86mj25M29JK97j32j84k55j21J43J3M24N7o17j97j91L14J06L34k06
4633A8l06j43J97o5N36N2j53K10l84p6L23q0L50k0k92k82L0J24j66M29l5j99k51
4656a83p8k00K87M09p9k79o2k65J98Q0J49M68q9l11k12N5J87K13R5L2k78m64k04
4679e31M29L20Q7J30m97m81M92j44K25M25j31l09k61n9L46M05L6n0l06l71l11
4700e56N80P6m0L7j01j38l75N92R4J61m8l55L69l97J27Q7J13N0l25l10K7N1L90
$$ plain form
4545 -326 74 384 465 180 -384 -178 -278 139 300 234 316 -370 -241 -246 177 82 335 221 -411 -88 -293 -364
4567 -364 -177 389 77 109 -266 -197 182 249 366 285 -431 -262 -284 -51 100 156 85 -249 -117 -258 -52 361
4589 361 298 80 -51 -465 -236 -127 312 337 124 42 4 -331 162 301 -49 232 25 -345 -528 -226 -140 161
4611 161 318 -68 -72 -197 232 233 530 398 214 -41 -162 -19 -6 418 475 -142 -339 -530 -216 -110 224 18
4633 18 -288 -431 -234 -299 237 289 136 346 -38 -114 209 129 479 459 167 -115 -85 39 -127 302 267 68 -183
4656 -183 -261 -461 -174 235 156 -123 -185 -450 -252 -172 -23 445 356 45 -167 -112 75 288 383 415 137 -327 -531
4679 -531 -102 218 305 435 -62 -543 -51 -195 30 455 324 15 -246 -305 41 446 482 432 126 -245 -556
4700 -556 24 100 60 97 -4 -142 -517 75 169 330 282 -73 296 -101 26 113 226 276 -49 -359 -332 -281 109
4723A09J67j56o2k94l49K61O0K72K95l78m64J92j45L43N87J89l91j61l1k17L91
4744B18J83L9l48j22j70L8J99P3K11j38l73l12J5J94N89K30n09J61n35J50J21
4765h6M39J62l66k67k07N84m09M90R1J7n71J51k76M9L31K63r2m57J69l62K99K70
4787B22j52K50m1o47J85j6L02k6L00m77l37K00j91J95M6K49q0m36K31M1N18J78
4809E14L7j19o13R4L09O5R4M66n51l07j40l9r2O39j27m07k86Kl57N33N53k75K54
4832B47n55J13k3J59K26N19k56n07j16m0J4M30J90m2l46m41NN01j03P5l9k85j21
4855c95k30N69M21jl38M1k95J71m9L73J63q7m10j3m27J37M43M06m25r3n04j61
4877g04M40N26J45J53n68l1Q%O02k89N9j87k52k96K72J71j1J1j51l05j55L14K57
$$ plain form
4723 109 276 120 58 -236 -585 -324 -264 8 303 -75 -539 -347 -492 -149 438 627 236 75 44 -173 218
4744 218 401 440 92 -30 -200 -162 37 110 321 183 -190 -502 -487 -293 296 526 17 178 -357 -207 -86
4765 -86 353 515 149 -118 -325 259 -150 340 431 448 -123 28 -248 -199 132 395 303 -154 15 -347 -48 222
4787 222 70 320 279 -368 -183 -199 103 77 377 -100 -437 -237 -428 -233 -187 62 -18 -454 -223 -182 336 514
4809 514 551 432 -181 -87 222 287 381 847 296 -11 -151 -190 -282 357 230 -177 -463 -461 -818 -285 268 -7 247
4832 247 -308 -195 -218 -59 167 686 430 -77 -193 -233 -219 211 401 359 13 -428 -423 78 -25 50 11 -274 -395
4855 -395 -625 -56 365 364 26 67 -228 -57 -106 267 430 343 -67 -80 -507 -370 73 479 54 -39 -543 -704
4877 -704 -264 262 407 560 -8 -39 -31 -31 571 282 341 154 -98 -394 -122 49 38 49 -102 -407 -562 -248 9
4900Ij07J26K00m48j32K37K76L73j13j6j87k85k4K31J53J11m42l83l6J81p3K30
4922a19J81J71o57J64J79J88O00l54k20j52j92o3O01k9rJ60l72l49J12p7L25K32
4944C20l57r6k56K12k60N96J54j00k33j55j5P73o58M08Ll65j26o9M6L73q2O2m65
4967b90K2l70K88M16J99R1n87J10l09M28K83J70j78k41o5J01k56M41J42j93k32
4988c0l81l9nL61M04l14K4l00j24k9N18K55n2L5m86k9J55NK67M4k76l72m5J23
5012b91J33J45J3J05m08k43j2L23M78Mqk18m51N31N6O8L86j43l50l97J46J60J85
5035B12r8pk85l09k55N09M92j10M0l77mk7M11j44N52m27m18L30k25O7J67K65n3
5058C06k80m23j05J76L31N3M6j62r4r3K04L74k4r5J9m66R3J13J8K19Mj56n41p1
$$ plain form
4900 9 -98 28 228 -220 -352 -115 161 534 421 405 218 -67 -91 140 293 404 -38 -421 -457 -276 -349 -119
4922 -119 62 233 -424 -260 -81 107 707 353 133 -19 -211 -274 327 298 289 449 77 -272 -160 -237 88 320
4944 320 -37 -133 -389 -177 -437 159 313 213 -20 -175 -190 583 -75 333 336 -29 -155 -224 -178 195 113 175 -290
4967 -290 -268 -638 -350 66 265 356 -231 -121 -430 -2 281 451 273 32 -33 68 -188 253 395 202 -30
4988 -30 -411 -450 -455 -94 310 -4 20 -280 -404 -433 85 340 288 323 -163 -192 -37 -32 235 279 3 -369 -414 -291
5012 -291 -158 -13 0 105 -303 -546 -558 -235 243 247 239 21 -430 101 157 225 611 468 118 -279 -133 27 212
5035 212 114 107 -178 -487 -742 -233 259 149 189 -188 -192 -219 192 48 600 173 -245 85 -140 -73 94 359 306
5058 306 26 -397 -502 -326 5 58 104 -58 -152 -245 -41 333 309 214 233 -233 -140 -27 -9 210 214 58 -483 -554
5082e54K59J95m6M07j67m72J42J05K05M93L3n23m3p6J4L53J14R2k03l98l21J31
5104b60L85k64N56o40k24j21n0M34M27l0p5j96p8O9J09M95Jk77k3p15K21M25L5
5127B04J03n84K21k02j07L43o0R9J86l71k20K89J83Q6L47l11l9j40l28M75J33
5148C07J7k28j66l31j97K24K91J98n0k39k72k05N48L01j15K70k41j23K4q7J49
5169G5M94j98l90lj0l61L18M58j93p9m85j12L01K53J34J07o9m23j32K63J16R8
5191A62J31j38k03k27n2M00M0P3m17r6k23J71K51M4K0j17J56k90j0K02N31o6j8
5214C24Kn20K21L76J4J20l54m00l1j21K32K23Q3k62%l52l5K02K79K14j38k08k20
5237c51L13r1J12P00k03o41m9J56k2K99R4L3l23l20j01J48L61K23q3l16k5n21
$$ plain form
5082 -554 -295 -100 -146 261 94 -378 -236 -131 74 567 600 77 34 -42 -28 325 439 531 328 -70 -391 -260
5104 -260 125 -139 417 -223 -447 -568 -618 -184 243 213 138 -58 -136 -67 42 537 538 261 238 -477 -256 169 204
5127 204 307 -277 -56 -258 -365 -22 -82 17 203 -168 -388 -99 84 170 517 206 167 27 -301 174 307
5148 307 324 96 -70 -401 -598 -374 -83 115 65 -174 -446 -651 -103 198 83 353 112 -11 13 -74 75
5169 75 569 371 -19 -22 -32 -393 -75 383 190 111 -374 -486 -185 68 202 309 240 -183 -315 -52 64 162
5191 162 293 155 -48 -275 -327 73 113 186 -231 -327 -550 -379 -128 -84 -64 -181 -25 -315 -325 -123 408 342 324
5214 324 326 -194 27 403 417 537 183 -217 -248 -369 -137 86 169 -93 -93 -445 -480 -278 1 215 77 -131 -351
5237 -351 -38 -129 -17 683 480 -161 -210 -54 -76 223 317 350 27 -293 -394 -246 115 338 255 -61 -86 -607
5259f07N28M57J50l6n94l6k02J40O2L37J06o87L83l13P6K58J26L7m25r2K9j0J91
5282a22N20J16l33Q5j91l6K71K55o2l24k35k74p4J50K44L58m46j52n68L97n6O50
5304A73j05j12j00l43O72q0L7J91K85m39k17J82j25J85M0k39J57n94l3K01JN96
5326C33l17j5m61L23n2M39q4M5l44m09J77L92J69K48l33j66P0m23L79Q2m6mj78
5349a75k32J93L2M55Q5P4k73m16N71m17M64J30m00J56l62l28J15K34L74l20l02
5370c42j0k77J24J57M67J47k74n05J70L27K07L79N1l03O8m37K58l9K52rm27k51
5392b67j02%K53Q1Ok06k28j63L32q2O45P3k50K8j07O2k5J86R4J11j60n03o6L06
5416A8J07k1Q3o12J77k06K12J33K27J82m13j11L4K60r8L52j25j14R7l50K43pN08
$$ plain form
5259 -607 -79 378 528 492 -102 -138 -340 -200 -138 199 305 -382 1 -312 -236 22 148 185 -240 -332 -303 -313 -122
5282 -122 398 514 181 266 75 39 310 565 503 179 -56 -330 -404 -254 -10 348 -98 -250 -818 -421 -477 173
5304 173 68 -44 -144 -487 185 105 142 333 618 179 -38 144 19 204 244 5 162 -432 -465 -264 -263 333
5326 333 16 1 -460 -137 -189 250 166 211 -133 -542 -365 27 196 444 111 -55 15 -408 -29 53 7 3 -175
5349 -175 -407 -214 -182 273 358 432 159 -257 314 -103 361 491 91 247 -115 -443 -328 -94 280 -40 -342
5370 -342 -352 -629 -505 -348 119 266 -8 -513 -343 -16 191 570 621 318 386 -51 207 168 420 411 -16 -267
5392 -267 -369 -369 -116 -35 -29 -235 -463 -626 -294 -376 269 342 92 120 13 75 50 236 330 441 281 -222 -288 18
5416 18 125 104 187 -425 -248 -454 -242 -109 118 300 -113 -224 -190 70 -28 324 199 85 182 -168 75 68 576
5439E76m39j99l78J43n0L42N8J29j95k33k39M41K64K31j7k12j64k73L36K90j25
5460B86J7k51m20J72l50L32L63L31l85m48j7p6L33M98M2m38L7j73J20L05k0L14
5482E72k59l79l04J86j8L91n4k51l89M2KJ77N59k24J4N8m12O0L66L97K4j18n51
5505a11j53J14J65N24l4j79k83m19l0K49O9L70k80j61l17J92J85M80k71J81m67
5526a76lk05L41K73J87j83j98J14n27Q5L44J74P0k66m33QL66K73K29M7n46l30
5548c56M55j73R9J25M5j66k06p3j54j9P80j38m19k11J50J83m0K19L53O5n35j38
5570a54J66K21J37Q1j47l88m43L26J19K73P0k29m50j00q1K02L55L28k29k99k9
5591b71L85n5J61M04k52m02j13m94P32J08Q6j76j02m1l03L50M58J08j91k88m11
$$ plain form
5439 576 137 -62 -440 -297 -347 -5 53 182 -13 -246 -485 -44 220 451 434 222 58 -215 121 411 286
5460 286 303 52 -368 -196 -546 -214 149 480 95 -353 -370 -446 -113 385 427 -11 26 -147 -27 278 258 572
5482 572 313 -66 -370 -184 -202 189 135 -116 -505 -463 -461 -284 275 51 65 123 -289 -229 137 534 558 440 -111
5505 -111 -264 -150 15 539 505 326 43 -376 -406 -157 -88 282 2 -159 -476 -284 -99 381 110 291 -176
5526 -176 -179 -384 -43 230 417 234 36 150 -377 -292 52 226 296 30 -403 -395 -29 244 473 520 -26 -356
5548 -356 99 -74 25 150 195 29 -177 -250 -404 -423 357 219 -200 -411 -261 -78 -118 101 454 519 -16 -154
5570 -154 12 233 370 451 304 -84 -527 -201 -82 191 261 32 -418 -518 -599 -397 -42 286 57 -242 -271
5591 -271 114 59 220 624 372 -30 -143 -637 95 203 289 113 11 -30 -333 17 475 583 392 104 -307
5612c07L05j57J91L15n8j97j92j35lK12J55K18k87m41kp7L88K73j18k24j37J63
5634a15K55J46J8K28l27k49P5j93L77L11k50l26pj76J16K56o9j75J2n48j68N17
5656b92P1K16K64n7l05M7O5L16P7K29k33n16j24j50K98M80n6p2l89l08p2M43M39
5679C71q4j62m82r7J95J15J96J50J70n04k16K46M13K47k57K2l95l28n5K17J83
5700e5K63J27j82k57o3M2K65K62n7m39J04n38L21L67J04J49n08J17j94j19J77
5721a14O83k77n03k33n5M37j21K88M1M5k12j48J79L14k9O5l65l96L1K48R1M34
5743D03K05l79R2m76p4j40M32l8j58j67j50K2K38M64Q1Ok84N3l08J47%N06n22
5766d7l31kJ53P2N78J64m50k56k80j94N38J2J09n1l61R8J76K2M24L34m2n38k16
$$ plain form
5612 -307 -2 -159 32 347 289 92 -100 -235 -238 -26 129 347 60 -381 -383 -460 -72 201 83 -141 -278 -115
5634 -115 140 286 304 532 205 -44 31 -162 215 526 276 -50 -57 -233 -117 139 70 -105 -93 -641 -809 -292
5656 -292 -221 -5 259 202 -103 -56 9 325 402 631 398 -118 -242 -392 -94 386 330 258 -131 -439 -511 -68 371
5679 371 287 125 -357 -454 -259 -144 52 202 372 -132 -348 -102 311 558 301 323 -72 -400 -455 -238 -55
5700 -55 208 335 153 -104 -167 -125 140 402 345 -94 10 -528 -207 160 264 413 -95 22 -172 -291 -114
5721 -114 569 292 -211 -444 -499 -62 -183 105 146 191 -21 -169 10 324 295 360 -5 -401 -370 -122 -31 403
5743 403 608 229 321 -155 -229 -369 63 25 -133 -300 -450 -428 -190 274 355 361 77 130 -178 -31 -31 475 -47
5766 -47 -378 -380 -227 -155 423 587 137 -119 -399 -593 -55 -43 66 15 -346 -248 -72 -50 374 708 666 128 -88
5789h8K07p7J76m0k21l29jJ87o2K12M18j27j22m50k74M69j15J87M87p23o4P5K82
5812Gr5N73m55N0k55J85l96M07K29k16Ll93J16J79K67J62l6l35j0l70j50N68M60
5835D95k09j84l40N9l7M47q1O1k33j70m02K55k1L52L89j1l93l4l05M61M85k76
5857C08K90n03j50l62J70N82j22j31k6k00k96O52k38L07J7m29l99K40j24O67k69
5878a6K01k37j44n0L27M31j5M6j23l81k66K75M2J89J49m04k42j38L47r0K13J23
5900B37m22k3j87J07J94N34j51l0n00L15J8j99R3L65l46k45l89L97j64K79L61
5921B44m0k29j26J98J67j56J80P7k74m59J12N52PJ64m39l3j03r2P7K25M04m78
5943b2k0l07p2L12Q4J13L9j67p9j17M10j34J64k08J3l25P7K34K20K40J35o64k98
$$ plain form
5789 -88 119 42 218 178 -43 -372 -373 -186 -248 -36 382 255 133 -317 -591 -122 -237 -50 437 -286 -350 -275 7
5812 7 -88 485 30 80 -175 10 -386 21 250 34 37 -356 -240 -61 206 368 332 -3 -13 -383 -533 35 495
5835 495 286 102 -238 -179 -216 231 150 211 -22 -192 -594 -339 -360 -8 381 370 -23 -57 -362 99 584 308
5857 308 598 95 -55 -417 -247 335 213 82 56 -144 -440 212 -26 281 298 -131 -530 -290 -414 253 -16
5878 -16 185 -52 -196 -246 81 512 497 543 420 39 -227 48 90 279 428 24 -218 -356 -9 -99 114 237
5900 237 -185 -208 -395 -288 -94 440 289 259 -241 74 92 -107 -14 351 5 -240 -629 -232 -396 -117 244
5921 244 204 -25 -151 47 214 58 238 315 41 -418 -306 246 253 417 -22 -55 -158 -250 -173 52 456 -22
5943 -22 -42 -349 -421 -109 -25 88 127 -40 -119 -236 174 40 204 -4 9 -316 -239 -5 215 455 590 -74 -372
5966c72o3J26N17Q6j48j40k62J32J35OJ70m2l60R0l47K49J26K73K10m95kj61L08
5989C6k9J25R0j32l05M1J74K02K2j94L8j75l44Q6K29K85j2o1l22j80L23J97J49
6012B43P7l43r7l25N88j83K16J72k29k19k02L35o9MM20l43k77m4j26M29N6JJ29
6035B13j02l55L55n5M64mO3m69k75J28L04n6Q5m51J04j55m12M89L82k40m6q4k30
6058c47k26J47N98O8PL8k51j87K22L03JJ54n58Q1l47o0L23J36J64l56j0n63N28
6081a35K86r5J21l64K0J3J14m2L45j7J2k44J4K6O2J28n8k4o50L27k06K96M60O1
6105D50o94L08k26J96qL24m1o5m39lJ41K3L31j13r0O9k06k22M1M31j00K0l83j43
6129c99k8K44L29J85k24k98L35j87L42K01Kk92j27k23q3o0L80J63j47j78l42J13
$$ plain form
5966 -372 -435 -309 208 294 146 6 -256 -124 11 17 187 145 -215 -125 -472 -223 -97 176 386 -109 -111 -272 36
5989 36 7 132 222 90 -215 -174 0 202 224 30 68 -107 -451 -365 -136 149 137 76 -246 -426 -103 94 243
6012 243 320 -23 -120 -445 143 -40 176 348 119 -100 -302 33 -36 -32 388 45 -232 -276 -402 27 83 84 213
6035 213 111 -244 111 56 520 516 579 110 -165 -37 267 211 296 -155 -51 -206 -618 -129 253 13 -33 -117 -347
6058 -347 -573 -426 172 240 247 285 34 -153 69 372 373 527 -31 50 -297 -357 -34 102 266 -90 -100 -663 -135
6081 -135 151 56 177 -187 -167 -154 -40 -82 263 246 258 14 28 54 116 244 186 162 -488 -161 -367 -71 389 450
6105 450 -244 64 -162 34 26 350 309 244 -195 -198 -57 -34 297 184 94 163 -43 -265 -224 207 107 127 -256 -399
6129 -399 -427 -183 146 331 107 -191 144 -43 299 500 502 210 83 -140 -223 -283 97 260 113 -65 -407 -294
6151b94JJ77K06P1j39l93J62j8L75p6K31j45l26OK58P9N0K11k82k66l2j6L06R3
6175B39O6J33n87lj39J49K9P1j17o5j60J48L68K37M8j59k95r4K39n69M40Pk90
6198c04j75K48k15L94J79J3j98j05J5Q0J08L20j70k37r1M9j89N12q0J34o0m43
6220b15J47l02r1K81K87j05k24J2j60K24K20K86J69n12Q0k72J72k7M56j74j42
6241A10l42rJ51J75L7J21l26l8k01p2J85J50J84k13k73L03J14L05k83K02j22l00
6263a42k56J21J98J25O0p9Q4l01O0J72J61k3J23n34R0R7j01L52O0k3n25K13j29
6286a97L44n3K52j52m62k25J51L12O4n0Q3J74k42k61K03J22J03q6j68k08o0J15
6308b41J28N42k47j52Mj10j14J82K01J02m87k74K44k12K39M47j5k32pk94K57L67
$$ plain form
6151 -294 -293 -116 90 161 22 -371 -209 -227 148 72 303 158 -168 -162 96 175 225 436 154 -112 -144 -160 146 239
6175 239 305 438 -149 -152 -291 -142 -113 -42 -159 -224 -384 -236 132 369 417 258 -37 -131 108 -461 -21 -14 -304
6198 -304 -479 -231 -446 -52 127 140 -58 -163 -148 -68 40 360 190 -47 -138 -89 -278 234 154 288 228 -215
6220 -215 -68 -370 -461 -180 107 2 -222 -210 -370 -146 74 360 529 17 97 -175 -3 -30 426 252 110
6241 110 -232 -241 -90 85 122 243 -83 -121 -322 -394 -209 -59 125 -88 -361 -58 56 361 78 280 158 -142
6263 -142 -398 -277 -79 46 106 27 111 -190 -130 42 203 180 303 -231 -141 -44 -145 207 267 244 -281 -68 -197
6286 -197 147 94 346 194 -268 -493 -342 -30 34 -16 67 241 -1 -262 -59 63 166 80 -88 -296 -356 -241
6308 -241 -113 429 182 30 34 -76 -190 -8 193 295 -192 -466 -222 -434 -195 252 237 5 -2 -296 -39 328
6330C28K04j25j23k89o6p9J07K95O1rm18o8J31k36N62j01j99k14J42k21K48J83
6352A13P0j02L8k39p9L43J03j26j1k45q0N4M9L32J01L0l80o5j8J29J71K0l62l0
6376a84O6j07r0L89l8K65k60k68L12p6K03p4j37J31o15M49j12L92j68K26k19l28
6398b43j37M48J78j38J40k92k31R6q8K96ok24P6j75L31K5j7M18m61k59J40n00
6420f23L81J61J77L74M8m59o86M86M32k57J1n5j55J27r2rM01m2k60m6P5pK91O4
6444C37m0k43j8m3j60K81k2QL67l65j25k32K49K0J24j76j58p5K79j40J32K02M9
6467B51j92k99K85j42K58O8j16j56j99J15L01LL6j42j9k28j22K91J15n4k36Q3
6489i9j25o8L62J36J47k73j41j9j12K20Q3O6l8m9o14J90M35j17J85j16l9O8l04
$$ plain form
6330 328 532 407 284 -5 -71 -150 -43 252 313 304 -114 -182 -51 -287 275 174 -25 -239 -97 -318 -70 113
6352 113 183 81 119 -120 -199 144 247 121 110 -135 -215 -161 -112 220 321 351 -29 -94 -112 17 188 208 -154 -184
6376 -184 -118 -225 -315 74 36 301 41 -227 85 9 212 138 1 132 -483 -34 -146 246 78 304 85 -243
6398 -243 -380 68 246 108 248 -44 -275 -179 -267 29 23 -201 -125 -300 31 56 39 457 -4 -263 -123 -623
6420 -623 -242 -81 96 470 518 59 -627 -141 291 34 45 -10 -165 -38 -130 -139 262 220 -40 -86 -11 -18 273 337
6444 337 297 54 36 -7 -167 114 92 100 467 102 -23 -255 -6 14 138 -38 -196 -271 8 -132 0 202 251
6467 251 59 -240 45 -97 161 229 113 -43 -242 -127 174 177 213 71 52 -176 -298 -7 108 54 -182 -99
6489 -99 -224 -292 70 206 353 80 -61 -80 -192 28 111 177 139 90 -524 -334 101 -16 169 53 14 82 -222
6512b22PK63K19J13l94J42J7m3O2L4%L09p44K14k21O06p5l06J19k65l00K05N9
6535b01l3L87j62j99P4j88J81K33r0O4n1l18K62J12P5l4L4l41K28j75K40R4o2
6558A30R5l53N9l46L55J35J18j60M6k74J23qK9L43j50k94J75k75K76J05L50l93
6580H6k36p9r8L26k37K03Q9l09K60l08M67J08j32o6Q3k2j80J9J56O6k37L59k39
6603G9l18j07N72j38O2j0k42k80j21L60M28o9m7j21r1J95m6L24l03P3l55p9K00
6626c4PK3K44j33k49ol45L60M40k17j10j47j06J32K21J64N6k26r4M03m10J49m8
6649G4PJ22k90K75m74L9K00M8J03n5j82k65K25K25P0O0j37k50n5J42J75J19J6
6672A92j02j49j60j1L94p6O0j64R5n19K39J72j03L66j53jm67N26j39L3L75m63
$$ plain form
6512 -222 -215 48 267 380 -14 128 145 102 164 198 198 507 -237 -23 -244 362 287 -19 100 -165 -465 -260 -201
6535 -201 -234 153 -9 -208 -134 -322 -141 92 2 66 15 -303 -41 71 146 112 146 -195 33 -142 98 192 130
6558 130 225 -128 -69 -415 -60 75 193 33 79 -195 -72 -80 -51 292 142 -152 23 -252 24 129 479 86
6580 86 -150 -229 -327 -1 -238 -35 54 -255 5 -303 164 272 140 74 157 135 -45 -26 130 196 -41 318 79
6603 79 -239 -346 226 88 150 140 -102 -382 -503 -143 285 216 169 48 -43 152 106 430 127 200 -155 -234 -34
6626 -34 -27 -4 240 107 -142 -148 -493 -133 307 90 -20 -167 -273 -141 80 244 300 74 -20 383 -27 122 74
6649 74 81 203 -87 188 -286 -247 -47 1 104 49 -133 -398 -173 52 122 182 45 -205 -260 -118 57 176 192
6672 192 90 -59 -219 -230 164 88 148 -16 79 -440 -201 -29 -132 234 81 80 -387 139 0 33 408 -55
6694e5J53p7n3K7R7K22j49l24j20J40J76k6J30j0l77K1K95p9K54j96K3j50n9K76
6718A39j98K70L3m53J61r8K17K61o42L23j25L47L7l24J16k13M29j24m25J68l04
6739d05L53j75K99RP3o4j87J9J11J08k46J88l29N3n5K79qJ9J3q9j60J27R4L02
6763C29l24l34J86M6j20K87K8j61J56k23M6Q6j20l7J62k3o1j59K31j4J8J75Qm00
6787b18J66j5J40R0j13j1j08o1j5K87k29L82l2l73n9qN3M15l0j9l75k1j29K20
6811f3K50J75m92P3J9p2J41K03k01J42k69M3j6l63P34l23K0l25L19q1k34L39J66
6834A85l4j50k6q2J77N4J64k12j70j08O5P3O6L97k59j80j71J03m8K3K08J75K7
6857B77l88j08L42k08J25j35P3J4j55k4M27j54j11J60l07J1J05J20R2o6ll89J68
$$ plain form
6694 -55 98 21 -32 -5 92 314 165 -159 -279 -139 37 11 141 131 -246 -225 70 -9 245 49 72 -78 -137 139
6718 139 -59 211 244 -209 -48 -146 71 332 -310 13 -112 235 272 -52 64 -149 280 156 -269 -101 -405
6739 -405 -52 -227 72 81 154 90 -97 -78 33 141 -105 83 -246 -193 -248 31 23 42 55 -34 -194 -67 27 329
6763 329 5 -329 -143 -97 -217 70 98 -63 93 -130 -84 2 -118 -155 7 -16 -77 -236 -5 -19 -1 174 182 -218
6787 -218 -52 -67 73 163 50 39 -69 -130 -145 142 -87 295 263 -110 -169 -177 -124 291 261 242 -133 -154 -283 -63
6811 -63 187 362 -130 -57 -38 -110 31 234 33 175 -94 -51 -67 -430 304 -19 1 -324 -5 -86 -320 19 185
6834 185 151 1 -25 -107 70 124 288 76 -94 -202 -137 -64 2 399 140 -40 -211 -108 -156 -133 75 250 277
6857 277 -111 -219 123 -85 40 -95 -22 -8 -163 -187 240 86 -25 135 -172 -161 -56 64 156 90 87 -302 -134
6880a34R7r7K87m3k07j92kL87o1j42J28l8k36Q6J44P0nL70m44J03j92k33L07K13
6904A66O4m33K52k44J08J53K6k7j11o6k02K18M1J0K05J5k87K06m2l5M3J73m7j72
6928A4k88q1J07K97n2J16J62m96K9RJ28J21q5P0N4j51q8J45j04L54k42l8m2j70
6952b31K59O4K2m2J82j54p0k6nK7K8k05p7J03j70M31R4m0m94K41j0j52L69N4k55
6977e7l9J95l82M0K84J5m3qj27j5o6L02k7K99l20j81J99k78J77N6R3m8l95K80
7001d6J4J11J49O4p7l77K44j99K8J05R1k78O5R8j1o4O2J04O0j02%q9J98Oq7q8
7027a9j72J22m9K31p4OL8l34O7P2K16Q9n9m1l26N2n8m5M04n7K8n7l44K26k58N04
7053A62M4Lk35r8k08J29L21P1r8j99K17m90K15L42j43k5rr9O9R0L0n0K84k29j09
$$ plain form
6880 -134 -37 -134 153 110 -97 -289 -291 96 35 -107 21 -17 -253 -167 -23 47 42 412 -32 71 -121 -354 -47 166
6904 166 230 -203 49 -195 -87 66 92 65 -46 -112 -314 -96 -55 -45 160 175 -112 94 52 17 60 233 186 14
6928 14 -274 -355 -248 49 -3 113 275 -221 -192 -183 -55 66 -19 51 105 -46 -134 11 -93 261 19 -19 -61 -231
6952 -231 28 92 114 72 254 100 30 4 -1 26 54 -151 -228 -125 -295 136 230 190 -304 -63 -73 -225 144 198 -57
6977 -57 -96 99 -283 -243 41 56 13 5 -122 -137 -203 99 72 371 51 -130 69 -209 -32 24 117 69 -326 -46
7001 -46 -32 79 228 292 215 -162 82 -117 -89 16 107 -171 -106 -8 -19 -83 -21 83 143 41 41 -48 150 156 69 -19
7027 -19 -191 -69 -118 113 39 45 83 -251 -184 -112 104 193 134 93 -233 -181 -239 -284 120 63 91 34 -310 -84 -342 162
7053 162 206 209 -26 -124 -332 -203 118 189 91 -108 109 -381 -166 176 33 8 -1 -100 -31 59 89 39 323 94 -15
7078a5j75k5J89J37j08k1j50p8J02K17j04K07p5k52N7J37j24K06j95l9J39N9n6
7101C3J09O7j30J21j30l54K67L9k17Q9K09k04j41j8J39M61k81k12J02n3J02O2
7123F0O7K9j88J62q3Q7l11J62L25k29j13K85k24j98K02k70M04j48k07J66l18O62
7145C22j26K47k57j90LL1L1J6n5l0Q3j67J9L23j3k4n8k33j77K85j37J55J3r4l13
7170c46K82Q9j40K38j31j21J36l62M08k10Q5n8K29j48K13j24J05L0k75J78j38
7191f0K8j53L51j96J56j68Q0N1k56o7L38J01k23j6j43M3K79k25j57L2K73j97J57
7214B8l7P7O2j97j69N2M26q5m45K57K6m5jO2K16k08J63l41J74j23O5K4J60j49
7238hJ25m04J32k22M29P3J26j28k66O2j33K09K3Jj26O8J30l80J80k7K08k47L03
$$ plain form
7078 -15 -190 -215 -26 111 3 -18 -168 -246 -144 73 -31 176 101 -151 -94 43 -81 125 -70 -109 30 89 33
7101 33 142 209 79 200 70 -284 -17 22 -195 -106 103 -101 -242 -260 -121 340 59 -153 -51 -104 -2 60
7123 60 127 156 -32 130 47 134 -177 -15 310 81 -32 253 29 -169 33 -237 167 19 -188 -22 -340 322
7145 322 196 443 186 -4 -1 30 61 77 22 -8 75 -92 -73 250 237 213 155 -78 -255 30 -107 48 61 -33 -346
7170 -346 -64 25 -115 123 -8 -129 7 -355 53 -157 -72 -130 99 -49 164 40 145 175 -100 78 -60
7191 -60 -32 -185 166 -30 126 -42 38 89 -167 -234 104 205 -18 -34 -177 -134 145 -80 -237 -205 68 -129 28
7214 28 -9 68 130 -67 -236 -184 242 157 -288 -31 -5 -50 -51 11 227 19 182 -159 15 -108 -43 -19 141 -8
7238 -8 117 -287 -155 -377 52 125 251 123 -143 -81 -214 -5 18 19 -107 -39 91 -289 -109 -136 72 -175 128
7261A28k97J75j43L42l22Q4L18k90k11L68o1R1L4k37L3j39L43r4j71N7J70l48
7283a70P6QMJ75j18R7j37K88L8m74K00N9j23J9l3K6R5kJ50r4j25l6l6o7j8M65
7309B67l61l34L72k39L89j08J19J8j22k74J15L80m1o1m0Kn7k36K11o1L43J89O8
7332E39p68J70lJ09o6K64l85j1J28l33K03J51J01j83M2j5n1J82p4J63k17N4L11
7355C11l38J01P2J14k61k49K89P1j20K57J60m48N1J0L5O9k21L10m82N25k15k07
7377a66K2J99k4j57J83k52J74j19K10K15k15k6m1k91K38j31J82J76P5l05j32K05
7399B0k6j13J35j53q0J45J0R2O9N9m47j56K89j69J61L15p0jK01n08J13J18M7J41
7423A92k31K97k20j55Q9N1j55K04k03R3l9mJ79j62J2J46l37J83J29MK0l17L32
$$ plain form
7261 128 -169 6 -137 205 -117 -33 285 -5 -216 152 91 182 216 -21 12 -127 216 122 -49 8 178 -170
7283 -170 -94 -86 -82 93 -25 72 -65 223 261 -213 -13 46 -77 -58 -91 -65 30 28 178 84 -41 -77 -113 -180 -198 267
7309 267 -94 -428 -56 -295 94 -14 105 123 1 -273 -158 222 181 120 80 82 25 -211 0 -61 282 471 539
7332 539 -229 -59 -62 47 -19 245 -140 -151 -23 -356 -153 -2 99 -84 -42 -57 -108 74 0 163 -54 0 311
7355 311 -27 74 146 260 -1 -250 39 110 -10 247 407 -41 10 20 55 124 -97 213 -269 256 41 -166
7377 -166 -144 55 31 -126 57 -195 -21 -140 70 285 70 44 3 -288 -50 -181 1 177 252 -53 -185 20
7399 20 -6 -119 16 -137 -217 -72 -62 30 99 158 -289 -445 -156 -325 -164 151 81 80 281 -227 -114 4 51 192
7423 192 -39 258 38 -117 -28 23 -132 72 -131 -38 -77 -81 98 -64 -52 94 -243 -60 69 73 93 -224 108
7446A08k20o5K4J48Q8lJ29p5k52j1J01n9J60k78J30j28L78J06l54J67k28J7N1
7469f6L0K21J96l40qJ90l33J20J48j93J41N2K1P2J5l02J67m3O7j28Q1k8PK39n28
7494b02r7L50l19K30R7o3k67R9L86n02J05K81m1j57J23j57J32j22j8R3J35l08
7516b22J23m8J63K76q1l13J36K7k80L64j77K42l00M2L3K39j26o6Q6p4M8k27N0
7539h5j45M00q8n7J77j68q1N6m5n8J26M7Q4l52L15k89K57J5j04K8j14J61j54q2
7563a56J50Q3j37R0J7j74K6L81j81j68L84j12l00j65L70J2j20J18n7j22J90j93
7585f4J4m8J94j8P5j18j74K71j93p2J45J13n21M14J56l16K1K22k86k3M30L7p4
7608A85j54p5j55K49R4l30J58M2K25k45O5l13J90J08K6r1K52n59L02j23K38L67
$$ plain form
7446 108 -112 -177 -153 -5 83 80 209 134 -118 -129 -28 -87 73 -205 -75 -203 175 281 -73 94 -134 -117 -66
7469 -66 -36 185 381 41 33 223 -110 10 158 -35 106 158 179 251 266 -36 131 88 155 27 108 80 87 326 -202
7494 -202 -299 51 -268 -38 59 -4 -271 -172 214 -288 -183 98 57 -100 23 -134 -2 -124 -142 -49 86 -222
7516 -222 -99 -147 16 292 211 -102 34 61 -219 145 -32 210 -90 -48 -15 224 98 32 118 44 92 -135 -85
7539 -85 -230 170 82 25 202 34 -47 9 -36 -94 32 79 163 -189 126 -163 94 109 5 33 -81 80 -74 -156
7563 -156 -6 77 -60 30 47 -127 -101 280 99 -69 315 203 -97 -262 108 120 0 118 61 -61 129 -64
7585 -64 -50 -98 96 78 153 35 -139 132 -61 -133 12 125 -396 18 174 -142 -121 101 -185 -208 222 259 185
7608 185 31 -44 -199 50 144 -186 -28 14 239 -6 59 -254 -64 44 70 -21 231 -328 -26 -149 89 456
7630D56p23K74k43L31r3N1j92J42KJ02l0k5l9Q8l40L02l29K98n4J22l8j28O5%
7654aO2J8k39L24k84L0J14l1Q5j37m9RK69j45M2J35m6p8k35M4N7K84j72J07p3
7679I0j19q8R8K23j37p5N4N2k24P3j91L53o8l2j3k63K50K85M2k18LM6m43L46j10
7704f6Q8j60j6L25l34L89m03lK21L03l50j50J13j09J7K81p8k46O7J94J03l42L48
7727A92J37N2o86K13P8N3l47J31L94l52K10j93K68n8M5k47N6R6k50J99J95J00
7749B86j20k40L1j51L50m13K94L7p0k4q0K39l73L74n1k83N51n63L17j78L56q3
7771B06m87L10j33L59j11l80K43K53l87K55l06J27O4M3J92l89J89K2j2r2jl9J78
7794A04j74P0j33K46k04Km5J11j21K8n4J79m0o6l3q3Q2R5qK24k96j95M46l4k90
$$ plain form
7630 456 -267 7 -236 95 2 53 -139 3 5 107 77 52 13 101 -239 63 -266 32 -22 100 62 -66 -1 -1
7654 -1 61 79 -160 164 -120 -90 24 -7 78 -59 -108 -99 170 25 67 202 156 78 -157 -113 -56 228 56 163 90
7679 90 -29 -117 -19 204 67 -8 46 98 -126 -53 -244 109 41 9 -4 -267 -17 268 310 92 95 141 -302 44 -66
7704 -66 22 -138 -154 171 -163 226 -177 -180 41 344 -6 -156 -43 -152 -135 146 68 -178 -111 83 186 -156 192
7727 192 329 381 -305 -92 -14 39 -308 -177 217 -135 75 -118 150 92 137 -110 -54 42 -208 -9 186 286
7749 286 166 -74 -43 -194 156 -257 37 74 4 -20 -100 139 -234 140 89 -194 357 -206 111 -67 289 206
7771 206 -281 29 -104 255 144 -236 7 260 -127 128 -178 -51 13 56 248 -141 48 70 58 -34 -35 -74 104
7794 104 -70 0 -133 113 -91 -89 -134 -23 -144 -116 -170 9 -31 -97 -130 -213 -131 -36 -44 180 -116 -311 135 101 -189
7819a89j5N26j33Nm16J09K82p1k64M38k66M9K5j77K85k80n8O3P5k00J93J14k08
7842a13j38K20J3j8r2J84j62K78q2k80J96n9P9j28K94l46L31k67Q2J49j2l7j20
7865b8j06L12m93K38J2j24K19j37J78k13J76j13L7p1J42q5O1p2K32r2j59R3J84
7888A91j49k7O0M8n2J01k31j23K33r4L1o7M08l24K55m39K37K21j98j59Q1RJ66
7911A78k36n8J6L50o8k25P7M1n5K39k29J90m49K88K44l43m1j77K66j58J17r2l3
7934a58J49j4K2k50K02J83j17k5m5j31L3M63n9k02N7J59l17J57j69J0K69j91P8
7957A04K9j22j31K81o4l6j84QL33j20J19k58L9j75MN9K12j5j13j02M8K41j58l6
7981c7K15k20K63l96J31K49j43J10l8j64o9J43k47J82J05p1r5L37j35o2J71k0
$$ plain form
7819 -189 -204 322 189 194 -222 -113 169 98 -166 272 6 55 80 -97 188 -92 -150 -87 -12 -212 -19 95 -113
7842 -113 -251 -31 -18 -36 -128 56 -106 172 90 -190 6 -53 26 -102 192 -154 177 -90 -8 141 129 92 -28
7865 -28 -134 178 -315 -77 -65 -189 30 -107 71 -142 34 -79 -42 -113 29 -56 5 -67 165 73 -86 7 191
7888 191 42 15 75 123 71 172 -59 -182 51 -43 -12 -79 329 5 260 -179 58 279 81 -78 3 12 178
7911 178 -58 -116 -100 250 182 -43 34 75 20 259 30 220 -229 59 303 -40 -81 -258 8 -150 -33 -125 -158
7934 -158 -9 -23 -1 -251 -49 134 17 -8 -53 -184 -151 312 253 51 108 267 -50 107 -62 -52 217 26 104
7957 104 133 11 -120 161 97 61 -123 -115 218 98 217 -41 -2 -177 -173 -114 98 83 -30 -132 -84 157 -1 -37
7981 -37 178 -42 221 -175 -44 205 62 172 134 -30 -99 44 -203 -21 84 13 -82 255 120 58 229 209
8003B09l85N79l81k3k75K40L38l16l7J7Qn6k5J38J3p4K46k47J2j45k3nK67m7P0
8028I8j0m1k51K45k7k66J71L0j6m5K9J28l2m4K06r8j19j13K54K02k63k67J58J26
8052E5J22Lo0J8oo8R9m0l0r8K00j81j17j08K54N9k8J40m33K26j87K84k73J78M8
8077E7j83P1mJ37J00k12L2J69m26K99J01j31N9Mj89J50K01l32K70j27m46L59J03
8100F2k71K21l0J5J70l52L35l9j73J2O5J73j97n1L9l1J04K57l03k04M57l53k45
8123c39M14L09o04J81M0m3K6j0k02P4l0J67J2j15rJ19jl7K02r9N3n2m6o7j70J37
8149i0j08J60J57m04K03K15J2q4j6r8m0J83m1k15P8P9R9j02L3J26R5k08K4j32
8173g4r4N19l11J24k2k66L60m45K09J18j3J08j04Q8j45n9J1q2
$$ plain form
8003 209 -176 403 22 -1 -276 -36 302 -14 -51 -34 -26 -82 -107 31 44 -30 216 -31 -19 -164 -187 -192 75 28 98
8028 98 88 47 -204 41 14 -252 -81 -51 -67 -112 -83 45 13 -31 175 77 -42 -155 99 301 38 -229 -71 55
8052 55 177 180 120 138 132 64 163 123 93 -5 195 14 -103 -211 43 102 74 214 -219 7 -180 104 -169 9 57
8077 57 -126 -55 -59 78 178 -34 -2 167 -259 40 141 10 69 73 -116 34 235 -97 173 46 -400 -41 62
8100 62 -209 12 -18 -3 167 -185 150 111 -62 -50 15 188 -9 -60 -21 -52 52 309 6 -198 259 -94 -339
8123 -339 75 384 -220 -39 1 -42 -16 -26 -228 -154 -184 -17 -5 -120 -129 -10 -11 -48 154 55 108 56 10 -57 -227 -90
8149 -90 -198 -38 119 -285 -82 133 145 61 45 -53 -93 90 49 -166 -88 -9 90 -12 21 147 242 34 58 -74
8173 -74 -168 351 40 164 142 -124 236 -209 0 118 105 213 109 197 52 -7 4 -78
8191g8
$$ Imaginary data points
##PAGE= N=2
##DATA TABLE= (X++(I..I)), XYDATA
0@%%%%%%%%%%%%%qJ6j6J6k4L2l2M0m8N6p0Q0r1J08j26J45j67J90k18K50k82L17
35A68l58M03m52N03n59O24o94P70q53R44j044J151j268J399j544J702j873K063
53A082k277K515k785L091l441L850m329M903n608O492p643R212j1481J5076k1663
68a3006L7625j48900j87817K75129J99977m2058j28111N7566J01219j9257r8415
79C3952J1740O4686N915l1653K750n2855j11826k4568J29868Q6132j23896k00984
91b10739o444J41530K6473r6943K2858J56767N9896j08410o1798J22240J47746
102A93176j6300r5759l3336k7159q1004j8989R2678N0448r0504r2673N0104Q8970
114A9652l1113n0229Q6579R4950p7257j31025J5931J07735K7029m5956J7762O5006
$$ plain form
0 0 0 0 0 0 0 0 0 0 0 0 0 0 0 -8 8 -8 8 -16 16 -16 24 -24 32 -38 42 -49 59 -67 78 -89 101 -117 133 -149 168
35 168 -190 213 -239 264 -295 329 -365 405 -448 496 -548 603 -665 734 -810 892 -981 1082
53 1082 -1195 1320 -1465 1626 -1815 2035 -2294 2609 -2999 3493 -4150 5062 -6419 8657 -13006
68 -13006 24619 -124281 -312098 -36969 163008 120950 -7161 50405 151624 132367 33952
79 33952 45692 110378 116293 84640 87390 34535 -77291 -101859 28009 114141 -9755 -210739
91 -210739 -217183 -75653 -49180 -146123 -123265 33502 93398 -15012 -76810 45430 193176
102 193176 176876 81117 47781 20622 -60382 -79371 13307 63755 -26749 -119422 -69318 19652
114 19652 -11461 -61690 24889 119839 42582 -88443 -72512 35223 62252 16296 34058 99064
126I9064l5411j07153L951J10582K6019j01600q5754Q373J7241m6552k3151Q5489
138d8902Q7566l1544o6409J8276N9025K3114J8240M6162J359j00144q4754P0611
150g400J23014j5027r3701N692O8803k8274j08429k1026R6843M4893r7097j04153
162a35862L8M1315K7240M1608M1865q111l6406R140N9670K3908l9997o799O1357
175G8966N931j03449p3102O8801J21109J4217r6454o0977L4557K7033k9947j0663
187b3978L0284Q33m5531l4628J1132K8645K5252M7422M7808l6863r6471j4371
199f0466Q5909M8883m8498n8534K894J7774l0770k6408N2919P4451k928n1953
211C273k6172M109J0420J7462K9137J4060l7887n8870K21N4895L1746l825J068
$$ plain form
126 99064 63653 -43500 -39549 71033 97052 -4548 -90302 -81929 -64688 -111240 -134391 -48902
138 -48902 38664 7120 -59289 -41013 18012 41126 59366 105528 106887 6743 -78011 -7400
150 -7400 115614 100587 6886 12578 81381 53107 -55322 -76348 20495 65388 -31709 -135862
162 -135862 -135824 -94509 -67269 -25661 16204 8093 -28313 -19173 40497 64405 24408 17609 78966
175 78966 84897 -18552 -91654 -22853 98256 112473 16019 -44958 -10401 16632 -13315 -23978
187 -23978 6306 7139 -38392 -73020 -61888 -33243 -7991 39431 87239 50376 -46095 -60466
199 -60466 25443 74326 25828 -32706 -29812 -12038 -42808 -69216 -16297 58154 55226 3273
211 3273 -22899 -18790 -8370 9092 38229 52289 14402 -44468 -44247 10648 42394 38569 39637
224C9637K63l0555n1697j6070M5589M1839k3141m4055r819k40o080K6378O3308
237C5357L7183l6850o4051o293M2578J4812q665J4183J0243l2257m0495K722M0950
250I417L4339K53j6932k4921m1052k2094L6579N0388n18l9891k6444J0128K1510
263i238K702Q774M0016K0071m3330n7230q545L8350L8811N072j9752k3342k5655
276c3296r842L2040M1207K033j8924r904j2303k4060j0494L4233N7573O943n7297
289b091m1193J6776L3387J7369Q418j279j6788l1469k2683J0779K9703J5117J150
302A7196q545k8973k7205J0328M2852L7412m079l8864k4024P830Q313N803K3503
315B1547K0359j3371l8688k5541J2026L1544J5305o06o978k7557l1266M752L4697
$$ plain form
224 39637 39900 9345 -42352 -58422 -12833 29006 5865 -38190 -48009 -48249 -54329 -27951 35357
237 35357 72540 35690 -28361 -34654 7924 22736 14071 28254 38497 6240 -34255 -31533 9417
250 9417 43756 44009 27077 2156 -38896 -60990 -24411 25977 25459 -14432 -40876 -30748 -9238
263 -9238 -6536 2238 42254 62325 18995 -38235 -46780 -8430 30381 35453 15701 -7641 -33296
276 -33296 -43138 -11098 30109 32142 13218 3314 -8989 -33049 -43543 -9310 48263 55206 -2091
289 -2091 -43284 -26508 6879 24248 32666 31387 14599 -16870 -39553 -28774 929 16046 17196
302 17196 8651 -20322 -47527 -37199 5653 43065 38986 122 -23902 -16072 -7759 -1956 21547
315 21547 41906 28535 -10153 -35694 -23668 7876 23181 22575 15597 -11960 -43226 -38474 -3777
328c777K5973m37j8779j6534p046l552J3462L6904K1148k1744l3449j3749P493
341a4087J8593J5710P175m835k9705l5071L90L1479K5124N906r536j9429j6691
354b4977m910J4263L4355K1351j5640k7803j5423l383J2741K5922K1777p73k8558
367H942l3799k903K1595J4039M144r03j6643k6905j2554J4030L4314K7019k963
380B7413j9079j6084q926Q414K6662J9167n328k5149k7491p802J4608J7260J5305
393A8970J0983j5113l4231k0271R486K5928K0219l371j9297j6910r355Q369L1258
406F665K9023N816j2399k0766j7737p52J4030J6419P139j8939l4837j6022J1924
419c0436K3404K2112P612j1444j8306j6703m637J8697K6366Q197j0018j9755j6639
$$ plain form
328 -3777 22196 21759 2980 -13554 -20600 -24152 -10690 26214 47362 25618 -7831 -21580 -14087
341 -14087 4506 20216 27391 22556 -7149 -42220 -41830 -10351 14773 20679 11143 -8286 -24977
354 -24977 -29887 -15624 18731 40082 24442 -3361 -18784 -22167 -9426 16496 38273 37500 8942
367 8942 -24857 -27760 -6165 7874 12018 11115 -5528 -32433 -44987 -30957 3357 30376 27413
380 27413 8334 -7750 -16676 -8262 18400 37567 32239 7090 -20401 -28203 -13595 3665 18970
393 18970 29953 14840 -19391 -39662 -30176 -4248 15971 12600 -6697 -23607 -32962 -24593 6665
406 6665 35688 41504 29105 8339 -9398 -10150 3880 20299 27438 8499 -26338 -42360 -30436
419 -30436 -7032 15080 22692 11248 -7058 -23761 -28398 -9701 16665 24862 14844 -4911 -21550
432b1550M241K4382K6957J3757j2919l3188k4224k893N285J1689J0965m441k0407
445b2346j8878o51K4821L3924J8287j659j6066k2339p357J4784J9548J0494l020
458B9542j8591j9864l427Q691J7486J5278o639k7488k9971j6425N845K1154J3308
471a1101O62n947r940k086K1438L2348K1538L772j5634k3501j2815q86J2214J8980
485B9042J393k0513k1070q969L537J6729J5092j524j8222k7265j8734N842K0725
498b3937J8762J3160j335j3164m636J1728K0557K1758O788j9881k9938k0891l888
511b4917J3026J7480O991o469j6858j5766N369K1428J6755O421n453k2239k3086
524b7318j961J8071K6003J5170n057j2587j0128n680P697J7678L191j7332k5056
$$ plain form
432 -21550 -17309 7073 34030 47787 34868 1680 -22544 -25437 -20152 -8463 2502 -1939 -22346
445 -22346 -41224 -41875 -17054 16870 35157 33498 17432 -4907 -12264 2520 22068 32562 29542
458 29542 10951 -8913 -12340 -3649 13837 29115 22476 -5012 -34983 -51408 -45563 -24409 -11101
471 -11101 -10439 -16386 -26326 -28412 -6974 25374 46912 50684 35050 11549 -1266 -2152 10062 29042
485 29042 30435 9922 -11148 -20117 -16580 149 15241 13717 -4505 -31770 -50504 -44662 -23937
498 -23937 -5175 7985 6650 -6514 -11150 578 21135 42893 49681 29800 -138 -21029 -24917
511 -24917 -11891 5589 12580 6111 -10747 -26513 -21144 284 17039 23460 18007 -4232 -27318
524 -27318 -29279 -11208 14795 29965 24908 12321 2193 -3487 4210 21888 25079 7747 -17309
537a7309k4173r945J1810K0862J7506O074j0519j0563L769J5589K0732J5771n183
550C4421k1839j7412n630Q311K2474J8352j739j6206j9881j0713L036Q155N600
563F929l383k3165l0816r358J4823K2181K2614J1938n238j1903n565Q166J8609
576A5832J3528r92j0961j8480j6810M449K3386K0809O870r575k1676j4980O10
589g990Q735Q632p25j3994j7628j2687j340J8998K7703J3164o179j4919j6378
602a4608m294J2357J4111M108r347j7894j0342M412J2971K0807K0031J29j7421
615A5020j5620n007N241J3582P368p718j7120j5027RJ5750J6850J0088M78j5770
629H124k2707q160N725R517P771j621j3157j3551k140J4304K4829J6830r19j0637
$$ plain form
537 -17309 -41482 -51427 -39617 -18755 -1249 4825 -5694 -16257 -12488 3101 23833 39604 34421
550 34421 12582 -4830 -10460 -2149 20325 38677 36938 20732 851 -9862 -6826 1329 6929
563 6929 3546 -19619 -50435 -59793 -44970 -22789 -175 11763 6525 -5378 -10943 -2777 15832
576 15832 29360 28368 17407 -1073 -17883 -13434 9952 30761 37631 28056 6380 -8600 -7990
589 -7990 745 9377 8652 -5342 -22970 -35657 -36997 -17999 9704 22868 16689 1770 -14608
602 -14608 -18902 -6545 7566 11674 2327 -15567 -25909 -21497 -8526 12281 32312 32441 15020
615 15020 -600 -5607 -366 13216 20584 12866 -4254 -19281 -19272 -3522 13328 23416 23894 8124
629 8124 -14583 -22743 -17018 -7501 270 -1351 -14508 -28059 -30199 -15895 8934 25764 24845 14208
643A4208j6468j2697M686J5666R012r86r179j3283m769Q830J7153J6962L356j4198
657A8293j9862j3327k228J3020J3717k467j2599j0598n074M779J5193J4447N020
670A8314j0272k1031j3667Q91R343J5587J2140p291j6384l228J2413J7931J3938
683B8684M516n661j3905j8032o481J0446J2115N259m358j5984j5146J013J3479
696d055J2680L892j0193j8723j2774j570Q740J5166J0321K187m888j0676k950
709a2843J7256K2688O911q975j5818j6461o579O418J4303J1943l556j6232j0752
722a1697k417L211J3479J4710j638j7620j9562p423J0220J7325J2774M679o697
735I344j5249o338P884J2770J0610R9j5148j7271q322J288J2072J6995P190p877
$$ plain form
643 14208 -2260 -14957 -10271 5395 14407 13421 4242 -9041 -13810 -4980 12173 29135 32491 18293
657 18293 -1569 -14896 -17124 -4104 9613 7146 -5453 -16051 -21125 -16346 -1153 13294 18314
670 18314 8042 -12989 -26656 -25765 -16422 -835 11305 4014 -12370 -15598 -3185 14746 28684
683 28684 33200 27539 13634 -4398 -10879 -433 11682 16941 12583 -3401 -18547 -17534 -4055
696 -4055 8625 12517 2324 -16399 -29173 -30743 -22003 -6837 3484 5671 783 -9893 -12843
709 -12843 4413 27101 34012 25037 9219 -7242 -13821 -7403 6900 18843 15287 -945 -11697
722 -11697 -14114 -10903 2576 17286 15648 -1972 -21534 -28957 -18737 -1412 11362 16041 9344
735 9344 -5905 -12243 -4359 8411 19021 19120 3972 -13299 -21621 -20333 -8261 8734 15924 8047
749H047j5273q377P447J5808R203J900m820j7067j4148M125J5625J1971L812n008
763A3245j2179j3047n802R940J7971L410j3991j5280q912L93J2580J6295R029
776A3652j015j1114j0558J185R604J1914R062l960j5547j4496l498R545J7069
789A1843P609q916j3368r514m169M177J0845J0293Q52j3333j5667j169J1587J2643
803C713J1957M580j1307j5637m875Q040J2592O346l133o683j1169j1501J844J4960
817b73J1282L21q834j3300o631N667J0559J1048M353q701j2498m540M530J0974
831C957J1102J690p209j0925j0672q18J3103J1927m5r349j2191p688K032Q392
845f694J2257P905p210j4682n052M631P840J1327P521l996j2640j1646r48J1279
$$ plain form
749 8047 -7226 -15603 -8156 7652 16855 18755 13935 -3132 -17280 -13155 2470 14441 18253 13245
763 13245 1066 -11981 -17783 -7843 10128 13538 -453 -15733 -24645 -24252 -11672 4623 13652
776 13652 12637 1523 -9035 -7850 1754 13668 22730 18770 3223 -11273 -14771 -5226 11843
789 11843 19452 10536 -2832 -12346 -16515 -12338 -1493 8800 9652 -3681 -19348 -20517 -8930 3713
803 3713 15670 20250 8943 -6694 -11569 -3529 9063 15409 12276 5593 -5576 -17077 -15233 -273
817 -273 11009 11330 2496 -10804 -17435 -11768 -1209 9839 14192 5491 -7007 -11547 -7017 3957
831 3957 15059 16749 9540 -1385 -12057 -12875 228 12155 12110 2761 -9430 -17118 -15086 -6694
845 -6694 5563 13468 6258 -8424 -13476 -8845 -1005 10322 17843 13847 1207 -10439 -11387 -108
859a08J1142K022m573j0975j2188n16R755J0553O284m279j2811r098M19O829J2502
874D958R337j869j0569j0763k614J1197J3682M030l896r896j3035o931O556J1433
888A620P863j725j0909r691l001M043J2904J2602q40j2093r851l090N143J1917
902D892Q961J699o208j1414o495N051R633P409N79j0582j5125o527K101R474J1820
917E268K886p767r572m521M069J1345J0248L546m807j3067j0628L198J1745J0037
931A1980M555m239j2098r139m65P547J0528K609q384j2070q702k449R811J4058
945C542P140j568q510q590P9Q816J0171N407l517j2509j0901j905N950J1702R114
960A4421l447r815r163m473M289J0791N985k258r052j1496k769Q423J1158R480
$$ plain form
859 -108 11034 13056 8483 -2492 -14680 -15196 -5441 5112 11396 7117 -5694 -14792 -14373 -7544 4958
874 4958 14295 12426 1857 -8906 -11520 -323 13359 17389 13493 3597 -9438 -16369 -9813 1620
888 1620 9483 7758 -3151 -12842 -15843 -11800 1104 13706 12866 773 -9078 -12168 -7025 4892
902 4892 13853 15552 9344 -2070 -8565 -3514 6119 13528 14107 3525 -11600 -18127 -16026 -6552 5268
917 5268 8154 387 -9185 -13706 -9637 1708 11956 15502 10695 -2372 -13000 -9802 1943 11980
931 11980 16535 12296 198 -8941 -9406 -1859 8669 11278 2894 -9176 -17878 -20327 -10516 3542
945 3542 10682 9114 604 -7986 -7907 909 11080 16487 12970 461 -10440 -12345 -6395 5307 14421
960 14421 10974 1159 -8004 -12477 -8188 2603 8588 6330 -2722 -14218 -16987 -8564 2594 12074
974A2074L540p346j0420l841K931P609P537j933r565j0151n649L550J1593Q977
988H906J480n455r987o036L802Q607O366J942o890j0730m559M573J0494J1267
1002A3780K528p409r839p685j050P522P928N05n847r789p029L926J0417J0185
1016H143O083k771j0527p851J43N933Q462L413n274q299o692j032Q209J1479M050
1031A3469m481r441j0416j729N550O681M860p81q577p282J983P942J0845P547
1045A6170k150r014r489n189L721R655M795k757o846q027j716O343Q977P388N69
1060A2430r317j1408k792L888O845P375J127o581p267l492N073J0933O260k647
1074A0427p009r911q288J759Q657P881K277n877q273j406N254Q150R849L381p170
$$ plain form
974 12074 15614 8268 -2152 -5993 -3062 4547 12084 10151 586 -9565 -15214 -11664 -71 8906
988 8906 10386 4931 -5056 -11092 -7290 1317 7683 9625 2735 -7995 -12554 -7981 2513 13780
1002 13780 16308 8899 -940 -8625 -9675 -2153 5775 6280 433 -9356 -16385 -12459 -2042 8143
1016 8143 14226 11455 928 -6923 -6780 -847 7615 11028 5754 -2545 -9237 -10269 -2060 9419 13469
1031 13469 8988 -453 -10869 -12598 -7048 -367 4493 3712 -4865 -12147 -10164 -2222 8623 16170
1045 16170 14020 5006 -4483 -9672 -5951 3704 8499 5742 -1104 -9131 -10847 -4504 4473 11861 12430
1060 12430 3113 -8295 -11087 -7199 -354 7021 8148 1567 -5700 -9192 -4119 6814 13074 10427
1074 10427 3418 -6493 -14781 -13022 -4365 3516 5793 -84 -8357 -9763 -4509 3641 13490 16871 9701
1089I701j0799o923M35Q936Q034J005l532p324q361j77Q408P928J378o752j1298
1104i341o642l50M982J0607Q399k718p949l109K663P295P990L592k239q820j1025
1119f665k716P747P503L176j792p431p598j848M160P786N735m228r662o506j349
1134a3688M762R123P812K377m809r066k348O861P629K013j910o353r731n469L054
1149i743R549P499q12o912m089k949K72Q176R082j27q193q636k693N658P368N507
1165H957L879l831j0411o052K143N863N321k03p008p678n038l07P990J1194L512
1180H331m145o786l422K461N263N266M310j210r798p736K935P264N418K302k355
1195H098o789q741l538N843Q908K21n955n153l942p21N139R756O687q48p962o581
$$ plain form
1089 9701 -1098 -8021 -7586 1350 9384 10389 6857 -467 -8828 -9005 -597 7331 8709 1957 -9341
1104 -9341 -15983 -16333 -11351 -744 7655 4937 -3012 -6121 -3458 3837 11827 15419 13180 4360 -6665
1119 -6665 -9381 -1634 5869 9045 7253 -178 -7776 -9624 -5464 2322 8057 3829 -5833 -12339 -13688
1134 -13688 -8926 197 8009 10386 5577 -3489 -5837 1024 8653 10666 8756 2403 -7328 -12797 -9743
1149 -9743 -194 7305 6493 -419 -4508 -7457 -7185 991 10073 9946 1753 -6883 -9576 -3918 3450 8957
1165 8957 12836 9005 -1406 -7458 -5315 548 5869 5666 -1342 -9020 -14058 -14365 -6375 4819 8331
1180 8331 4186 -2600 -6022 -3561 1702 6968 11278 10068 270 -7466 -4531 2733 8151 10453 8098
1195 8098 1309 -7432 -10970 -5127 3781 4002 -1953 -7106 -11048 -11769 -6630 3126 9813 8965 1003 -5578
1211e578J036M245N864M990j232q297p100k430N682R006L205l483n260n936m827
1226a0115J591Q252O527l56q145p014Q86M789N564P337K869p760r347k356L876
1241c402N879K982N37k895p203p561L140J0069O413k80m989p001m274J546N041
1256a998P889L368n201p089l067J671N483O218K034k681p046q031p28P851N879
1271D552m2k957m873m056r34M512Q610M633n019p697k162n0K397O708N668j669
1287G621p838o628O05O288M919K150m74o059q424j440M947O293M161j123o024
1302a026m406j934K502P324O127j030n874p179k095M882N638K442J313l267p827
1317d410m245M482O660L673m40m328n053m340L57Q088P785j832n571m199k055
$$ plain form
1211 -5578 -4542 -297 5567 10557 9325 1028 -6072 -8502 -2820 6186 9391 5908 648 -5288 -10115
1226 -10115 -8524 -272 6255 5899 -2246 -9260 -8374 -3585 1979 9316 12185 4425 -4922 -7278 -3402
1241 -3402 2477 5459 5996 3101 -4102 -11663 -8523 1546 7959 7679 2690 -4311 -8585 -7039 -1998
1256 -1998 5891 9259 4058 -3031 -6098 -4427 1056 7274 9308 6627 -419 -8450 -9178 -1327 4552
1271 4552 4510 1553 -3320 -7376 -8310 -3798 4812 9445 4426 -3271 -5433 -5483 -3086 3622 9290 7621
1287 7621 -217 -6845 -6240 48 4967 7117 6643 584 -7840 -9280 -4333 1960 6121 4998 -1026
1302 -1026 -5432 -7366 -4864 2460 8587 7557 1683 -5496 -7591 -2709 2929 5371 6684 3417 -4410
1317 -4410 -8655 -4173 2487 6160 5720 1392 -3661 -8001 -7644 444 8229 6397 826 -3373 -5428
1332e428J103M827N578K234l652q211l564K478M299M639K722l860o215l756M01
1347f405N506N875R83m154m351l005j23M327N611K846k171p504m112K616M642
1362E81L115L301j192p222n806N14O138N514P96k443l972n190k741N490P836K048
1378F767k361n250m636p33L809N244M498j299o084n079p15L292N622L696j727
1393E044m098n174l361K944P337L640j437m922m877j613K409M585O190Q67o535
1408I99n617m64J967L531M468K125l788p299l894L065O768L113J58j944n607m973
1424g392J633N577M934J075l988m640k725P80M032O212K075l709n706m124Q60
1439e106N473M379L23j495n160n217J64N473N501K258l401n037k979j037K186
$$ plain form
1332 -5428 -4325 502 6080 8314 4662 -3549 -7113 -4635 -336 4303 7025 3165 -3050 -6806 -6405
1347 -6405 -899 4976 5959 1805 -2546 -5551 -5674 -1347 4264 7110 4939 -2565 -6677 -4061 581
1362 581 3696 6997 5805 -1417 -7223 -6709 -571 4943 5739 3296 -676 -5866 -8607 -3117 4719 6767
1378 6767 4406 -844 -5480 -6213 -2404 2840 7338 6039 -45 -5124 -5839 -2547 3075 6771 5044
1393 5044 946 -4228 -7589 -4645 2692 6332 4895 -27 -4904 -6517 -4108 477 6667 7534 999
1408 999 -4618 -5082 -3115 416 4884 7009 3221 -4078 -7972 -4907 1861 4974 5132 3188 -2419 -7392
1424 -7392 -5759 -182 4752 5827 1839 -2801 -5526 -4746 -714 5498 7573 3864 -1842 -5966 -5106
1439 -5106 367 4746 5069 3574 -1586 -6803 -6639 -1166 4335 6593 3192 -1845 -4824 -5861 -3675
1454c675O974M247l187n763l314k24L617M608L193m7n493o155o95L757L817K810
1470D470j88m034m806j468K229N718L890j242m388l906j587J971M530L499O48
1485E336l169n796j683L698L767K576N30l179n188l477J648N643M279j205l241
1500E39k451k393m72M912N067J82l523m704k222J698K955L758K237k251n785k340
1516d793J721L250L878M78k691l291l178o85M236M733J484k514m139l356J500
1531c367K853L389K727j265o341l550R96L633L384J797p83l424m177j327L931
1546a524N157Q06j374l265l582j279K674M659L213j079m705l470L61J528L405
1561A525K905j029l628m043j192K695N112J886p55k774l384j978K070M199L472
$$ plain form
1454 -3675 3299 7546 4359 -1404 -4718 -4942 -1325 3283 6476 6429 936 -5219 -5914 -2157 1660 4470
1470 4470 4282 248 -4558 -6026 -3797 1921 5811 4569 181 -3725 -5312 -3341 1189 4688 5336
1485 5336 2167 -3629 -5312 -1614 2153 4729 5259 2080 -3108 -6585 -4937 706 4985 3780 539
1500 539 -1912 -4305 -4777 135 5202 5384 1861 -2843 -5065 -3367 -412 3346 5583 3332 -2453 -4793
1516 -4793 -3072 178 4056 4534 1843 -1448 -4626 -5311 -1075 3658 5142 2628 -1511 -4867 -3367
1531 -3367 -514 2875 5602 4337 -2004 -5554 -4558 -925 2459 4256 3473 49 -4128 -5455 -1524
1546 -1524 3633 4439 3065 -200 -3782 -5061 -2387 2272 5485 4406 -299 -3769 -3408 -1880 1525
1561 1525 4430 3401 -227 -4270 -5462 -2767 2345 4231 3476 702 -2682 -4660 -2590 1609 5081
1576E081n59m062l944m33J097L110M283O46l897m509j676J563M101K566L28j693
1592B002m362l258J947M483L119N64k243m270k119Q34K714M395J332k956m457
1607b275k471Q84L229M132R81j560l788l661N24L724L198J495j077l874l264m99
1623d302K704M074K482k023l942k349j162K276M005J567n99k961l572m65K761
1638a506L457K102K1l239l438q10K255L120K756j083l186l025j373J331L828K554
1654C764o79l140l333j681J916L386K185R51k943l410j086J718K904L505N14k795
1670A776l089j767P89L373K527L83k011l042k725R98L013K422Q07j802l820k103
1686d271P86K619L236J234k022l388j300R6K599L075J161j546l039k613K10K778
$$ plain form
1576 5081 4522 460 -3484 -3917 -2820 290 4573 5219 1322 -3187 -4863 -3300 801 3367 3695 2002
1592 2002 -2360 -5618 -3671 812 3931 4495 2252 -2018 -4137 -3303 -589 3806 5138 2182 -2275
1607 -2275 -4746 -3862 -633 3499 4480 2920 -868 -4529 -4005 -281 2917 4412 3335 -539 -3803 -4302
1623 -4302 -1598 2476 4958 2935 -1007 -3356 -4518 -2242 1763 3330 2731 -230 -3802 -4267 -1506
1638 -1506 1951 4053 4074 835 -2603 -3413 -1158 1962 4718 3635 449 -2576 -3949 -2618 1210 3764
1654 3764 3085 -55 -3388 -5069 -3153 233 2418 3369 426 -2984 -4070 -2352 552 4057 4571 1776
1670 1776 -1313 -3080 -2291 1082 3609 3992 1981 -1061 -3786 -2788 225 2647 3454 1652 -2168 -4271
1686 -4271 -3485 -866 2370 3604 1582 -1806 -3106 -3010 -411 2664 3825 2279 -760 -3373 -3163 -385
1702c85K741Q87q22k893k646r3K296L182J375j392k681j580q78J697L330J811
1718C949j278l052k389o73K315K294J158j65k906k897k13K065K836K056p24k567
1734a91k205n85J137L596K438o00k477k855j046K008K496J822M50k522l733j468
1750c735J745K395J820R7k080k468k223Q12L841K264k56j647k235j518N84K870
1766B66K842Q78k017l210j425J015K381K030J166k010k829k166O6K731K843J4
1782B575j614k046j876m84K480K839J295j317k865j916P33J333K192J679m68l531
1798i91k150N56K234K066P96n52j976k578j105K917K870J115j142k123k026k81
1814b370J481K404K071q58l007k088m54J465K304J459m57j666k697j454J662L365
$$ plain form
1702 -385 2356 3243 2421 -472 -3118 -3211 -915 2267 3642 2250 -431 -2011 -2889 -1192 2138 3949
1718 3949 2671 -381 -2770 -3443 -1128 1166 2324 2159 -747 -3644 -3857 -1792 1044 3100 2376 -191
1734 -191 -2396 -2981 -1844 1752 4190 3590 1113 -1742 -2788 -780 1716 3538 3988 1466 -2267 -3735
1750 -3735 -1990 405 2225 2322 242 -2226 -4449 -3637 204 2468 2212 565 -1670 -3188 -2604 266
1766 266 3108 3986 1969 -1241 -2666 -1651 730 2760 3926 1916 -913 -3079 -3013 -282 2561 2575
1782 2575 961 -1085 -2961 -3445 -965 1874 3169 1852 -1013 -2929 -2196 -863 1329 3008 2540 -991
1798 -991 -3141 -2585 -351 1715 2511 1959 -17 -2595 -3700 -783 2087 3202 2060 -63 -2089 -2370
1814 -2370 -889 1515 3586 2728 -279 -2367 -2821 -1356 948 2407 1950 284 -2413 -3867 -2205 1160
1830A160Q98l04j308j960j138L60K732K591L44k758j681l96J87J256K453P31k190
1847I77k546j340J492J980R78K8l24k304k286Q87K182K273K23j533j411j247j79
1864b150K171K260Q38j668k159j901Q18J989J106Q57o84k048k677O59K304J955
1880A670L01j281j488j197l82J254L345J027k015j648j101m70J322K174R98o0
1896B449k513k120R1J301J484J452m02j809k126n60J266K349J703r09j757j340
1912a441n68O51J868J627L73k168k608m7J622R82J448M48j361k264q83J108K446
1929A233R00o13o95j387j585J80K823J575o11j361j924q76N62J393J311P80j272
1946D33k274q68Q78J344J885N90n99j583j472K60J711J949M11j337j396j164k4
$$ plain form
1830 1160 2058 1754 446 -1514 -2652 -2292 440 3031 3375 617 -1064 -1460 -1273 -17 2436 3167 977
1847 977 -1569 -2909 -1417 563 1541 1569 1245 -1059 -3345 -2458 -276 1997 2220 687 -724 -1971 -2150
1864 -2150 21 2281 3119 1451 -708 -2609 -1791 198 1304 2161 1477 -571 -3248 -2589 -285 1670
1880 1670 1971 690 -798 -1995 -2377 -1123 2222 3249 1234 -414 -1515 -1985 -663 1511 2509 2449
1896 2449 -64 -2184 -2093 -792 692 2144 1742 -67 -2193 -2753 -1487 862 2565 1656 -101 -1441
1912 -1441 -2009 -1358 510 2137 2510 342 -2266 -2313 -691 291 1739 2187 826 -1438 -2321 -1213 1233
1929 1233 2133 1520 825 -562 -2147 -1967 856 2431 1820 459 -1465 -2341 -1779 -386 925 1705 433
1946 433 -1841 -2709 -1831 -487 1398 1988 1389 -194 -1666 -1406 305 2254 2665 1328 -68 -1232 -1256
1963a256R03J436J190p86k570j122O30O47J425R94k85k009j426j74J944J568M95
1980A604j60j037j600m87J388J208J402o25j704j145k22M00J844J301m43j299
1996D25j601o31J213J434O34j94r60j166j094R70J510J061m29j165j445j27j73
2013a738J502J391l32j255j124J4L66J742J198N02r91k025m64R90J409P22j0p16
2031A181j560q98J75J070J249L34j434j205j169J31J591J296J6n92j085j156M86
2048a570J823R95O82q09j104q79l81J585J259L85j140n32j319k43N23J920M35
2065A630n23j783j035k1R00J313N11R3j741r52K14P71R49J151l78q72j380m27
2083a580Q99J400Q14n99r24j076J42P15R94P21O2r56j684l07R92J043O39q6p32
$$ plain form
1963 -1256 -353 1083 2273 1487 -1083 -2205 -1575 -928 497 1491 1206 -803 -2229 -2403 -459 1109 1604
1980 1604 1444 407 -1193 -1680 -292 916 2318 1693 -11 -1156 -1378 -978 866 2167 1724 425
1996 425 -1176 -1807 -594 840 1474 1280 320 -846 -1940 -970 540 1601 1172 7 -1438 -1565 -1738
2013 -1738 -236 1155 823 -432 -1556 -1542 -1176 566 1764 2266 1275 -750 -1214 -224 1185 1907 1897 1181
2031 1181 -379 -1277 -1102 -32 1217 1551 117 -1088 -2257 -2126 -535 761 777 185 -900 -2056 -1570
2048 -1570 253 1248 1930 1121 17 -862 -1243 342 1601 1986 846 314 -1005 -1248 -725 1195 1630
2065 1630 1107 -676 -1711 -1732 -832 481 992 1085 -656 -1608 -1394 -623 326 1477 1099 227 -1153 -1580
2083 -1580 -681 719 1533 934 10 -1066 -924 -209 785 1506 1568 612 -1072 -1379 -387 656 1295 1209 477
2102D77j313q97P68J279J115n84j041r07n99L41J236J087L42r41j330j76N15R30
2120C02J106J80q45j060r54L59J053Q01L02n45j016o78j5P65Q77N83n93j287n07
2139a172l7R14Q22O75l79j077n26L7Q13Q94K51l75j013j184j3R12R72J54j65m98
2159Er34oK36J353P27q42n35r14k32N06J198N54l69n26j260k99Q32R37M38m01
2179D68j67j198l69N82O76J387l81o38p66l06K65P94N17L80r12j020n08M46Q26
2198G6K65N84p42r21l89J63Q99P36J98r34m31l53K94O88J016J57o16n23n65N2
2218c46N15O53j45J9j386o04M50O39N69L74o02p15n00N0N06J019K71k83q50l10
2238f76K76M64Q58J07N3j215k62j56N85N52L56n47o05k77l76M17M65O71o37l15
$$ plain form
2102 477 -836 -1733 -965 314 1429 845 -196 -1103 -1702 -1361 -125 962 1304 363 -967 -1143 -628 302
2120 302 1408 1588 743 -317 -1271 -912 141 942 1244 699 -317 -995 -1010 -245 632 1215 622 -665 -1172
2139 -1172 -1209 -295 527 1202 823 -254 -780 -743 70 964 1215 840 -173 -1357 -1370 -458 514 668 503 5
2159 5 -929 -935 -699 654 1381 539 4 -910 -1142 -636 562 1116 747 221 -1039 -1338 -506 431 869 468
2179 468 301 -897 -1266 -684 -8 1379 998 360 -406 -712 -447 347 864 1244 332 -688 -1196 -750 76
2198 76 341 925 183 -738 -1127 -964 -65 671 869 -65 -496 -849 -555 133 1149 1306 690 167 -398 -346
2218 -346 169 822 677 696 -690 -1294 -844 -205 364 738 136 -579 -1079 -1029 -523 496 767 484 -366 -676
2238 -676 -400 64 922 1029 1082 -133 -395 -551 34 586 942 395 -210 -487 -863 -446 19 690 53 -262
2258b62n86J05N10P40J59K5p76n50j05M36M98N84k15o10n99l80N30P02O08j95
2278F19n80l05k62J78N10O76J3n33o15l90L22N72L07R0l53p88k23q0N67M58K65
2299D48m88o83j41P1R71K64L79k58q17n2K61K44N48K5J58r97j89j71L53N58L6
2320E20Qn92r05K64K33O35J76j05n26p20O42j32O98K95K26p84l82J38J73N61J90
2341F13k76l00k42k71M50K24K29m2l17p95K39N8L53O76k31j27l01k72k5M48K30
2362C21J37n58l7k96o1N49Q7K63n15j01l75L60L71p4J75k41j64k81J56N29K09
2383D54Qj52m05l73L02K24L65M7l46l45m87J09K28O23K08k12p52N5K50K35R9J05
2405B40K75n21n36J80M39L04j5m1m40j36n4K55K02Q4m9m67n4J3J47J71J09K37
$$ plain form
2258 -262 -848 -743 -233 507 666 691 -85 -635 -740 -304 194 778 563 -47 -646 -1026 -496 206 814 619
2278 619 39 -266 -528 -350 160 836 849 316 -299 -689 -367 205 512 602 249 -539 -762 -842 -275 183 448
2299 448 -40 -723 -864 -793 178 442 821 563 -254 -306 -45 199 747 772 930 -67 -256 -427 -74 484 520
2320 520 528 -64 -969 -705 -472 163 339 234 -292 -1012 -370 -502 196 491 717 -67 -449 -311 -138 423 613
2341 613 337 37 -205 -476 -26 198 427 385 68 -727 -488 -430 -77 599 368 241 -60 -332 -357 91 321
2362 321 458 -100 -137 -433 -494 55 142 405 -110 -211 -586 -226 145 71 246 5 -159 -440 -284 245 454
2383 454 462 310 -95 -468 -166 58 423 470 124 -221 -708 -599 -371 252 460 248 -504 -449 -199 36 135 240
2405 240 515 -6 -542 -362 77 381 366 325 -115 -251 -305 -50 152 236 187 -280 -334 -321 -174 -3 106 343
2427C43m93mJ25j61K42L71R4j28m46j48M23R6l46J42j15j54j9j88J75L28l51L7
2449a77k96o9K74L48K77K3k18l10J34L32j21K33k3k82k93K19j5L1K26O8l61k98
2471b98O8k44O8N08R9l9l70l94L11M09n2R6M1k75j04P6J64j89L85p9m4N2m62K38
2495c5k1J90o0rj12M8rML45o4l62J81j34k74N26q7m8Mj01j74j5K9J47j39j01Q0
2521a91J57l9j17L36k88K67k27J26k8K26k86J20m0K67l74P0M8O5J70l73J69p4
2543a6j14J90n4j29J6m7J08j36J68J12J41k86J06l85J18M03K9o4j45J91l06P1
2565b9P3k99L38qm6j33M64l47r3J17r8K84n11L36k57L21l3j02j58L76l47p5L94
2588A67k23k4N7R7n0j2k11o4M44l47K9OL5K7K8jJ06Q8M0k02p4N3O0J19k38K07
$$ plain form
2427 343 -150 -154 -29 -190 52 423 517 389 -57 -205 218 314 -32 110 -5 -159 -178 -366 -191 137 -214 -177
2449 -177 -473 -542 -268 80 357 380 162 -148 -14 318 197 430 407 125 -168 51 36 67 293 361 0 -298
2471 -298 -230 -474 -406 102 201 162 -208 -602 -291 118 66 162 203 -72 -176 -100 64 -125 260 181 137 189 -273 -35
2495 -35 -56 134 74 65 -47 1 -8 -4 341 277 -85 96 -38 -312 214 127 79 83 -18 -192 -207 -178 -31 -170 -271 -191
2521 -191 -34 -73 -190 146 -142 125 -102 24 -4 222 -64 56 16 283 -91 -21 27 92 262 -111 58 -16
2543 -16 -130 60 6 -123 -107 -154 -46 -182 -14 98 239 -47 59 -326 -208 195 224 160 15 206 -100 -29
2565 -29 44 -255 83 75 29 -104 360 13 -80 37 -61 223 -288 48 -209 112 79 -23 -181 195 -152 -227 167
2588 167 -56 -80 -23 74 24 12 -199 -263 181 -166 -137 -131 -96 -69 -41 -42 64 152 192 -10 -84 -31 29 148 -90 117
2614A17j64J26k15J58O8K1j8q4k03J59j99L36O0q4n3j37L8j13L17r7P8j95m4j65
2638b93k7K3K05Q3K25q8j41K71j54n7N1J57k06m5j43J13L6N2J5j70p9J19l64M10
2662gN6J87k86k70J44J67NK77k42j29K28n83O52n08M28K33j63k29l39K71p7M38
2684B53k30M9j41j34J41LK14nj56k19l60K37N00J56j30l0k55j50K26j18L33qk62
2707h6m0k22J91J76P6J91l34J48k37J09k39J36L24k64j24J10j87Q3J66K73m3m16
2729b09L2Q0J44J03O4J2n1l85r8K8L76L45l54o8q7l48L37R8K90o7l65L61o82M8
2753c96M06J46j50M2p5m61L08J17K71l9k28k75K19l05M74J41K01j11k29l50J94
2774a00J77K32k5j04k49j35N8k1M16J29m42r8q5P1J07M21J08m04k70j80r3O74
$$ plain form
2614 117 -47 79 -136 22 90 111 93 9 -194 -35 -234 102 162 78 25 -112 -74 -187 130 33 111 -84 -128 -293
2638 -293 -320 -297 -92 -9 216 128 -13 258 104 47 98 255 49 4 -139 -26 10 62 77 -93 -172 -53 -417 -7
2662 -7 49 236 -50 -320 -176 -9 -4 273 31 -98 130 -453 199 -309 119 352 189 -40 -379 -108 -185 253
2684 253 23 72 -69 -203 -62 -59 155 150 -6 -225 -585 -348 152 308 178 148 -107 -257 -31 -149 184 176 -86
2707 -86 -126 -348 -157 19 95 286 -48 100 -137 -28 -267 -131 193 -71 -195 -85 -272 -189 -23 250 207 -209
2729 -209 -177 -97 47 150 214 226 175 -210 -308 -280 96 441 87 19 -68 -416 -79 19 309 242 -123 238 -444 -396
2753 -396 10 156 6 48 -27 -488 -180 -63 208 169 -59 -334 -115 -420 54 195 396 285 56 -294 -100
2774 -100 77 309 284 180 -69 -204 -146 -167 249 378 -64 -162 -247 -176 -69 352 460 56 -214 -394 -487 187
2796A87Q6J33j39j57l52l9J05M39l01L58l06k95M8J65J58K10j3j84o6l06p2L96
2818E5M20k47m35Kl00K97j27Q57o7j27m37k63K95J30N08j79l10p67M26jL99J42
2840B71K22k05n34j72J01K43J13L95j47m46l42O7N76r6L33k35j51j38k28K49K25
2861A01K91m64j82Q0l29L29M62j27r0k52j74mK90O18J9n2l81l20L8J43K63J49
2883D08l6n60k99j39J67P07q2O6n23m80K39M65L14J55j16k85m00K54R8L68K56
2904E77l9l33l73k15N0K88K58j3j64n59J36N0N21J24j06l24l00n4L14N60M9J85
2926F32j76m48k45l7M71K02q8j49m76n32L33J54M03k8j65k11j23J18L55L47J04
2947D41j99k26m4j61M67N58J4j9r30k1l41K11J59K6J84n89l42P2N06N66k4l31
$$ plain form
2796 187 273 406 267 110 -242 -281 -176 263 -38 320 14 -281 -233 -68 90 300 287 103 37 -269 -341 55
2818 55 475 228 -207 -205 -505 -208 -335 522 455 328 -109 -372 -77 53 561 382 72 -695 -269 -270 129 271
2840 271 493 288 -246 -418 -317 -74 39 434 287 -159 -501 -434 142 46 379 144 -7 -145 -373 -124 101
2861 101 392 -72 -254 -174 -503 -174 288 161 71 -181 -355 -359 -69 549 568 516 135 -185 -147 -4 259 408
2883 408 372 -188 -487 -626 -459 248 166 232 -291 -771 -532 -67 247 402 286 1 -399 -145 -47 321 577
2904 577 538 205 -168 -383 -333 -45 213 200 36 -523 -387 -337 184 308 202 -122 -422 -476 -162 398 447 632
2926 632 456 8 -237 -274 197 399 311 162 -314 -846 -513 -359 44 16 -149 -360 -483 -365 -10 337 441
2947 441 242 16 -28 -189 278 836 850 831 -99 -120 -461 -250 -91 -65 119 -470 -812 -740 -234 332 308 -23
2969b3j71m63K05L52P90O5j91l64j31J8N80m23N28L1l99p28k44M66O1K3N3l86
2991c51k17j18K12O96J45L39n28l80l10K04Q00qK04m22l64l90K87j40N72l3p2
3012A26q44m5k94O47P46J93l13J58p09N61J5O99j29k55m70n43K75L34L13k68k74
3033g7n14k08p3K69L30L67k40l16j38K1M07N47M56K97p50j76K93J01K97K34m56
3054F71m68l69k00L54K64k47J43n36m78l08N34N95M2o9j70k38o5K59Q99J46k7
3075G32j96m97J72J7M63M7j65j61n40n55K97N05P4J21k78n1m85Q7L88L86j37k68
3097d4m47k29M98L51M19K35p57k05k39rL73O46l63j55m85m60O33Q5N66N36m49
3118E00o49K8r8N88J27L91m63l18m58p9M83K78kr3m46n81q2K15L72J21M9n53k53
$$ plain form
2969 -23 -194 -657 -452 -100 690 755 564 200 69 87 667 244 772 803 404 -324 -568 -102 -41 -18 35 -351
2991 -351 -568 -686 -474 222 367 706 178 -202 -512 -308 492 484 688 266 -98 -488 -201 -341 231 198 126
3012 126 -718 -763 -1057 -410 336 529 216 374 -335 226 241 940 811 556 86 -457 -182 152 465 197 -77
3033 -77 -591 -799 -872 -603 -273 94 -146 -462 -600 -579 -172 375 831 1128 378 202 495 596 893 1127 671
3054 671 203 -166 -366 -12 252 5 148 -388 -866 -1174 -640 -45 -3 -72 -242 -480 -545 -286 613 759 732
3075 732 536 39 211 228 691 738 573 412 -128 -683 -386 119 193 314 36 -15 -500 -413 -25 361 224 -44
3097 -44 -491 -720 -222 129 548 783 26 -179 -418 -427 -54 592 229 74 -411 -871 -238 -153 413 949 500
3118 500 -149 -121 -219 369 496 887 424 106 -352 -431 52 330 328 235 -211 -792 -874 -659 -287 -166 -117 -670 -923
3141i23L43L20Q98K05q3m53m16k3L04L16N49l75n42k22k92K93M81J40k46l56n33
3162f15J13j47L23K37J55m29m47jN21M10K56OJn71j63L83o9N90J80n40m16j42
3184c65J72O77K74j51p44p3m55j99Q25M28m2l33k32k89L14K60L10M7k78p18j69
3205g41J54L46O22j6k13k58l72K99L04P29k23l17m40k58K17o1M86M72j28o30m66
3226d94Q2M00K32K86j92o85o07J28M84M56K9N6l11k25j41N56M39K02j40n03n29
3247d77K0K16N24M71r3k52n95k43J42M89J13R7n42l56l37mJ031M60k59m04j36
3268a35k83J7L55N25k8l95l91k08K87L79O27m48K16l84q20N26M29J41m3j98l39
3289a70l92q3O54L54Q3j27k12n75nM09N27k1m14l95k89m3P41K84P9M4m02o21K15
$$ plain form
3141 -923 -580 -260 638 843 760 307 -109 -132 172 488 1037 662 120 -102 -394 -101 380 520 274 -82 -615
3162 -615 -502 -649 -326 -89 66 -363 -810 -811 -290 120 376 382 383 -188 -351 32 -37 553 733 193 -223 -365
3184 -365 -193 484 758 607 -137 -210 -665 -864 -39 389 347 14 -218 -507 -193 67 377 424 146 -572 -741
3205 -741 -587 -241 381 365 152 -106 -478 -179 125 854 631 314 -126 -384 -167 -228 258 730 602 -28 -494
3226 -494 -412 -12 220 506 314 -371 -978 -850 -366 90 119 175 -136 -361 -502 54 493 695 555 52 -477
3247 -477 -457 -241 283 754 661 409 -186 -429 -287 202 315 412 -130 -486 -823 -827 204 664 405 1 -135
3268 -135 -418 -401 -46 479 451 56 -335 -543 -256 123 750 302 518 134 -686 -160 269 410 367 169 -170
3289 -170 -562 -645 9 363 446 319 107 -468 -473 -64 463 442 28 -367 -656 -699 42 326 405 449 47 -574 -359
3312c59L53O12lm88k82j93J27N4O89K53l67l04o60K66k4O74o2Nn13p0l03K96O52
3335C53J16P3l44p08o5L81K77J92M10n71l82l62O30N65q5L26o22o10k21P66k00
3356h1N88j76k29j13l40J42J58N88K0m12l30l57j11O27K45L18k52m23l5k94K31
3377b36P71Q3j61o74k92J56L24N87K74p09n95L4l27N98N65J05k39o55p0K92Q8
3398h1M79L33k29n37m16L74K66M42J03j39p05l36k20O40M70K61n38o89k87R4K46
3419d69P71K60l44j95n72q2P73K10L51m80k5l17l78L13N17J31j18m94k92j96l2
3440f68P16L61n9n07n29j56M54K75K71N05m11m38l15Q53Q3K73r2l81m68k25j55
3461f13P20K07L18m67o48j85J58O15Q1N2j44o38j34K54N91J17M84l78m09l18J56
$$ plain form
3312 -359 -6 606 603 115 -167 -360 -233 -179 510 763 396 92 -568 -302 -326 348 286 291 -222 -292 -595 -299 353
3335 353 469 542 198 -510 -575 -194 83 275 685 114 -268 -630 0 565 480 806 184 -426 -647 119 -81
3356 -81 507 331 102 -11 -351 -209 -51 537 557 145 -185 -542 -653 -26 219 537 285 -138 -173 -467 -236
3377 -236 535 618 457 -217 -509 -353 -29 558 832 123 -472 -438 -765 -167 398 503 264 -391 -461 -169 -81
3398 -81 398 731 502 -35 -451 -77 189 631 734 595 -110 -446 -666 -26 444 705 167 -522 -809 -715 -469
3419 -469 302 562 218 23 -549 -631 142 352 703 223 198 -119 -497 -184 333 464 346 -148 -440 -636 -668
3440 -668 48 409 350 -157 -686 -842 -388 -113 158 663 252 -186 -501 352 435 708 616 235 -233 -458 -613
3461 -613 107 314 632 165 -483 -668 -510 105 186 238 94 -544 -678 -424 167 284 768 390 -19 -337 -181
3482a81O66J4K17k33p28l20J24r2R87J60o93k34l02oN24M01N0k9n35m21N3M35
3504a43M25M77n9r06p8j73M93J05J80j56j76n43j29L57L64N04L05n36q93K1O89
3525A28NK91K46n24o07m9K65M10N03j02l13n53m60L71N83j24j55j34m60l02P71
3546b10K39O48k19m78L5m34n6O92M00J40n89m63K96K7M18M45o3n13o28m18K48
3567d83L24M14k79j6m95j83O2K23Q47J46n38k92k61J25K61N15j02K49m65l68L78
3588F2K09M81ol11o49j13k14J60N70n4l04m47r2LN05M65K72M7o91l81k17N75L17
3611A87N49q1l20l86l55L50O47N2k19n19m53m12L37P27R8m7o0m97J6M09O15K8
3633F66j50l95l85k63R7M78J71n4m94K04k51j52M58Q45n42j05p29k09J42O90M61
$$ plain form
3482 -181 485 499 716 483 -245 -565 -441 -533 454 614 -79 -313 -615 -621 -97 304 354 325 -210 -631 -578 -143
3504 -143 282 759 700 -206 -284 -457 36 141 321 165 -11 -554 -683 -326 38 542 847 311 -582 -561 128
3525 128 133 424 670 146 -461 -510 -245 165 668 566 253 -300 -760 -389 194 70 -85 -219 -679 -981 -210
3546 -210 29 677 458 -20 15 -419 -475 217 617 757 168 -295 1 28 446 891 828 315 -313 -731 -483
3567 -483 -159 255 -24 -40 -535 -718 -656 -433 414 560 22 -270 -531 -406 -145 370 268 517 52 -316 62
3588 62 271 752 746 435 -214 -327 -541 -381 189 135 -169 -616 -708 -705 -200 265 537 584 -107 -488 -705 -130 187
3611 187 736 655 335 -51 -406 -56 591 643 424 -95 -548 -960 -623 104 202 155 95 -402 -386 23 638 666
3633 666 516 121 -264 -527 -430 48 219 165 -329 -125 -376 -528 -70 775 233 128 -601 -810 -668 22 483
3654D83L01l13l45n3M4J43P02p1n30o28k22j92L34M73q0k89J27n95R9K40O83l43
3676c2k18l6n01J40J36J082J31o0k58N5n90K77N96K9l87o60k45k49L51N26L12
3697C99p1m15j87k91L86L00J21K8l33l46j98J39O21O05Qm09k83m78K23K07K91
3718C17R7p41k87k96L39O17L10K67m64m34N7J45M51J05p2l02l15n95M75K07M39
3739C20J04l32n68m8k75O44M69k89j75q0m2j18N95M93j6l98k76K1j28J50M42j52
3761C41k51o05j37J90L67O40m6m29l89j06K8L01L67j45j92j77k91O0O70J98K13
3782F07J75j015P9k81K53L08K60j70n84j89j49O46L71R6k23qq02L35J99L43K71
3803E22j61l69m59J08L15M24M18j74q05k84j05J6L92M58j75j53l52K1J2O26L67
$$ plain form
3654 483 784 471 126 73 117 260 962 891 361 -267 -489 -681 -347 126 46 -243 -116 -711 -612 -372 311 -32
3676 -32 -250 -286 -787 -647 -511 571 702 642 384 439 -151 126 722 751 364 -296 -541 -790 -439 87 399
3697 399 328 -87 -274 -565 -179 121 242 270 -63 -409 -607 -468 153 758 766 357 74 -404 -181 26 317
3718 317 414 -327 -614 -910 -571 46 356 623 159 -275 -218 -73 378 483 411 109 -206 -801 -326 -119 320
3739 320 424 92 -476 -524 -799 -155 314 25 -150 -230 -272 -390 205 698 682 284 8 29 -99 51 493 341
3761 341 90 -515 -652 -462 -95 545 499 70 -319 -425 -397 -96 271 126 -66 -243 -534 -474 196 394 607
3782 607 782 -233 -154 -435 -182 126 386 216 -368 -557 -706 -60 311 407 184 176 -626 -291 -92 251 522
3803 522 361 -8 -467 -359 -44 380 798 624 -181 -465 -570 -554 -162 296 121 -32 -384 -363 -351 275 642
3824F42O5l15p03M4J50K49M98j16m01m98r2L87L21K70j2k89p85m62M14O24L81
3845C72p4j72k27n76P53j59P49l14on11M7m54N32O30k50K8n31l37O9L63N40p5
3867C97l39l39l9k65L68L23O48n09k55l50O5j6P14K73k88k32l73j00M4N03J42
3888C72j57k79l33R4L13J27K58l2j67l84j30j5O05J52m7m17j50j0Q5L42r2K96
3910D31k31n75n4J41J85P27q1o08l00pN4K87P01k20j89l30l40Q5M23M42p4l59
3932A08l89P0o7K52K17J38k07p93L26J75m6O90j08j67l75k09J99J61L28Ql7o52
3954c78k22M23J32L26J17k71l20l90p7M90M22N4j17o5o21J35L27M64J96n18j53
3975d6m78J32L74L25J86l91j54l06K8N5N62M42l66k61l20l68Q69K83L7j32l02
$$ plain form
3824 642 707 392 -311 -267 -117 132 630 514 113 -385 -477 -90 231 501 489 200 -585 -1047 -633 -9 372
3845 372 298 126 -101 -677 76 -83 666 352 346 -165 -118 -572 -40 590 340 368 -163 -500 -431 -68 472 397
3867 397 58 -281 -320 -585 -217 106 754 245 -10 -360 -295 -311 403 676 388 156 -217 -317 -273 230 372
3888 372 215 -64 -397 -303 10 137 395 363 196 -188 -318 -333 272 424 377 -40 -190 -200 -115 227 135 431
3910 431 200 -375 -429 -288 -103 624 543 -65 -365 -372 -318 -31 670 450 261 -69 -409 -324 99 541 467 108
3932 108 -281 -211 -278 -26 191 329 122 -671 -345 -170 -216 474 366 199 -176 -385 -186 -25 303 311 274 -378
3954 -378 -600 -177 -45 281 398 127 -193 -583 -660 -170 252 306 189 124 -497 -362 -35 429 625 107 -46
3975 -46 -524 -392 -18 307 493 102 -52 -358 -330 -275 287 729 363 102 -218 -586 283 566 603 471 169
3996A69m34l20M97rM83N9m29m41K17J89k2L39M7j97l16l86L71L71K98k95k65q6
4018a60l50M12M21K63L3m57l37l21m9K73O22j8k40n94J82j01N83J50J1J53n57
4039h1l04K05q9N90lk88j90K3j42L79N70Pm19m55o30K40L92K36O18o09l45k6o9
4062c90O35J82L80m38m03k88K64k51O52J19p4l27m36J52P3K20L93l67j93n45K3
4083f19L75L73J97j33j79k65O7L03J72K40J7p31l07r5L12K35K74K8l45o6m11K12
4105c46L51L10o7o59j30J59k25O81K21K41k42n30J41K32M4K74j56o7o30j3P4L51
4127A4m6K08k7l56k83K87K08M30p8l40Rn96K88N40N73j33k83k71m33K2O89l16
4149A06n3q4k08m73J01K87M02N79n89j98o0j88K3O18L29k69l75l30K5J11K67N65
$$ plain form
3996 169 -265 -585 -88 -97 386 445 16 -425 -208 -19 -41 298 345 148 -168 -554 -183 188 486 191 -74 -160
4018 -160 -510 -98 323 586 619 162 -175 -496 -545 -272 350 332 92 -502 -320 -421 162 312 323 476 -81
4039 -81 -385 -180 -269 321 318 30 -160 -137 -279 100 670 677 258 -197 -827 -587 -195 41 659 50 -295 -321 -390
4062 -390 245 427 807 369 -34 -322 -58 -309 343 462 388 61 -375 -223 -150 70 463 96 -97 -642 -619
4083 -619 -244 129 326 193 14 -251 -184 119 291 531 548 -183 -490 -585 -273 -38 236 264 -81 -147 -558 -346
4105 -346 5 315 248 -411 -541 -382 -607 74 295 536 294 -236 -95 137 181 455 299 232 -398 -411 -337 14
4127 14 -32 176 149 -207 -490 -203 5 435 357 17 26 -570 -282 258 831 698 415 144 -289 -267 422 106
4149 106 53 -31 -239 -712 -611 -324 78 657 68 -130 -190 -378 -355 263 592 323 -52 -382 -357 -246 21 586
4171E86O6o07k50l1L7L33l1O4o12o8j63M34L53L95o6l35l21J2L5M21J6j3m00k54
4195c99K5L76l9K26K39l43l30l53K33P14l29J10m68K1k0J11O17j08L60j39o07
4216a03l2O2N93J9j78n06m3l46L61J15L30M21m79l76m37j3N21J40K91m41m53L99
4238a55J70J50M17q2o9k19l65k77M10K35jj00j13m15R9L73L06J16k35n30j07k0
4260d12j9L23O25l91l04r8p9L56L21K68n06M4m70j18K31K99K21K6j59m28p1L29
4282a2K76M65m13l45p6l85L76K23K04j17l19R0n34N62J83K76o9n60l43l02M42
4303c78L05J85J57k67l15j4r3N97L03n5l02k37P4m31N76K93J69n87P6n72J20L50
4325d6L25J93q59J06k54k77P61N97l05r2k67j39J37M34J82j61o7k34m28J15J59
$$ plain form
4171 586 652 45 -205 -236 -199 134 103 167 -445 -513 -676 -242 111 506 440 105 -216 -204 -169 252 268 255 -145 -399
4195 -399 -374 2 -37 189 428 85 -245 -598 -365 349 20 130 -338 -317 -337 -226 391 283 643 504 -103
4216 -103 -135 -73 520 539 361 -145 -188 -534 -173 -58 272 693 214 -162 -599 -612 -91 49 340 -101 -554 -155
4238 -155 15 165 582 500 431 212 -153 -430 -20 215 214 114 1 -414 -315 58 364 480 245 -285 -392 -412
4260 -412 -431 -108 517 126 -178 -276 -355 1 322 590 84 128 -342 -460 -229 70 291 317 158 -270 -341 -12
4282 -12 264 729 316 -29 -105 -490 -114 109 313 196 -123 -33 -567 -5 178 454 385 -175 -518 -820 -378
4303 -378 -73 112 269 2 -313 -327 -420 177 480 425 123 -114 -40 -471 105 398 567 -20 56 -516 -396 -46
4325 -46 279 472 -387 -281 -535 -812 -51 546 241 149 -118 -257 -120 314 496 335 268 34 -394 -279 -120
4346a20O74p0k2l59n93K43J74K53k61k61K28m11k9N80L05K8j47o2k03j30R4O44
4368E55O7Lp03j54j02N3N20K63m28k09j77o3O7K86N49l20r1l48j06O5M68L12L71
4391H78o84K7l85J17J27K84j59j86j84m25K75L65jM5l0j42l18K38K43K48K40m37
4413A36j81J06k37N43Q4J57n14j62k23J05L58J6N0l00l78K4j4M06Q5L89k32k89
4435g1k32L33l0J99K54k3k75l94L5Q0M47n6k17k63m95JL04M13o2J66j32k84R3
4458b09J08L58L5O8k62l38J6M89K46k99J87k53l31k1j23K22p4L23n03k5K6r5M34
4481b1N74n3k91n07K72k30M47N4L7l04k21J80J62K80Rj89j52m18j72K41M70K34
4503D02K76n38n31J11k6K52L89l9K09m34k95O3M94M1j69q4l08k94J60J55L89J79
$$ plain form
4346 -120 554 484 462 103 -490 -247 -73 180 -81 -342 -114 -525 -554 26 331 359 212 150 -53 -183 -89 555
4368 555 622 625 -78 -232 -334 -281 239 502 74 -135 -312 -375 -308 -22 527 207 116 -232 -338 -273 195 507 878
4391 878 194 221 -164 -47 80 364 205 19 -165 -590 -315 50 49 94 64 -78 -396 -158 85 333 573 136
4413 136 -45 61 -176 367 451 608 94 -68 -291 -186 172 188 238 -62 -440 -416 -430 -24 61 450 218 -71
4435 -71 -303 30 0 199 453 430 155 -239 -204 -124 323 267 50 -213 -708 -707 -403 10 -52 114 -18 -302 -209
4458 -209 -101 257 292 360 98 -240 -224 265 511 212 399 146 -185 -206 -329 -107 -181 142 -361 -386 -360 -455 -21
4481 -21 553 500 209 -298 -26 -256 191 245 282 -22 -243 -63 99 379 388 199 47 -371 -543 -302 168 402
4503 402 678 140 -391 -280 -306 -54 335 296 505 71 -224 -161 333 374 205 121 -187 -481 -321 -166 223 402
4525D02m14J16o13J72L1N00O7J7k39l9j96L82M3j1J54n22j66l8J03K96N38o90
4547a07J01k66J2K72M44l11Q3k35j7j82J62K79L83m29N9n18j48K87J81J79j37
4568I2j30j44l06L57Q5J24L72l00l81k17L97K77Q2J25m46l48N8l7L72N33k39j81
4590A45l27l91J62L94MJ74j07l94k0K6O39K14j75K3n14J10o6J57K77Q7m38k03
4612b23j04K8L47R1M2J57l25j37M17k65L27R6k70k52j32j1J6M12J13j59l73k35
4634d40K79J72J58k02j64j69j38l7L58M96J9j95J94m13O6k26N67L55l50n57K06
4655b1k31K34m6L07j47j71l22l1j2K97L14J86m65l59j11M45M65J31p7k97j52K
4677f1o2L8N84j15m91k02j14J65K18J72J41k79r7p6n2J90J56j25J19q6k68K82
$$ plain form
4525 402 -12 104 -509 -337 -306 194 261 278 39 0 -196 186 229 218 372 -150 -316 -354 -251 45 583 -107
4547 -107 -6 -272 -260 12 456 145 228 -7 -24 -206 -44 235 618 189 248 -270 -418 -131 50 229 92
4568 92 -38 -182 -488 -131 -46 78 450 150 -231 -448 -51 226 308 433 -13 -361 -303 -340 32 565 326 145
4590 145 -182 -573 -411 -17 -13 161 54 -340 -360 -334 305 519 344 367 -147 -37 -103 54 331 418 -20 -223
4612 -223 -327 -299 48 139 181 338 13 -124 293 28 355 451 181 -71 -203 -214 -198 214 327 168 -205 -440
4634 -440 -161 11 169 -33 -197 -366 -504 -541 -183 313 332 137 331 -82 -16 -242 325 680 330 -227 -21
4655 -21 -252 -18 -64 243 96 -75 -397 -428 -440 -143 171 357 -108 -467 -578 -133 332 463 386 89 -63 -61
4677 -61 -123 -85 499 384 -107 -309 -423 -258 -40 132 273 -6 -103 -179 -231 -41 115 -10 109 23 -245 37
4699C7R0R2q1k72R6k94j62K54K41L26m35j28n8N1R4L04K97k86l24n4M73L2K96
4722E89j12r6l40l41L7K63J59R6l09j67k01l5M6O56r8k2l20j56j0M0O68p7O0n5
4746B75n36O2Q0M22K3J26k95k27j48N04o3j24M50p47l65J63L32R2K57k09r2k03
4768b23j30J63P6L20m1k55k31J22J51K1L15q3j44k75k5j04N08o9J91m93J16k39
4790c29K91M58o6N8m06N5l18L38kJ90L7k80l93k30j4J28N03o6r6k67k9J70M37
4813A69o1L53O9n25k08M13R8L15o0J3o58Rk66J60L29m5Mk53j58n05O63J77J7j62
4837a12J17o15M42L2J62M58j52k37j51L1K2M71j75K12n57O7k00L1K54N2%r8m04
4860c50K32o6K92J77m9l16nJ6k9J58K83m6j59k73j37p9J99L09L6j47m87k20L84
$$ plain form
4699 37 127 219 138 -134 -38 -332 -494 -240 1 327 -108 -236 -294 -243 -149 155 452 166 -158 -212 261 293 589
4722 589 477 381 41 -300 -263 0 159 255 -54 -221 -422 -457 -411 245 147 125 -195 -351 -361 -321 347 270 330 275
4746 275 -261 -199 -119 303 326 452 157 -70 -218 286 223 99 549 -198 -563 -400 -68 24 281 72 -20 -223
4768 -223 -353 -190 -114 206 165 -90 -321 -199 -48 -27 288 205 61 -214 -239 -343 165 96 287 -206 -90 -329
4790 -329 -38 420 354 412 6 61 -257 81 79 269 306 26 -367 -597 -611 -483 20 -46 -142 -409 -438 -268 169
4813 169 108 461 530 5 -203 210 308 623 563 576 -82 -73 -339 -179 150 105 109 -144 -302 -807 -144 33 50 -112
4837 -112 5 -610 -168 -136 26 484 332 95 -56 -25 -3 468 293 505 -52 15 -185 -154 100 152 152 54 -350
4860 -350 -118 -184 108 285 236 -80 -85 -69 -98 60 343 297 138 -135 -272 -351 -152 157 193 46 -441 -661 -277
4883b77L21M08j32J26n87j05N18J17K3K54m65l21j88L12L5k62K28J5l95j42j89
4904g06J43O84Q2o0l58K45J1j4M02P0j69k00l64K21J94P1J36k74l46k7kJ04K32
4927G5J06m09L2k45J21J07N27J12n1l03j9k12J99L73L28m60l37j37j00L13q8J42
4949G4j64m0k52R7K02L%K54j21j03N1J5L23K84m23P1n27J07J71R5Qr6j12k86P
4974c62k80Q19K51k07k63R0m11L83L5K61P8j79j90l57L56j96N88k8k26m49k38
4995e25K48J61J84O7k57l23L7r5M29M87J32l17r2j32o9j7M05P3j77l95m8j92K77
5018a39K81M3p6m75L3OJ31M44j66kJ95n06M4K45M3J85J61k48l94j00Q9J83O35
5041F12n54m53K80l84K13L43J70j07m61K9J94N2K94%J33j95J4n58M34RJ42k46
$$ plain form
4883 -277 44 452 320 446 -141 -246 272 389 412 666 201 -120 -308 4 39 -223 5 20 -375 -517 -706
4904 -706 -563 121 203 143 -215 30 41 27 429 499 330 130 -234 -13 181 252 388 114 -232 -259 -261 -157 75
4927 75 181 -228 -196 -441 -320 -213 314 426 375 72 53 -159 40 413 741 281 -56 -193 -293 20 -68 74
4949 74 -90 -130 -382 -285 -83 -80 -80 174 53 -50 1 16 339 623 200 271 -256 -149 22 117 125 29 -83 -369 -362
4974 -362 -642 177 428 221 -42 48 -363 20 55 316 394 215 25 -332 24 -172 416 388 162 -287 -525
4995 -525 -277 -116 68 135 -122 -445 -408 -503 -74 413 545 228 136 4 -65 -82 323 396 219 -176 -224 -416 -139
5018 -139 142 185 109 -366 -333 -327 -196 248 82 80 275 -231 -187 58 101 286 447 199 -195 -295 -206 -23 612
5041 612 58 -395 -115 -499 -286 57 227 120 -341 -312 -118 -66 228 228 361 166 180 -378 56 65 207 -39
5063c9J23l91M4j21M02J49k74K14j47k94L82L20mL9j71k34Oo6J79M6o0J10o15
5086d02k6j59L16K46m0q0j04l94N50M3K51J84l44L55l06K5j92L71K40j05m15k35
5108b21J53O4L05q7m24M9k71O3K31K80r7K47l86j45q1L68M21j27P4k74m86O2M44
5131A62j73J29R9m15k28n6K87J71R5J5Q5l66k47J81M55O0J4m64P4j8l4K59N99
5154F84m16k74Oj05R6l3J19J25l38l00K31J22K72J29L17n26l7k71n6L83K24L3
5176C85j33n07p3L05j19K14R1J88p67j20N7L34L37O1j81Rj74R7J21P4M15m47k66
5199i9Pj44J74J29P0j02j08l25J19R5L72Lm94k2k20K39k16N91M11j93j29k35k7
$$ plain form
5063 -39 84 -307 -263 -384 18 167 -107 107 -40 -334 48 368 364 403 232 -2 4 -62 117 163 103 213 -402
5086 -402 -428 -587 -271 -25 -65 -145 -249 -643 -93 -50 201 385 41 396 90 115 -77 294 534 429 14 -221
5108 -221 -68 -4 301 214 -210 -161 -432 -369 -138 142 45 292 -94 -239 -320 48 469 342 416 142 -344 -282 162
5131 162 -11 118 217 -198 -426 -482 -195 -24 71 86 171 -195 -442 -261 194 254 268 -196 -122 -140 -174 85 684
5154 684 268 -6 0 -105 -9 -42 77 202 -136 -436 -205 -83 189 318 635 109 72 -199 -255 128 352 385
5176 385 252 -255 -328 -23 -142 72 163 351 -416 -536 -479 -145 192 253 72 81 -93 4 125 199 614 167 -99
5199 -99 -92 -236 -62 67 137 35 -73 -398 -279 -184 188 191 -303 -325 -545 -306 -522 69 480 287 158 -77 -104
$$ [...]
8191h2
##END NTUPLES=NMR FID
##END=
