##TITLE=1H_CA-8559
 CDCl3, 8 sc, 
 4.2.2019
##JCAMPDX= 6.0         $$ Bruker NMR JCAMP-DX V2.0
##DATA TYPE= NMR FID
##DATA CLASS= NTUPLES
##ORIGIN= UXNMR, Bruker Analytische Messtechnik GmbH
##OWNER= root
$$ XWIN-NMR		Version 3.5
$$ Mon Feb  4 15:38:23 2019 Russian Standard Time (UT+4h)  she@DPX200
##.OBSERVE FREQUENCY= 200.1313
##.OBSERVE NUCLEUS= ^1H
##.DELAY= (6, 6)
##.ACQUISITION MODE= SIMULTANEOUS
##.ACQUISITION SCHEME= undefined
##.AVERAGES= 8
##.DIGITISER RES= 18
##SPECTROMETER/DATA SYSTEM= spect
##.PULSE SEQUENCE= zg30
##.SOLVENT NAME= CDCl3
##.SHIFT REFERENCE= (INTERNAL, CDCl3, 0, 15.7039)
##AUDIT TRAIL= $$ (NUMBER, WHEN, WHO, WHERE, WHAT)
$$ ##TITLE= Audit trail, XWIN-NMR		Version 3.5
$$ ##JCAMPDX= 5.01
$$ ##ORIGIN= Bruker BioSpin GmbH
$$ ##OWNER= she
$$ F:/spectra/data/she/nmr/H-F/1/audita.txt
$$ ##AUDIT TRAIL=  $$ (NUMBER, WHEN, WHO, WHERE, WHAT)
(   1,<2019-02-04 15:37:19.65 +0400>,<she>,<DPX200>,
      <created by zg, POWCHK disabled, PULCHK disabled
       configuration hash MD5:
       00 E9 B6 7A A2 85 ED C7 34 08 36 98 17 FE 4E 26
       data hash MD5: 16K
       99 D7 96 1C 2E 8F 70 6B 67 C5 52 41 DD C2 77 CF>)
$$ ##END=
$$ 
$$ hash MD5
$$ 91 ED E7 87 95 94 8D D2 04 80 9B E6 6D 49 98 5D
##$RELAX= 
##$RELAX= 
##$RELAX= 
##$RELAX= 
##$RELAX= 
##$RELAX= 
$$ Bruker specific parameters
$$ --------------------------
##$DU= <F:/spectra>
##$EXPNO= 1
##$NAME= <H-F>
##$PROCNO= 1
##$TYPE= <nmr>
##$USER= <she>
##$AMP= (0..31)
100 100 100 100 100 100 100 100 100 100 100 100 100 100 100 100 100 100 
100 100 100 100 100 100 100 100 100 100 100 100 100 100 
##$AQSEQ= 0
##$AQ_mod= 1
##$AUNM= <au_zg>
##$AUTOPOS= <>
##$BF1= 200.13
##$BF2= 200.13
##$BF3= 200.13
##$BF4= 200.13
##$BF5= 200.13
##$BF6= 200.13
##$BF7= 200.13
##$BF8= 200.13
##$BYTORDA= 1
##$CFDGTYP= 0
##$CFRGTYP= 5
##$CHEMSTR= <none>
##$CNST= (0..31)
1 1 145 1 1 1 1 1 1 1 1 1 1 1 1 1 1 1 1 1 1 1 1 1 1 1 1 1 1 1 1 1 
##$CPDPRG= <>
##$CPDPRG1= <>
##$CPDPRG2= <>
##$CPDPRG3= <>
##$CPDPRG4= <mlev>
##$CPDPRG5= <mlev>
##$CPDPRG6= <mlev>
##$CPDPRG7= <mlev>
##$CPDPRG8= <mlev>
##$CPDPRGB= <>
##$CPDPRGT= <>
##$D= (0..31)
0 1.2 0 0 0 0 0 0 0 0 0 0.03 0 0 0 0 0 0 0 0 0 0 0 0 0 0 0 0 0 0 0 0 
##$DATE= 1549280239
##$DBL= (0..7)
120 120 120 120 120 120 120 120 
##$DBP= (0..7)
150 150 150 150 150 150 150 150 
##$DBP07= 0
##$DBPNAM0= <>
##$DBPNAM1= <>
##$DBPNAM2= <>
##$DBPNAM3= <>
##$DBPNAM4= <>
##$DBPNAM5= <>
##$DBPNAM6= <>
##$DBPNAM7= <>
##$DBPOAL= (0..7)
0.5 0.5 0.5 0.5 0.5 0.5 0.5 0.5 
##$DBPOFFS= (0..7)
0 0 0 0 0 0 0 0 
##$DE= 6
##$DECBNUC= <off>
##$DECIM= 32
##$DECNUC= <off>
##$DECSTAT= 4
##$DIGMOD= 1
##$DIGTYP= 9
##$DL= (0..7)
0 120 120 120 120 120 120 120 
##$DP= (0..7)
150 150 150 150 150 150 150 150 
##$DP07= 0
##$DPNAME0= <>
##$DPNAME1= <>
##$DPNAME2= <>
##$DPNAME3= <>
##$DPNAME4= <>
##$DPNAME5= <>
##$DPNAME6= <>
##$DPNAME7= <>
##$DPOAL= (0..7)
0.5 0.5 0.5 0.5 0.5 0.5 0.5 0.5 
##$DPOFFS= (0..7)
0 0 0 0 0 0 0 0 
##$DQDMODE= 0
##$DR= 18
##$DS= 0
##$DSLIST= <SSSSSSSSSSSSSSS>
##$DSPFIRM= 0
$$ [...]
##$SUBNAM2= <"">
##$SUBNAM3= <"">
##$SUBNAM4= <"">
##$SUBNAM5= <"">
##$SUBNAM6= <"">
##$SUBNAM7= <"">
##$SUBNAM8= <"">
##$SUBNAM9= <"">
##$SW= 20.0189088683792
##$SWIBOX= (0..15)
0 0 2 0 0 0 0 0 0 0 0 0 0 0 0 0 
##$SW_h= 4006.41025641026
##$TD= 16384
##$TD0= 1
##$TE= 0
##$TE2= 300
##$TE3= 300
##$TEG= 300
##$TL= (0..7)
0 120 120 120 120 120 120 120 
##$TP= (0..7)
150 150 150 150 150 150 150 150 
##$TP07= 0
##$TPNAME0= <>
##$TPNAME1= <>
##$TPNAME2= <>
##$TPNAME3= <>
##$TPNAME4= <>
##$TPNAME5= <>
##$TPNAME6= <>
##$TPNAME7= <>
##$TPOAL= (0..7)
0.5 0.5 0.5 0.5 0.5 0.5 0.5 0.5 
##$TPOFFS= (0..7)
0 0 0 0 0 0 0 0 
##$TUNHIN= 0
##$TUNHOUT= 0
##$TUNXOUT= 0
##$USERA1= <user>
##$USERA2= <user>
##$USERA3= <user>
##$USERA4= <user>
##$USERA5= <user>
##$V9= 5
##$VALIST= <valist>
##$VCLIST= <CCCCCCCCCCCCCCC>
##$VD= 0
##$VDLIST= <DDDDDDDDDDDDDDD>
##$VPLIST= <PPPPPPPPPPPPPPP>
##$VTLIST= <TTTTTTTTTTTTTTT>
##$WBST= 1024
##$WBSW= 4
##$XGAIN= (0..3)
0 0 0 0 
##$XL= 0
##$YL= 0
##$YMAX_a= 166697
##$YMIN_a= -224698
##$ZGOPTNS= <>
##$ZL1= 120
##$ZL2= 120
##$ZL3= 120
##$ZL4= 120
##$ABSF1= 10
##$ABSF2= 0
##$ABSG= 5
##$ABSL= 3
##$ALPHA= 0
##$AQORDER= 0
##$ASSFAC= 0
##$ASSFACI= 0
##$ASSFACX= 0
##$ASSWID= 0
##$AUNMP= <proc_1d>
##$AZFE= 0.1
##$AZFW= 0.1
##$BCFW= 1
##$BC_mod= 2
##$BYTORDP= 1
##$COROFFS= 0
##$CY= 11.3945322036743
##$DATMOD= 1
##$DC= 2
##$DFILT= <>
##$DTYPP= 0
##$F1P= 18.9103706918063
##$F2P= -1.10871071338519
##$FCOR= 0.5
##$FTSIZE= 0
##$FT_mod= 4
##$GAMMA= 1
##$GB= 0.15
##$INTBC= 1
##$INTSCL= 1
##$ISEN= 128
##$LB= 0.24
##$LEV0= 0
##$LPBIN= 0
##$MAXI= 10000
##$MC2= 0
##$MEAN= 0
##$ME_mod= 0
##$MI= 1.114404
##$NCOEF= 0
##$NC_proc= 0
##$NLEV= 6
##$NOISF1= 3.799351
##$NOISF2= 2.8
##$NSP= 1
##$NTH_PI= 0
##$NZP= 0
##$OFFSET= 15.70392
##$PC= 1
##$PHC0= -9035.127
##$PHC1= 14.20004
##$PH_mod= 1
##$PKNL= yes
##$PPARMOD= 0
##$PSCAL= 0
##$PSIGN= 0
##$REVERSE= no
##$SF= 200.130013532006
##$SI= 16384
##$SIGF1= 3
##$SIGF2= 2
##$SINO= 400
##$SIOLD= 16384
##$SREGLST= <1H.CDCl3>
##$SSB= 0
##$STSI= 0
##$STSR= 0
##$SW_p= 3612.71676300578
##$SYMM= 0
##$S_DEV= 0
##$TDeff= 0
##$TDoff= 0
##$TI= <>
##$TILT= no
##$TM1= 0
##$TM2= 0
##$TOPLEV= 0
##$USERP1= <user>
##$USERP2= <user>
##$USERP3= <user>
##$USERP4= <user>
##$USERP5= <user>
##$WDW= 1
##$XDIM= 8192
##$YMAX_p= 0
##$YMIN_p= 0
$$ End of Bruker specific parameters
$$ ---------------------------------
##NTUPLES= NMR FID
##VAR_NAME=  TIME,          FID/REAL,        FID/IMAG
##SYMBOL=    X,             R,               I
##VAR_TYPE=  INDEPENDENT,   DEPENDENT,       DEPENDENT
##VAR_FORM=  AFFN,          ASDF,            ASDF
##VAR_DIM=   8192,          8192,            8192
##UNITS=     SECONDS,       ARBITRARY UNITS, ARBITRARY UNITS
##FACTOR=    0.0002496,     1,               1
##FIRST=     0,             0,               0
##LAST=      2.0444736,     0,               0
##MIN=       0,             -224698,         0
##MAX=       2.0444736,     166697,          0
$$ Real data points
##PAGE= N=1
##DATA TABLE= (X++(R..R)), XYDATA
0 0 0 0 0 0 0 0 0 0 0 0 0 8 -8 8 -8 15 -16 16 -24 24 -32 40 -48 56 -64 76 -88 103 -118 135 -153 175 -199
33 -199 226 -256 288 -323 361 -405 453 -502 558 -621 688 -760 839 -925 1021 -1125 1238 -1365
51 -1365 1506 -1659 1829 -2021 2237 -2483 2768 -3095 3480 -3941 4510 -5224 6149 -7413 9241
66 9241 -12140 17459 -30455 134568 87202 -106037 109931 126688 -20828 -38516 51641 -53683
78 -53683 -116314 -4130 40922 -99710 -97984 37768 25309 -97344 -49613 28498 -37759 -60183
90 -60183 69870 91027 -1865 31375 117644 42947 -30858 36482 54370 -49568 -63539 7879
102 7879 -23197 -89049 -19060 50544 -21690 -59896 37349 56652 -44820 -38678 52014 16429
114 16429 -48672 21577 70925 -8042 -31530 42112 31216 -42622 -20141 28953 -20997 -61002
126 -61002 2195 34011 -24501 -23915 50792 43638 -17229 9875 44561 -16309 -45067 15289 17279
139 17279 -43910 -29399 20296 -7873 -39844 2843 28044 -11928 -18792 25800 22201 -20462
151 -20462 -397 44874 22013 -7152 28277 38670 -13303 -21147 12658 -9390 -46630 -22521
163 -22521 -2393 -33683 -42342 -3667 10704 -7716 2333 30942 22479 -286 17427 35239
175 35239 8274 -2992 25562 23802 -9893 -5356 11514 -10736 -28765 -11637 -9243 -31546 -32029
188 -32029 -12388 -8332 -14595 -1884 19381 17857 10094 24272 31536 10650 3531 18079 9548
201 9548 -9960 -2721 5462 -9356 -16410 -7294 -7573 -14939 -13633 -7063 -8986 -14716 -8928 5251 7542
216 7542 4330 17114 25985 14714 9148 14059 4762 -7221 -3060 -941 -11371 -15544 -10646 -6770
230 -6770 -4994 -3338 605 2764 -3102 -3829 3555 1545 -2894 7439 15789 8263 5901 10727 3269
245 3269 -4880 -2298 -2607 -10086 -13553 -10801 -7131 -6012 -4311 5247 11570 5814 4829 10610 4133 -3622
261 -3622 3685 6308 -2556 -2303 3919 -741 -6460 -4035 -3185 -6137 -7584 -6172 -4316 -6006 -4668 5451
277 5451 10717 6739 9420 15076 7443 1437 5877 1107 -8485 -5331 -1597 -7347 -9826 -6359 -5148
292 -5148 -6032 -3754 192 1918 -1015 -146 7179 7420 3635 10046 14196 5491 2211 5323 -1667 -8901
308 -8901 -5257 -5046 -10094 -9583 -6789 -6848 -5595 -2914 792 3468 3934 6003 9208 5722 4530 10532
324 10532 9909 2585 2468 2738 -5411 -7880 -4861 -8546 -10806 -6074 -4248 -5717 -4554 -2041 1180 3952
340 3952 4273 6133 8232 5821 5163 9151 6621 1894 3309 1552 -4960 -5689 -5666 -9383 -8791 -5450 -6364
357 -6364 -5361 -1082 765 2597 5081 4287 4491 5720 3871 3634 4412 1741 1344 3526 2 -3540
373 -3540 -900 -2479 -6371 -4725 -4781 -7567 -4701 -58 684 2497 4714 4024 3910 4319 2631 2286 1420
390 1420 -1332 -863 -547 -3709 -2463 1721 -214 -1277 1207 -1475 -4907 -1110 737 -1048 56 2502
406 2502 1480 2222 2859 2193 2026 797 -1156 -1516 -3273 -6151 -3213 -329 -1978 -250 3759 1658
422 1658 1458 4944 3178 -615 1130 1432 -1229 -788 -192 -427 264 -196 -783 -16 -2479 -4086 -1485
439 -1485 -2026 -5300 -1994 1687 1035 3129 6399 4429 2902 4686 3139 105 -490 -1529 -2724 -2505
455 -2505 -3479 -3480 -1715 -1660 -738 1254 -1564 -3988 -1255 -541 -1894 870 3758 2701 3930 5877 3876
472 3876 2442 3032 1388 -594 -2578 -5661 -5734 -3777 -3582 -1794 846 2 -711 1474 998 -1004 550
489 550 718 -147 1268 1956 1208 2998 4367 3027 2677 858 -2371 -3397 -3054 -5046 -4440 -1432 -1694
506 -1694 -759 1991 1881 1404 2960 1418 -388 -578 -1673 -1981 448 770 330 3055 2862 1109 1907
523 1907 1237 -2712 -2873 -1694 -3176 -3186 -1604 -301 1709 3451 2611 1796 1049 -736 -508 -539 -3348 -3172
541 -3172 161 513 431 3922 4081 1550 1956 1753 -1953 -3786 -2868 -2317 -1424 -566 325 1487 1567 617 2558
560 2558 1823 -2669 -2562 -813 -3133 -2705 1509 2530 1493 3747 3711 1064 -138 -62 -1624 -2813 -3467
577 -3467 -2266 -439 -1002 373 3206 2380 267 1703 1143 -3176 -3086 -156 -1257 -1971 1175 2279 1446
594 1446 2490 2854 1461 -673 -1705 -1059 -1134 -2880 -1626 1444 560 -251 3240 2978 -382 76 932
611 932 -2575 -4161 -1851 -1331 -1250 712 2032 2227 1382 1621 2514 1443 -1331 -461 780 -2232 -2396 1130
629 1130 607 -865 2041 2132 -2136 -2551 -1307 -2192 -2813 -1854 -265 338 617 1981 3863 3059 2218 3338
647 3338 3063 -1407 -2320 -505 -2631 -3372 -147 143 -1997 -863 226 -948 -1513 -880 -180 -552 -1130
664 -1130 66 2235 2146 2170 4901 3875 232 783 819 -2510 -3773 -1754 -1844 -3234 -1174 -349 -687 -500
682 -500 924 1569 906 -987 -14 1378 79 141 2775 2154 89 2246 2598 -1100 -1913 -1191 -2267 -3019
700 -3019 -1999 -1177 -962 -159 1024 1959 1859 741 1641 2360 -182 -1186 768 -771 -1891 1141 1507
717 1507 -553 -672 716 -1111 -1723 -971 -645 -474 -897 -285 917 811 827 2769 2807 -124 -85 691 -1643
736 -1643 -2503 -280 -606 -1812 -354 322 -305 -625 712 1329 970 -134 -26 1010 -33 26 1880 1403
754 1403 -715 668 1117 -1459 -2192 -595 -1424 -2454 -963 -486 -689 514 1714 2021 1770 825 1752
771 1752 1831 295 -110 1194 -358 -1842 345 382 -2112 -1483 -117 -1697 -2215 -1120 -657 -367 265 1369
789 1369 1407 1255 1314 2322 2785 519 697 1323 -899 -1930 -553 -1271 -2870 -1274 -407 -1947 -1858 -570
807 -570 -353 -66 637 1336 1465 984 1261 2312 2124 585 1443 1823 -1049 -1791 -603 -1743 -2660 -993
825 -993 -765 -2153 -1735 -204 70 232 550 1217 1698 851 895 1883 1050 122 1424 553 -1471 -936 209
844 209 -1532 -1431 -286 -579 -1178 -265 358 261 87 522 1191 1537 429 674 1063 121 -976 428 -152
863 -152 -1862 -585 153 -1686 -1192 -186 -235 -247 1214 1405 832 916 685 960 594 -45 381 583 -771
882 -771 -1007 -450 -1380 -1852 -107 -372 -1422 -753 -169 -273 547 1593 1648 2199 1917 1292 1028 726 -262 541
902 541 301 -1474 -1727 -1296 -2099 -1790 -455 -659 -1280 -71 205 -492 182 1147 1207 1955 2143 1498 1585 1033
922 1033 369 504 -312 -1212 -1322 -1486 -2303 -1489 -883 -1080 -580 450 187 29 870 741 721 1126 887 888 786
943 786 411 687 682 -279 -1095 -146 -678 -1765 -1202 -833 -1325 -316 506 331 966 1473 1404 646 569 427 -118
964 -118 150 -318 -535 -362 -809 -627 219 -451 -503 28 -2 -684 136 346 2 1092 1675 1032 819 872 -81
985 -81 152 -502 -1370 -1364 -1440 -1478 -1179 -465 -697 -4 1019 461 448 1164 878 544 1200 1322 556 470 553 73 -100
1008 -100 -282 -1118 -523 -1467 -2109 -1804 -1273 -1473 -495 734 444 744 1744 1383 1074 1695 1034 397 337 239
1028 239 -478 -88 -475 -309 -407 -919 -1188 -981 -948 -1174 -480 -65 -461 389 1323 971 1205 1340 761 21 436
1049 436 -491 -530 -399 -702 -468 -474 -730 -125 497 151 80 422 -152 -588 167 610 -173 446 848 162 -165
1070 -165 -7 -334 -424 -672 -890 -1003 -890 -854 258 958 789 840 1426 731 26 948 632 -400 -49 253
1090 253 -851 -639 -213 -396 -552 -444 -653 -726 -732 -991 -16 197 -76 1129 1855 952 832 1565 681 -138
1110 -138 240 -243 -1062 -776 -627 -1024 -1016 -857 -817 -246 -557 -535 283 -40 -512 693 1153 480 903 1608 952
1131 952 427 792 91 -455 -538 -554 -727 -991 -488 -650 14 -431 39 462 226 -298 342 247 -299 560 1008
1152 1008 323 29 366 155 -109 286 53 -610 -547 -558 -53 -346 -78 295 1119 396 276 634 21 -204
1172 -204 337 82 -924 -864 -307 -541 -402 -178 401 31 22 2 734 76 -201 625 863 159 304 583 -43
1193 -43 -115 455 -201 -956 -599 -968 -1057 -505 -468 -299 150 158 69 457 526 155 1013 868 -29 655 681 81 125
1216 125 384 -77 -484 -325 -426 -1028 -768 -636 -154 -386 -219 24 492 316 509 893 399 -205 579 950
1236 950 -303 122 346 -246 -109 -110 -479 -393 -294 -517 -251 -510 -538 71 323 -121 260 560 66 -146 618
1257 618 539 -145 209 57 -89 81 49 34 -49 72 177 154 -72 -311 259 225 -469 76 137 -527 -274 241
1279 241 114 -242 -30 -148 -182 -63 252 -172 252 192 109 522 279 150 533 271 -29 -171 51 -624 -474
1300 -474 -198 -445 -173 -65 -518 -295 -26 253 96 368 207 35 501 201 432 687 378 189 23 -272
1320 -272 -751 -573 -233 -602 -280 -102 -436 -373 -119 -187 161 166 230 376 549 341 199 667 353 143 155 221
1342 221 -208 122 -18 -412 7 -256 -642 14 -350 44 172 -4 -262 238 427 152 291 349 407 49 545
1363 545 -122 -206 661 -293 -401 -98 -152 -501 7 -479 -77 395 -330 -369 50 123 -175 139 174 -19 -57 169
1385 169 205 -53 267 -151 -546 -226 -86 89 259 -226 16 343 13 -171 39 -363 -138 201 400 -123
1405 -123 -195 247 20 460 241 92 110 325 -41 -259 149 -165 -24 515 -223 -195 31 -62 -335 -32 -314
1426 -314 -239 -105 50 -64 161 -220 207 89 -91 -86 121 -57 -29 217 -32 -76 -31 387 183 47 -192 -282
1448 -282 -187 177 -259 -188 331 -76 -333 415 400 106 461 217 41 110 185 -171 263 241 12 -76 -289 -150
1470 -150 -174 21 -285 -132 -255 -199 -41 -55 -31 16 456 -3 38 143 104 103 245 58 -26 -209 -283 -382 -66 96
1494 96 -23 348 -30 -450 -31 94 -250 -82 325 278 -99 396 346 108 180 331 -164 77 -2 -12 66 -273
1516 -273 152 -99 -91 -372 298 -59 -185 93 -158 -239 -215 -87 53 -97 47 -46 -56 247 64 -8 112 -85
1538 -85 27 186 -192 -418 398 133 -196 -211 -269 -378 186 146 -294 -109 1 36 -25 111 -88 264 425 2
1560 2 17 174 61 -20 69 12 -91 430 -435 -63 7 -91 -166 61 -37 13 -29 58 -264 90 300 -122 106 85 163
1585 163 140 76 -92 27 203 248 -338 -55 -195 -134 -100 -258 -432 -3 -71 -67 12 -120 42 62 3 -26 243 92
1609 92 -104 163 114 -110 167 310 -310 79 221 58 -30 154 -20 -57 150 -136 61 193 -96 74 47 176
1631 176 -56 304 12 -156 418 141 -235 198 -47 -373 55 94 -369 -143 276 -108 -307 -180 63 -168
1651 -168 182 199 7 290 -49 -28 96 159 -158 -55 -58 -207 141 -69 -54 -208 121 -37 -194 -94 -327 -87
1673 -87 224 251 -172 141 115 52 257 25 342 124 41 -129 -46 -133 -379 32 155 3 114 3 -116 -47 -122
1696 -122 -282 -213 -15 1 -207 117 -65 203 108 185 41 90 424 32 197 -118 86 -156 439 -103 -294 137
1718 137 -260 -186 90 80 29 -53 -215 -343 -35 -328 81 -21 180 -4 -15 7 20 64 171 26 -20 126 -110
1741 -110 2 -133 73 -208 -84 -215 44 -156 -46 -42 233 -271 -111 69 -106 126 78 343 276 193 174 -18
1763 -18 72 -216 -99 135 -159 -111 -75 -83 -151 79 -138 -229 194 -93 -18 -149 26 -120 190 36 -52 81 109 75
1787 75 21 352 -179 -155 -16 -282 -191 -192 -208 180 -166 -37 6 51 134 -37 22 58 -70 36 -1 232 -94 51
1811 51 65 35 -81 278 -101 199 -226 170 148 -97 -21 2 -13 47 -78 294 -127 210 85 79 -117 29 -328
1834 -328 70 105 -104 164 64 39 46 130 -100 -158 36 -82 -265 227 -194 4 -18 -252 107 71 172 82 205
1857 205 249 266 38 176 75 -7 -50 156 151 -48 -192 -232 -77 -183 85 31 -212 -163 63 37 12 138 279 122
1881 122 118 212 -55 -270 92 195 -77 103 26 -273 46 62 -122 0 -287 -149 157 -91 286 227 -102 -23
1903 -23 34 47 29 184 5 64 115 -31 109 -99 -121 -267 -102 150 -8 -107 112 -188 68 11 12 -24 -21 -119 -23
1928 -23 226 25 14 234 81 63 151 121 -20 250 -115 -245 -4 -159 -121 -144 -137 -180 -282 218 109 53 97 -108
1952 -108 170 -225 251 172 296 147 -76 142 90 -77 170 -190 -74 206 -87 21 -92 10 47 79 2 55
1974 55 -121 89 -20 117 82 -109 160 -88 62 -2 33 -59 28 -220 -31 -8 -43 224 -187 -269 -25 -6 -202
1997 -202 -55 -35 -174 -7 103 -100 -31 285 181 258 178 -31 101 -194 -115 -176 -108 -4 -184 14 -216 -61
2019 -61 198 -151 -61 -193 -242 149 163 205 111 290 211 197 148 -59 99 218 -6 139 -111 25 114 68 -444 -218
2043 -218 15 -291 32 -83 52 35 70 -193 292 102 74 56 88 190 104 304 46 -309 -46 -241 -133 -44
2065 -44 -92 -175 -123 42 -103 -33 -152 -69 -9 -61 -7 151 63 92 114 -143 213 9 -99 139 158 -5 154 175 -109
2090 -109 -18 -62 -6 29 53 -117 23 -29 -129 106 -175 219 92 -83 -113 128 -148 92 323 28 32 87 34 82
2114 82 54 -36 -88 -51 12 -262 -11 -169 -123 -24 94 45 108 112 60 139 29 230 11 -41 189 5 17 157 124 3
2140 3 -61 -187 -130 -88 -67 88 -118 -264 -41 46 -239 46 286 130 62 83 94 -196 67 -257 55 -184 -17
2163 -17 19 7 97 -72 -165 -134 -33 74 -110 -119 107 1 -208 52 109 210 48 188 -148 146 -15 -71 -105 -148
2187 -148 204 -39 188 -132 -216 149 -72 -255 195 161 12 101 129 -18 162 119 -135 317 -135 8 297 37
2209 37 -60 -56 -158 -392 139 -152 -36 -181 -144 137 -89 116 -303 -27 -16 -92 69 118 242 122 64 167 -116
2232 -116 -80 -43 -104 -97 -185 135 52 -225 -146 -2 -101 11 61 24 41 225 -105 -84 64 110 163 -83 271 -190 -103
2257 -103 -60 124 -128 103 94 -34 -143 -133 -26 267 76 -22 -99 -163 -227 174 89 -58 -65 177 45 193 -68 -37
2281 -37 -127 187 -105 154 210 45 -183 304 75 -47 219 80 28 -155 -51 70 -99 31 -74 -352 79
2302 79 -41 -235 -117 284 -37 354 91 10 -226 85 64 -28 138 -59 308 15 -149 91 -185 -45 -61 -71
2324 -71 -40 -105 184 -6 37 -234 146 -12 159 -128 -254 187 -269 239 -11 -297 102 99 -128 195 39 -141
2346 -141 144 -42 3 -80 -101 138 -149 215 123 -183 106 409 -152 86 31 -172 68 137 -100 -30 103 108 -234
2369 -234 221 48 24 109 31 -146 -54 56 18 -93 69 -151 -86 320 -116 -94 61 42 -86 -67 -207 -212 -15 182
2393 182 77 -12 -363 -287 122 189 7 123 -21 -13 -1 46 -131 -70 265 3 29 -15 -70 187 59 -172 -162 145
2417 145 26 -58 170 -121 -19 -79 -93 21 4 -107 -36 -286 152 251 -28 -12 -139 -188 -101 139 -86 66 -169
2440 -169 228 38 -56 -186 -269 1 -206 17 160 -235 29 -253 -67 241 183 -234 80 137 100 215 -182 33
2462 33 155 -42 -87 68 -197 -188 -218 -99 -30 -26 -175 193 118 231 -141 13 254 62 -76 -11 21 27 5 -133 268
2487 268 100 58 137 173 80 -114 2 61 -232 16 87 9 63 7 44 84 -28 52 -140 5 -25 -64 -65 -215 82
2512 82 243 -138 -88 22 -2 69 111 176 176 1 197 -306 14 85 54 157 70 82 -268 -59 98 135 -23 97
2536 97 -48 75 103 -109 110 -28 19 78 -20 48 -136 26 201 294 -287 -4 22 46 -96 -276 -145 230 73
2559 73 -6 -31 -161 158 -125 111 -75 -6 -134 -69 -175 206 40 -61 -69 61 -167 257 -79 -329 98 -103
2581 -103 -237 -15 108 97 278 31 -91 -247 70 130 -148 -37 -58 89 -311 -137 122 -56 -133 120 161 5
2603 5 -4 -114 51 -72 -75 -28 -199 -187 61 23 -35 -1 -221 -151 219 391 -35 -3 -132 -89 -63 60 62 -51 42 -16
2629 -16 104 -110 198 -20 -25 -210 -323 -248 244 -272 102 -63 -92 326 -93 -70 -39 170 -19 107 -96 -237
2651 -237 -185 -67 -66 -41 -140 116 -62 0 154 -236 -25 -109 25 22 -331 78 49 16 248 100 -162 73 138 98
2675 98 -56 85 48 74 20 -171 16 39 39 -163 -184 0 -17 -32 108 143 -58 -72 171 143 96 102 183 -77 -111 -78
2701 -78 226 -47 4 260 288 28 -285 83 -354 59 -43 41 70 -22 -40 -74 115 190 36 -47 -139 168 310 175
2725 175 110 145 -104 83 154 -212 -181 159 -65 -198 109 -251 -88 -23 -119 -46 -14 -163 243 15 46 -9 15 88
2749 88 -41 110 151 -13 -36 140 81 151 120 -357 -155 -96 -155 33 241 -8 192 83 -109 188 -68 -48 44
2772 44 -248 281 65 65 -4 -174 -56 -73 -215 -224 -8 -213 -21 -49 10 -397 134 81 -101 186 194 -137 12 105
2796 105 -151 26 127 -122 -1 -196 -24 -41 30 -131 18 -71 18 18 -5 25 -65 28 276 69 102 72 44 71 64
2821 64 144 -370 156 45 -231 -115 131 -111 164 136 150 -15 95 -176 -130 -49 -38 -74 -8 -16 -60 -120 57 -11 -19
2846 -19 244 -35 147 60 122 107 497 -31 -9 206 54 214 -153 -44 -160 -247 -42 59 -59 -24 100 316
2868 316 3 160 -194 -109 70 -124 127 207 244 50 -85 76 104 292 51 23 -226 -64 269 -35 172 -106
2890 -106 -319 286 -105 58 -50 -369 -166 -160 145 -34 138 88 122 193 -54 -46 -119 -37 -124 131 -194 24 278
2913 278 -58 -98 -317 77 44 -17 49 322 -116 53 -19 239 -105 -85 53 110 29 10 -84 -225 -33 -145 159
2936 159 -12 40 113 -43 -41 23 337 -7 14 102 -79 242 -182 -167 -78 242 -80 -264 274 -52 165 100 369
2959 369 -175 25 164 78 21 165 -288 -151 194 -311 -15 227 -53 19 -159 146 -192 113 38 11 -70 -219
2981 -219 41 -239 18 126 129 39 -202 104 -60 132 233 -131 -26 129 58 -380 -51 77 -26 143 249
3002 249 -206 7 -121 -77 -24 -120 -219 197 -133 163 -85 38 90 -30 -112 -140 242 -47 127 -131 157 -108
3024 -108 242 53 67 112 38 -327 -252 149 -151 -272 -32 432 98 73 133 31 -56 -59 104 151 152 168 -43 -71 -139
3049 -139 88 -333 -30 -59 56 125 30 -243 70 143 121 9 -204 109 35 -89 -164 105 114 -18 275 49 105
3072 105 36 98 -184 189 -233 -141 -229 -62 187 -45 -71 -10 -126 -453 -137 -40 171 -90 132 -197 263 -112
3094 -112 -61 64 246 -184 74 -68 -112 189 -39 -51 -23 69 49 -53 110 45 102 297 -85 236 -124 -27 96
3117 96 -39 167 183 267 -55 162 109 -141 21 0 211 141 128 242 -17 110 10 48 218 43 122 80 64 310
3141 310 191 -95 -262 175 -88 18 78 43 110 58 78 62 -33 54 -95 296 -75 9 70 -71 -38 -30 3 -81 219
3166 219 -87 195 51 2 -83 -33 195 93 -88 -3 -171 -194 13 -48 123 34 -135 -56 -107 -73 -61 189 -161 115
3190 115 42 178 106 -81 205 136 214 -35 87 181 23 -184 -4 -3 108 -207 5 60 -25 -69 282 -170 -115 106
3214 106 -123 -93 145 45 131 30 244 63 -199 218 57 45 -202 256 141 -67 -81 23 91 120 10 155
3236 155 161 -45 14 -239 -53 -92 -3 -131 54 130 -86 174 -25 -467 14 188 -332 45 162 -117 95 306
3258 306 42 107 119 -102 -215 132 54 -285 81 -62 -353 66 25 -20 -148 -4 -176 50 17 156 55 -68
3280 -68 66 40 146 37 127 44 107 168 166 53 101 92 -300 181 108 14 -9 -28 -40 61 266 193 -184 -170 -61 167
3306 167 -97 -143 49 65 -34 -110 74 -37 -141 -92 -150 -192 -66 -19 145 -185 114 -63 -117 -96 -47 122 -32 -355
3330 -355 -197 -25 49 -10 108 -121 -100 -98 90 81 -104 198 -62 89 31 138 -163 26 39 -131 2 72 -29
3353 -29 -217 91 -23 -41 193 41 172 -123 199 -87 -76 -224 -108 64 -49 -48 94 -145 -30 -180 35 -160
3375 -160 210 96 -83 84 97 341 44 130 -184 -22 -69 74 -199 -115 116 -101 88 -77 -69 13 -80 -84 121
3398 121 108 -159 213 315 39 -195 28 127 3 -84 -172 -276 -130 73 101 -104 -114 -21 38 166 -4 11 -104
3421 -104 43 -200 -42 -157 47 -158 -30 -234 -88 231 144 -8 -114 179 -81 64 67 -29 233 106 28 237
3443 237 -267 -163 -169 54 40 -151 39 124 -116 -103 203 39 6 6 39 325 109 -110 -11 51 279 -4 -47 -9
3467 -9 -116 211 198 129 22 269 72 116 -8 68 68 0 -185 113 254 -131 -163 -63 123 -152 -107 -31 270 17
3491 17 -64 -5 163 129 249 -116 -151 48 115 188 131 76 -245 142 -157 209 115 -77 79 70 147 25 291 -119
3515 -119 196 -111 145 113 146 126 -84 245 181 68 274 -35 95 87 190 -133 -22 -103 246 7 -98 26
3537 26 -151 -153 327 -316 -166 -187 -3 109 -257 -279 67 14 -152 -3 -119 -126 119 -177 -55 -36 -248 179 -428
3560 -428 -177 -136 -268 15 -49 -39 -201 178 -28 -124 5 64 -29 -222 144 322 311 -107 51 29 73 -70 7
3583 7 -192 10 98 -146 -26 -190 -42 -265 -118 54 353 -73 123 28 -39 151 99 -159 38 169 143 129 -239
3606 -239 26 -127 105 -41 11 150 -23 7 -172 -24 -23 -49 23 -177 -55 -112 187 111 5 39 -20 -386 135
3629 135 116 -239 105 319 326 78 -148 -261 95 117 -92 -92 98 -120 15 376 187 -97 37 -233 -59 -141
3651 -141 -321 27 302 160 -159 -41 83 76 -179 65 -234 116 -47 -50 157 175 48 -154 -261 248 0 142
3673 142 174 190 2 113 -202 -141 43 -61 50 15 164 -18 -109 -26 49 7 71 31 -54 -7 -36 -60 390 -129 262
3698 262 267 197 -182 -97 27 -138 148 -259 33 90 94 158 1 181 -282 165 -204 -149 -68 126 -310 -152 392
3721 392 232 -38 -21 -225 -141 68 -139 44 189 -26 -267 -234 198 -28 38 223 202 -278 -101 126 3 -175
3743 -175 36 156 -93 17 170 -122 -113 -76 42 -86 -51 -98 18 -169 138 -185 -81 0 172 -154 -3 69
3765 69 -150 -54 -161 -114 105 122 -439 201 -121 -246 150 -159 155 -61 367 -79 -80 12 87 -191 -109 -250 -51
3788 -51 90 -223 0 -130 123 11 70 159 132 36 -134 -140 -3 85 108 -75 226 -31 -5 10 128 -12 -68 77
3812 77 -24 5 239 -149 22 92 36 -220 -1 244 54 -178 -38 -139 65 72 -159 25 37 131 -335 329 -41
3835 -41 -39 -38 82 10 1 35 -249 -139 78 93 105 -56 -125 -247 140 -140 104 -112 67 108 -158 32 273 100
3859 100 -62 60 171 56 -27 -47 -14 73 -21 1 70 388 -238 12 -11 -43 -230 -230 -19 -55 -67 176 -68 -86 55
3884 55 -35 1 -2 -18 42 -64 83 -103 126 -23 71 -312 108 -105 -78 -227 2 183 79 234 -76 141 -18
3907 -18 -114 86 32 164 370 54 207 -145 -65 -20 129 160 -48 -67 201 -56 70 -10 -464 171 -11 0 95
3930 95 192 -18 297 102 230 28 -224 -217 -169 152 -157 188 158 -23 103 -14 -234 -47 364 122 198 59
3952 59 -8 -131 -221 -47 -271 -223 -137 -45 5 179 128 -231 -9 52 -32 98 -202 -284 320 137 -8 -46 -38 292 44
3977 44 -284 -159 53 -96 3 183 90 91 130 -239 -62 -388 167 -101 195 99 175 112 73 114 -70 204 60 -149
4001 -149 -261 -106 62 263 -157 93 -147 -171 -180 113 70 9 176 -42 80 37 170 -27 -72 -60 -126 163 -122
4024 -122 -47 122 162 125 99 -89 -353 16 -80 137 -169 -107 -267 -83 -88 -269 228 -109 191 87 -175 185 -114
4047 -114 226 -263 244 217 -342 212 -90 -130 -114 105 51 49 -106 43 -77 127 96 -35 -166 111 9 -175
4069 -175 -76 -294 23 -137 45 -145 -162 -322 70 -39 -52 99 117 314 122 -47 16 -131 -120 197 -55 7
4091 7 -87 -183 2 -153 -194 94 -131 178 37 20 108 -141 -204 -42 197 -55 21 -122 22 -11 -336 -84 -64 -8
4115 -8 -230 154 -112 12 228 -105 -102 -10 -44 -115 -6 239 9 291 -77 22 176 87 176 165 85 68 -13 111 47
4140 47 -175 -93 -53 -99 52 -10 130 15 -87 -2 -185 -79 -229 108 -82 56 160 275 -188 -195 31 -22 93
4163 93 21 332 112 65 -36 39 27 -2 -10 203 128 105 36 -58 75 43 -306 -78 -47 6 81 -197 -123 -72 66 -292
4189 -292 124 81 -126 73 -261 79 -81 -133 -120 -88 41 139 1 -131 3 36 95 6 -265 -327 -11 106 -271
4212 -271 -131 76 130 142 31 -40 1 44 63 -82 75 133 -47 169 -33 118 71 22 -312 -94 -56 -182 85
4235 85 61 52 -179 177 -99 -75 -123 -17 -183 137 81 -200 -279 146 46 106 249 21 -38 -3 5 -38 38 228 -5
4260 -5 27 245 -224 -196 27 -213 -150 188 -134 117 -100 -81 35 -195 -9 -267 140 0 31 -92 -84 344 67
4283 67 -12 -152 -416 -41 -308 34 273 160 62 133 175 32 14 -6 -348 252 -4 92 31 157 -140 139 -70
4306 -70 -125 86 78 -245 51 -44 -79 29 -40 180 -32 -69 -151 -5 -27 -8 -205 84 27 22 -146 30 -43 -287 252
4331 252 -89 -116 -5 52 6 -81 48 49 218 61 -24 59 64 -129 136 112 -28 105 -150 108 -140 -95 -63 -8 -192
4356 -192 -129 12 -180 -59 180 411 -160 -8 7 24 97 -52 28 91 -182 -133 80 245 15 63 -183 -61 -54
4379 -54 -184 32 117 -134 -134 -106 82 126 -190 -52 -69 240 163 -27 147 9 -198 89 -124 70 149 0 -270
4402 -270 16 6 166 -48 -17 -99 126 28 47 60 96 37 260 350 -89 201 -183 -61 -85 328 54 -2 40 -66
4426 -66 -4 63 62 -88 -91 159 -19 34 427 25 56 -340 115 6 183 114 96 103 -24 -31 -97 -158 192 -200 152 -115
4452 -115 -40 32 99 -69 44 9 -227 -75 -201 -92 -18 -34 -21 77 -31 -199 -64 143 65 -112 -27 -215 -19
4475 -19 222 -34 -208 42 141 -25 100 -38 170 300 54 -36 -79 -212 99 87 -89 -52 -304 -147 133 51
4497 51 157 100 169 -69 9 -110 -9 -30 -27 123 -120 71 97 -345 -229 84 -107 49 247 -16 85 125 -49
4520 -49 -209 59 208 -56 185 73 8 -2 294 84 -163 69 -5 21 -159 216 -88 -57 -121 70 -177 279
4542 279 92 -65 -9 81 -19 -62 -89 47 149 -215 177 11 66 163 29 147 135 -106 -56 -150 -24 -246 -28
4565 -28 -172 -263 143 -10 120 123 -79 141 58 24 -57 -267 239 -149 -14 -18 24 195 38 -70 125 13 38 17
4589 17 -126 -142 129 -103 -178 -60 113 174 40 46 0 99 -336 -146 187 -450 53 -36 125 -173 190 -82 27
4612 27 -106 -79 104 234 -242 135 53 -27 125 -152 -45 73 -259 55 21 125 87 19 13 -179 61 71 -206
4635 -206 -166 83 10 -85 -178 127 41 -32 -114 -58 99 75 -30 231 102 92 121 218 10 136 91 -109 -140 -58 355
4660 355 101 -112 -128 12 140 154 92 -122 -57 35 -17 44 -96 134 39 -213 155 -5 27 -252 -51 162 157 -65
4684 -65 -171 48 171 39 68 103 -237 302 1 57 123 104 -64 -159 -98 12 103 170 182 168 -12 -13 67 48 -25 200
4710 200 -53 -57 13 64 -37 102 -128 269 51 -49 -39 54 -85 -177 238 -292 -30 -37 -72 50 100 -70 54 205
4734 205 92 -209 87 94 -208 -138 129 -214 16 -72 -176 30 -117 47 -371 -139 540 23 86 85 -39 58 -42
4757 -42 62 159 -7 255 53 -95 -159 33 -286 186 22 -2 -85 -10 -144 -18 157 -201 25 94 14 -54 206
4780 206 61 -182 -72 -83 -222 -72 130 -23 -188 88 213 -175 -106 -91 -15 -263 -87 -67 -126 91 -65 74
4802 74 -50 -17 -69 176 -50 -87 110 -229 -127 149 -109 29 -98 -55 230 -91 8 18 -5 -164 39 -223 -49
4825 -49 -242 -173 78 82 45 102 -135 10 -57 59 215 16 2 59 -72 -61 43 87 62 -69 1 -75 17 44 85 10
4851 10 80 -168 98 192 126 61 25 19 174 153 -15 267 -27 -25 260 -62 -169 -55 -50 156 -70 20 -62 170 -189
4876 -189 74 62 -263 12 63 -95 -344 185 138 138 187 90 187 -138 -1 75 108 -14 -141 70 -20 334 -32 155
4900 155 -250 10 118 -116 223 91 -81 -114 -109 -40 -68 -133 97 138 -102 76 88 -122 -271 5 75 29 85 -67
4924 -67 -177 218 -124 -256 83 -101 98 -72 125 -222 31 -187 -62 -150 -123 31 -68 42 -69 33 57 -282
4946 -282 173 -24 66 129 -125 -2 20 -271 -42 197 13 -78 96 354 -12 178 62 41 -27 128 20 66
4968 66 -57 46 -154 -284 141 -83 -139 -191 105 21 -174 -37 -2 -48 89 -155 96 -252 62 -80 66 -114
4990 -114 -116 -28 38 -56 -86 135 41 426 -79 165 182 -51 88 -256 18 -264 -16 312 90 -146 6 0 149
5013 149 140 43 100 -40 87 158 -92 60 -176 104 -162 46 -76 -303 104 -191 -91 -32 -52 -37 314 43 -31
5036 -31 -66 -80 -14 -106 106 -139 -103 19 29 -96 209 -73 125 -152 -40 69 66 161 23 121 184 -287 -229 24
5060 24 -332 -71 -224 38 -87 199 -11 29 169 -212 -69 29 -300 -5 23 -18 -21 93 138 81 -5 103 -14
5083 -14 -181 113 -22 148 -194 19 -99 -2 161 58 -42 114 -39 73 -81 503 -105 -51 -301 -181 -123
5104 -123 83 39 -193 -24 -102 109 -68 -219 260 136 -45 -11 182 -52 -169 101 76 -301 87 -114 212
5125 212 -32 -129 -148 129 19 26 180 24 227 -70 -277 73 -66 -135 -41 -139 56 227 -63 63 -122 48
5147 48 36 -80 -53 -3 -110 -106 111 -55 80 124 19 99 -118 119 42 101 -36 -43 -43 2 -179 -151 -3 -75 129 -46
5173 -46 143 -283 -62 -159 30 8 64 -114 21 -48 -22 94 102 -120 121 47 -117 -69 64 -189 -70 -1 -85 152
5197 152 -140 118 35 -102 62 230 88 105 -58 -6 -134 -32 -21 41 133 -113 -190 -108 60 -345 115 16 75
5220 75 -117 -165 -272 -76 51 110 23 145 61 137 343 -65 236 172 68 298 146 -33 -329 -101 -8 75 -167
5243 -167 4 -75 70 -86 -81 67 -106 85 121 -266 -248 9 19 67 -4 248 93 280 51 -99 92 103 -340
5266 -340 34 166 283 -207 25 27 -36 -162 156 12 245 102 -282 96 0 34 -207 -62 96 -96 -351 60
5288 60 -118 -144 -98 29 -125 -308 -126 -178 32 -117 -201 107 -44 -131 -232 -214 85 2 95 278 16 -127 -18
5311 -18 45 -228 -32 20 202 -177 -76 -11 -53 114 44 53 -201 138 99 18 -36 -20 232 -80 -21 -31 -60 60 -61
5336 -61 48 -381 50 210 -77 206 80 -198 -81 -157 -81 -35 -8 -362 -14 91 -133 55 -130 -151 -122 -86 66
5359 66 -67 -56 -14 10 -140 167 -137 44 49 67 14 31 189 -12 170 -25 46 101 205 -91 -298 6 -83 -139
5383 -139 121 -17 -72 -51 -116 108 42 -138 -13 262 97 97 -91 -259 -14 -12 -117 68 -86 -32 150 -181 -19
5406 -19 -33 69 99 -67 96 -27 38 128 2 -24 -58 -247 -189 258 169 10 245 224 162 61 -64 -50 -34 75
5430 75 -62 -209 80 123 -8 212 -145 -16 63 207 -113 168 -20 -40 -33 52 51 109 -296 239 -10 44 -18 -37
5454 -37 -78 -49 169 -81 85 -165 92 185 -59 186 -154 21 92 -251 -94 -82 189 12 -185 -165 -96 48 -338
5477 -338 40 25 -152 -62 -4 -33 89 132 -40 82 -139 103 -171 76 -163 133 -68 22 -43 -127 47 67 99
5500 99 53 74 39 313 26 196 108 47 -24 -50 -146 -54 226 -32 222 -44 204 21 -11 61 228 111 186 153 -52
5525 -52 104 139 2 174 -314 -11 92 -131 -31 -21 -49 -170 0 31 153 103 -9 -178 11 -251 -219 195
5547 195 144 186 163 16 -97 -131 -85 -49 77 -217 -227 142 -108 -177 167 154 -85 -3 -299 166 11 -68 -180 32
5571 32 62 -11 80 39 58 112 52 -59 -121 -20 91 125 -14 136 -110 -87 59 5 266 80 -177 -135 115 34 -15
5596 -15 -116 87 -76 219 -348 169 6 -82 -34 277 121 -155 13 -189 -104 -99 -172 5 107 -13 -142 -48 -102
5619 -102 108 180 -31 141 -153 83 304 34 -14 387 -320 -206 7 34 97 0 -59 12 100 80 -36 126 142
5642 142 3 -253 -131 412 102 3 230 -144 10 69 -181 50 69 150 48 249 -211 48 198 -34 -198
5663 -198 -86 86 -40 -98 87 5 116 176 -66 50 -92 -239 258 -187 214 -26 -92 137 -79 -247 38
5684 38 55 2 228 140 -21 -41 119 -10 -208 -108 32 -105 -133 82 15 -132 144 -6 86 -2 -18 133 -69
5707 -69 228 -267 -309 85 -31 -41 253 -228 -72 -360 39 -74 -30 218 1 60 -78 -112 60 160 55 23
5729 23 -45 -110 -54 -172 -105 160 -63 211 34 -68 -83 -151 277 7 -69 181 116 -62 143 -174 193 206 153 -120
5753 -120 77 -67 85 10 8 72 156 -214 -134 -281 150 -11 -238 143 68 33 -43 -157 258 162 -124 -75 210 -75
5777 -75 93 5 -26 -73 -9 -232 -185 -118 -241 -47 -216 150 33 -60 53 114 -85 109 173 -31 -21 -53 -77 -43 -30
5802 -30 9 41 -15 72 120 97 296 35 -1 -34 113 -241 -13 67 187 -46 162 -38 11 96 158 78 -175 72 34
5827 34 2 210 156 105 -203 27 -126 -64 -89 46 -24 -31 21 -157 -50 -104 41 -69 290 -33 123 102 -56 -94
5851 -94 5 243 185 9 -67 -3 25 -149 112 59 -55 47 -49 -37 -118 -95 52 -51 -255 -74 55 91 117 -34
5875 -34 86 -29 68 68 73 18 44 -287 219 -173 -78 -354 94 125 61 -149 -132 83 24 187 80 -141 -1 -140
5899 -140 152 -57 16 167 -11 -13 140 197 108 -37 16 -16 68 -34 68 -54 18 191 -93 108 104 -285 86 -232
5923 -232 -93 114 99 209 -16 -157 -24 -45 -51 -66 -262 -132 286 280 -245 19 -23 49 -121 -62 -100 159 165 -237
5947 -237 98 -51 -52 94 -60 84 155 -28 9 -49 -120 30 160 4 40 194 29 57 134 83 -139 -17 25 -208
5971 -208 25 -282 20 140 -43 235 164 38 19 242 -67 -142 -96 -397 24 -296 1 -55 39 104 32 240 -150
5994 -150 -144 148 -113 -168 106 -90 268 205 -379 -62 186 -78 -152 -14 165 -57 -157 -2 -276 139 94 34
6016 34 -87 144 168 80 -46 -180 28 -102 -46 35 -18 -84 66 4 -128 -202 -66 -78 -51 -9 91 -161 -80 263
6040 263 -163 119 119 -79 157 -152 -63 -114 230 129 -238 -25 -22 -90 41 46 161 6 -97 -166 -116 -92 223 -284
6064 -284 -168 -251 29 112 62 -125 60 14 -153 288 -22 52 -8 -68 207 21 46 -113 28 209 14 -81 -169
6087 -169 -108 20 -171 159 68 -111 -47 197 -161 16 357 266 194 310 -60 336 164 167 -198 282 -172 143
6109 143 -174 -75 -51 -8 39 49 128 -42 -31 188 68 21 78 35 169 -48 167 -156 168 -139 -67 222 -11 -65
6133 -65 -190 158 -180 14 -77 -159 27 313 62 -45 -201 -51 11 -39 121 7 37 16 85 -191 250 47 -15
6156 -15 36 5 121 47 -150 -8 -63 4 129 -187 157 -45 39 -90 110 -151 -19 -50 -45 -7 182 -48 87 -186
6180 -186 182 0 -56 -200 77 277 -98 135 155 23 -262 -187 -121 -124 236 -116 -37 -140 -212 -1 170 -24 92
6203 92 87 48 48 -178 23 64 10 103 15 204 129 67 -106 -69 -113 156 64 17 101 28 95 -177 58 201 90 212
6229 212 23 78 -238 13 -142 -94 0 28 -104 -93 154 -216 88 95 -40 55 257 90 -110 -61 -162 -272 -214
6252 -214 10 -40 -102 -127 -96 -131 -260 176 -187 226 -31 41 206 -82 -10 220 45 128 67 -76 -307 201 -172
6275 -172 133 -40 75 -77 -9 104 -100 126 6 29 -213 -137 187 178 -44 -20 88 -55 -303 -76 -232 105
6297 105 329 -162 70 302 53 45 -111 -24 -201 76 182 141 -73 75 232 -262 -111 227 68 -215 31
6318 31 138 -180 -7 49 -102 -181 281 -9 66 83 188 -120 219 -122 -29 -70 182 -174 -171 298 209 26 179
6341 179 -35 -83 -144 -24 68 69 -291 -32 -63 -26 84 -43 164 -296 -101 -24 162 -74 43 -93 -138 -146 3 -21
6365 -21 9 158 -13 -250 -160 -34 -39 -183 -71 62 -144 264 150 15 -211 6 -32 75 -6 355 -121 32
6387 32 123 -302 37 -166 -6 23 62 -19 98 164 -227 -133 -160 -9 213 -123 -216 -110 153 32 9 82 -153 -5
6411 -5 -32 -66 150 -28 -226 -187 -34 -99 -14 24 -124 -21 210 -245 -83 -15 249 325 -298 37 240 -64 -59 100
6435 100 77 -179 278 -193 -187 -12 -33 108 -121 -40 -79 4 94 32 -121 -108 -8 -128 -144 135 156 -169 -30 110
6459 110 -92 -104 86 -49 -64 54 -113 -377 124 185 -74 -26 59 -68 -256 -166 100 -206 179 -11 -100 -9 149
6482 149 107 -19 61 -179 109 35 -2 124 1 -88 39 -431 -29 68 150 1 -297 117 -199 128 -123 -5
6504 -5 200 -188 -27 -50 19 204 20 -49 -45 133 6 -41 -71 42 -50 13 -119 -37 149 -256 133 -77 168 -72
6528 -72 -102 130 -184 -56 226 142 217 -87 33 91 -71 142 15 359 -62 38 10 104 -73 -63 119 28 1
6551 1 -113 203 149 -182 143 145 -185 156 -73 -126 -121 -48 93 -50 176 -257 128 159 49 -25 46 -98 60 -119
6575 -119 3 104 42 28 -81 45 -242 86 -130 -110 -95 -91 159 -9 -191 -89 93 -4 -177 -426 -111 -34 91
6598 91 377 -129 4 -129 36 41 17 89 174 -205 -49 -197 -302 187 4 154 -156 26 169 101 -115 -44 -100
6621 -100 -76 -125 93 250 163 45 10 116 157 138 -15 -11 -143 252 126 104 27 -92 35 91 -69 227 205 -90
6645 -90 -106 -138 -65 -162 -35 154 99 7 -54 -146 -2 82 -54 -25 -146 297 -33 -94 -64 81 11 -36 171 -201 -214
6670 -214 -48 39 -51 195 66 36 277 15 135 103 -124 295 -209 -59 -216 -36 -101 222 129 -114 -53 -34 -90
6693 -90 65 -228 -198 -62 42 -213 -17 201 29 28 -179 102 286 -78 5 -141 -89 -110 279 99 108 -277 151
6716 151 -98 322 144 -46 144 -174 157 -174 93 -96 -120 -204 -153 -214 147 294 2 153 125 394 -207 -83
6738 -83 132 18 -3 -29 11 42 145 92 -193 -210 -38 199 62 45 88 322 35 -154 169 68 97 290 239 226
6762 226 183 149 37 -16 -89 -180 -32 44 195 -210 -43 -386 -145 92 -298 -192 -38 -202 62 -37 -127 19 45
6785 45 -176 -120 224 82 8 107 -48 -100 -29 -44 -136 182 81 42 194 -22 -142 -158 -230 128 2 114 -227 117
6809 117 -66 -8 129 133 191 134 37 61 -150 -45 -454 107 -51 -68 -126 -155 76 -100 71 2 47 13 186 80
6833 80 -8 3 104 -21 -38 -20 59 223 170 -20 18 -77 -279 23 -187 194 438 143 50 -15 26 8 -2 28 214
6858 214 -81 118 -118 -77 85 68 57 55 125 106 -101 -90 -78 10 64 165 -52 -102 139 -194 68 150 -112 -71 243
6883 243 -24 21 -68 -199 -13 299 181 158 43 68 301 -216 -74 -39 19 -109 -15 -211 23 36 227 39 -64
6906 -64 -64 94 -69 -137 265 145 -11 61 -25 74 205 -47 9 -322 188 -188 101 19 -36 -43 -178 -66 -174 22
6930 22 155 57 -28 -256 -65 -238 -81 46 118 31 -108 -13 -227 -172 -13 81 -28 -95 -35 -30 171 -212 15 -149
6954 -149 -344 -44 103 -14 -72 -200 -113 -170 163 -344 13 143 2 78 -26 -143 -32 11 -36 -163 -47 -361
6976 -361 205 10 218 249 119 -7 93 107 -9 214 2 -6 -224 140 33 79 15 -70 220 171 133 -82 95
6999 95 -72 -201 149 -134 72 -120 39 -58 -167 -57 -39 310 186 -12 11 67 -112 -21 -117 -196 96 113 116 -221
7023 -221 2 112 -146 -133 34 -80 -6 -14 16 -152 110 172 160 -69 -170 147 -17 -13 -60 -22 137 -151 -177 245
7047 245 130 -18 -155 -51 -4 213 292 178 -100 -40 -160 -100 89 95 -85 74 -2 26 -173 264 181 35 -55
7070 -55 -320 421 -127 -208 115 -67 34 -72 21 -3 332 -62 -134 70 26 32 65 238 78 -64 -85 -33 63 -76
7094 -76 151 91 222 -185 89 44 -111 44 31 20 -96 -75 -26 -42 278 -67 -151 78 92 -21 -22 142 -45 222
7118 222 123 55 -87 -113 -78 182 -30 -106 91 -47 -28 -39 -379 -146 -114 45 -99 4 -90 55 -131 -119 -174 -89
7142 -89 54 -38 -159 10 259 -166 65 229 23 -37 -156 156 40 149 140 -241 -46 -77 40 -114 109 -91
7164 -91 51 -258 -216 -45 185 25 -151 -28 87 -46 -159 -32 -41 74 -109 -128 164 -44 45 -72 133 -70
7186 -70 24 -156 107 262 198 -71 111 92 20 23 -104 -140 146 -112 78 -3 45 75 230 -61 -17 89 -302 -139
7210 -139 -19 -8 -79 -146 -97 24 -32 42 45 20 -157 -82 -193 43 95 181 -226 -62 225 -6 170 -222 13 257
7234 257 52 -189 142 383 -216 236 92 -194 114 -224 114 -24 75 7 19 -149 29 -157 215 -121 -78
7255 -78 210 -91 12 -80 -228 -54 83 -117 -32 5 -184 -148 88 -36 108 -337 346 16 140 -53 -323 -25
7277 -25 171 -260 69 -189 -230 232 67 3 -28 363 -97 47 51 -201 -36 41 -21 282 140 122 24 231 -86
7300 -86 1 91 -332 -98 109 -80 29 57 -361 -360 -72 94 10 86 -131 69 382 36 -252 100 30 350 -94
7323 -94 130 -88 -357 43 -123 -197 69 132 104 92 -5 -308 170 69 -101 49 -15 9 226 -119 -35 -48 -89 27
7347 27 -153 -78 -170 3 33 62 -208 -243 125 69 -133 -45 194 220 -75 -40 -66 5 177 151 -12 120 -94 -257
7371 -257 162 161 -118 -27 33 -6 141 -102 -99 34 -133 -63 -151 -2 -126 -150 -44 -332 -312 25 156 -76 -116 172
7395 172 93 5 -9 137 -150 52 39 -126 -41 -96 45 -190 193 -93 -3 13 -8 -64 57 141 3 -91 44 113
7419 113 65 -57 -111 44 190 30 -30 184 325 7 123 180 -26 127 97 -168 18 76 -77 262 -108 -57
7441 -57 -91 65 156 -104 128 275 -19 -130 -99 96 21 45 112 137 -116 72 30 341 -38 86 223 72 74 105
7465 105 5 40 -189 -120 27 230 -113 38 -129 153 9 -25 95 -123 -214 -195 -104 79 32 -138 -30 19 -150
7488 -150 -70 -29 -187 162 -1 31 105 -105 -131 -240 115 -32 -21 189 -69 -65 -120 213 73 -37 -336 -435 -203
7511 -203 167 -41 -152 245 -149 -204 257 288 55 -248 177 76 182 78 -39 57 -27 354 -63 41 135 135
7533 135 5 13 9 90 -81 46 228 -170 4 -220 -245 14 60 -229 61 126 155 -143 121 -114 83 64 -157
7556 -157 18 126 26 248 -26 17 104 -188 20 150 -92 -22 -59 -147 -60 212 -18 70 -92 80 -8 26 -18
7579 -18 15 124 -214 6 -266 -103 -7 -168 79 108 -15 -160 91 193 -43 -97 100 -306 184 94 -86 -187
7601 -187 9 237 74 -200 5 -77 53 -114 203 232 114 388 4 253 -191 227 13 62 54 -141 -284 150
7623 150 -50 -32 0 143 181 52 -6 152 178 127 45 -113 -65 66 49 138 -10 355 60 288 35 -18 63 278
7647 278 313 -178 92 -202 14 154 259 -61 -206 176 -20 -89 171 -69 38 -45 266 -136 -20 222 -100
7668 -100 15 222 -44 -61 21 -64 51 367 -67 130 161 -216 85 4 36 -72 92 199 -146 -308 -61 -185
7690 -185 82 -70 39 -215 51 128 210 15 -107 456 -137 -105 8 -298 -149 209 -131 46 -56 -129 -83 64
7712 64 -22 9 -199 -70 -88 84 34 -130 -277 -185 37 61 -127 -112 1 -12 146 40 -21 111 166 84 38 -242
7736 -242 184 151 211 106 -10 -117 -108 -7 -185 -118 -17 -82 -71 -63 -77 -45 99 204 -83 51 246 -27 -310 -38
7760 -38 56 -219 -74 145 18 71 -9 -148 95 -19 -96 40 10 -84 158 159 -43 3 -21 -220 -277 56 -293 46
7784 46 41 -86 88 -98 -62 165 -129 25 -165 -15 20 -36 -98 24 50 262 -100 -57 -46 19 -208 -160 -72 33
7808 33 -72 166 68 234 -191 -74 90 -256 -26 162 -40 -42 -20 49 -2 -27 -8 -324 69 -39 203 191 -296
7831 -296 252 -83 -18 -49 1 65 -66 -125 248 -76 -267 209 13 195 4 -115 -227 -163 -229 138 282 -282
7853 -282 53 24 131 -32 39 -94 -87 -124 -116 146 -95 110 239 252 -32 -146 60 69 -93 92 154 -37 170 252
7877 252 -70 -46 229 156 243 55 80 -251 -169 -13 8 253 143 110 67 94 -70 226 -155 -164 -195 280 66 -16
7901 -16 -76 18 -127 -123 -115 -141 -23 24 -125 48 20 -23 30 -206 -172 -289 151 -185 112 -122 122 -78 -223 -2
7925 -2 -161 126 191 -215 51 -18 -104 131 107 314 -78 -286 -62 113 132 100 167 26 136 -73 30 -13 -183
7948 -183 -26 -201 -208 -88 177 -89 14 47 -49 369 51 105 -42 -146 207 232 -204 3 46 -103 22 -133
7970 -133 120 169 128 255 -61 -36 16 -178 104 85 -101 -47 -143 -86 -269 -140 -95 63 -40 -147 150 99 81 150
7994 150 -2 163 165 159 259 -158 -149 -55 -335 -81 -6 146 -193 232 -298 188 -162 -52 -284 230 -47 -107 45
8017 45 -17 -141 -53 -16 -139 -293 32 -128 -342 146 -111 158 -3 -20 412 71 11 -84 87 44 107 -88 4
8040 4 3 184 48 70 242 -102 161 96 -3 16 -57 -39 39 -70 332 -59 56 -23 96 -189 126 22 -227 -220 45
8065 45 -108 -38 -81 -85 27 59 -342 128 212 241 159 -32 63 62 -83 -173 -57 -290 -3 19 -140 78 -2 -178 192
8090 192 -13 176 -67 -63 247 164 -238 14 -27 -163 43 8 16 -111 206 190 -100 22 211 54 43 133 135 -268
8114 -268 -26 -323 -12 -39 -83 -198 123 -17 43 98 -358 -39 259 89 -67 -42 -19 34 -8 24 155 196 -277
8137 -277 126 -115 -31 -353 67 68 55 -46 -72 73 -170 -169 -101 41 122 -44 112 -168 -161 34 36 339 -332 -185
8161 -185 -205 -55 125 111 -118 -7 146 -30 61 159 -118 -214 -229 -15 276 -165 -131 -76 22 -48 298 -110 105
8184 105 -224 -21 81 135 91 178 -25
8191b5
$$ Imaginary data points
##PAGE= N=2
##DATA TABLE= (X++(I..I)), XYDATA
0 0 0 0 0 0 0 0 0 0 0 0 0 0 0 0 8 -8 8 -8 8 -16 16 -16 24 -24 32 -32 40 -47 53 -59 68 -77 88 -99 113 -125
36 -125 141 -158 176 -197 218 -242 269 -296 328 -362 399 -441 486 -534 588 -650 716 -791 875
55 875 -969 1078 -1204 1352 -1528 1741 -2006 2344 -2796 3429 -4382 5968 -9091 17514 -86447
70 -86447 -224698 54027 166697 34036 24132 139052 62223 -27433 62542 96372 -52645
81 -52645 -74164 64232 55820 -84230 -58599 33223 -36322 -101797 -6945 12594 -95867 -75583
93 -75583 41307 14959 -37270 57218 116269 28829 2348 71661 41131 -48633 -13651 43561
105 43561 -31518 -82971 10811 46151 -48794 -51334 46595 21583 -61446 -9383 48431 -26407
117 -26407 -55794 34385 49717 -19150 760 61034 15374 -43162 1870 28673 -40134 -58709
129 -58709 14774 21369 -36927 -9150 49774 12613 -18619 39912 49803 -20480 -23364 25615 -576
142 -576 -42582 -6283 23214 -17958 -33771 7133 7331 -37531 -25480 22168 4989 -27498 10390
155 10390 38995 2408 -976 46656 40089 -1312 12350 29976 -9821 -36343 -10611 -3931 -33552
168 -33552 -35448 -8662 -10505 -28721 -9661 17183 1442 -9175 20476 27736 -404 4883 32141
181 32141 20280 4129 21937 26368 -813 -10981 -824 -8915 -29032 -28581 -16480 -20556 -28333
194 -28333 -11296 6020 -2126 -1633 21637 23575 5674 11298 22643 8187 -1576 9213 11377
207 11377 2275 1074 3482 -2657 -13833 -16042 -10810 -14341 -22151 -14005 -2291 -5834 -3623 12477
221 12477 16051 11086 18538 21294 6579 -2305 263 -702 -4348 -4228 -2262 -1746 -6333 -7263 -1390 -3971
237 -3971 -11429 -5018 2858 -5156 -6178 5763 8600 6207 13989 17181 8585 723 -1093 -3481 -8962
252 -8962 -11964 -7806 -3713 -7904 -7719 2080 2597 -2731 5641 10614 970 -677 7175 3820 -953 4518
268 4518 7854 3688 543 -416 -3148 -9318 -12521 -7169 -4698 -10462 -7664 3015 2257 424 10582
283 10582 13130 5199 7350 11817 4051 -2652 -487 -271 -3715 -3984 -2974 -4547 -8309 -9891 -5158
298 -5158 -4317 -7332 -2047 5426 1575 1765 10919 10506 6008 10393 11547 2695 -734 -283 -4076 -7058
314 -7058 -7099 -6589 -6332 -7970 -8222 -4985 -4783 -5097 2734 7598 3308 5313 11023 7756 5978 9364 6262
331 6262 609 1229 -570 -6121 -8125 -7358 -6856 -5662 -6239 -6022 -3767 -3876 -2755 2986 4839 2790 7209
348 7209 9878 6181 6587 8660 4038 1298 1611 -3001 -7180 -6433 -6756 -7052 -5127 -4600 -3884 -748 103
365 103 360 2549 2215 1765 4849 4197 2223 5969 6707 2402 2651 2371 -3262 -4326 -2539 -5025 -6811
382 -6811 -5126 -4221 -3166 279 1619 3209 4421 2791 2166 2343 -215 -1059 2281 1022 -1497 1066
398 1066 675 -2828 349 2260 -1914 -2719 -1163 -3233 -3161 -90 799 2009 3198 3164 3686 2647 -433
415 -433 -140 1110 -3445 -4935 -2010 -3156 -3701 907 1921 -580 1956 3587 1164 399 1241 -24
431 -24 649 1090 741 1676 1790 631 1675 564 -4061 -3908 -1992 -4939 -5561 -1943 -2591 -2799 2249 4601
449 4601 3133 4319 5194 3410 2370 459 -611 504 -124 -930 398 -699 -3678 -1167 38 -2881
465 -2881 -3542 -1945 -3997 -4039 -936 -309 684 4586 6029 5019 4936 2986 1614 2042 -1 -2262 -1783
482 -1783 -3491 -4555 -1256 -256 -1492 29 1055 -1475 -2238 -1805 -2945 -1477 1370 1223 2826 4343
498 4343 2995 3804 4453 1968 -317 -302 -2925 -4864 -3055 -2619 -1759 360 1449 361 1592 685 -506
515 -506 222 -1084 -2574 -1152 372 -209 2051 4050 2099 2314 3312 645 -2238 -1894 -2663 -2940 -1446
532 -1446 -1480 -866 1216 1651 2289 3124 -134 -2379 -577 -1649 -3447 -1444 636 -751 1259 3629 2409
549 2409 1210 2254 1279 -446 -1429 -2594 -2288 -1526 -784 1494 2634 398 395 2137 -762 -2943 -506
566 -506 -1016 -3323 -1158 976 3 879 3643 3326 1889 757 68 -276 -2274 -3000 -807 -498 -1941
583 -1941 795 3190 191 -159 2956 564 -2895 -1763 -1206 -2499 -1238 662 899 688 1659 2806
599 2806 2413 -283 -1327 -388 -1813 -3676 -702 1215 -944 959 4110 1661 -246 1409 387 -2336
615 -2336 -2803 -2708 -3079 -2572 -927 1666 2163 757 1705 3274 -120 -1676 559 403 -1606 607 2236
632 2236 -391 -431 2530 2203 -215 -494 -1581 -3256 -4296 -3546 -1798 -1004 -925 2326 4102 1810 1282
649 1282 3731 2072 -568 1221 1108 -2326 -1869 254 -33 -425 147 365 -845 -2793 -3220 -1872 -2249
666 -2249 -2096 515 1670 254 2185 4914 2856 1419 3189 1961 -950 -1327 -1413 -2663 -2174 -627
682 -627 -142 -324 -1564 -889 799 -591 -1537 170 -92 -1479 1037 3092 928 740 3321 2261 427
699 427 369 -379 -2190 -2825 -2410 -1708 -1527 -1530 110 2013 820 49 1773 900 -852 771 1410 -929 -762
718 -762 1324 424 45 1197 881 -490 -1343 -2135 -1447 -1654 -1534 267 1239 -417 518 2873 1483 162
736 162 1756 937 -1888 -944 -258 -1757 -1750 -15 450 101 -616 -471 427 -520 -953 886 855 -852 765
755 765 2619 627 95 2215 1269 -992 -631 -962 -2177 -2283 -1303 -1043 -1139 -898 424 1600 538 345
773 345 2038 1586 -81 1703 1960 -121 2 1471 190 -1580 -510 -378 -1600 -1890 -1437 -2055 -1796
790 -1796 -1726 175 1282 376 719 2949 1788 519 2299 2192 30 571 1230 -1100 -2182 -954 -803
807 -803 -1537 -1530 -1419 -1405 -1580 -1473 236 535 151 1350 2710 939 548 2310 1917 502 868 788 -1424
826 -1424 -1475 -928 -1528 -1793 -1190 -1189 -925 -1096 -611 698 422 183 1625 1921 134 493 1745 787 -323
845 -323 859 103 -1611 -859 -444 -941 -1304 -751 -473 -27 -580 37 762 551 229 1416 1337 210 479
864 479 1230 -772 -1121 -308 -1067 -1205 -236 -219 -868 -318 53 607 722 547 1075 1691 475 58 1295 568
884 568 -279 799 854 -1449 -1553 -1202 -1617 -1598 -1029 -989 -764 -603 -234 516 1084 1206 2473 2389 999 368
904 368 1197 60 -529 206 -166 -1663 -1150 -964 -1843 -1450 -861 -900 -437 -475 -521 245 840 1021 2250 2318 1378
925 1378 1459 1439 363 -320 320 -999 -1583 -737 -1553 -1485 -937 -384 -345 11 59 -183 455 305 377 854 939 864
947 864 1428 1393 -2 144 46 -870 -942 -753 -1353 -1423 -541 -109 -248 628 464 854 1377 976 170 432 9
968 9 -242 183 29 -505 -35 -8 -925 -745 -471 -1032 -721 42 -328 -125 585 875 1291 2100 1247 731 808 -87
990 -87 -598 -514 -1237 -1464 -575 -947 -1575 -525 -371 -483 324 438 71 294 959 661 1134 1504 1219 1384 1283
1011 1283 204 326 -379 -1150 -1105 -1025 -2121 -2023 -896 -612 -488 382 865 375 837 983 682 673 647 345 794
1032 794 518 122 550 395 -768 -513 -439 -1775 -1594 -506 -783 -1095 285 331 312 1348 1071 959 775
1051 775 583 -252 -367 -304 -620 203 -3 -686 -18 35 -589 -29 329 -611 -612 495 70 197 777 884 779
1072 779 894 374 -81 -260 -763 -583 -408 -867 -1210 -38 -247 -543 637 886 50 532 937 187 -61
1091 -61 167 149 211 376 -85 17 -260 -794 -581 -807 -1370 -1279 -394 -662 -701 657 656 480 1415 1696 934 891
1113 891 837 136 20 -409 -182 -415 -603 -874 -162 -448 -1202 -560 -301 -900 -1034 288 167 -192 811 1015
1133 1015 838 1268 1149 527 174 -23 -546 -135 -746 -712 -276 -249 -693 111 340 -549 -181 477 -494 -291
1153 -291 373 139 212 924 692 392 7 -270 17 -70 -886 -368 199 -204 -441 767 221 41 1100 936
1173 936 51 -113 95 -116 -645 -142 -319 -206 -261 -194 -163 -386 -442 202 138 -646 -338 520 334 290 1012 1138
1195 1138 138 645 681 99 -220 -173 -459 -558 -737 -1012 -347 -248 -344 111 128 -242 67 877 365 213 808
1216 808 574 180 1071 529 291 181 -151 -258 -567 -721 -832 -613 -637 -657 -179 -68 -453 490 574 144 253
1237 253 302 348 -191 390 270 55 26 407 -55 -139 -429 -195 -72 -425 -547 -113 -25 -190 425 585 -263 128
1259 128 305 25 38 233 -108 -130 176 41 205 236 -224 211 286 -255 -199 200 57 -214 440 186 -377 30
1281 30 140 -114 43 25 -164 -194 -253 -137 -108 205 -202 619 325 -155 198 703 -6 52 659 -92 -507 -300
1303 -300 -156 -232 14 -65 -585 -345 -343 -375 -92 -79 -53 347 319 -63 415 508 -132 256 312 229 46 280 -393 -437
1327 -437 169 -50 -247 -196 -361 -459 180 -173 -44 19 200 210 264 133 157 586 595 424 253 59 -175 -389 293
1350 293 -62 -237 -470 -444 -336 -145 -54 -127 222 -228 -125 44 417 -52 534 173 89 280 298 208 172 226 -124
1373 -124 -18 -108 -126 -64 -120 -248 -259 20 -78 -95 333 -359 94 206 -81 -138 329 98 251 386 -190 -180 169
1396 169 -152 -150 31 280 -89 65 318 -188 -217 85 -107 -126 372 37 -69 136 21 -289 208 143 -78 205
1418 205 90 -204 426 -178 -189 40 -191 -328 -36 -87 -356 -323 -101 -229 -203 -136 -412 85 45 -159 -85 101
1440 101 -70 162 351 115 70 -20 327 136 -5 100 -389 135 22 -140 -219 -81 -223 -63 -271 -513 54
1461 54 464 8 134 371 121 -32 186 191 -17 203 162 78 -11 -290 -259 -73 -8 28 -120 -271 -236 -46 -24 -37
1485 -37 314 98 240 182 318 -74 96 399 3 -60 102 -212 -17 154 -32 -151 15 -415 -421 22 -99 -308
1507 -308 13 176 -81 88 -32 -26 -269 -2 -14 298 327 -137 88 126 57 -107 164 -42 -203 114 -451 -368
1529 -368 -158 32 113 -87 120 37 135 105 75 243 265 -118 257 94 -49 68 92 -163 -168 153 -20 -328 -59
1552 -59 -177 -242 -166 -130 -79 1 52 -325 -159 -80 157 303 5 125 170 27 191 215 227 24 184 138 -145 -157
1576 -157 -119 134 -208 -20 -309 -165 80 -74 227 298 3 131 245 -143 -4 157 -117 -43 215 167 -246
1597 -246 70 -104 -31 21 -118 -81 -206 32 29 -195 159 75 -45 93 -258 110 63 -314 -148 123 179 81 189
1620 189 -180 -168 114 -235 218 290 -6 -386 7 -21 -80 78 -28 91 -106 256 -286 60 261 -191 107
1641 107 384 46 -46 43 161 -164 241 -31 -416 -53 -21 -210 -264 23 -186 166 -148 -90 144 142 44 -37 187
1664 187 -100 -113 52 -88 -204 -38 -167 63 88 -168 -168 -178 -219 -123 -74 -37 -229 121 128 -143 130 226 78 300
1688 300 171 98 -113 164 31 -150 134 139 274 479 -212 -437 77 152 -107 88 28 -49 82 -2 -133 -5
1710 -5 253 -153 386 67 -16 -128 156 89 -70 -38 17 -185 -41 -22 21 -119 28 22 -143 -303 -447 -64 -150 -132
1734 -132 -3 220 -16 72 -52 -65 269 293 -11 -20 -151 203 -18 166 -23 48 -120 -192 -386 -86 -222 58
1756 58 67 188 -33 -84 -118 80 175 93 -151 227 195 55 -29 7 5 -123 59 -29 -171 -201 -207 -298 -28 -171 -162 57
1782 57 -153 123 238 -178 -95 241 -107 264 118 23 359 -4 70 -198 344 76 63 14 -111 -207 -51 213
1804 213 -63 72 -249 -361 198 8 -120 34 300 81 -3 347 -191 -257 47 -106 -129 -1 14 -189 -234 8
1826 8 -135 2 51 -121 127 -113 -148 194 304 -155 139 97 192 59 112 155 245 11 8 -106 -88 -189 -305 22
1850 22 -210 -66 253 -89 -248 185 -127 -4 -179 172 -64 81 -9 274 -40 210 248 205 -148 175 213 -151
1872 -151 -74 -265 143 -75 -104 71 -113 51 -78 3 166 -235 230 32 -86 -17 2 -130 60 294 144 167
1894 167 -255 -201 -282 -41 -81 40 -190 -145 -224 -80 -175 13 30 166 141 12 138 -3 125 234 26 149 128
1917 128 155 -70 -2 -38 10 -11 -117 -133 -150 -102 -88 -45 126 -116 -126 145 62 53 -71 -50 62 137 210 -156 177 8
1943 8 -12 -166 -58 123 88 -142 -127 -149 -149 -233 -95 188 2 -59 -30 85 246 -22 127 65 -82 -70 127 122 175
1968 175 -50 -281 84 -481 -3 64 -62 7 -28 -23 -127 23 131 1 148 406 21 -26 360 -129 17 209
1990 209 -141 255 49 -146 -140 -104 88 -210 -183 -503 -295 84 -52 -240 58 -111 68 23 102 112 230 86
2012 86 376 -12 -23 17 57 132 -184 -240 -19 -72 -354 -89 -252 -114 116 -210 10 -178 103 28 115 -37 8
2035 8 106 70 105 123 -15 122 4 -78 -109 -350 -167 -58 -158 -4 -19 -175 22 -114 -257 -90 -173 -69 68
2058 68 18 189 172 112 -9 133 -127 51 19 181 -225 23 -39 -6 -166 286 -151 -120 -39 -18 278 -84 207
2081 207 72 5 48 -109 -16 241 -158 -105 79 -99 -61 31 -73 83 -11 48 85 193 -201 -199 -155 114 -411 270
2105 270 -134 -289 0 -65 156 211 17 -138 170 164 13 26 51 110 60 163 -142 -342 -102 -79 -99 70 233
2128 233 28 -151 -304 -99 123 339 109 -40 234 36 -24 127 213 -159 -169 216 -140 -106 -75 98 -41 -278
2150 -278 62 11 121 -211 -217 -116 -119 7 90 -118 219 250 130 -185 163 112 -186 -100 73 269 318 -6 -121
2173 -121 203 -66 -134 -8 -163 123 187 -56 166 200 -68 -278 284 46 34 53 157 74 289 -32 -244 279
2195 279 43 -131 -7 -19 -211 182 -286 -209 35 47 -128 -114 278 70 -335 -5 516 88 -106 14 188
2216 188 76 -88 204 91 -165 -157 282 145 -79 -207 6 8 224 30 -280 -46 46 -6 106 -108 179 -87
2238 -87 5 -70 -109 174 -7 142 -48 122 -144 107 12 73 -157 47 -259 16 -169 142 275 27 -97 86
2260 86 274 128 265 -37 -6 16 -93 -47 85 177 4 -358 67 -157 -271 163 -156 -243 31 -144 -167 -52
2282 -52 168 -132 -88 59 -68 137 237 83 -117 -44 -122 -105 185 -45 -168 -156 192 -217 116 -59 -326 -1
2304 -1 97 -16 296 -6 -39 172 -192 -132 67 206 -78 221 -138 -33 -51 220 -22 -214 100 166 96 -108 182
2327 182 -141 240 111 -82 46 32 -51 202 148 -71 -12 127 199 -34 -18 -138 -60 -49 -116 -70 -22 185 173 19
2351 19 -67 212 62 -125 63 -73 448 -116 -42 68 99 -111 31 -34 -240 -80 -92 23 -170 159 -187 -148
2373 -148 117 96 -286 -42 -79 -7 194 347 61 -104 15 243 -80 143 -56 95 80 -306 -265 -261 138 -242
2395 -242 -53 51 -29 -145 82 201 25 121 10 -4 182 4 9 106 56 26 131 -12 100 228 6 -77 -14
2418 -14 -6 -113 -54 47 31 7 -363 84 55 -254 119 64 24 -49 -3 17 356 -6 -66 10 -63 -43 -131 28 -424 -110
2444 -110 -66 49 -322 -271 -143 -180 180 47 -123 -126 -14 134 -9 108 -126 -121 -201 234 -296 182 17 -11 -233
2467 -233 -65 91 -41 -32 10 225 -226 57 -158 -84 -232 -150 16 75 -133 101 118 -49 -8 239 -53 -122 201
2490 201 130 190 -363 -243 -23 -119 45 -21 -215 157 -209 -112 94 -33 123 82 -70 -103 2 -124 2 -46 148
2513 148 -59 11 79 78 362 -171 -17 113 -269 -172 138 6 -99 -104 240 -93 -122 141 184 6 -189 162 118
2536 118 24 -7 -24 53 82 16 -119 29 0 110 197 -23 -232 153 197 139 -5 -78 -212 -106 162 -35 2 77
2560 77 15 14 165 28 -83 -134 52 88 -32 -172 -104 7 214 33 -167 -293 218 83 -96 149 -124 -138 -104
2583 -104 14 -135 -106 -144 15 130 -77 -45 34 188 180 -159 -95 -32 -110 142 210 2 161 85 -135 -89 -159 -278
2607 -278 -7 -16 5 -150 68 13 175 94 -228 1 -177 -158 9 121 -27 -109 -279 220 113 183 134 -36 188
2630 188 -112 -80 189 41 51 -124 29 -42 162 -157 68 -76 -276 -150 24 -229 81 194 -88 -177 -53
2651 -53 -16 147 -11 70 45 142 122 2 17 206 -18 -257 24 -7 -98 120 -66 10 -6 146 59 -189 78 129
2675 129 -13 43 -198 -189 -75 -9 236 62 165 -164 136 105 124 -61 89 74 178 -80 146 105 -167 108 162
2698 162 -312 21 -24 -64 181 337 27 179 -42 -55 -3 -63 10 -2 -9 183 135 -289 -65 -163 24 286 -213 -263
2722 -263 49 -219 69 169 4 4 44 33 -31 -142 -107 68 -132 149 495 -60 -127 204 -3 -244 138 -48
2744 -48 -169 -1 35 -55 92 32 125 -84 -61 47 -33 111 -105 -276 -136 143 -53 -24 -94 -251 29 314 134
2767 134 249 -17 -126 216 -64 -46 85 75 172 -22 5 -5 -83 -65 -224 110 220 79 -70 -170 -42 -140 -26
2790 -26 -31 246 72 116 -51 -110 179 -179 -57 59 -93 -24 -268 150 71 169 13 -40 -112 -155 14 -189 76 -11
2814 -11 60 103 106 -157 18 158 -174 68 115 -303 -140 -6 -24 95 -112 39 -52 97 75 236 99 -162 -131
2837 -131 -60 -170 -75 45 -22 80 -9 223 17 32 -120 -115 216 152 -59 54 -127 68 -212 -22 50 362 -183
2860 -183 148 35 31 8 -128 -217 -154 -95 10 -251 198 177 85 115 110 181 -5 49 -23 -17 289 -288 242 170 -310 -153
2886 -153 -128 22 -155 -238 42 -22 158 -44 -136 -153 -98 6 -126 234 -318 -51 -30 70 118 123 -71 27 17 -32
2910 -32 -53 132 0 118 -206 -97 -142 5 3 60 -151 -281 26 209 -201 -75 -176 -262 -190 -138 106 157 -144
2933 -144 112 139 -1 -67 -332 -42 -46 183 122 31 22 358 -131 -89 204 171 20 35 -119 -327 35 106 91 33 17
2958 17 160 -92 86 121 -93 181 144 148 -62 14 19 -58 -40 -19 63 109 188 363 129 -2 92 -18 -173 -107 -415
2983 -415 121 -342 -43 -118 -86 -64 -14 -74 167 21 16 -179 84 -236 -142 -72 193 41 -34 -105 -146 97 161 -94
3007 -94 116 158 255 31 25 -244 75 151 86 -234 -53 -39 85 53 118 178 41 -84 -255 -220 -103 -188 41 148
3031 148 49 -60 -154 -113 -140 -35 143 53 151 206 -204 182 -14 -113 -153 -183 -180 -167 83 -170 84 94 -67 107 165
3056 165 -72 229 -99 55 -49 -345 66 -166 135 74 -285 -34 -142 -93 -174 -59 18 210 154 138 6 86
3078 86 133 -67 -24 -139 14 132 -201 -133 -192 -149 310 -30 -155 43 -216 -22 -142 111 108 158 -22 -152 -241
3101 -241 -16 103 68 253 -192 44 111 -109 178 -14 -95 -117 92 -382 -26 -214 288 132 143 36 20 -196
3123 -196 -58 169 113 -216 -78 12 -57 -40 68 154 107 -76 251 -217 -78 -68 -136 36 54 78 280 -100 159
3146 159 49 -13 2 80 -101 -254 237 -81 -78 48 88 -15 -58 48 -13 189 19 -287 -100 38 2 -365 -133
3169 -133 194 -117 -59 -4 -66 -150 134 -241 155 115 -189 -135 -301 -62 146 -127 186 -5 -53 -304 140 55 204
3192 204 44 54 -109 97 -125 -126 -119 111 -156 -166 4 -93 121 104 18 -84 140 -150 90 -379 -206 220 -131
3215 -131 82 -23 -295 -210 104 206 90 -125 117 278 91 -103 -67 -199 49 92 218 -92 -45 182 -130
3236 -130 -173 -356 -61 -24 316 54 -158 -160 -191 68 169 52 17 -102 97 -92 120 74 -49 32 37 -10 -3 -14 -71
3261 -71 69 206 153 14 -110 57 -101 67 -240 -74 -35 -73 -42 32 -144 45 -23 -4 187 114 30 64 -48 -2
3285 -2 -94 -73 458 72 183 130 -49 -225 -166 -198 -72 -92 4 -92 -15 47 22 101 -95 100 41 -6 -110 -37 -109 167
3311 167 -105 242 298 -99 -108 198 65 -11 -148 -112 -115 -35 317 -2 167 -148 -111 -108 -102 -32 -151 70 77 39 37 -78
3337 -78 -83 -148 9 52 216 -74 125 -6 200 78 30 50 3 124 7 169 -136 -71 134 78 30 -75 -14 -87
3361 -87 -63 34 -9 -473 20 -118 -70 108 165 -137 -77 78 4 19 -40 -101 -42 47 43 65 106 39 64 253 -128 24
3387 24 19 -48 -69 58 122 46 162 4 -41 -190 105 250 -102 -73 -291 -283 -45 -200 96 94 -48 268 -164 128
3411 128 -6 -128 38 -189 -310 -21 -211 -61 150 22 148 113 72 -61 18 -271 63 -82 -133 151 110 -267
3433 -267 -104 79 -22 81 -28 94 -69 99 22 -13 182 -341 -41 -12 26 3 9 11 103 -59 -82 181 -51 272
3457 272 -90 -141 -107 64 -104 -93 -280 -366 -161 -163 123 -126 -46 -29 -161 160 -123 -6 263 -17 -9 91 324
3480 324 -127 -101 -93 43 213 -9 150 8 236 -13 131 -15 50 -5 94 -104 -96 191 72 -144 37 415 -22
3503 -22 -106 -64 -52 -166 -75 249 82 175 131 221 223 86 -217 -197 91 164 -168 228 -166 36 60 -187 104 -81
3527 -81 -248 163 108 -162 58 93 149 -56 104 206 -197 -36 -145 -143 -57 87 53 171 -207 66 -11 -107 -37 145
3551 145 50 97 -175 37 -9 -127 -229 24 -59 41 112 137 -130 38 66 -125 -141 -290 33 -121 -34 34 -60 42
3575 42 -264 -168 95 -57 13 -143 140 132 18 116 -257 -66 -175 299 169 22 83 -225 145 -145 -98 15 -242
3598 -242 42 -12 204 34 -161 172 -4 94 -7 103 46 118 -126 -66 165 -217 -76 263 161 -49 -176 -296
3620 -296 -136 -167 23 242 -81 60 42 66 -6 -55 -75 -7 -16 295 -17 -261 3 -87 176 38 287 -37 -22 -70
3644 -70 -59 -106 74 -137 -219 133 -180 -11 -13 53 -131 223 -62 105 151 -169 -13 249 -64 -89 -324 161 106
3667 106 -87 18 83 -204 44 -165 -98 -114 91 128 292 202 279 -93 -181 193 -76 7 -137 57 -165 -143 -299
3690 -299 53 -56 -12 97 -219 11 1 -239 33 107 -115 121 12 -95 -22 100 -312 341 18 136 131 230
3712 230 158 266 242 242 -193 235 311 -81 -77 -138 -5 177 -58 27 115 39 -80 -130 375 -2 -92 255 54 -24 -146
3737 -146 -22 28 -37 -37 244 23 -18 -177 239 47 -155 -80 108 -124 -160 -122 9 -168 -19 40 1 44 32 21
3761 21 99 126 99 96 54 -225 103 165 -54 -170 270 168 -48 -65 -181 -9 -124 24 132 84 -45 -175 134
3784 134 91 -358 -84 135 152 -173 -94 1 -12 -202 -4 165 81 -104 110 -62 -126 112 -108 76 -60 68
3806 68 179 109 -190 189 143 -14 -86 144 191 141 84 -62 -182 -62 83 -21 281 187 50 43 7 50 146 161 -193
3831 -193 -88 20 -75 145 0 364 51 226 108 366 -17 -26 -36 30 -77 -70 -105 54 34 -96 -199 -61 102
3854 102 50 7 183 56 -60 -30 138 299 65 183 -26 141 -111 -4 -214 150 27 -233 -112 29 14
3875 14 -125 222 153 -111 -36 232 7 -87 -21 12 57 -171 -97 -3 -117 -75 214 37 -82 63 -50 -52 -126 -101 -198
3900 -198 -62 124 75 -99 -65 -114 20 -83 -60 -96 34 -29 -205 -58 113 97 5 53 -108 167 -80 337 -87
3923 -87 1 4 -100 -158 -303 -34 -140 -16 -6 -114 -121 -213 -34 -75 -89 124 -107 -126 59 181 -125 -54 -248 10
3947 10 223 180 -41 49 5 -25 104 107 -69 46 129 160 -98 -211 1 -23 -181 42 -311 102 345 -9 -123
3970 -123 132 43 -85 -196 -86 -181 -182 225 51 223 -264 -6 139 -44 -143 11 216 -157 -28 -27 -45 20 65
3993 65 153 -21 21 -66 71 69 -59 -36 244 138 -104 -164 151 227 173 21 28 -109 83 209 98 78 171 -244 -350
4018 -350 -71 -383 -145 162 91 -179 53 -175 -25 -21 -15 228 20 -93 114 -120 94 -223 -101 -124 43 102
4040 102 -124 282 63 -290 21 -190 86 -171 -2 315 79 131 81 -178 55 -90 -111 -53 -122 -138 262 405
4062 405 57 -315 106 305 -99 -11 -22 -220 -7 -12 16 -13 52 -41 88 106 -13 29 39 -89 0 93 105 251 -166
4087 -166 -118 -97 79 58 220 -81 -10 -100 -219 -80 121 168 -7 -5 -83 -34 37 -63 57 3 188 -102 44 22
4111 22 190 2 98 47 29 -181 26 -100 -302 167 95 -74 18 119 21 67 -188 -61 -78 112 116 42 -136 -192
4135 -192 -100 -8 13 105 -162 179 -6 -17 -83 -145 225 118 197 -278 -26 -183 133 -245 0 -11 0 -54 200 107
4159 107 -12 66 56 175 -165 -102 78 47 156 -239 -149 23 -222 9 327 -3 -154 -59 -175 -118 -108 -112 154
4182 154 203 -72 -198 22 -94 -117 -12 70 -114 -255 116 76 75 40 -153 -134 32 4 186 162 298 89 -96
4205 -96 93 -33 -40 -150 0 -44 306 199 14 322 231 133 -43 105 24 262 158 213 216 34 104 154 141 50 50
4230 50 77 289 301 -99 -161 111 -2 6 -58 135 -172 169 136 48 -98 -177 25 211 -376 72 -13 -1 -57 208
4254 208 209 -124 113 0 232 -24 253 -71 88 -15 141 -61 -74 -188 28 7 -279 66 -59 97 88 4
4276 4 -58 169 124 -71 149 -97 165 9 28 182 183 91 187 -96 -10 -137 -309 97 -213 -197 -103 -58 -165 26
4300 26 298 -101 103 231 153 37 113 13 175 20 109 355 -71 156 22 -35 -33 0 -139 -111 -57 238 -57
4323 -57 29 11 96 50 187 73 338 9 -93 -76 219 40 -198 -135 184 157 50 -17 -61 83 110 70 -100 60
4347 60 61 194 183 76 -84 124 -159 130 -42 112 -120 -64 24 -74 3 -169 185 -229 49 -42 -163 -72 -35 112
4371 112 -1 -16 -377 -173 56 -138 32 208 -48 -37 94 16 -36 -105 117 -175 34 403 -102 -131 -10 -305
4393 -305 -144 140 -83 -52 -63 240 52 308 -88 -33 -98 -1 188 -121 -24 44 17 114 -53 -64 73 11 -32 199
4417 199 37 -270 111 68 65 192 50 36 -164 -293 158 34 133 -114 246 -14 95 -417 -255 90 43 28
4439 28 331 26 -189 -188 -189 -63 78 339 86 -83 24 218 98 -241 -14 114 -243 81 -93 154 -273 223
4461 223 3 45 -126 154 -38 -67 -119 143 87 -66 -200 -261 -283 -213 86 -152 8 2 142 -5 -72 -202 -108 6
4485 6 72 -504 54 12 -125 -80 -281 162 165 -145 146 -72 52 52 97 -98 -1 -43 -63 88 37 -159 -149 86 -191
4510 -191 91 13 -10 244 -2 69 190 230 245 66 -46 32 175 -9 21 162 -28 -33 -277 -72 79 154 145 294
4534 294 -281 83 -266 32 -157 -3 225 2 48 -140 -130 16 106 125 -310 105 3 -247 253 -57 110
4555 110 -38 241 -73 -172 343 -25 -159 226 104 -31 61 104 -33 35 -27 -86 -152 31 -87 -140 166 82 -30
4578 -30 171 229 61 97 10 -60 -71 27 83 154 -187 -75 -177 -134 -26 240 -174 107 27 -69 -144 -171 -87 35 -23
4603 -23 34 118 104 101 -13 259 167 -99 -9 160 -8 90 107 -62 42 35 66 -98 -9 -75 -92 -92 -166 -133 -232 22 -91
4630 -91 -178 -116 4 206 -152 -79 -206 79 -270 -81 187 -77 -86 115 218 175 38 105 -73 -358 52 85 -4
4653 -4 38 -325 94 54 -264 460 -83 -147 93 -302 -120 274 137 -147 -84 174 -184 124 165 132 183 -64 148
4676 148 105 -85 141 64 86 -220 169 70 34 -152 -83 170 -168 -18 8 113 -246 -354 104 133 160 -72 -6
4699 -6 -38 161 -171 182 161 -25 -34 -217 108 162 172 -24 78 130 92 21 -67 -32 -151 160 283 167 293 -305
4723 -305 -19 219 -284 133 247 55 -93 120 100 77 -188 -45 -119 73 -198 -91 -410 95 -35 105 -48
4744 -48 -99 -86 -110 -87 24 -247 150 67 35 120 -243 30 238 193 -183 -96 178 47 262 -62 168 -29 -110 -86
4768 -86 90 -78 -26 57 94 71 150 -151 16 -172 -63 62 78 105 -16 -79 -128 22 -72 290 69 89 63 38 135
4793 135 51 -107 27 -127 71 9 -98 22 32 -39 24 25 -70 -242 41 -89 35 -210 54 -169 30 44 10
4816 10 -66 -185 24 -30 -60 -7 26 -53 -252 -17 -283 115 184 -218 17 -152 -17 45 -329 84 141 -8 -13 -269
4840 -269 -40 160 71 111 27 61 23 41 -202 -124 114 -12 -306 -18 42 102 168 2 -273 18 -145 52 -161
4863 -161 -134 -62 -155 -38 87 32 46 214 -319 -186 -113 -231 -304 -177 -98 -96 133 86 5 -67 18 -159 51 -20 137
4888 137 -62 -142 -106 -18 -62 -176 45 -14 10 -115 -77 77 75 -54 -96 -72 -246 -100 369 -62 -11 87 -109 -119 -60
4913 -60 -47 -27 123 -92 121 -164 13 -151 170 -41 -41 147 54 -131 397 -109 -205 128 255 121 -10 -37 -211
4936 -211 167 81 74 115 -255 25 166 -14 -190 26 38 -98 -92 36 143 -263 -141 -88 200 -216 -164 -40 19
4959 19 -85 182 76 119 -220 112 67 -92 -240 -20 -150 -45 100 -114 -194 -52 212 -83 55 -299 4
4980 4 -249 58 151 -23 1 110 -60 30 232 -257 -50 4 -221 134 55 73 196 93 -101 -55 54 33 62 -99
5004 -99 19 -87 68 -212 -167 -105 42 212 21 -50 23 91 113 49 162 -33 23 -238 -132 127 -28 31 43 19
5028 19 -96 -33 -118 1 -169 31 12 -19 -305 17 15 -169 98 32 -62 239 -35 -111 17 -22 -89 11 246 120
5052 120 -127 288 70 25 2 -161 48 56 39 169 -78 42 -72 19 -58 -42 -100 105 278 -56 -108 25 -158
5075 -158 33 -133 -206 73 34 -167 105 216 32 28 -125 -75 -118 -199 -8 -43 -255 -80 -139 239 174 -226 -68
5098 -68 -99 0 -136 62 146 -139 -112 -130 -132 83 146 -45 -41 -30 37 26 -61 -284 -229 -40 132 -101 23 95 162 -30
5124 -30 198 12 -76 149 4 37 17 -29 -278 188 -38 337 -188 177 57 108 -256 83 151 27 -92 -50 -126
5147 -126 -36 -20 -45 1 -137 114 91 -197 56 -58 -132 -5 -105 200 -121 -67 -59 -48 6 10 -56 77 55 210 4
5172 4 140 -38 -78 51 -5 138 -50 -149 156 38 -147 42 107 -324 -53 57 -114 -57 21 251 112 -119 -158
5195 -158 -19 253 187 119 117 -65 -119 -79 67 -333 13 -50 -46 -63 -144 -73 85 -101 -70 14 171 -80 88 -151 18
5220 18 136 -121 8 -106 22 205 1 -82 -25 -163 116 -51 104 -74 90 -15 -102 -75 -93 36 300 49
5242 49 235 -253 72 -42 113 135 -131 -6 -313 -6 141 31 52 21 176 -130 -339 29 -256 133 95 49
5264 49 -173 47 41 23 161 -159 169 -160 81 -27 -47 -49 -150 -15 33 261 28 -45 -210 -92 -39 -357 142
5287 142 -7 -11 217 -94 179 73 -47 -24 -270 26 -22 -34 -343 -199 -174 -46 247 -198 -157 59 -175 -227 -199
5310 -199 199 -201 132 2 -3 -139 153 61 153 -107 226 -84 326 -101 7 14 -70 12 -86 -138 -139 57 -183 51
5334 51 75 116 22 46 -54 86 -2 149 -121 -153 -97 -435 -108 -23 -185 38 -89 117 -23 -96 99 235 40
5357 40 -37 11 82 82 279 -252 141 -260 78 -92 -12 -126 -96 -139 107 44 -252 128 -218 -47 98 62 157 275
5381 275 41 166 -10 -22 180 -115 -168 162 25 -187 149 -117 -36 135 57 -119 -183 -346 -60 24 139 -110
5403 -110 -21 82 110 -159 248 -80 -136 -69 97 -63 -2 -104 95 217 130 -186 -81 -66 -125 -87 -173 55 -53
5426 -53 6 -149 74 48 39 108 -114 85 -89 104 -150 129 111 -111 -15 2 3 -152 -118 120 112 127 -6 -240 -165
5451 -165 -9 -18 98 -214 -180 -71 -369 66 51 -134 -251 86 61 279 167 -54 141 -145 42 54 15 -53 -225
5474 -225 -47 28 -29 -109 112 -163 70 -295 -64 -40 83 -33 18 204 -83 51 29 241 -133 5 -23 379
5496 379 64 207 -63 -188 -121 -206 123 -179 -53 28 -152 -86 -164 81 73 -42 -19 -85 83 -179 64 -21 56 -34
5520 -34 -14 -46 144 330 -173 -86 -90 314 166 -13 -175 -198 172 119 13 112 -57 49 84 -32 184 -16 -50 102
5544 102 38 -49 194 -111 -72 291 135 -49 -110 104 -154 155 -10 -90 55 242 -26 19 -143 -50 305 -167
5566 -167 312 109 -14 32 83 -50 220 -73 -295 27 -70 189 272 40 -8 12 -201 -348 8 -22 -65 -89 -10
5589 -10 -108 18 114 194 -1 18 -66 40 -16 19 -105 185 12 10 -116 24 42 -200 32 34 27 -140 -104 -49 227 -3
5615 -3 51 -76 -16 108 -162 71 74 -72 303 154 -83 -90 -99 -67 83 33 26 4 29 37 154 -102 162 326 -90 -157
5641 -157 74 -178 -67 80 -101 232 -213 -144 -47 51 14 -9 -96 193 -176 172 -237 43 212 86 116 -66
5663 -66 16 -62 36 -59 38 -95 117 99 -130 95 -75 -176 16 -165 -62 102 -19 -99 72 25 -121 -44 -2 137
5687 137 239 -328 -156 -32 61 -180 75 -154 119 -42 -137 219 279 -181 -200 139 -165 -107 5 -246 100 -6
5709 -6 -116 25 -51 101 -83 -81 -52 40 -128 -204 -36 -62 -14 60 -97 -1 -73 6 246 197 140 87 64 18 -5 62 -143
5736 -143 -161 188 35 -192 13 -13 148 341 -7 -145 13 130 -191 2 46 181 -29 134 174 -124 -93 -124
5758 -124 -36 13 -109 -42 -60 -30 101 313 11 249 34 136 -101 108 -131 215 199 -115 -197 -28 120 -113
5780 -113 122 -208 128 -17 88 -224 10 99 40 -167 38 44 -145 -182 -105 -190 99 -2 217 130 -47 -97 87
5803 87 -32 -100 -141 -44 70 -6 -26 25 -8 41 41 127 69 -33 98 71 99 -98 116 -79 310 -77 -241 208 -171
5828 -171 -63 -312 -61 59 -42 -72 110 -131 -141 60 70 -12 21 110 -12 213 22 30 -324 -129 -66 38 180
5851 180 69 -79 -12 -181 -123 -93 -36 109 215 -142 59 119 84 -66 -218 -63 79 -123 158 124 -54 190
5873 190 -119 74 -87 53 217 46 -168 182 -15 138 -114 -134 -105 54 32 -119 -41 69 77 -115 -112 -202 -95
5896 -95 -78 -40 56 203 109 -307 133 217 26 62 -103 -72 176 102 98 -5 -305 -41 137 -15 118 -226 -146 205
5920 205 4 -95 -46 -23 176 68 174 -187 153 79 11 -191 -18 -38 -64 -107 -47 145 87 -40 -23 93 23 124
5944 124 18 4 7 -86 -3 139 -75 -57 -220 -107 134 -223 58 -42 129 130 -317 62 60 -6 180 10 26 -159
5968 -159 -154 -39 -301 25 189 49 396 -257 -139 -215 160 -85 -52 142 116 15 373 -24 110 -130 65 -80
5990 -80 107 138 87 -53 193 -305 35 28 -68 -50 49 83 98 -123 104 -201 179 -79 101 -89 -181 89 -88 -45
6014 -45 183 104 -11 -28 37 -124 -107 73 112 7 -286 172 -67 -18 -155 -119 6 49 139 -87 -125 -141 -27 -24 -23
6039 -23 -72 169 357 -338 -23 -95 32 -380 -253 -89 213 -23 -110 -1 111 -162 -61 -28 -66 94 -244 63
6061 63 -233 -98 -60 106 184 -8 -214 119 120 -225 22 59 160 -185 61 89 -52 327 -96 -221 207 -125
6083 -125 -42 223 158 -131 41 -108 21 -177 153 38 -72 196 -81 -136 149 79 170 -190 -205 79 244 -255
6105 -255 113 -143 -115 -114 98 -168 52 -14 -82 -80 100 283 170 -13 -198 102 -31 250 30 42 50 157 -6
6128 -6 195 -1 -31 -105 400 81 94 30 126 -165 105 97 69 -69 51 -26 100 -41 -73 165 -151 61 101 -29
6152 -29 150 43 -61 -43 -138 -87 -69 -80 116 175 62 -49 -93 14 -47 -98 57 76 -147 -46 -120 -48 30 358 -54
6177 -54 260 37 -151 -241 42 -96 -108 -31 47 -4 -61 169 -168 205 -8 71 58 -72 166 232 59 7 -105 144
6201 144 4 180 -111 151 88 -9 86 -145 -23 -10 -231 -106 173 -156 -242 -90 45 -31 1 -259 219 -12
6223 -12 -246 11 1 57 -16 1 -105 -12 109 -143 -115 -11 100 -227 137 -97 -103 15 -18 -63 140 56 137 100 78
6248 78 18 110 -10 -27 70 -142 70 -107 -39 24 76 76 202 54 -66 -31 -15 160 -187 -85 255 -38 -150 42
6272 42 198 181 48 -182 -6 -2 168 -62 -74 -148 -15 -42 191 -223 -124 157 130 27 -150 -156 -279 62 108 -100
6296 -100 -97 -174 152 -207 72 -8 -38 97 -45 -71 215 296 -156 129 141 225 175 -77 -97 109 87 34 164 122 -153
6321 -153 109 -127 56 -25 293 223 60 -188 214 -204 -166 -46 -196 250 81 -50 137 -190 -102 56 28 108
6343 108 -316 -267 -160 -183 -1 -44 137 161 17 -118 -53 165 -65 35 344 267 18 106 -119 61 18 -73 116
6366 116 -80 86 -56 -130 187 211 111 -88 210 -233 -128 -385 47 -51 -134 -74 -14 253 -44 110 -37 -162
6388 -162 -114 392 42 50 64 -86 164 -87 63 72 186 125 -179 74 -61 -6 -130 -88 -44 -15 6 60 -65 -100 112
6413 112 -24 229 49 -55 165 99 -66 -28 86 99 116 -211 -22 102 174 -35 -122 -215 -226 64 240 -25 175
6436 175 -175 25 86 -165 -13 104 65 -94 80 76 147 16 -4 112 -106 74 94 165 162 220 -101 -181 23 136
6460 136 452 55 -34 137 0 54 -31 28 -39 194 267 -90 44 -94 -152 -182 -148 -53 -225 6 -56 -52 -26 -1 173
6485 173 -79 215 49 -300 185 -345 -10 -188 -60 129 -1 92 -156 -144 88 -153 -50 -138 63 -6 -22 292
6507 292 268 -48 144 -164 18 -39 394 -189 -202 -17 -96 -115 20 374 -85 41 35 145 -280 122 20 98 -9
6530 -9 164 -377 -148 111 143 80 -187 -32 -64 60 233 -256 88 74 -374 223 -194 -188 131 -167 -28 -31 -88 118
6554 118 157 24 30 -102 50 -209 226 -254 49 -211 -161 -70 82 -39 123 200 -66 47 -66 -195 59 -63
6576 -63 -101 116 -2 274 4 -52 -97 -62 -79 -13 -40 169 205 123 160 30 -207 -215 248 80 -67 147 169 264 53
6601 53 89 144 75 318 -55 181 -4 101 -118 -89 41 -60 62 -103 -17 141 -111 -147 21 -45 116 75 184
6624 184 79 162 52 198 -81 -187 -46 67 90 18 -21 208 -127 75 -182 -247 -253 -52 74 54 -303 18 237
6647 237 -32 82 -38 32 -22 30 180 166 115 90 41 12 -127 -36 65 14 -15 103 -136 -66 168 125 19 -169
6671 -169 26 -148 -47 -55 -106 19 -87 258 -70 134 -63 305 -224 -16 -201 -18 35 -30 161 56 139 84
6693 84 -7 -55 -88 8 -55 -18 -69 -60 -247 162 447 158 50 -59 -100 -134 -81 50 -42 -39 -166 7 -89 -216 -70 -212
6719 -212 158 9 -18 -41 184 -19 -94 -24 -5 -72 -163 150 181 -151 -68 -56 327 -57 -55 336 -216 -168 -56 -89 -36
6744 -36 -7 -118 -86 -96 -155 55 -7 -116 -44 -468 -66 12 18 -116 -23 -230 -356 75 99 70 -194 239 118 64 -225
6769 -225 16 -336 -54 133 -236 36 0 163 136 -47 -61 -120 -17 -16 206 -130 79 -180 -223 -136 -58 -82 178
6792 178 -15 -8 -171 -31 161 35 -278 -208 -233 -32 -79 245 -22 -196 120 -163 -37 -250 -227 102 219 110
6814 110 -201 -277 -159 -182 -80 142 -183 -36 -30 -99 95 8 -94 165 179 261 -101 118 -209 -51 161 -67 19
6837 19 344 -114 -133 1 24 -124 49 13 -275 -74 -29 102 101 -65 -115 5 -50 -11 -29 58 43 62 189 -56 -80
6862 -80 201 -70 -168 -201 -53 -250 66 96 222 215 37 29 -106 -7 110 76 16 210 87 -26 -33 136 -40 -60 -178
6887 -178 -75 152 -104 -297 -172 -263 -23 -102 -79 -160 173 -8 -1 288 -28 -85 126 217 94 -78 81 29 -80
6910 -80 45 7 214 116 201 46 -123 86 3 -155 208 10 95 25 -174 209 -99 -59 -166 -75 -47 30 -28 2
6934 2 -4 -41 47 -42 -17 -172 91 221 -104 -217 7 302 232 318 122 39 -173 -118 -146 -34 142 5 263 -12
6958 -12 59 23 102 22 262 -255 -4 168 -93 79 8 73 -116 19 -198 14 150 118 37 -115 104 44 -185
6981 -185 224 19 161 -131 -41 -114 -46 -101 -235 36 124 -152 106 -146 -196 -29 -75 49 326 73 -2 38 162
7004 162 228 -75 173 60 -51 158 139 4 182 -45 38 110 135 15 101 168 -109 137 199 -14 -271 68 11
7027 11 -113 115 5 156 99 127 -39 118 -378 155 96 -143 -123 -89 80 -145 -89 -111 36 444 -14 107 -87
7050 -87 0 -99 -233 -230 -38 29 120 49 -101 43 -184 250 69 1 -171 147 117 -62 -114 -15 -351 180 -93 -181
7074 -181 -94 -175 54 -81 101 44 113 99 -116 -223 -10 -29 -146 105 19 35 215 142 -69 231 -31 147 221
7097 221 -107 23 -193 2 132 21 -170 60 -41 -88 -261 27 -161 165 55 -141 -10 -88 -100 -34 -100 78
7119 78 18 73 143 24 267 -97 -109 -240 101 -89 95 22 282 -101 -158 178 -6 82 -172 -45 233 -200 -15
7142 -15 167 -268 -230 -99 -2 -16 118 125 145 -159 -85 43 -174 2 -27 125 -46 -73 -6 27 -371 204 126 -17
7166 -17 -78 -49 -9 37 14 -254 13 -30 -58 -92 -9 39 46 47 88 -52 23 97 -287 -108 -52 152 370 221 57 306
7192 306 -39 136 144 -100 -28 120 -28 -160 -284 -72 46 -54 113 106 -211 188 3 194 30 219 66 -134
7214 -134 -6 324 -59 -161 184 127 66 26 181 297 -15 -82 -165 -116 -175 190 115 -84 54 -231 -243 26 17 -328
7238 -328 -127 -117 -161 -156 -169 122 -76 -156 309 -307 -94 -111 271 -31 25 157 -125 -326 -190 -338 -245 45 3
7261 3 62 -40 89 -205 -109 20 300 -92 -201 59 -140 194 257 -34 -17 92 -79 -160 129 157 -41 -143 -201
7284 -201 -224 -4 -30 -186 -189 -57 -85 -44 -79 128 -32 -28 142 294 -87 -16 6 -146 44 215 -30 -13 -193 -136
7308 -136 151 2 97 229 274 -189 154 -157 -262 39 206 -122 95 67 201 91 0 2 24 -44 -33 -112 -114 103
7332 103 328 276 -26 -41 65 16 131 21 -9 -128 108 123 -95 94 -39 -211 -103 19 117 67 -264 142
7354 142 127 122 -112 -39 -7 -402 23 -195 -30 -11 161 -125 -30 -272 -6 222 43 22 -32 -36 -7 289 -2 -99
7378 -99 -159 -64 145 54 104 118 21 2 85 -135 -134 -51 53 306 -143 137 -90 -41 -159 -20 -62 -36 -136 -40 -32 -190
7404 -190 34 -53 -124 -146 -208 -95 -280 -61 64 173 14 158 -103 183 133 -192 -212 233 92 -158 -52 -48 -70
7427 -70 26 157 30 -101 -189 -239 46 113 -148 -19 67 -43 5 121 165 -35 -34 -25 -72 128 -133 69 -184 -159 -52
7452 -52 -65 63 152 21 -57 -72 -116 82 -253 -98 -231 -337 -165 -41 -20 -135 79 -241 75 25 68 -162 -13
7475 -13 167 213 70 -49 140 1 181 132 218 -10 -288 72 -90 -168 88 188 267 141 30 51 193 144 -247
7498 -247 235 -146 71 107 76 -136 -121 104 -56 -172 31 -85 -34 -148 -25 -132 81 108 182 -71 -123 74
7520 74 186 155 -240 -69 -110 -13 63 118 -113 -238 88 125 102 -168 -62 168 162 17 -33 -122 24 -36 76 30 -332
7545 -332 160 -25 -70 190 15 60 108 -25 -150 -182 66 10 130 69 80 11 230 123 38 -134 -14 129 -37
7568 -37 20 -14 -101 223 51 20 -143 76 -93 -1 -32 -131 -61 -127 96 36 -103 174 -49 182 141 216 169 75 162
7593 162 91 80 -40 120 -212 73 -114 -1 -207 40 -303 91 -73 210 36 -86 -180 -98 55 -13 143 -28
7615 -28 246 -78 -131 -67 -95 101 155 203 -4 -251 -42 25 85 -182 184 -124 172 19 152 51 81 159 182 -189
7639 -189 -55 -309 22 -70 157 83 -44 150 10 105 -21 -96 -75 -265 -211 -54 136 -303 50 44 -78 -210 398
7662 398 172 -40 10 -5 70 -163 20 129 117 43 108 257 148 12 -3 199 43 43 -157 45 -35 128 237
7685 237 -212 16 13 -80 -37 178 14 -10 -87 -75 -91 1 133 19 88 198 -12 -132 20 -29 -72 -252 -90 -17
7709 -17 -134 -21 -84 -68 5 -120 -117 -56 -239 -121 -23 239 8 54 -71 31 -139 -139 -8 -54 -18 -90 44 55 -84
7734 -84 -70 -62 191 -26 210 140 33 13 -9 172 -71 -282 159 -168 79 138 -137 165 28 -156 -81 67 -47
7757 -47 127 25 -186 -129 169 19 162 28 -163 207 158 -141 3 -61 223 -58 51 132 162 26 100 -36
7779 -36 93 25 109 -143 -204 -84 -92 160 182 12 -40 104 -36 109 -259 -188 303 -95 116 -245 212 197 -66
7802 -66 80 -64 -135 -4 80 -187 -189 35 -2 -52 -37 17 133 253 30 281 75 337 -51 43 167 110 -62 -21
7826 -21 -213 16 -2 -41 131 107 147 -162 156 -135 87 -53 64 266 -183 -7 299 -235 206 192 14 -115
7848 -115 -2 -93 -78 149 149 115 -48 175 172 23 74 -119 -56 21 16 175 -70 -231 -153 -73 29 45 61 -107 -167 -66
7874 -66 -201 -114 -18 178 121 -53 -133 277 -49 54 16 -95 206 41 9 -16 -140 -38 127 -101 83 30 21 -58
7898 -58 270 -83 -83 83 243 -100 -2 120 90 -83 48 -232 -171 83 1 43 139 62 157 -103 151 229 63 -69
7922 -69 -129 131 288 92 -113 -250 61 103 -50 -15 248 85 -6 5 -166 -204 -56 -41 82 267 69 260 144
7945 144 244 258 -84 -278 52 -244 216 -156 -50 -46 28 63 -114 -16 -7 149 35 173 147 38 181 -130 -237
7968 -237 82 99 -6 -118 -72 110 17 62 -169 -46 77 -119 311 -63 -163 47 -194 -18 -112 37 -62 21
7990 21 -66 160 -240 -92 -142 212 270 -196 113 154 -164 19 -133 -59 94 -258 144 165 -245 -12 67 -155 -135
8013 -135 108 -372 85 40 -11 134 7 -227 127 -106 26 -25 -42 -47 -197 -185 10 10 -49 -53 21 177 18 139
8037 139 -142 122 47 51 44 -48 -48 -101 186 80 92 71 -184 38 12 -58 84 23 -122 -40 2 77 -102 328 53 -76
8063 -76 99 216 108 -197 207 -319 -109 -24 117 -34 -53 -141 49 -62 9 -111 61 197 11 -59 -103 312
8085 312 -186 163 -214 46 -224 316 110 -75 179 -95 19 54 -59 -161 86 39 -41 -84 -239 -78 161
8106 161 121 20 -112 -262 19 59 -65 58 -108 94 164 8 17 66 -148 -51 97 135 11 23 -9 -212 21
8129 21 43 -82 -137 -19 -4 131 124 43 108 -205 -175 178 -32 119 -40 63 -57 -155 -2 -6 -277 21 67 -132
8153 -132 -154 85 -65 195 93 33 140 112 -202 157 122 -70 242 -83 -46 46 -108 -23 145 89 -133 -166 -273
8176 -273 -41 138 -41 -163 -337 -279 26 9 161 26 167 -44 -25 242 -156
8191a56
##END NTUPLES=NMR FID
##END=
