##TITLE=1H_CA-8559-pc
 CDCl3, 8 sc, 
 4.2.2019
##JCAMPDX= 6.0         $$ Bruker NMR JCAMP-DX V2.0
##DATA TYPE= NMR FID
##DATA CLASS= NTUPLES
##ORIGIN= UXNMR, Bruker Analytische Messtechnik GmbH
##OWNER= root
$$ XWIN-NMR		Version 3.5
$$ Mon Feb  4 13:59:57 2019 Russian Standard Time (UT+4h)  she@DPX200
##.OBSERVE FREQUENCY= 200.1313
##.OBSERVE NUCLEUS= ^1H
##.DELAY= (6, 6)
##.ACQUISITION MODE= SIMULTANEOUS
##.ACQUISITION SCHEME= undefined
##.AVERAGES= 8
##.DIGITISER RES= 18
##SPECTROMETER/DATA SYSTEM= spect
##.PULSE SEQUENCE= zg30
##.SOLVENT NAME= CDCl3
##.SHIFT REFERENCE= (INTERNAL, CDCl3, 0, 15.7039)
##AUDIT TRAIL= $$ (NUMBER, WHEN, WHO, WHERE, WHAT)
$$ ##TITLE= Audit trail, XWIN-NMR		Version 3.5
$$ ##JCAMPDX= 5.01
$$ ##ORIGIN= Bruker BioSpin GmbH
$$ ##OWNER= she
$$ F:/spectra/data/she/nmr/H-F/1/audita.txt
$$ ##AUDIT TRAIL=  $$ (NUMBER, WHEN, WHO, WHERE, WHAT)
(   1,<2019-02-04 13:57:14.39 +0400>,<she>,<DPX200>,
      <created by zg, POWCHK disabled, PULCHK disabled
       configuration hash MD5:
       00 E9 B6 7A A2 85 ED C7 34 08 36 98 17 FE 4E 26
       data hash MD5: 16K
       06 42 8C F0 C6 89 89 DE 5A 75 C5 FA DB 06 65 54>)
$$ ##END=
$$ 
$$ hash MD5
$$ 06 49 B6 A7 24 12 22 BC 4F 1E 34 76 C6 DB BF 5A
##$RELAX= 
##$RELAX= 
##$RELAX= 
##$RELAX= 
##$RELAX= 
##$RELAX= 
$$ Bruker specific parameters
$$ --------------------------
##$DU= <F:/spectra>
##$EXPNO= 1
##$NAME= <H-F>
##$PROCNO= 1
##$TYPE= <nmr>
##$USER= <she>
##$AMP= (0..31)
100 100 100 100 100 100 100 100 100 100 100 100 100 100 100 100 100 100 
100 100 100 100 100 100 100 100 100 100 100 100 100 100 
##$AQSEQ= 0
##$AQ_mod= 1
##$AUNM= <au_zg>
##$AUTOPOS= <>
##$BF1= 200.13
##$BF2= 200.13
##$BF3= 200.13
##$BF4= 200.13
##$BF5= 200.13
##$BF6= 200.13
##$BF7= 200.13
##$BF8= 200.13
##$BYTORDA= 1
##$CFDGTYP= 0
##$CFRGTYP= 5
##$CHEMSTR= <none>
##$CNST= (0..31)
1 1 145 1 1 1 1 1 1 1 1 1 1 1 1 1 1 1 1 1 1 1 1 1 1 1 1 1 1 1 1 1 
##$CPDPRG= <>
##$CPDPRG1= <>
##$CPDPRG2= <>
##$CPDPRG3= <>
##$CPDPRG4= <mlev>
##$CPDPRG5= <mlev>
##$CPDPRG6= <mlev>
##$CPDPRG7= <mlev>
##$CPDPRG8= <mlev>
##$CPDPRGB= <>
##$CPDPRGT= <>
##$D= (0..31)
0 1.2 0 0 0 0 0 0 0 0 0 0.03 0 0 0 0 0 0 0 0 0 0 0 0 0 0 0 0 0 0 0 0 
##$DATE= 1549274233
##$DBL= (0..7)
120 120 120 120 120 120 120 120 
##$DBP= (0..7)
150 150 150 150 150 150 150 150 
##$DBP07= 0
##$DBPNAM0= <>
##$DBPNAM1= <>
##$DBPNAM2= <>
##$DBPNAM3= <>
##$DBPNAM4= <>
##$DBPNAM5= <>
##$DBPNAM6= <>
##$DBPNAM7= <>
##$DBPOAL= (0..7)
0.5 0.5 0.5 0.5 0.5 0.5 0.5 0.5 
##$DBPOFFS= (0..7)
0 0 0 0 0 0 0 0 
##$DE= 6
##$DECBNUC= <off>
##$DECIM= 32
##$DECNUC= <off>
##$DECSTAT= 4
##$DIGMOD= 1
##$DIGTYP= 9
##$DL= (0..7)
0 120 120 120 120 120 120 120 
##$DP= (0..7)
150 150 150 150 150 150 150 150 
##$DP07= 0
##$DPNAME0= <>
##$DPNAME1= <>
##$DPNAME2= <>
##$DPNAME3= <>
##$DPNAME4= <>
##$DPNAME5= <>
##$DPNAME6= <>
##$DPNAME7= <>
##$DPOAL= (0..7)
0.5 0.5 0.5 0.5 0.5 0.5 0.5 0.5 
##$DPOFFS= (0..7)
0 0 0 0 0 0 0 0 
##$DQDMODE= 0
##$DR= 18
##$DS= 0
##$DSLIST= <SSSSSSSSSSSSSSS>
##$DSPFIRM= 0
$$ [...]
##$SUBNAM2= <"">
##$SUBNAM3= <"">
##$SUBNAM4= <"">
##$SUBNAM5= <"">
##$SUBNAM6= <"">
##$SUBNAM7= <"">
##$SUBNAM8= <"">
##$SUBNAM9= <"">
##$SW= 20.0189088683792
##$SWIBOX= (0..15)
0 0 2 0 0 0 0 0 0 0 0 0 0 0 0 0 
##$SW_h= 4006.41025641026
##$TD= 16384
##$TD0= 1
##$TE= 0
##$TE2= 300
##$TE3= 300
##$TEG= 300
##$TL= (0..7)
0 120 120 120 120 120 120 120 
##$TP= (0..7)
150 150 150 150 150 150 150 150 
##$TP07= 0
##$TPNAME0= <>
##$TPNAME1= <>
##$TPNAME2= <>
##$TPNAME3= <>
##$TPNAME4= <>
##$TPNAME5= <>
##$TPNAME6= <>
##$TPNAME7= <>
##$TPOAL= (0..7)
0.5 0.5 0.5 0.5 0.5 0.5 0.5 0.5 
##$TPOFFS= (0..7)
0 0 0 0 0 0 0 0 
##$TUNHIN= 0
##$TUNHOUT= 0
##$TUNXOUT= 0
##$USERA1= <user>
##$USERA2= <user>
##$USERA3= <user>
##$USERA4= <user>
##$USERA5= <user>
##$V9= 5
##$VALIST= <valist>
##$VCLIST= <CCCCCCCCCCCCCCC>
##$VD= 0
##$VDLIST= <DDDDDDDDDDDDDDD>
##$VPLIST= <PPPPPPPPPPPPPPP>
##$VTLIST= <TTTTTTTTTTTTTTT>
##$WBST= 1024
##$WBSW= 4
##$XGAIN= (0..3)
0 0 0 0 
##$XL= 0
##$YL= 0
##$YMAX_a= 547634
##$YMIN_a= -616605
##$ZGOPTNS= <>
##$ZL1= 120
##$ZL2= 120
##$ZL3= 120
##$ZL4= 120
##$ABSF1= 10
##$ABSF2= 0
##$ABSG= 5
##$ABSL= 3
##$ALPHA= 0
##$AQORDER= 0
##$ASSFAC= 0
##$ASSFACI= 0
##$ASSFACX= 0
##$ASSWID= 0
##$AUNMP= <proc_1d>
##$AZFE= 0.1
##$AZFW= 0.1
##$BCFW= 1
##$BC_mod= 2
##$BYTORDP= 1
##$COROFFS= 0
##$CY= 11.3945322036743
##$DATMOD= 1
##$DC= 2
##$DFILT= <>
##$DTYPP= 0
##$F1P= 18.9103706918063
##$F2P= -1.10871071338519
##$FCOR= 0.5
##$FTSIZE= 0
##$FT_mod= 4
##$GAMMA= 1
##$GB= 0.15
##$INTBC= 1
##$INTSCL= 1
##$ISEN= 128
##$LB= 0.24
##$LEV0= 0
##$LPBIN= 0
##$MAXI= 10000
##$MC2= 0
##$MEAN= 0
##$ME_mod= 0
##$MI= 1.114404
##$NCOEF= 0
##$NC_proc= 0
##$NLEV= 6
##$NOISF1= 3.799351
##$NOISF2= 2.8
##$NSP= 1
##$NTH_PI= 0
##$NZP= 0
##$OFFSET= 15.70392
##$PC= 1
##$PHC0= -9026.995
##$PHC1= 14.60004
##$PH_mod= 1
##$PKNL= yes
##$PPARMOD= 0
##$PSCAL= 0
##$PSIGN= 0
##$REVERSE= no
##$SF= 200.130013532006
##$SI= 16384
##$SIGF1= 3
##$SIGF2= 2
##$SINO= 400
##$SIOLD= 16384
##$SREGLST= <1H.CDCl3>
##$SSB= 0
##$STSI= 0
##$STSR= 0
##$SW_p= 3612.71676300578
##$SYMM= 0
##$S_DEV= 0
##$TDeff= 0
##$TDoff= 0
##$TI= <>
##$TILT= no
##$TM1= 0
##$TM2= 0
##$TOPLEV= 0
##$USERP1= <user>
##$USERP2= <user>
##$USERP3= <user>
##$USERP4= <user>
##$USERP5= <user>
##$WDW= 1
##$XDIM= 8192
##$YMAX_p= 0
##$YMIN_p= 0
$$ End of Bruker specific parameters
$$ ---------------------------------
##NTUPLES= NMR FID
##VAR_NAME=  TIME,          FID/REAL,        FID/IMAG
##SYMBOL=    X,             R,               I
##VAR_TYPE=  INDEPENDENT,   DEPENDENT,       DEPENDENT
##VAR_FORM=  AFFN,          ASDF,            ASDF
##VAR_DIM=   8192,          8192,            8192
##UNITS=     SECONDS,       ARBITRARY UNITS, ARBITRARY UNITS
##FACTOR=    0.0002496,     1,               1
##FIRST=     0,             0,               0
##LAST=      2.0444736,     0,               0
##MIN=       0,             -616605,         0
##MAX=       2.0444736,     547634,          0
$$ Real data points
##PAGE= N=1
##DATA TABLE= (X++(R..R)), XYDATA
$$ [...]
3574G225N732j1346j3728K436J5312P692r913j4568K26J4442R678p905j5414j785
$$ 7225 12957 1611 -12117 -9681 5631 13323 3410 -11158 -10932 3510 13188 5283 -10131 -11916
3588a1916J3912J0805n880j5069m406J2414J2808l966j5481o133J1039J3585j732
$$ -11916 1996 12801 6921 -8148 -12554 -140 12668 8702 -6779 -12912 -1873 11712 9980
3601I980j5315p885R691J4227j30j3944j0022P450J5148K405j3121j1242N567
$$ 9980 -5335 -13220 -3529 10698 10568 -3376 -13398 -5948 9200 11605 -1516 -12758 -7191
3614g191J4888N075j2011j2882L896J5112O122j0382j3640J378J4253Q454r209
$$ -7191 7697 12772 761 -12121 -8225 6887 13009 2627 -11013 -9635 4618 13072 3863
3627C863j4133n18J3231R968o586j4980l052J3096J1535n278j4570m833J1157
$$ 3863 -10270 -10788 2443 12411 5825 -9155 -12207 889 12424 7146 -7424 -12257 -1100
3640a100J3201l177j4834o489R775J3514p50j4211q527Q286J3946J513j3290j0450
$$ -1100 12101 8924 -5910 -12399 -2624 10890 10140 -4071 -12598 -4312 9634 11147 -2143 -12593
3654a2593O501J4302L357j2413j1494M635J4290N575j0704j2854K348J4194P424
$$ -12593 -6092 8210 11567 -846 -12340 -7705 6585 12160 1456 -11398 -9050 5144 12568
3667A2568r168j3536J72J3491Q768p310j4196j329J2099J0350n391j4526l841
$$ 12568 3400 -10136 -9964 3527 12295 4985 -9211 -10540 1559 11909 6518 -8008 -11849
3680a1849J1570J1738l972j3832o164J0657J2450j756j3206p623Q589J3232P98
$$ -11849 -279 11459 7487 -6345 -12509 -1852 10598 8842 -4364 -11987 -3398 9834 10632
3693A0632j3280r579P107J3767K315j1872j0701M930J3806M547j1420j1481L332
$$ 10632 -2648 -12227 -5120 8647 10962 -910 -11611 -6681 7125 11672 252 -11229 -7897
3706g897J3582O294r700j2598R54J3736P372p724j3345q50J2664R404o263j3768
$$ -7897 5685 11979 2279 -10319 -9365 4371 11743 4019 -9326 -10176 2488 11892 5629 -8139
3720h139k252J1202J0428m307j3991m471J0584J1540k718j3054p078R353J3131
$$ -8139 -10391 811 11239 6932 -7059 -11530 -946 10594 7876 -5178 -12256 -2903 10228
3733A0228j113j3035p966P836J2902J345j2094r578O041J3373K773j0901j0693
$$ 10228 9115 -3920 -11886 -4050 8852 10197 -1897 -11475 -5434 7939 10712 -189 -10882
3746a0882L675J3718N019j0226j1928K458J2999O834q469j3021K84J2683Q249
$$ -10882 -7207 6511 11530 1304 -10624 -8166 4833 11667 3198 -9823 -9539 3144 11393
3759A1393o680j3394j538J1960R783n336j3378l674J0741J0883l159j3306n490
$$ 11393 4713 -8681 -10219 1741 11524 6188 -7190 -10864 -123 10760 7601 -5705 -11195
3772a1195R635J1548j865j2792o597Q096J2670j37j2329q274O692J2403K548j1776
$$ -11195 -1560 9988 8123 -4669 -11266 -3170 9500 9363 -2966 -11240 -4548 7855 10403 -1373
3786a373r679M612J3037M396j0418j0774K748J2970N773q896j1797R79J2395P294
$$ -1373 -11052 -6440 6597 10993 575 -10199 -7451 5519 11292 2396 -9401 -8422 3973 11267
3800A1267p578j2339q79J1720Q860o095j2472k984J1333R900m511j2835m020R723
$$ 11267 3689 -8650 -9529 2191 11051 4956 -7516 -10500 833 10733 6222 -6613 -10633 -910
3814i10J1219k475j3036n937R123J1327n74j1925p813O814J2396J107j1441q656
$$ -910 10309 7834 -5202 -11139 -2016 9311 8737 -3188 -11001 -4187 8209 9316 -2125 -10781
3828a0781N365J2813K713j1031r869M324J2222M466q955j1021J999J2514O123
$$ -10781 -5416 7397 10110 -921 -10790 -6466 5756 10222 1267 -9754 -7755 4759 10882
3841A0882q299j1542J81J1828P994o992j2339j369J1453Q952n124j2298l672J0186
$$ 10882 2583 -8959 -8778 3050 11044 4052 -8287 -9656 1797 10749 5625 -6673 -10345 -159
3855a59J0283l345j2414m930Q755J1155j458j2317o072P475J1961j37j1227q024
$$ -159 10124 6779 -5635 -10565 -1810 9345 7887 -4430 -10502 -3027 8934 8797 -2430 -10454
3869a0454N886J2133K034j0754r054M651J1715M071r913j0509K928J2479N276
$$ -10454 -4568 7565 9599 -1155 -10209 -5558 6157 10228 315 -10194 -7266 5213 10489
3882A0489q772j0921J107J1703O976p228j1688n04J1161Q133n521j1875k179J0085
$$ 10489 1717 -9204 -8097 3606 10582 3354 -8334 -8838 2323 10456 4935 -6940 -9119 966
3896I66Q833l882j1978l964R592R895k606j1794n067P642J0933l83j1722o878
$$ 966 9799 5917 -6061 -10025 -433 9462 6856 -4938 -10005 -2363 8570 8187 -3535 -10413
3910a0413O870J1313J023j0298q729N224J1984K754r983r245L301J1905M045q675
$$ -10413 -3543 7770 8793 -1505 -10234 -5010 6974 9728 -255 -9500 -6199 5706 9751 1076
3924A076j0228J816J1533N539p177j1109K08J1308O965o259j1147j321J0107Q585
$$ 1076 -9152 -7336 4197 9736 2559 -8550 -8342 2966 9931 3672 -7475 -8796 1311 9896
3938I896m586j1602l124R776R130l156j1256m909Q536J0098j907j1149n615P038
$$ 9896 5310 -6292 -9416 360 9490 6334 -4922 -9831 -1295 8803 6896 -4253 -9868 -2830
3952b830J0871Q2j0637p308N728J1042J604j0054q073M316J1153L640r495r098
$$ -2830 8041 8123 -2514 -9822 -4094 6948 8552 -1502 -9575 -5259 5894 9534 39 -9059
3966i059K769J1428M556p854j0520J236J1079N987o627j0787m87J0730P439n639
$$ -9059 -6290 5138 9694 1840 -8680 -7444 3635 9622 2995 -7792 -8279 2451 9890 4251
3980D251j1012k347R659Q848l666j1559l484Q633R483k029j0897n641P809J0390
$$ 4251 -6761 -9108 551 9399 5733 -5826 -9310 -677 8806 6777 -4120 -9761 -1952 8438
3994H438q83j0627o496O099J0787J037j0452p565N096J0839K701r512q962L617
$$ 8438 7555 -3072 -9568 -3469 7318 8355 -2097 -9662 -4566 6273 8974 -538 -9500 -5883
4008e883J1199L786q192r279J765J0728N423p284j0103M93J0198O405n588j0730
$$ -5883 5316 9102 910 -8369 -6604 4124 9547 2263 -7840 -7347 2851 9256 3668 -7062
4022g062j162R567Q043m721j0834k646Q887Q874l194j1080l972Q111R711j989
$$ -7062 -8224 1343 9386 4665 -6169 -8815 72 8946 5752 -5328 -9300 -1189 8522 6533
4036F533r962o022O932J0210q5r823o748N391J0165J533r360p724M154J0521K935
$$ 6533 -3429 -9451 -2519 7691 7606 -2217 -8965 -3574 6591 8124 -1236 -8960 -4806 5715 8650
4051H650q409q907K544J0798M121p395r475R73J0589N708o659r793j40R476P103
$$ 8650 241 -8666 -6122 4676 8797 1402 -8073 -7100 3489 9197 2538 -7255 -7395 2081 9184
4066I184m833j0653j986R240P902l912j0427l042Q153Q500k610r900m469O792
$$ 9184 4351 -6302 -8288 952 8854 4942 -5485 -8527 -374 8126 5516 -4384 -8853 -2061
4080b061R690q85r825o207O410R811O23r177p191M835J0405J787q932p763L393
$$ -2061 7629 6744 -3081 -9288 -2878 6933 7556 -1621 -8812 -3977 6428 8215 -717 -8480 -5087
4095e087J0132L552p995q749K056R948M827o954r254M80R682O422n961r737p91
$$ -5087 5045 8597 602 -8147 -6091 3857 8684 1730 -7524 -7044 2638 9060 3099 -6638 -7429
4110g429Q856P305m535r813k681Q579Q182k678j0554l596P277R026j649j0208
$$ -7429 1427 8732 4197 -5616 -8297 282 8464 5786 -4768 -8364 -1087 7939 6290 -3918
4124c918m759O133R638J65r847o230N433R906J098q780p277L773J0262K653q127
$$ -3918 -8677 -2544 7094 7259 -2588 -8818 -3385 6521 7619 -1161 -8438 -4665 5597 8250 123
4139A23q284K789R789M180p448q731J285R835M801n846r256l62R165O474n117
$$ 123 -8161 -5372 4417 8597 1149 -7582 -6297 3538 8339 2493 -6763 -7125 2040 8514 3397
4154C397r554j465Q301P198l189r611l318P767Q388k058r643m616O992Q717o28
$$ 3397 -6157 -7622 679 7877 4688 -4923 -8241 -474 7914 5856 -3787 -8403 -1411 7306 6678
4169F678r656n283N788Q962O32q979o589M872R173J970p852p882L098R826L343
$$ 6678 -2978 -8261 -2473 6489 7121 -1858 -8447 -3575 5598 7568 -284 -8166 -5068 4758 8101
4184H101p291q377J993R320M457o043r344O93R176N704n472r175j021Q628O473
$$ 8101 810 -7567 -5574 3746 8203 2160 -7184 -6491 2685 8389 2917 -6258 -7279 1349 7822
4199G822l623r673j990P491P808k370r854l778P454Q084j776r125m612O099Q908
$$ 7822 4199 -5474 -7464 27 7835 5465 -4389 -8167 -713 7371 5595 -3530 -8142 -2043 6865
4214F865k01q631o056M965Q839J410q446o652L657R350K567p544p529J827R432
$$ 6865 6664 -1967 -8023 -3058 5781 7191 -1255 -7907 -4250 5100 7667 123 -7406 -5579 3853
4229C853L964o574q407J434Q628N122n427r160m7Q518O157m414r087j687P967
$$ 3853 7817 1243 -7164 -5730 2898 8020 2593 -6567 -6614 1904 8061 3647 -5440 -7127 840
4244H40O992l376r265k698P228P405j867r472l866O462Q208q71q192n472N168
$$ 840 7832 4456 -4809 -7507 -279 7126 5259 -4213 -8079 -1617 6591 5720 -2472 -7944 -2776
4259b776R179M73q594n786M060R059J642p750p050L117Q956K809p198p260J431
$$ -2776 6403 6876 -1718 -7504 -3444 5615 7257 -493 -7543 -4426 4530 7339 141 -7119 -5688
4274e688Q947M418o147q194M61Q615N337n037q722o64Q169O261m171q598k179
$$ -5688 3259 7677 1530 -6664 -6203 2412 7749 2712 -6010 -6674 1495 7756 3585 -5013 -7192
4289g192P517P358l000q658l278O332P781j261q741m533N830Q055j70q329n425
$$ -7192 325 7683 4683 -3975 -7253 -921 6860 5599 -3142 -7675 -1845 6210 6040 -2289 -7714
4304g714M490Q894R70p658o369L366Q554L024p269p235K245Q693L451o412p655
$$ -7714 -3224 5670 6640 -1018 -7387 -4021 4533 7557 288 -6947 -4702 3991 7442 1030 -6625
4319f625R63Q407M821n414q160j07P747N808m323q366j765P913O557l106q679
$$ -6625 -5662 2745 7566 2152 -6008 -6115 1632 7440 3117 -5249 -7014 899 7456 4350 -4329
4334d329k546O418P391j794q525l633N410P976p51p962m993M555Q377P03p770
$$ -4329 -6875 -457 6934 5140 -3385 -7018 -1608 6368 5617 -2345 -7338 -2783 5594 6297 -1473
4349a473n727L707Q351J788p110o630K361Q697L293o442p529J217Q667M022n384
$$ -1473 -7200 -3493 4858 6646 -464 -7094 -4733 3964 7257 815 -6714 -5497 3170 7192 1808
4364A808p789J26P849N247m258q464j114P815N784l399q427k127O972O678k396
$$ 1808 -5981 -5855 1994 7241 2983 -5481 -6595 1220 7004 3605 -4822 -6949 23 6701 4305
4379D305q172l459O304P629j328q298m131N131P892lp994n003M407Q124Q52p140
$$ 4305 -3867 -7326 -1022 6607 5279 -3019 -7150 -2019 5873 5870 -2124 -7127 -2720 5404 6256 -884
4395h84o145L295Q096K314o459o909J912Q215L645o016p468J013P941M302m399
$$ -884 -7029 -3734 4362 6676 217 -6692 -4780 3435 7080 1064 -6404 -5391 2550 6852 2453
4410B453q010l60P613N461l874p856j810O996O094k733q152k180O082O667j678
$$ 2453 -5557 -5917 1696 7157 3283 -4573 -6383 613 6707 3974 -4178 -6358 -276 6391 4713
4425D713p801l958N415P828j050p552m567M623P719L89o951n513L427Q100J868
$$ 4713 -3088 -7046 -1631 6197 5147 -2405 -6972 -2349 5370 5759 -1192 -6705 -3278 4822 6690
4440F690o925o126K485P821K819o185p006J392P994L728n204p385N22P497M685
$$ 6690 -235 -6361 -3876 3945 6764 579 -6427 -5035 2959 6687 1483 -5902 -5380 2117 6802
4455F802m321p536q43P181N477l338p678j780O384O371k273p815k962N207P093
$$ 6802 2481 -5055 -5898 1283 6760 3422 -4256 -6036 348 6719 4446 -3369 -6331 -1124 5969
4470E969j018p455m449N118P411l90p234m706M056P472J041o860n318L008P876
$$ 5969 4951 -2504 -6953 -1835 5576 5186 -2048 -6754 -2698 4774 5815 -1045 -6363 -3355 4521
4485D521J768o172o005J856P629K751n852o230P32P597L823m537p290j70P002
$$ 4521 6289 117 -5888 -4032 3597 6348 496 -5734 -5002 2595 6418 1881 -5409 -5579 1423
4500A423N114l768p439j331O677N609k754p473k197O171N976j554p645l423N343
$$ 1423 6537 2769 -4670 -6001 676 6285 3531 -3942 -6139 32 6008 4454 -3191 -6614 -1271
4515a271P020n64p635m404M941O948M03o664m997L167P606J394o300o170K842
$$ -1271 5749 5185 -2450 -6854 -1913 5035 5438 -1226 -6223 -3056 4550 5944 -356 -6526 -3684
4530c684P341K634n496o589J285P410L549m975o572j32P180M521m081p047j003
$$ -3684 3657 6291 795 -5794 -4509 2901 6450 1475 -5097 -5229 1951 6472 2391 -4656 -5659
4545e659O832N182l219p350j765O111N688j985p455k440N497O298j253p009l641
$$ -5659 1173 6355 3136 -4214 -5979 132 5820 3835 -3620 -6060 -563 5735 4482 -2527 -6168
4560f168M732O808l13o567m914L831P380P51o807m801K734P333K124n812o328
$$ -6168 -1436 5372 5059 -1508 -6422 -2591 4789 5540 -1267 -6068 -3334 3999 6123 311 -6017
4575f017K312O853K691m905o659R39O697M258m344o719l44O993M515l654o873
$$ -6017 -3705 3148 5839 934 -5725 -4786 1911 6169 1825 -4894 -5238 1755 6270 2616 -4257
4590d257j045N961N072k273o986k463N520O080j314p157l372M981O498m60p011
$$ -4257 -5302 659 5731 3458 -3528 -5991 -471 5609 4295 -2862 -6234 -1253 5245 4785 -2226
4605b226l943M383O645N63o836m779L125P466J177o057n505K510O657K557n210
$$ -2226 -6169 -1786 4859 5422 -1414 -6193 -3068 4398 5575 -482 -5987 -3477 3180 5737 527
4620E27o160J530O645L436m871o148K49O542M072l803o651m33N850N071k734p009
$$ 527 -5633 -4103 2542 5978 1107 -5041 -4792 1750 5822 2019 -4632 -5065 785 5856 3122 -3887
4636c887j529N749N439j876p378k309M972O142j113o809l423M388O466J40o529
$$ -3887 -5416 333 5772 3896 -3482 -5791 -819 5323 4210 -2599 -6022 -1634 4832 4972 -1557
4651a557m345L691O434J063o025n154K937O747J721n478n473J440P005K723m835
$$ -1557 -5902 -2211 4223 5286 -739 -5893 -2956 3791 5512 34 -5439 -3999 3006 5729 894
4666H94n962P76O534L577m038o360n46O538M462l567o509j134N796N335k502p033
$$ 894 -5068 -4292 2242 5819 1781 -4579 -5125 1413 5875 2308 -4201 -5335 461 5796 3294 -3739
4682c739j700N107N634j536o268l184M958O025j032o155l812L964O542po171m348
$$ -3739 -5439 -332 5302 3766 -2502 -5686 -728 5297 4265 -1890 -5702 -1738 4804 4797 -1374 -5722
4698e722L083O429J230n525n397K376P021K006m818n725J114O515L069m546n830
$$ -5722 -2639 3790 5020 -505 -5902 -3526 3495 5501 683 -5042 -3928 2587 5656 1110 -4720
4713d720K52O203M050l501o533r40O482M365l116o523j526N482N381j810o861
$$ -4720 -4468 1735 5785 2284 -4249 -5189 1293 5658 2542 -3981 -5507 -25 5356 3546 -3315
4728c315j962M704N575j050o273l174L948O473m24o059l698L082O144J137n842
$$ -3315 -5277 -573 5002 3952 -2321 -5495 -1547 4926 4502 -1557 -5255 -2173 3971 5108 -734
4743g34m488K655O021J545m710n651J614O538K589m628n553O27O023L788m068
$$ -734 -5222 -2567 3454 4999 289 -5362 -3748 2790 5379 751 -4802 -4175 1848 5636 1568
4758A568o160M3N960M110k940o493r23N733M379k569n821k045M849N243j537n986
$$ 1568 -4592 -4549 1411 5521 2581 -3912 -4835 898 5277 2708 -3113 -5158 -309 4934 3397 -2589
4774b589k868M346N777m71o226l344L864N950O6n729m155K909O270J516n550n071
$$ -2589 -5457 -1111 4666 4195 -2031 -5375 -1511 4439 4505 -1224 -5379 -2470 3800 5316 -234 -5305
4790e305K390O097J917m682n504J388O187K865m281n596M30N822L690l419n989
$$ -5305 -2915 3182 5099 417 -5087 -3699 2488 5353 1072 -4524 -4094 1728 5418 1999 -3990
4805c990o58N731M276k525o117j447N081M834k086n947k340M750N281j106n983
$$ -3990 -4648 1083 5359 2834 -3283 -4730 351 5185 3099 -2848 -5188 -438 4843 3737 -2246
4820b246k940L868N841k18n837l638L295N954K66n257m042K367O185J271m836
$$ -2246 -5186 -1318 4523 4305 -1532 -5170 -1875 4079 4345 -912 -4954 -2587 3598 4869 33
4835C3m915J658O046K259m106n555M23O362K919l659n572k63N366M193l025n905
$$ 33 -4882 -3224 2822 5081 975 -4580 -4157 2205 5124 1465 -4107 -4370 996 5189 2164 -3741
4851c741p01M810M760k071o015j666M522M846j285n662k732M011N494o40n530
$$ -3741 -4442 368 5128 3057 -2958 -4624 -102 4744 3459 -2203 -4935 -924 4570 3930 -1600
4866a600l473L083N731N45n374l985K622O066J056m715n016K019N970J968m672
$$ -1600 -5073 -1990 3741 4286 -1088 -5073 -2451 3615 4671 -44 -5060 -3041 2929 4897 225
4881B25n028J330N709K793l766n635L43N908K921l079n415p39N333M142k587n705
$$ 225 -4803 -3473 2236 5029 1263 -4372 -4029 1879 4800 1721 -3694 -4433 900 5042 2455 -3250
4897c250j452M771M722j595o007k101M463N003r20n688l084L742N719m25n507
$$ -3250 -4702 69 4791 3196 -2811 -4912 -449 4554 3634 -2054 -5138 -1396 4323 3898 -1609
4912a609l389L221N340O03m837m356K515N767J357m637m617J357N553K528m007
$$ -1609 -4998 -1777 3563 4166 -671 -5027 -2512 3255 4612 -25 -4642 -3285 2268 4796 789
4927G89n229Q76N348L211l554n277q7N393L480k643n671j026M979M474k380n747
$$ 789 -4440 -3564 1784 4995 1441 -3836 -3923 1470 4950 2307 -3364 -4390 589 5063 2683 -3064
4943c064j498M478M454j390n637k384M072N543q98n417l228L302N387K84m741
$$ -3064 -4562 -84 4370 2980 -2657 -5041 -969 4574 3676 -1741 -4969 -1667 3720 4004 -737
4958g37m180K789N265J176m771m020J712N387J982m408m423Q13N336K853l876
$$ -737 -4917 -2128 3137 4313 -458 -4478 -2766 2621 4603 195 -4228 -3415 1921 4774 898
4973H98n160M61N524L128l356n099m35M997L607k238n451j370M623M429j325n602
$$ 898 -4262 -3801 1723 4851 1495 -3604 -4039 958 4565 2327 -3124 -4494 129 4558 3233 -2369
4989b369k268L980M941r00n375k854L623N039K1n057l527K974N374L42m546l945
$$ -2369 -4637 -657 4284 3384 -1991 -4845 -1222 3817 3838 -1219 -4746 -1772 3602 3944 -602 -4547
5005d547K128N487J472m479m526J577N734J733l959m703N30N584K662l726m653
$$ -4547 -2419 3068 4540 61 -4465 -2888 2846 4579 620 -4083 -3553 2031 4693 967 -3686
5020c686k73N110L396k752n279p81N106L781k114n401j390M442M457j654n244
$$ -3686 -3959 1151 4547 1795 -3484 -4265 841 4622 2508 -2893 -4283 159 4616 2962 -2282
5035b282k172L589M542l8n524k925L368M939N18n359l528K792N320J074m474m187
$$ -2282 -4454 -865 3677 3639 -1885 -4810 -1442 3497 4015 -1344 -4872 -2080 3240 4314 -160 -4347
5051d347J545N369K025m389m212R91N148K334l329n012L16N361K703l007n266
$$ -4347 -2802 2567 4592 203 -4009 -3018 2130 4464 1135 -3877 -3561 1800 4503 1496 -3770
5066c770l04M959L409k363n022j002M503M015j890m995j981L986M542o76n702
$$ -3770 -4074 885 4294 1931 -3091 -4093 410 4425 2535 -2460 -4441 -455 4087 3411 -2291
5081b291j915L359M645qn010l398K816M975O34m412l574K210M792J327m134m097
$$ -2291 -4206 -847 3798 3790 -1220 -4618 -1802 3173 3807 -605 -4179 -1969 2823 4150 16 -4081
5097d081J253M886K251m035m278P69M915K688l128m976J50M891L238l038m577
$$ -4081 -2828 2058 4309 274 -4004 -3235 1680 4368 1240 -3736 -3586 1305 4543 1505 -3072
5112c072q46M472M061k188n162j362M116M051j299n126j944L392M631n42n005
$$ -3072 -3918 554 4615 2427 -2735 -4097 19 4070 2771 -2355 -4299 -907 3724 3182 -1823
5127a823k554L144M561M86m882l257K558N287M81m378l795J615N206J748m503
$$ -1823 -4377 -1233 3328 3814 -1068 -4325 -1767 3520 4001 -377 -4172 -2557 2649 4397 -106
5142a06m051J155M924K543l694m473K74M932K906l191m382m59M764L210k381m988
$$ -106 -4157 -3002 1922 4465 771 -3702 -3428 1504 4410 1219 -3163 -3622 1142 4352 1971 -3017
5158c017q88M120L906j555m705k087L805M104p57m756k567L667M200k25m524k875
$$ -3017 -3905 215 4121 2566 -2139 -4226 -421 3683 2926 -1830 -4397 -730 3470 3245 -1279 -4154
5174d154K793M576O85m644l349K233M594J238m143l727J167M825J961l654m371
$$ -4154 -1361 3215 3900 -744 -4093 -1860 2734 3972 -171 -3898 -2731 2094 4055 401 -3970
5189c970R53M897K490l437m474J63M367L006k489m573q47M498L697j922m725j665
$$ -3970 -3017 1880 4370 933 -3541 -3378 989 3995 1506 -3067 -3914 584 4281 2359 -2366 -4031
5205d031M181L748j290m775j803L450M208l58m752k699K856M616J76m949k768
$$ -4031 150 3898 2608 -2167 -3970 -520 3688 3330 -1422 -4121 -1265 3351 3527 -1422 -4190
5220d190K616M583P46m374l424J893M783J409m096l937J269M639K250l579m060
$$ -4190 -1574 3009 3755 -619 -4043 -2150 2633 4042 -54 -3991 -2722 1917 4167 588 -3472
5235c472K70M769K603k994m506p5M532L095k464m669j034M479L494j681m730j395
$$ -3472 -3202 1567 4170 1176 -3330 -3405 1127 4222 1758 -2911 -3945 534 4028 2347 -2383 -3778
5251c778L642L668o17m669k383L178M563k02m654k794K623M704L03m200l085J924
$$ -3778 -136 3532 2915 -1754 -4137 -959 3604 3402 -1252 -4046 -1423 3281 3584 -616 -3701 -1777
5267a777M693O76l898l927K169M165J944l833l799P69M658K201l264m013q2M609
$$ -1777 2916 3592 -306 -4233 -2064 2101 4045 212 -3587 -2818 1840 4041 777 -3236 -3318 1291
5283A291K742k716m327n36M149L412k089m513r90L513M108j731m613j666L434
$$ 1291 4033 1317 -3010 -3546 603 4015 1926 -2587 -3577 -64 4044 2313 -2300 -3966 -532
5298e32M197q65m391k691L166M409O9m472k675K264M635O02m118l512J794M572
$$ -532 3665 2800 -1591 -4282 -1116 3293 3362 -1110 -3785 -1521 3114 3716 -402 -3914 -2120 2452
5314B452J352l853l535R71M556J948l363m018J78M633K750k545m536k95M710K753
$$ 2452 3804 -49 -3584 -2613 1943 3891 528 -3490 -3312 1321 4071 1526 -3010 -3305 1405 4158
5330D158k543m379n19L572L578j941m426j095L620L715j442m228k279L549M037
$$ 4158 1615 -2764 -3283 289 3867 1926 -2500 -3595 25 3740 2298 -1930 -4209 -660 3377
5345C377n76m086k780K922M398J27m357k526J776M931O48m194l423J231M649J809
$$ 3377 2801 -1285 -4065 -1143 3255 3382 -975 -3501 -1725 3206 3854 -340 -3763 -2532 2117 3926
5361C926l606l624P07M288J990k671m157K57M136K653k449m248p70M340K833j794
$$ 3926 320 -3304 -2597 1691 3681 1010 -3147 -2890 1246 3899 1450 -2798 -3568 772 3605 1811
5377A811m196r65L626L318j086m430j576L108L993q52m504k087K986L945Q2m196
$$ 1811 -2385 -3350 276 3594 2508 -1922 -3498 -390 3603 2751 -1753 -3840 -854 3091 3173 -1023
5393a023k850K491M256M17l866l034J751M244J076l229l595J145M064J854k936
$$ -1023 -3873 -1382 2874 3291 -575 -3609 -1858 2386 3462 233 -3362 -2217 1847 3701 765
5408G65m016L79M497K017k580m071N0L945K691k365l949p54M015K990j758m179
$$ 765 -3251 -2872 1625 3642 1062 -3009 -2959 986 3677 1312 -2637 -3391 624 3614 1856 -2323
5424b323j200L206M043j364m276j553K797L632k97l988k159K554L770N51m530
$$ -2323 -3523 -317 3726 2362 -1914 -3467 -670 2962 2665 -1323 -3482 -928 2842 3393 -1137
5439a137k754K180M235Q37l576l723J539M534J643l570l401P32M229J939l066
$$ -1137 -3891 -1711 2524 3361 -215 -3938 -2399 2135 3778 208 -3193 -2461 1768 3707 641
5454F41l821L37M071K509k414m295l20L757L098k075m095q04L776L099j352m166
$$ 641 -3180 -2843 1228 3737 1323 -2972 -3292 465 3563 1488 -2607 -3411 365 3464 2112 -2054
5470b054j209K714M096q72m188j920K727L686j62m077k548K570M125J25l685l113
$$ -2054 -3263 -549 3547 2675 -1513 -3433 -706 2980 2818 -1259 -3807 -1237 2888 3013 -672 -3785
5486c785K059M012R18l384l416J393M090J630l148l673N50M183K086k635l778
$$ -3785 -1726 2286 3204 -180 -3596 -2203 1887 3517 369 -3304 -2754 1429 3515 880 -2898
5501b898j82M247K657k618l787m96L719K879j635l987j520L796L476j445l878
$$ -2898 -3080 1167 3824 1206 -2581 -3077 642 3521 1886 -2101 -3621 175 3651 2206 -1672
5516a672j973K997L743m57l694k667K529M286j98l691k703J596M660N96l685l228
$$ -1672 -3645 -648 3095 2638 -1056 -3723 -1194 3092 2894 -797 -3500 -1904 2756 3352 -333 -3561
5532c561J495M143J299l492l305J114M012J642k433m057L49M193K180k609l660
$$ -3561 -2066 2077 3376 -116 -3421 -2307 1705 3347 914 -3143 -2794 1399 3579 970 -2690
5547b690k76L835K595j899m213o86L768L109j515l754j482L305L098o63m062j961
$$ -2690 -2966 869 3464 1565 -2648 -3334 434 3543 2028 -1726 -3208 97 3195 2532 -1530 -3491
5563c491K871L429L3m337j862K463L484L09l404k921J815L893J107l396l390J487
$$ -3491 -620 2809 2842 -1495 -3357 -894 2590 2899 -505 -3426 -1611 2282 3389 -7 -3397 -1910
5579a910L855J540l187l568J142L754J940k742m126N24M147K160k604l593m90
$$ -1910 1945 3485 298 -3270 -2128 1626 3566 824 -3302 -2778 1369 3529 925 -2668 -3158
5594c158L476L175j762l951r64L152L142r43l966j700L201L654j037l869j850
$$ -3158 318 3493 1731 -2220 -3184 -32 3110 2167 -1799 -3499 -298 3356 2319 -1550 -3400
5609c400K477L901l1m144k411K423L725N72l497k926J423M027J239l562l276J400
$$ -3400 -923 2978 2947 -1197 -3608 -1185 2540 3112 -385 -3311 -1888 2139 3378 -184 -3460 -2060
5625b060L780J339k763l547P35L696K257k480l728l27L984K382j721m129m38L417
$$ -2060 1720 3059 296 -3251 -2516 1180 3437 957 -2771 -3098 886 3268 1547 -2582 -3020 397
5641C97K913j514l944j092L408K906p08m168j536K918L480p03l554k266K402L560
$$ 397 3310 1796 -2148 -3240 168 3074 2366 -1802 -3338 -420 3060 2357 -1197 -3463 -1061 2499
5657B499N04l821k415J900L919O09l454k829J085M000J242l201l421R25M170J514
$$ 2499 3003 -818 -3233 -1333 2586 3195 -259 -3088 -2003 1997 3239 38 -3383 -2458 1712 3226
5673C226k586l493L05L769K148k028l861k32L437K671j754m020q55L366L038j206
$$ 3226 640 -2853 -2548 1221 3369 1341 -2520 -2752 685 3356 1602 -2418 -3273 93 3131 1925
5689A925l986j157L241K798l83l879j807K651L448k13l759k173K135L800J19l445
$$ 1925 -2061 -3218 23 2821 2438 -1441 -3248 -597 2851 2638 -1121 -3294 -1159 2641 2760 -685
5705f85k336J579L688Q95l347l008R30M095J369k714l580O64L853J854k539l488
$$ -685 -3021 -1442 2246 3141 -206 -3214 -2284 1811 3180 466 -3114 -2450 1403 3257 718 -2770
5721b770P0L485K421k051l563k57L213K612j675l480j139L008L122r79l796j402
$$ -2770 -2700 785 3206 1155 -2408 -2665 548 3160 1485 -1995 -3134 -126 2996 2017 -1779 -3181
5737c181K837L190m42l837j829K213L745j53l658k142K059L561Q40l426l049J570
$$ -3181 -344 2846 2404 -1433 -3262 -1049 2696 2543 -1115 -3257 -1198 2363 3203 -223 -3272 -1702
5753a702L683J242l201k884Q87L527J978l135l428M82L772K068k097l578l75L571
$$ -1702 1981 3223 22 -2862 -1975 1552 3530 395 -3033 -2551 1221 3289 1192 -2386 -2761 810
5769H10K320j749l609o12K949K857j246l580j163K812L046o51l514j621K298L276
$$ 810 3130 1381 -2228 -2840 109 2966 1720 -1860 -3023 -211 2835 2184 -1330 -2951 -653 2623
5785B623O1l727k299K240L506L28l399k803J968L856Q76l525k638J048L648J277
$$ 2623 2684 -1043 -3342 -1102 2404 2732 -667 -3470 -1502 2354 3230 -295 -2933 -1885 1763 3040
5801C040k560l267N86L740J514k359l353M2L833J866j926l537m46L285K772j677
$$ 3040 480 -2787 -2201 1539 3053 694 -2659 -2617 1216 3082 1156 -2381 -2827 458 3230 1553
5817A553l636r95L324K875j375l504j575L145K997n64l760j746K469L520j67l429
$$ 1553 -2083 -3078 246 3121 1746 -1758 -3333 -188 2809 2245 -1515 -3261 -792 2728 2561 -868
5833h68k481K156L654P4l052k593J510L500J071l218k566J068L403J336k672l204
$$ -868 -3349 -1193 2461 2535 -517 -3110 -1600 1900 2971 -247 -2813 -1745 1658 2994 322 -2882
5849b882N61L374K374k389l304q3L180K271j945l431n68L246K914j630l939q00
$$ -2882 -2321 1053 3427 1038 -2266 -2349 831 3102 1157 -2274 -2842 404 3318 1688 -2251 -3051
5865c051K914L477j612l300j564K328L767n61l485k157K253L545N08l734k359
$$ -3051 -137 3340 1728 -1572 -3136 -808 2959 2398 -1087 -3244 -991 2554 3062 -672 -3031
5880c031J591L819P07l501k693J138L747J293k913l152J112L340J546k203l608
$$ -3031 -1440 2379 3086 -415 -3108 -1970 1777 3070 157 -2995 -1883 1457 3003 800 -2808
5895b808K18L705J964j879l546k57L048K632j539l611m30K945K669j414l768r81
$$ -2808 -2590 1115 3079 1200 -2346 -2603 445 3077 1538 -2073 -2503 442 3111 1697 -2071 -3052
5911c052K983K856p12l108j876K453L020k1l526j875J923L482K64l364k425J357
$$ -3052 -69 2787 2075 -1033 -2909 -456 2564 2543 -983 -2858 -935 2547 2811 -553 -2978 -1621
5927a621L698P26k770k854R28L645J040k370l118M07L471J846k194l434j2L344
$$ -1621 2077 2803 33 -2821 -1893 1752 2792 422 -2696 -2289 1182 3028 834 -2600 -2612 732
5943G32K172j742l315p79L363K460j278l765m66K731K571l60l646j332K200L189
$$ 732 2904 1162 -2153 -2932 431 2891 1613 -2152 -2618 113 2684 2324 -1322 -2654 -454 2735
5959B735n57l254j538J796L436n4l253k358J904L381L32k698k845J135L640J047
$$ 2735 2178 -1076 -2614 -818 2618 2564 -689 -3047 -1143 2238 2570 -128 -2973 -1838 1802 2849
5975B849k717k741P85L479J164k196l266K83L450J914k110l105l41L323K394j921
$$ 2849 132 -2609 -1824 1655 2819 623 -2643 -2360 1090 3004 894 -2211 -2552 771 3165 1244
5991A244l383o44L286K375j240l230j023K797K816q95l506j682K783K986m37l405
$$ 1244 -2139 -2783 503 2878 1638 -1592 -2615 182 2998 2103 -1403 -3085 -302 2684 2247 -1158
6007a158j851K109L043M40l280k391J680L151Q92k732k878J459L307Q03k677k687
$$ -1158 -3009 -900 2143 2583 -697 -3088 -1408 1743 2635 -97 -2975 -1516 1791 2594 -83 -2770
6023b770P95L595J155k065l426L05L312K091k122k880l57K980K370j711l290p26
$$ -2770 -1975 1620 2775 710 -2716 -2411 901 2992 870 -2010 -2367 613 2983 1272 -2018 -2744
6039b744K485K971r07l600q78K353K943p04l049j974K494L294k68l350k051J951
$$ -2744 -259 2712 1805 -1795 -2673 -320 2623 1919 -1130 -3104 -610 2684 2416 -934 -2985 -1034
6055a034L176J79k616k713J419L301J188k922k812P43L681J442k538l315P67K919
$$ -1034 2142 2321 -295 -3008 -1589 1712 2900 -22 -2834 -2091 1590 3032 494 -2821 -2054 865
6071H65J995j912l434K66K708K613j829l593m66L259K443j235l610r39K819K728
$$ 865 2860 948 -2486 -2220 488 3101 1272 -2321 -2787 472 2915 1680 -1930 -2869 -50 2678
6087B678o10l634j106K356K879l52l225k011J752L872k27k888k150J338L395P24
$$ 2678 2068 -1566 -2672 -316 2563 2211 -1014 -3025 -1273 2599 2372 -516 -2666 -1328 2067 2791
6103B791l288k110J040L417J009k740l033O45L554J448k087l264L60L315J939
$$ 2791 -497 -2607 -1567 1850 2859 119 -2914 -2269 1285 2733 646 -2618 -2258 1057 2996
6118B996k088l142o3K980K130j316l530o39L111K216j223l116p46K211K971r40
$$ 2996 908 -2234 -2297 683 2813 1497 -2033 -2672 439 2655 1432 -1684 -2430 -219 2752 1812
6134A812l099j573K215K990j66l211j912K058L030L18l231j864J321K997P57k429
$$ 1812 -1287 -2860 -645 2345 2179 -1032 -2944 -886 2144 2462 -769 -2633 -1312 1685 2442 13
6150A3k606Q55L593R67k500l053P07L123J661k177l271J26L406K226j942l291
$$ 13 -2593 -1738 1855 2822 322 -2731 -2024 1099 2760 583 -2688 -2562 844 3070 1128 -2163
6166b163o01L156K244j327l211o36K691K476q28l521j013K144L132n70l186j390
$$ -2163 -2764 392 2636 1309 -1902 -2538 153 2629 1801 -1720 -2733 -589 2543 1973 -1213 -2603
6182b603J988L083m04k829k217J805L137N47k582k761J085L473J109k501l054
$$ -2603 -615 2468 2064 -765 -2982 -1177 1960 2507 -75 -2836 -1751 1722 2831 330 -2724
6197b724P88L251J573k503k719J17L288J866k296k822k33L071J884j358l448k95
$$ -2724 -1936 1315 2888 385 -2334 -2217 1071 2937 641 -2181 -2414 657 2541 1183 -2265 -2560
6213b560K610K507j195k660j191K462K391n89l169j412K058L122j6l345j606J748
$$ -2560 50 2557 1362 -1298 -2489 -27 2364 1775 -1394 -2806 -748 2374 2358 -987 -2593 -845
6229h45L053n7k594k456J585L210P51k871k307J011K998J133k586k648N78L028
$$ -845 2208 2151 -443 -2899 -1314 1896 2647 -224 -2531 -1520 1478 2611 25 -2623 -2045 983
6245I83J866k236k980R2L396J716j713l149k90K814K332j297l498k96K211K580
$$ 983 2849 613 -2367 -2275 1121 2837 1124 -2025 -2315 499 2831 1534 -1964 -2260 -49 2531
6261B531p39l675r15K252L029n45k954j978K273K911p8l000k013J904L143O11
$$ 2531 1792 -1883 -2798 -546 2483 1938 -1016 -2994 -721 2190 2112 -888 -2901 -997 2146 2757
6277B757l038k641J464L035R09k853j997M36L442R64k026k790N6L636J077j624
$$ 2757 -281 -2922 -1458 1577 2486 -367 -2364 -1928 1514 2478 452 -2338 -2282 1354 2431 807
6293H07k970l4K652K561j991k719j091L196K453j455k912r14K408K641q28l183
$$ 807 -2163 -2197 455 3016 1025 -1694 -2785 411 2864 1409 -1503 -2417 -9 2632 1804 -1379
6309a379j370K088K861l45k975j612K053K780J20k934j849J464K997L19k240k205
$$ -1379 -2749 -661 2200 1855 -1120 -2732 -679 2101 2221 -713 -2562 -1098 1899 2218 -22 -2227
6325b227N31L393P37k141k522K16L327J383k313k885M45K863J780j589l252j21
$$ -2227 -1696 1697 2434 293 -2229 -2013 1314 2697 384 -2501 -2056 807 2587 998 -2254 -2375
6341b375K929K148j631k679q22K700K197o53l445p85K240K573m24l214j504J894
$$ -2375 554 2702 1071 -1608 -2430 270 2467 1814 -1631 -2416 -176 2397 1973 -1241 -2745 -851
6357h51L197l78k881j764J559L114M59k798k342J223K951R14k175k687R07L036
$$ -851 2346 1968 -913 -2677 -1118 1996 2455 -343 -2685 -1462 1489 2403 228 -2459 -1552 1484
6373A484J147k303k552L78K873J374j716k687N3K361K117j287l271j74K542K231
$$ 1484 2631 328 -2224 -1846 1027 2401 685 -2002 -1949 412 2529 1242 -2029 -2203 339 2570
6389B570j106l178p60K268K526n68k982j447K348K853n16k673j886J821L001l06
$$ 2570 1464 -1714 -2474 -206 2320 1752 -1230 -2677 -329 2524 2008 -665 -2551 -730 2271 1965
6405A965k716j673J144L176K00k649j921Q81L000J081k566k581J254K783J049
$$ 1965 -751 -2424 -1280 1896 2096 -553 -2474 -1593 1407 2488 -78 -2659 -1405 1378 2427
6420B427k080k718M09L050J665j957k939J32K326K213j367l027m71K600K095r88
$$ 2427 347 -2371 -1962 1088 2753 796 -2143 -2011 315 2528 1161 -1866 -2337 263 2358 1370
6436A370k736j215K639K409o23k824j374J768K885k36k944j523J713K639P1k384
$$ 1370 -1366 -2581 58 2467 1844 -980 -2354 -586 2299 2063 -881 -2404 -691 1948 2019 -365
6452c65j860J288K881M93k317k473O46L010J066j863k957N00K888J424j607k869
$$ -365 -2225 -937 1944 2437 120 -2353 -1707 1303 2369 506 -2451 -1951 937 2361 754 -2115
6468b115O2K981J839j919k925J15K442J955j064k823p07K209K232n55l138j121
$$ -2115 -2053 928 2767 848 -2077 -1962 480 2435 1371 -1452 -2159 50 2282 1727 -1411 -2532
6484b532K186K533m52k825j505J948K706j26k691j754J736K602R9j768k280Q85
$$ -2532 -346 2187 1735 -1090 -2595 -647 2059 1933 -758 -2512 -776 1826 1925 157 -2123 -1238
6500a238K785J051k440k360O22K935Q89j885k562M77K622J494j678k728k00K860
$$ -1238 1547 2598 158 -2202 -1580 1355 2244 359 -2203 -1726 896 2390 712 -2016 -2216 644
6516F44J802j385k731o34K677J964j063k851p74K302K383n75l062j004K078K362
$$ 644 2446 1061 -1670 -2304 373 2337 1274 -1577 -2351 -49 2334 1759 -1303 -2307 -229 2133
6532B133n46k608j318J283L213j6k677j742J205K661O02k463k071Q99K761R21
$$ 2133 1587 -1021 -2339 -1056 2157 2141 -536 -2278 -1073 1588 2190 -273 -2344 -1445 1316 2237
6548B237k241j989M78K688J288j861k890O96K573J230j136k938j38K545J880j270
$$ 2237 -4 -1993 -1515 1173 2461 600 -2290 -1594 979 2209 1073 -1865 -2003 542 2422 1152
6564A152k863o64K248K372r10k260j017J680K385l78k843j460K312K322k37k549
$$ 1152 -1711 -2375 -127 2245 1335 -925 -1942 -262 2123 1745 -1098 -2558 -246 2076 1839 -710
6580g10j626J349K638O09k747j608O13L051M85k153j990N33K866R54j706k929
$$ -710 -2336 -987 1651 2260 -487 -2095 -1482 1569 2054 -99 -2089 -1556 1310 2264 558 -2371
6596b371P89K631J447j919k309l7K592J759j833k482l10K509J639j035k894j96
$$ -2371 -1582 1049 2496 577 -1732 -1769 823 2582 749 -1733 -2043 466 2105 1070 -1824 -2020
6612b020K152K271r23k669r59J810K369ok946j351J467K642J89l008j283J326
$$ -2020 132 2403 1480 -1189 -2148 -338 2031 2025 -921 -2272 -805 1837 2026 -982 -2265 -939
6628i39K490L93k529j422N90K700O34j978j991L26K838J034j809j987P2K119J885
$$ -939 1551 1944 -585 -2007 -1417 1283 1917 -61 -2052 -1726 1112 2146 337 -1650 -1578 541 2426
6645B426j517k804m4K375J825j238k663m01K240J872j054k513o02J966K228m51
$$ 2426 909 -1895 -1939 436 2261 1023 -1640 -2041 199 2071 1017 -1496 -2098 -132 2096 1645
6661A645l030p75J682K452m10k211j522J387K558K85k307j875J098K309R26k180
$$ 1645 -1385 -2160 -478 1974 1564 -647 -2169 -782 1776 2061 -246 -2121 -1023 1286 2212 32
6677C2k239Q50K605J121k413k165O07K614J020j673k056K08K152J459j362k439
$$ 32 -2207 -1357 1248 2369 -44 -2209 -1602 1012 2032 359 -1697 -1489 663 2122 760 -1679
6693a679k69K060K080j187k298p05K051K017o49k737q57J772K388o36k297j429
$$ -1679 -1948 112 2192 1005 -1293 -1998 53 2070 1421 -1316 -2173 -401 1987 1351 -946 -2375
6709b375J567K743l30k293j532J542K399K13k120k189J041K737M76j563k243O06
$$ -2375 -808 1935 1605 -688 -2220 -678 1721 1934 -186 -2375 -1334 1403 1879 316 -1927 -1321
6725a321K692O63j808k161M46K151J461j421k231k13K226J715j178k652l43J975
$$ -1321 1371 2034 226 -1935 -1489 662 2123 702 -1529 -1742 484 2199 1021 -1631 -1974 1
6741AK132j047k319o05J829J857m35k306j234J768K606n10k470j418J272K455
$$ 1 2133 1086 -1233 -1838 -9 1848 1413 -893 -2127 -359 2247 1737 -733 -2151 -879 1576
6757A576L07k361j577J105K527R3j855j977J086K305O46j873j870L99K381J359
$$ 1576 1883 -478 -2055 -950 1577 1670 -185 -2162 -1076 1229 1875 2 -1868 -1469 912 2271
6773B271j884k085Q4K261J108j022k091o35K247J647j251k180k66J912J860p51
$$ 2271 387 -1698 -1614 647 1755 733 -1358 -1993 254 1901 650 -1530 -1796 116 1976 1225
6789A225k259j064J722K230k57k647j011J341K500r0k245j525J551K059J22k219
$$ 1225 -1034 -2098 -376 1854 1597 -1050 -2061 -720 1780 1690 -555 -2080 -529 1530 1652 -567
6805e67j311Q34K360M86k033j434K51K347Q23j665j960M46K207J373j474k189
$$ -567 -1878 -1044 1316 1802 -231 -1665 -1414 933 1756 91 -1869 -1423 784 2157 683 -1506
6821a506J0J940J611j396k239k51J870J929j167j831j032K040J756n99k035q05
$$ -1506 -1496 444 2055 659 -1580 -1831 39 1968 801 -1030 -2062 -22 1734 1135 -900 -1705
6837a705J544J871k45k445r89J262K122J74j903j746J321K286K98k136j532Q87
$$ -1705 -161 1710 1465 -980 -1969 -707 1415 1589 -314 -2060 -739 1547 1845 -291 -1823 -936
6853i36K429M11j747j887M20K347O12j342k178L13K039J622j506k149J57J830
$$ -936 1493 1904 157 -1730 -1310 1037 1649 307 -1871 -1558 481 2103 597 -1552 -1395 435
6869D35J472r65k247k80J708J518n29k129j060J720K157m3k618r93J569J910N9
$$ 435 1907 942 -1305 -1585 123 1641 1112 -1017 -2077 -357 1800 1757 -861 -1854 -285 1625 1684
6886A684k471j261J340K155L01k021j321N37K390P42j668k125Q65J937Q81j912
$$ 1684 -787 -2048 -708 1447 1748 -273 -1594 -1057 1333 2075 407 -1718 -853 1084 1965 53
6902E3j843Q6K526R33j411k042K42J863J615j127k296k27J872J793p64k443l57
$$ 53 -1790 -1704 822 1755 344 -1698 -1456 407 2022 895 -1401 -1628 244 2037 1273 -1170 -1527
6919a527J363J805k99k432p28J490K041jk492j072J364K116j26k117j016P82K467
$$ -1527 -164 1641 1342 -1090 -1818 -328 1713 1712 -780 -1852 -488 1628 1502 -615 -1631 -849 1618
6936A618L8j957j578R47K189M18j356j886N02K105N68j097k171K98J979J323j391
$$ 1618 1656 -301 -1879 -932 1257 1675 319 -1567 -1065 1040 1608 511 -1660 -1362 617 1940 549
6953E49k228L9K003J470q35k173n94K231J377p70k003n53J228K143o25j976j075
$$ 549 -1679 -1640 363 1833 998 -1175 -1769 462 1839 1069 -934 -1487 -259 1884 1259 -717 -1792
6970a792J448J737L73k607j125J185K254J83k228j363J040K224K31j810j372O87
$$ -1792 -344 1393 1766 -841 -1966 -781 1473 1656 -572 -1935 -895 1329 1560 -250 -1622 -935
6986i35J790Q78j558j675N6K160J008j382j964N02J666J484j504j854j71J856
$$ -935 855 1733 175 -1500 -1444 716 1724 342 -1622 -1120 546 2030 526 -1328 -1499 357
7002C57J315q47j834p24J589J632k03k088p29J315J678j97j942j003J469J636
$$ 357 1672 825 -1009 -1733 -144 1488 1285 -803 -1532 -217 1461 1264 -678 -1681 -212 1424
7018A424J51k121j131Q14K028K04j466j540O70K095O72j763j684M56J744J191
$$ 1424 1575 -546 -1677 -863 1165 1369 -97 -1637 -967 1128 1800 37 -1647 -1191 553 1744
7034A744j456j804J98K089J083j606j587j28J970J301j130j979K4J590J537q77
$$ 1744 288 -1516 -1318 771 1854 248 -1339 -1467 503 1804 674 -1305 -1281 309 1846 969
7050I69j978l77J427J504k56k185o61J171J694k25j778j128J132J932O8j744j344
$$ 969 -1009 -1386 41 1545 1289 -896 -1557 -386 1308 1083 -695 -1823 -691 1241 1309 -435 -1779
7067a779J187J476L15j393j521N93K020R60j491j821J09K188O92j170j925K24
$$ -1779 -592 884 1199 -194 -1715 -1122 898 1858 367 -1454 -1345 843 1535 365 -1560 -1336
7083a336K054J194j413j644m20J823J409j067j663n92J790J424m23j962p71J630
$$ -1336 718 1912 499 -1145 -1565 258 1667 600 -1063 -1655 135 1559 1136 -826 -1597 33
7099C3J362j36j788j196J295J985q3j736j328J105J714M7j556j436Q77J833N18
$$ 33 1395 1259 -529 -1725 -430 1555 1472 -264 -1592 -487 1227 1274 -282 -1718 -841 992 1510
7116A510j481j657M30J984O71j050j767J58J792J105j565j482K1J705J141p53
$$ 1510 29 -1628 -1198 786 1457 407 -1360 -1202 590 1695 130 -1352 -1331 374 1515 762
7132G62j817l84J666J500j104j723j06J416J182m11j781o98J343J276J32j908
$$ 762 -1055 -1439 227 1727 623 -1100 -1206 210 1392 981 -800 -1498 -155 1121 1253 -655
7148f55o84P29J809P7j516j215O24J891K56j441j302M47J944M04j549j280L28
$$ -655 -1339 -610 1199 1276 -240 -1455 -831 1060 1316 -125 -1427 -980 964 1368 -181 -1461 -1133
7165a133K058N98j291j523j9K122P02r05k041K25J660Q54o77j685m80J846J163
$$ -1133 925 1523 232 -1291 -1310 812 1514 609 -1432 -1207 453 1307 630 -1055 -1535 311 1474
7182A474m12k064n34J472J542j93k158m26Q92J698j3j828j148J278J501K01j676
$$ 1474 1062 -1002 -1536 -64 1478 1285 -873 -1299 -407 1291 1278 -550 -1698 -420 1081 1282 -394
7199c94j324R18J814K81j206j677O29J996K95j182j880M93J841Q61j090j503q3
$$ -394 -1718 -800 1014 1295 89 -1588 -959 1037 1332 150 -1730 -1237 604 1465 375 -1128 -1211
7216a211J785Q78p99j524n53J945J056r37j504p02J533J389n49j492p42J312J362
$$ -1211 574 1452 653 -871 -1424 521 1577 640 -864 -1566 -33 1356 807 -685 -1427 -115 1247
7233A247k47j860q22J275J763n0j584j036R19J313N86j719j231O91J666L58j356
$$ 1247 1000 -860 -1682 -407 1356 1306 -278 -1314 -395 918 1504 -215 -1446 -755 911 1269 -87
7250h7j608Q23J529Q58j268j599K18J374J347j091j736K25J460J380j126j631
$$ -87 -1695 -872 657 1515 247 -1352 -1134 240 1587 496 -1240 -1015 445 1825 699 -932
7266i32m58J242J643q56j503m99J723J269q02j720o91J076J750k46j614n37Q03
$$ -932 -1390 -148 1495 639 -864 -1363 360 1629 827 -893 -1584 -508 1242 996 -618 -1155 -352
7283c52J419K34j463j337R73J793J32j532j430P51J869L99j181j270M3J787Q39
$$ -352 1067 1301 -162 -1499 -526 1267 1399 -133 -1563 -812 1057 1456 275 -995 -952 835 1674
7300A674j362j351J18J439Q43p49j786j55J751J083o61j861k89J299J289m53j564
$$ 1674 312 -1039 -921 518 1361 612 -1174 -1329 422 1505 844 -1017 -1306 -7 1282 829 -735
7317g35o45J268J456m65j546p18J010J414J2j620j001J114J428J33j452j243O78
$$ -735 -1380 -112 1344 879 -667 -1385 -375 1039 1051 -569 -1570 -456 972 1105 -347 -1590 -912
7334i12J982O2j089j437N80J655L95r45j447L78J126J035j073j446K49J367Q52
$$ -912 1070 1132 43 -1394 -814 841 1236 291 -1156 -778 348 1383 310 -1136 -887 480 1332
7351A332n34j915j37J199J283n81j347n47J150J335m39j693l92J194J222l75j188
$$ 1332 798 -1117 -1254 -55 1228 647 -700 -1247 -97 1238 799 -894 -1286 -92 1130 755 -433
7368d33o90O56J383L48j659j072R53J304N76j822r16P44J429J32j042q70J31J541
$$ -433 -1123 -467 916 1264 -395 -1467 -514 790 1366 -456 -1372 -628 801 933 -109 -979 -848 693
7386F93P41q46j654J71J364O55p29j768J15J684J028j080j365j50J216J425p11
$$ 693 1434 588 -1066 -895 469 1124 395 -1373 -1258 426 1454 374 -991 -1141 75 1500 789
7403G89j460p65J305J131K7j597p27P94J712l7j538j107J187J571r0j647n70N50
$$ 789 -671 -1436 -131 1000 1027 -570 -1297 -503 1209 1172 -366 -1473 -286 1285 1195 -452 -1022 -472
7421d72J014O34j150j437L80J679M92r50j262J22J511O86j114j202J07J410J038
$$ -472 542 1176 26 -1411 -1031 648 1140 190 -1072 -950 561 1247 133 -1069 -962 448 1486
7438A486r84j474o4J160J362j309r69k98J084J265m20j595m81J227J044k79j470
$$ 1486 502 -972 -1036 124 1486 177 -792 -1090 -6 1259 839 -756 -1237 -10 1034 755 -715
7455g15n52R46J713k57j714q49J021J379R6j388j039P63J204M62j019j066N7K236
$$ -715 -1267 -321 1392 1135 -579 -1428 -407 972 1068 -320 -1359 -596 608 1070 51 -1015 -958 1278
7473A278j90q95j231K82J103Q77r05j386M3J508Q25p43j561lJ213J161q36j157
$$ 1278 1088 193 -1038 -756 347 1224 319 -1067 -1024 484 1309 566 -995 -998 215 1376 540 -617
7491f17k75Q85J010j92j251q19J339Q96J96j540j009J104J340j12j491o50M17
$$ -617 -892 -7 1003 811 -440 -1259 80 976 1172 -368 -1377 -273 1067 955 -536 -1186 -769
7508g69J701M34j503j176N90J367M03r56j278M71J294N99r91j134J44R94N47m26
$$ -769 932 1366 -137 -1313 -723 644 1047 91 -1187 -716 578 1177 186 -948 -804 190 737 311
7526C11j313O6J218J070n74j487n78J390R94m10j251o40J032J348J22j810q26
$$ 311 -1002 -936 282 1352 778 -709 -1287 103 1097 687 -564 -1204 -172 1176 1298 -512 -1338
7543a338P07J601j46j215p52N16J541J81j491q32M86J548M36j465p99J40J481
$$ -1338 -631 970 824 -391 -1143 -627 914 1095 -396 -1228 -742 806 1242 -223 -1022 -882 599
7560E99M12q03j215J08J488P24r28j445K09J299N60l82j573p4J400N39n03j243
$$ 599 1011 208 -1007 -899 589 1313 385 -1060 -851 448 1008 626 -947 -1021 379 918 415 -828
7578h28j97J016J016j93j220o89P85J266k72r45j090Q78J315j49q40p09M04J456
$$ -828 -1025 -9 1007 814 -406 -1095 -310 956 684 -261 -1351 -473 842 693 -147 -856 -452 1004
7596A004J21j088j198N50J240K67m43j505J38J466O18q85j378L71J027R17j018
$$ 1004 1125 37 -1161 -611 629 896 453 -1052 -914 552 1170 285 -1093 -722 305 1222 204
7613B04r97l2Q36J246j063q94l01J129O63J32j404n98J106J104n20q53q80P50
$$ 204 -793 -825 11 1257 194 -700 -1001 128 791 923 -481 -1079 27 1131 611 -242 -1122 -372
7631c72J243k68r38q31Q16J357j71j185p98P01J308nq46r99O04J162n5m35j246
$$ -372 871 603 -335 -1166 -350 1007 836 -349 -1147 -446 862 857 11 -988 -384 778 723 288 -958
7650i58K77R72R41q13j225j17J183O74l50j151l73J249P50o42j224r9P35R49K08
$$ -958 -681 291 1232 419 -806 -923 260 934 584 -567 -940 309 1059 417 -807 -906 -171 778 986
7669I86j756n05J182J036P0j272p54P94J142r9j213n29N88R00M35r73j444Q87
$$ 986 -770 -1275 -93 943 1013 -259 -1013 -219 923 824 -389 -918 -330 570 1005 32 -1412 -525
7687e25J427o5j070o35M80R44O19j042q56p7J112O70r01j123J59R77J073p26j176
$$ -525 902 837 -233 -868 -388 556 1175 133 -723 -800 312 982 81 -1042 -883 94 1167 441 -735
7706g35j37Q28R44j80j007j041J683N28j83j114o07P87R58M01j512q38Q42R53
$$ -735 -872 -44 900 720 -287 -1328 355 883 700 -414 -1021 -234 724 1125 -387 -1225 -383 570
7724E70r9n68q60L81J182K12j064r45Q28P48L76p08j020J28J379O65j016j052
$$ 570 471 -97 -957 -576 606 818 -246 -1191 -363 385 761 53 -967 -839 540 1205 189 -863
7742h63r3J192Q20p14j277K42P75R66n03j407k03J139Q14o15o72n61J042N66J50
$$ -863 -956 236 1056 342 -935 -693 82 1048 545 -862 -1065 74 888 273 -399 -960 82 648 798
7761G98j161m78P57Q06j09p96n69J95J265K18r39p96O11Q00l7n12j084K88J383
$$ 798 -363 -841 -84 722 613 -183 -752 -557 708 926 -13 -809 -198 602 565 53 -1031 -743 640
7780F40K07r13q78K18J140N06p66j000Q7Q60R60o12r10k62J100M09m17q60m35
$$ 640 847 -66 -944 -726 414 920 154 -846 -759 101 1061 449 -461 -723 377 786 369 -491 -926
7799i26P62J049q5j380l76Q34P23K7j011p66J074R45nj327n32O33J013J40j241
$$ -926 -164 885 800 -580 -956 -122 601 628 -383 -1149 -75 870 865 -462 -994 -361 652 792 -449
7818d49k96L94P92K57m18j476O73J153J85m99r35k20J146M09m71o17l63J103J63
$$ -449 -745 -351 441 698 280 -1196 -523 630 815 316 -619 -839 307 716 245 -372 -735 368 531
7837E31l17j020P9P61O44k94q72l25O43R53N6j649k19P19J225l62p45o39L14J063
$$ 531 214 -806 -727 34 678 384 -488 -813 -170 783 839 -810 -1029 -310 915 553 -192 -831 -517 546
7857E46K50j214k97L16J023J45q77r89N87Q32M53p49j043M64Q48O33r62o38J04
$$ 546 796 -418 -715 -399 624 769 -108 -1097 -510 322 775 26 -1017 -553 295 928 -34 -672 -568
7876e68Q71O25m32r49n62J034J102n80j308R4P71P63m76p41m22P69P56l02o67
$$ -568 303 928 496 -453 -1015 19 1121 541 -767 -673 98 861 385 -356 -778 -9 747 445 -222
7895b22m62L39Q20L39r47o53N22J086j70j048m56Q7J223P3o50n85J57P61L91l87
$$ -222 -684 -345 475 814 -133 -786 -264 822 652 -396 -852 -765 458 531 -119 -704 -547 214 605 218
7915B18j347O38Q71L76n60p29k02J066P73n93j172K3Q16N76l34j052j32J079O20
$$ 218 -1129 -491 380 756 196 -533 -735 331 1104 511 -661 -638 178 754 420 -632 -764 315 935
7934I35o39r10k92P29R83j59r66m93O91N41K69q34m37N27P16K20r99o05L39J188
$$ 935 296 -614 -906 -177 806 647 -319 -812 -121 420 689 -145 -582 -55 661 881 -118 -723 -384 804
7954H04n7r59m35j24R36P31p52j012K57P95O62p13j032K09J116N39q36r28O6Q44
$$ 804 747 -212 -647 -771 165 896 144 -868 -611 184 846 133 -899 -690 426 965 129 -799 -733 111
7974A11M63k52r21J00P48M24l20p67l81Q17Q37j78r77o42N06Q73L32p75q77L52
$$ 111 574 322 -599 -499 249 673 353 -414 -795 22 859 681 -296 -938 -432 441 773 -2 -879 -527
7994e27R86K28r34m02M75P08J78q13n24r0J113L28m65r97L42P01O00o37q86j24
$$ -527 459 687 -247 -649 -174 534 712 -101 -625 -715 398 726 261 -736 -394 307 907 270 -616 -740
8014g40Q38O86j59j236k19Q98M66J82j161l02P32Q53n70o29m33O31Q52j43p14
$$ -740 98 784 625 -611 -830 68 534 716 -445 -747 -15 838 268 -361 -794 -163 689 546 -168
8033a68m61N47O95R7q87p62M78J173o6p01k75j71O73N24n29q41J44J015M16o40
$$ -168 -629 -82 613 710 -177 -939 -461 712 646 -55 -330 -501 172 696 167 -674 -530 485 901 261
8053B61p78J5N67P12n80q00p0N42R68m65n92m53Q73M14j42r20j94M99O60j09q63
$$ 261 -517 -502 65 777 197 -603 -673 -131 837 372 -220 -673 200 614 472 -448 -642 -143 517 408 -455
8074d55l30N33J005j97p78m57J54J034L58j053l36J85Q00K17p95n30K07P89M97
$$ -455 -785 -252 753 556 -222 -679 -525 509 867 -186 -522 -337 463 680 -115 -645 -438 351 848
8093H48n79r34p3J382P0n18p24R1P57M06m63o67k65P22Q85o14j058n0O51Q70k14
$$ 848 269 -665 -738 644 714 196 -528 -437 320 726 263 -404 -669 53 938 324 -734 -784 -133 737 523
8114E23q61k29N89P91k84q49m39M07P59p1o60m96K88J011p9j30q80J88P98O34
$$ 523 -338 -567 22 813 529 -320 -759 -352 407 336 -324 -820 -532 479 400 270 -610 -422 376 1010
8134A010q48j123N99N14O53o82q09O2Q57N27m67p87j94Q96O56p69o22r7M81J123
$$ 1010 162 -961 -362 152 805 123 -686 -624 233 760 293 -494 -688 208 864 95 -527 -624 -143 980
8154I80n32o09n57M57P55r1q99k3M99P39J69q34o52J36Q30L41p52m83J52Q30L
$$ 980 448 -161 -718 -261 494 403 -496 -519 -20 719 888 54 -598 -462 368 709 -43 -526 -374 456 459
8175D59l13q63K07Q82J35m57n76K7O32L96j10o09l33P29M40l58
$$ 459 146 -717 -510 372 507 50 -526 -499 133 529 419 -190 -523 206 646 288
8191B88
$$ Imaginary data points
##PAGE= N=2
##DATA TABLE= (X++(I..I)), XYDATA
0@%%%%%%%%%%%%Qj6J5j5J6j6K4l2L2l9N1o0O5p5R0j02J17j38J58j76K02k29K54
$$ 0 0 0 0 0 0 0 0 0 0 0 0 0 8 -8 7 -8 8 -8 16 -16 16 -23 28 -32 33 -42 48 -54 63 -75 83 -93 109 -120 134
35A34k88L25l61M03m52N01n53O16o80P49q31R17j007J110j222J344j482J637j808
$$ 134 -154 171 -190 213 -239 262 -291 325 -355 394 -437 480 -527 583 -639 705 -777 860 -948
54i48J996k214K464k749L086l486L968m571N343o364P795r940J3484k0359L8385
$$ -948 1048 -1166 1298 -1451 1635 -1851 2117 -2454 2889 -3475 4320 -5620 7864 -12495 25890
69B5890j67945m74550L86996O56495Q5669n42040m44235J79742N98039K35248
$$ 25890 -142055 -616605 -229609 426886 512555 -29485 -473720 -293978 304061 539309
79E39309m64295n71197J14013O37467K78584m51936n40511O3912N49303L31896
$$ 539309 75014 -496183 -382170 255297 533881 81945 -458566 -394654 154649 486545
89D86545l02349n81773q7874N59703M45948k84231n92159r9482M94885M42830
$$ 486545 184196 -397577 -485451 74252 520200 235969 -356190 -455672 39213 482043
99D82043j60533n63098k38091M17169N26283r0970n98479k87958M05247N22584
$$ 482043 321510 -241588 -479679 -62510 463773 372803 -225676 -513634 -108387 414197
109D14197m7184n18478l23449K78395N50757J00178n24431m43464K57114N92574
$$ 414197 367013 -151465 -474914 -196519 354238 454416 -70015 -513479 -256365 336209
119C36209J25893m76162m40580J55145N46069K34761l90991n16174N1381N65628
$$ 336209 462102 -14060 -454640 -299495 246574 481335 90344 -425830 -374449 191179
129A91179L04159l79340n30912K7256N14212L28810k59320n23623j04826M84674
$$ 191179 495338 115998 -414914 -387658 126554 455364 196044 -327579 -432405 52269
139E2269M31569k18299n63707j44560M46618M31778j40895n18718k23889L59461
$$ 52269 483838 265539 -298168 -442728 3890 435668 294773 -223945 -447834 -88373
149h8373M80129l2428n20470l10689L29527N09755j765m83270l22428K40345M97250
$$ -88373 391756 359328 -161142 -471831 -142304 367451 365686 -117584 -440012 -199667 297583
160B97583J11859m39600m08856J86503N32976J60285m17903m34836J18529N03449
$$ 297583 409442 -30158 -439014 -252511 280465 440750 22847 -411989 -293460 209989
170B09989K24330l42645m65836J8628M95146L16029l01677n06108k1900M69979
$$ 209989 434319 91674 -374162 -355534 139612 455641 153964 -352144 -374044 95935
180I5935L30707k26552m89238j17039M20839M04281j60495n10650j73093L94737
$$ 95935 426642 200090 -289148 -406187 14652 418933 258438 -252212 -425305 -30568
190c0568M33236j04972m93563k26726L24993M49387q808m65502l09088K72809
$$ -30568 402668 297696 -195867 -422593 -97600 351787 342979 -122523 -431611 -158802
200a58802M86072M0462m40473l25857K05373M61501J13218l92797l80977J39709
$$ -158802 327270 367732 -72741 -398598 -193225 268276 381494 -11303 -392280 -252571
210b52571M73513J75405l58082m15162Q4370M66584K25630l01875m27597J424
$$ -252571 220942 396347 38265 -376897 -292527 174057 399687 97812 -329785 -328361
220c28361M35424K99365k45549m61519n1466M18493L27669j86124m52362j24302
$$ -328361 107063 406428 160879 -300640 -352106 66387 394056 207932 -244430 -368732
230c68732L72973L73011j26885m59032j83901L35301M09077o7564m52859k29408
$$ -368732 4241 377252 250367 -208665 -392566 -57265 351812 284248 -168611 -398019
240c98019K90851M23320O667m21504k97215K31746M52149O3537l99004l25415
$$ -398019 -107168 316152 322819 -98685 -395900 -164154 287995 351532 -47472 -372887
250c72887J70977M39816J27793l54731l62803J10760M31765J80905l12689l94600
$$ -372887 -201910 237906 365699 10968 -351835 -241075 190690 371595 58906 -335694
260c35694N2661M25737K24958k66888l99950j1587L95705K84747k10323m22593
$$ -335694 -283033 142704 367662 100774 -299176 -310763 84942 369689 159366 -263227
270b63227o6992L71968L13995j52864m17526j30272L32276L49603r7372m10788
$$ -263227 -330219 41749 355744 202880 -214646 -344918 -12642 336961 239589 -171199
280a71199j81993K88488L77483m2015m06705k23930K50346L88952J9109l80616
$$ -171199 -353192 -64704 312779 270764 -135941 -359871 -109525 279427 298536 -82080
290h2080k80159K00235M16018P4173l58511l12262J42485M09725J34445l21375
$$ -82080 -362239 -162004 254014 328187 -30324 -342586 -200101 209624 344069 22694
300B2694l45526Q8556L98999J82065k77587l71649L3757L92368K21157k38014
$$ 22694 -322832 -234276 164723 346788 69201 -302448 -268691 123677 344834 106820
310A06820l77834k3758L63312K73066j85404l95793p4726L40005L01347j30210
$$ 106820 -271014 -294772 68540 341606 156202 -239591 -314317 25688 327035 196825
320A96825l88765j32150L01356L30485p7229l76917j80396K54211L53966k2383
$$ 196825 -191940 -324090 -22734 307751 230522 -146395 -326791 -72580 281386 259003
330B59003l68421k18230K16272L59009L1873l40137k66019J67589L79083Q2679
$$ 259003 -109418 -327648 -111376 247633 279506 -60631 -326650 -159061 220022 302701
340C02701l18474k96811J14918L76600J39874k84388l26410O3134L64615J87411
$$ 302701 -15773 -312584 -197666 178934 318808 34420 -291990 -228856 135759 323170
350C23170k38969l52084Q318L57355K23690k02672l55600m3437L26677K67521
$$ 323170 84201 -267883 -259565 97790 321480 118808 -236792 -280229 46448 313969
360C13969j52827l70097r1326L05127K95920j02731l66403j43795K71125L20915
$$ 313969 161142 -208955 -300281 4846 300766 198035 -168368 -312163 -41038 279877
370B79877n1691l49501j88944K20922L42079N065l38473k22802J83655L40681
$$ 279877 228186 -121315 -310259 -89337 252742 257807 -80666 -303468 -119813 220868
380B20868N0989l07073k61545J34989L49704R7342k82314k87460Q5430L47939
$$ 220868 271857 -35216 -296761 -161772 187932 285274 2960 -284500 -199070 148869
390A48869J48287k50035l10995L8998L32151J90007k02682l31759j4436L23481
$$ 148869 297156 47121 -263874 -224876 107275 297282 94600 -237159 -251595 71886
400G1886K25729j68313l33706n9831K93869K60370j24263l42711j04634K68651
$$ 71886 297615 129302 -204404 -264235 29634 290004 165741 -176970 -281604 -12953
410a2953K84480p7482l41483j50808K43750L09732l3578l25838j89648J96936
$$ -12953 271527 194045 -147438 -298246 -54496 255236 221658 -104180 -293828 -96892
420i6892L28386K0921l15080k25162J60638L27878O4175k84023k55873J15444
$$ -96892 231494 252415 -62665 -287827 -127189 200689 264864 -19159 -275032 -159588
430a59588L30034J03522k57329k78823O5793L26134J49842k29054k98373K7050
$$ -159588 170446 273968 16639 -262184 -196391 129743 279585 50531 -247842 -220792
440b20792L10939J88484j80819l12234k5384K97060K21529j44670l15090p1832
$$ -220792 90147 278631 97812 -214422 -239806 57254 278783 134113 -180977 -252809
450b52809K67430K51265j01950l17857j09428K38789K70842n5462l14162j54281
$$ -252809 14621 265886 163936 -153921 -263349 -24560 246282 190820 -123342 -277623
460b77623K14139K92626j7475l00862j88163J74190L11361L4689k87394k21937
$$ -277623 -63484 229142 211667 -89195 -277358 -103168 208193 242882 -44512 -266449
470b66449J36279L12250P7621k62046k54275R3456L12118J11420k33225k70269
$$ -266449 -130170 182080 259701 -2345 -256620 -163164 148954 260374 27149 -243120
480b43120M7474L06854J56425k05310k90290J0726K92143J89144j62599l01140
$$ -243120 -195646 111208 267633 62323 -227967 -217241 74902 264046 101447 -199693
490a99693l7146K76828K21069j22728k99506q2149K46993K48358q3279l01827
$$ -199693 -236839 39989 261058 138330 -161176 -243325 3668 252026 168747 -133080
500a33080j17754K14742K60793l7129k90376j57780J87349K79725N28k75316j88189
$$ -133080 -250834 -36092 224701 187572 -102804 -260584 -73235 206490 207018 -68298 -256487
511b56487J49411K92802M3652k62721k17221J13628K92998Q8396k34356k47578
$$ -256487 -107076 185726 229378 -33343 -250564 -136936 156062 244458 10102 -237476
521b37476P3444K94692J21439k08550k62431K8347K83834J59408j80192k77387
$$ -237476 -164032 130660 252099 43549 -218882 -190535 93299 252707 72515 -204872
531b04872o269K70321J91860j41251k89703m9360K56653K17814j06390k88592
$$ -204872 -211141 59180 251040 109789 -179914 -229274 27379 245193 138803 -149789
541a49789r3089K26659K47610o3680k85830j26456J96501K59550j8774k73439
$$ -149789 -242878 -16219 231391 167711 -118119 -244575 -48074 211476 192702 -80737
551h0737j63697J64108K69035J7095k53601j91707J25945K79741N9027k39911
$$ -80737 -244434 -80326 188709 205804 -47797 -239504 -113559 166182 225209 -14702
561a4702k15656R0870K73899R8669k10087k43076M8382K72904J33172j79615k53752
$$ -14702 -230358 -139488 134411 233080 22993 -220083 -171701 101203 234375 54760 -198992
572a98992P923K62388J66795j50925k63526k7158K42560J93585j14062k74408
$$ -198992 -191069 71319 238114 87189 -176337 -203495 39065 232650 118588 -155820
582a55820o6511K31033K17637q2372k70864j03446K02997K41553m3116k69687
$$ -155820 -222331 8702 226339 143967 -126897 -230343 -27346 214207 171091 -98596
592i8596j37456J72539K55166M4k57365j69749J44803K62407L3621k34450j94674
$$ -98596 -236052 -63513 191653 191697 -65668 -235417 -90614 171793 205414 -29036 -223710
603b23710J02524K66668P2438k19607k16112P1048K61694J08735j89168k35870
$$ -223710 -121186 145482 217920 -1687 -217799 -146751 114943 223678 34510 -201360
613b01360L2842K55658J39047j57864k47153j0451K42623J70978j28964k52174
$$ -201360 -168518 87140 226187 68323 -178830 -189281 53342 224320 95356 -156818
623a56818m1291K20344J92785r0131k56467p9582K03716K11755o1272k53051j11636
$$ -156818 -198109 22235 215020 124889 -131578 -211160 -7444 204311 143039 -110012 -221648
634b21648J79983K33201k5683k48124j39731J51648K45538J6067k38409j73707
$$ -221648 -41665 191536 165853 -82271 -222002 -70354 175184 191251 -47158 -220865
644b20865J23872K52097M6129k16591j94008Q5282K54047Q2894j99328k13644
$$ -220865 -96993 155104 201233 -15358 -209366 -124084 129963 212857 13529 -200115
654b00115N3505K48100J13932j74033k32915K0043K41898J42690j40815k39025
$$ -200115 -146610 101490 215422 41389 -191526 -171483 70415 213105 72290 -166735
664a66735k1735K27767J75141j11765k44430n2903K04492J92611p3727k42970
$$ -166735 -188470 39297 214438 102673 -141757 -194660 9832 202443 128716 -114254
674a14254q7455J83709K08256m1273k35742j19596J57711K24177j0974k30071
$$ -114254 -201709 -18000 190256 148983 -86759 -206355 -48644 175533 164559 -65512
684f5512j42839J28388K31533K9265k15927j73023J02795K39623N9015j96064
$$ -65512 -208351 -79963 151570 180835 -35092 -208115 -105320 134303 193318 -2746
694b746j92149O6511K39387R1824j77082k08126L5200K32241J22669j52482k25459
$$ -2746 -194895 -128384 111003 202827 25745 -182381 -147181 85060 207729 55247 -170212
705a70212M672K25849J44812j25057k31785l4153K11085J75687r5609k36067o3552
$$ -170212 -165540 60309 205121 80064 -151721 -185874 25211 200898 105289 -130778 -194330
716a94330J90433J94624n8036k34347r6437J68022K05765k5848k22169j26111
$$ -194330 -3897 190727 132691 -101656 -198093 -30071 175694 149846 -72323 -198434
726a98434J39368K19905M517k13303j46444J11332K21456L9724j98530j73064
$$ -198434 -59066 160839 165356 -47947 -194391 -83059 138397 178121 -20409 -193473
736a93473Q3408K25999O9241j76039j90415M8970K25093J00527j55702k01690
$$ -193473 -110065 115934 185175 9136 -181279 -132309 92784 193311 37609 -164081
746a64081J7168K13307J28677j29972k17007j1461K06414J47800j03840k19931
$$ -164081 -146913 66394 195071 65099 -151908 -163369 43045 190845 87005 -132926
756a32926m6087J92134J74239p7135k24464p4302J71772J93339m1833k22913j04378
$$ -132926 -179013 13121 187360 110225 -114239 -188541 -16769 176570 134737 -88176 -192554
767a92554J51654K04143r916k09693j33326J21835K15230J8958j99835j51964
$$ -192554 -40900 163243 153327 -56366 -189692 -67857 147373 166331 -33504 -185468
777a85468R3035K15129N2464j82451j74374O6184K15634P9996j58981j90005L2039
$$ -185468 -92433 122696 175160 -7291 -181665 -115481 100153 180149 21168 -168837 -136798
788a36798K13163J08750j37556j98101K425J98358J35094j09364k08398k7661
$$ -136798 76365 185115 47559 -150542 -148117 50241 185335 75971 -132427 -160088
798a60088J87001J51594q3004k08620n9446J71357J72345n8275k08952q3314J51170
$$ -160088 26913 178507 95503 -113117 -172563 -1206 171139 112864 -96088 -179402 -28232
809b8232J88533k5535k07586j11323J32921J98537M093j94954j37930J05048K08739
$$ -28232 160301 134766 -72820 -184143 -51222 147315 151408 -43546 -181476 -76428 132311
820A32311L2368j83641j54507P6703K06745O2677j67656j74455N2239K05797Q6344
$$ 132311 164679 -18962 -173469 -96766 109979 172656 5000 -169455 -117216 88581 174925
831A74925j45398j87561K0174K02616J13760j24719j94467q881J87321J38667
$$ 174925 29527 -158034 -137860 64756 178516 53797 -140670 -149551 37770 176437
841A76437r5838k01953l7238J73852J52110o7132j99318o7054J55898J69758m3131
$$ 176437 80599 -121354 -158592 15260 167370 100238 -99080 -166134 -10236 159522 116391
852A16391j96460q9793J34238J81682j2423j93061j14017J15439J89666J5087
$$ 116391 -80069 -169862 -35624 146058 133635 -59426 -173443 -58004 131662 146749
862A46749j79174j38649Q8779J98950M2374j67617j53411O1537J95971P1614j50977
$$ 146749 -32425 -171074 -82295 116655 159029 -8588 -161999 -100462 95509 167123 16146
873A6146j71284L7507J93045R3376j29666j82888P552J89715J16815j10499j88990
$$ 16146 -155138 -117631 75414 168790 39124 -143764 -136212 53503 170318 59819 -129171
884a29171j9437J75275J40474q3009j95941m6164J62803J54336n4934j91686p5341
$$ -129171 -148608 26667 167141 84132 -111809 -157973 4830 159166 104232 -87454 -162795
895a62795J43446J69107l0028j86339r5861J19277J78440q47j80504j17748J00052
$$ -162795 -19349 149758 119730 -66609 -162470 -43193 135247 134400 -46104 -163852 -63800
906f3800J82278K5547j65153j40192P3299J89346N2047j51960j53304M6027J85870
$$ -63800 118478 144025 -21128 -161320 -88021 101325 153372 1412 -151892 -105865 80005
917H0005Q0644j33549j67955K2238J79217J00222j11097j77059o903J74487J20262
$$ 80005 160649 27100 -140855 -118617 60600 160822 49725 -127334 -134237 40250 160512
928A60512r3379j81171l0758J60133J41377o7819j87828n6401J48299J54810m1287
$$ 160512 67133 -114038 -144796 15337 156714 88895 -98933 -155334 -7035 147775 106488
939A06488j83724q2766J30068J68475j7193j75257j02135J05291J75956J1143
$$ 106488 -77236 -160002 -29934 138541 121348 -53909 -156044 -50753 125203 136346
949A36346j70162j22106Q6962J76688L4614j53833j40045N9908J81823N9297j39139
$$ 136346 -33816 -155922 -68960 107728 142342 -11491 -151536 -91628 90195 149492 10353
960A0353j52949L3563J76288Q6443j19935j64835J0647J67645J05220r5011j70465
$$ 10353 -142596 -109033 67255 153698 33763 -131072 -120425 47220 152440 57429 -113036
971a13036j9289J60556J23757p6841j73465m2104J44083J40657n1967j76429o4882
$$ -113036 -132325 28231 151988 75147 -98318 -140422 3661 144318 92351 -84078 -148960
982a48960J30621J52866k5395j72490r0428J14197J65030l842j63925j07603Q9677
$$ -148960 -18339 134527 109132 -63358 -153786 -39589 125441 121599 -42326 -149929 -60252
993f0252J71274K5097j55838j26468P0774J71417M5788j40994j42011M6367J72681
$$ -60252 111022 136119 -19719 -146187 -75413 96004 141792 798 -141213 -94846 77835
1004G7835O7078j26133j51601K0866J68067R3066j07773j62655j010J58888J09098
$$ 77835 144913 18780 -132821 -111955 56112 149178 41405 -121250 -122260 36628 145726
1015A45726q2498j66622k9091J48501J26751o2659j65494n0869J31442J40349
$$ 145726 63228 -103394 -132485 16016 142767 80108 -85386 -136255 -4813 135536
1025A35536l9588j66680p0945J15846J48518j4174j60365r4542R9255J60300P556
$$ 135536 95948 -70732 -141677 -25831 122687 108513 -51852 -146394 -47139 113161 120717
1036A20717j51995j10260P5906J63932L4177j42407j26991N6445J62870N4764
$$ 120717 -31278 -141538 -65632 98300 132477 -9930 -136921 -80476 82394 137158
1046A37158j26323j41434L4896J63536P2268j12492j48383R986J56868R5579r5636
$$ 137158 10835 -130599 -95703 67833 140101 27609 -120774 -110788 46080 141659 46023
1057D6023j58537r673J49463J11592p2149j61432l5252J38605J26450n2120j59736
$$ 46023 -112514 -122187 27276 138868 66719 -94713 -129965 8640 135090 82970 -76766
1068g6766n7330J21284J39914k9125j58783p4916J05289J45051n216j50080r7855
$$ -76766 -134096 -12812 127102 97977 -60806 -135722 -30433 114618 109402 -40678 -138533
1079a38533Q6894J54064J5193j41117j11561O4395J57455M1134j29882j25788
$$ -138533 -51639 102425 117618 -23499 -135060 -70665 86790 127924 -1958 -127746
1089a27746M3997J53838O2881j12155j39596K0633J53050P9104r7241j43914j938
$$ -127746 -83749 70089 132970 20815 -118781 -98148 54902 134006 36765 -107149 -109087
1100a09087J44130R9250q0058j52341k1351J35202J13232n8656j55390m4663J26410
$$ -109087 35043 134293 54235 -98106 -119457 15745 128977 70321 -85069 -129732 -3322
1111c322J27961l9035j51584o4388J08360J39653j6360j50059q1436R2918J42767
$$ -3322 124639 85604 -65980 -130368 -22008 117645 101285 -48774 -130210 -37292 105475
1122A05475N219j40871j00414P5327J49085K3775j31382j13233N2790J51166M6897
$$ 105475 110694 -30177 -130591 -55264 93821 117596 -13786 -127019 -74229 76937 123834
1133A23834j19694j26052L4225J46607O7690r9963j36675J1160J43585Q3822q5152
$$ 123834 4140 -121912 -87687 58920 126610 26647 -110028 -98868 44717 128539 43387
1144D3387j39655j1014J33182J00925o8018j44954k9212J23278J12682m6513j46837
$$ 43387 -96268 -107282 25900 126825 58807 -86147 -115359 7919 120601 74088 -72749
1155g2749n1436J14033J24398k8691j42445o9272R6295J36061o137j39788q4600
$$ -72749 -124185 -10152 114246 85555 -56890 -126162 -29867 106194 100057 -39731 -124331
1166a24331Q0977J38971J4593j30310j02670O3581J43097L1276j19994j13611
$$ -124331 -43354 95617 110210 -20100 -122770 -59189 83908 115184 -4810 -118421
1176a18421M2216J44083N2904j09521j24430K4671J39395P1426r0992j34411K486
$$ -118421 -76205 67878 120782 11261 -113169 -88498 50897 122323 31331 -103080 -100594
1187a00594J36085Q7008p3770j36737j9128J24064J03355n6438j39249l6896J11454
$$ -100594 35491 122499 48729 -88008 -107136 16928 120283 63845 -75404 -112300 -846
1198h46J12777l5186j38541n7325J01169J22950j7617j33479p3835Q3627J32123
$$ -846 111931 76745 -61796 -119121 -17952 104998 87381 -46098 -119933 -36306 95817
1209I5817L845j29358q8416O7875J34027K4329j18556j04124N0702J36387M0055
$$ 95817 99662 -29696 -118112 -50237 83790 108119 -10437 -114561 -63859 72528 112583
1220A12583j07149j13198K9704J35364N9230r7519j22732J4060J30806P6145q0175
$$ 112583 5434 -107764 -78060 57304 116534 19015 -103717 -89657 41149 117294 37119
1231C7119j31518n915J26404R0407o4103j32295k7509J15710J05183m6211j34007
$$ 37119 -94399 -100314 26090 116497 52394 -79901 -107410 8300 113483 67272 -66735
1242f6735m3345J02824J13064k5402j32225o2406R0663J20713q690j25292p7862
$$ -66735 -110080 -7256 105808 80406 -51819 -114225 -23562 97151 88461 -36831 -114693
1253a14693P3122J28343J1458j20012r0196N7004J28576L1624j08715j04593M0292
$$ -114693 -41571 86772 98230 -21782 -111978 -54974 73602 105226 -3489 -108082 -67790
1264f7790J29929M6365r5729j11894J9951J27167O3822q4967j19106M275J20765
$$ -67790 62139 108504 12775 -99119 -79168 47999 111821 26854 -92252 -87977 32788
1275C2788P7931o9176j26201j3677J16758Q9908n3962j26720l2703J06384J05276
$$ 32788 110719 41543 -84658 -98335 18423 108331 54369 -72351 -105054 1330 106606
1286A06606l8090j28460m7701R3878J12016j6988j25448o5281Q2132J17930j573
$$ 106606 68516 -59944 -107645 -13767 98249 81261 -44187 -109468 -27336 90594 89021
1297H9021j17677p9703O4443J24187J6771j12635r1194M8976J23927L6446j00870
$$ 89021 -28656 -108359 -43916 80271 97042 -15593 -106787 -57811 66116 102562 1692
1308A692j04161L2131J23966N0846q6461j10605J1887J19770O8200p5083j15311
$$ 1692 -102469 -70338 53628 104474 18013 -92592 -80705 39065 107265 32182 -83129
1319h3129l692J11525Q0534n8375j20710k1311J05916R0434m3705j20164l9201
$$ -83129 -86821 24704 105238 46863 -73847 -95158 10758 101192 57487 -62677 -101878
1330a01878R5548J03485k7655j20371n2988Q3097J10371p982j17058o8932P1068
$$ -101878 -6330 97155 69500 -50871 -103859 -20762 89609 81627 -35431 -104363 -33295
1341c3295J15407O785j09091q1837N4648J19990K3284j03724r1833L9597J18437
$$ -33295 82112 88897 -20194 -102031 -47383 72607 95891 -7833 -99666 -60069 58368
1352E8368M1794r2672j03682K3396J18498N5451p8369j09072M075J13450P1554
$$ 58368 100162 7490 -96192 -72796 45702 101153 22784 -86288 -82213 31237 102791
1363A02791o5611j12680j1522J03872Q3177m8403j16531k8091R6560R1466l3662
$$ 102791 37180 -75500 -87022 16850 100027 51624 -64907 -92998 3562 95028 61366
1374F1366j14304m5002Q5321J02066j8888j12718n7275P2506J07620L20j08718
$$ 61366 -52938 -97940 -12619 89447 70559 -42159 -99434 -26928 80692 81012 -27706
1385b7706p2275O1056J11333J5460r9703q3692M4660J14265L0569r3807r1571
$$ -27706 -99981 -38925 72408 87868 -11835 -95527 -50867 63398 93967 160 -91411
1396i1411L0166J11848M6066q2837j02452J6074J11189N8617p0473j07029k485
$$ -91411 -61245 50603 96669 13832 -88620 -72546 38643 97260 26787 -80242 -82727
1407h2727J07166P3547n7780j10254j7067R7234Q5116m1242j12361l2582Q9498
$$ -82727 24439 97986 40206 -70048 -87115 10119 95235 53993 -58368 -90950 -1452
1418a452R1237k6446j08783m8966P7456J00530j2047j06868n9936O4616J04658
$$ -1452 89785 63339 -45444 -94410 -16954 83576 71529 -35339 -95275 -30659 73999
1429G3999O018j01679p3641N2540J07619K0760r2112q4022L6574J09551L5055
$$ 73999 80017 -21662 -95303 -42763 64856 85616 -6496 -90518 -53944 55607 90662
1440I0662q4672r0696K2430J05672M9728p3977r9509Q753J04047N9979o1725j03489
$$ 90662 5990 -84706 -62276 43396 93124 19147 -80362 -71609 32438 92417 30692 -72797
1452g2797q111R9836P3143n0602j05502k1907R1038Q4359l4292j08050l6484Q3221
$$ -72797 -80908 18928 92071 41469 -64033 -85940 5098 89457 55165 -52885 -89369 -6148
1464f148R0907k0645j03884n1145P1109R8348o186j01451o1787N8241J01578J0288
$$ -6148 84759 64114 -39770 -90915 -19806 78542 72356 -29095 -90882 -32641 68937 79225
1476G9225r6367p3930M6803J03169K4433q5681q4035L0326J04644L9280p7749
$$ 79225 -17142 -91072 -44269 58900 83333 -2348 -86383 -56057 48587 87867 10118
1487A0118q9607J5768J00481N2773o5720r6572K109R6346O2088n3169r9324j4198
$$ 10118 -79489 -63721 36760 89533 23813 -72759 -70650 25696 87784 34615 -64709 -78907
1499g8907R1662P3942m2626j00891k6562Q2233Q3785k6664j02569m0775P4931
$$ -78907 12755 86697 44071 -56820 -83382 -1149 82636 55972 -46597 -87372 -12441
1510a2441Q9749j2253r8189n4192O3071R6171M19r4391o3501M9747R8796J5711
$$ -12441 77308 65055 -33134 -87326 -24255 71916 72335 -22056 -85557 -35810 62986 78697
1522G8697q9248p5182L9214R9692K8609p9498q3859K3424J00202M3088p0925q8651
$$ 78697 -10551 -85733 -46519 53173 81782 2284 -81575 -58151 42051 85139 14214 -74437
1534g4437R337R5053N5965n8302r4676l909R0562O4659m5446r6069j9833Q3820
$$ -74437 -65100 29953 85918 27616 -67060 -70969 19593 84252 38806 -57263 -77096 6724
1546F724P5073l4405r6614l1062P4101Q3023j9637r6786m4287O6066Q8263n908
$$ 6724 81797 47392 -49222 -80284 -6183 76840 57203 -39583 -83870 -17804 70459 64551
1558F4551r1831n7171N5297R3896O698q6817o5328M2040R4290K1816q1292p5802
$$ 64551 -27280 -84451 -29154 64742 71440 -15377 -80705 -38665 55625 77441 -3851 -79653
1570g9653L2135R4289L2707p2357q2813J7501R4933M4698o3882q7313L882R0309
$$ -79653 -47518 46771 79478 7121 -75692 -58191 36742 81440 17558 -69755 -65873 24436
1582B4436N7708n2419r2430q264Q5284O5597l9145r2589k3323P8185P4572k8448
$$ 24436 82144 29725 -62705 -70969 14315 79912 40767 -51822 -75145 3040 77612 49164
1594D9164r2132l4449O8543Q0994j4611r1729m5928O0053Q5091j201q6253n8286
$$ 49164 -42968 -77417 -8874 72120 57509 -34220 -80148 -20095 64996 63795 -22458 -80744
1606h0744M8683R0781J1358q1057o5922L5509R0989K5910p4694p4021K4745Q9274
$$ -80744 -32061 58720 70078 -10979 -76901 -41392 49597 75507 813 -73208 -48463 40811
1618D0811L6310o5089q1104J0967Q9246M7036n6940q4748j672Q4022N8803m5505
$$ 40811 77121 12032 -69072 -58105 31141 78177 21237 -63511 -65183 18839 77642 32137
1630C2137q9887j2662P9128O6222l2737q9197k6776P2276P4552k2325q8104l7482
$$ 32137 -57750 -70412 8716 74938 42201 -46996 -73772 -1496 73056 50731 -37373 -74855
1642g4855O2306Q0208r162q6848m8131N3466Q3196L900q1665n8964M2240Q7232
$$ -74855 -12549 67659 58497 -28351 -76482 -23016 60180 64080 -17585 -76549 -34309 52923
1654E2923J5379p5350o6190K9796Q7136K9199o8191p3948J9069Q4984L9437n7582
$$ 52923 68302 -7048 -73238 -43442 43694 72893 4702 -69246 -50177 34807 74244 16662
1666A6662p9820N216Q3422M9316m9766q1529p338P7259O0228l8957q5468j8296
$$ 16662 -63158 -57942 25480 74796 25030 -56499 -63837 13422 73650 34693 -50775 -69071
1678f9071P2508O6883k6242q5614l0921O5098P4174j5102q2974m0874N4762P9072
$$ -69071 3437 70320 44078 -41536 -72457 -7359 66815 51713 -31261 -72135 -17373 61699
1690F1699k990q0648n0467M6843Q0556Q309p5039o0722L6264Q3996J9442p0089
$$ 61699 58709 -21939 -72406 -25563 54993 63302 -11737 -72459 -36195 47801 67243 -2846
1702b846o6469K3570Q4212L2449o2684p2860J3016Q0676M2283n2059p7750Q36
$$ -2846 -69315 -45745 38467 70916 8232 -64628 -51612 29064 71347 19288 -58462 -57626
1714e7626P8235N1030m3547p9295j1540P2514N9883l2583q1949k1927O5751O6722
$$ -57626 20609 71639 28092 -51203 -62743 9771 69654 37071 -44878 -66805 -1054 65668
1726F5668k0616q1235l3970N9261P2851j0345p8041m3407M8592P7669K711p5906
$$ 65668 45052 -36183 -70153 -10892 61959 51614 -26427 -69834 -21242 56427 59138 -16768
1738a6768n2115M0455P7755J3356o9353o0676K9925Q0112K2883o4038o6251J8562
$$ -16768 -68883 -28428 49327 62683 -6670 -67346 -37421 42691 65574 1536 -64715 -46153
1750d6153P9364L4885n6871p2013Q369P6478M4075m6089p6190m066P3765N2710
$$ -46153 33211 68096 11225 -60788 -52419 24059 68134 22045 -54145 -58211 15554 68264
1762F8264l7735p6848j5369O7270O0889k7377p8653k4999O0683O5369j5311p7385
$$ 68264 30529 -46319 -61688 5582 66471 39094 -39559 -64558 -3875 61494 46183 -31202
1774c1202l6788N3578P1290m960p3876m5533M2506P5642P702p0032n3952L3339
$$ -31202 -67990 -14412 56878 51918 -21958 -67491 -24985 50657 58359 -11673 -65625 -32286
1786c2286P5528J8841o3084o1385K2967P6190K7653n6910o6275J1804P4518L8300
$$ -32286 43242 62083 -1001 -62386 -39419 36771 64424 7514 -58761 -46957 27561 65861
1798F5861m9992p1302J982P1721M6739l9910p4226r469O7998N4562l0962p4420
$$ 65861 15869 -55433 -53451 18270 65009 25099 -49127 -58596 9402 63964 33002 -41418
1810d1418j9523O1537O1230k0741p4844k8750N4390O5469r445p3141l9425M7220
$$ -41418 -60941 596 61826 41085 -33759 -62509 -8119 57350 47905 -25236 -64661 -17441
1822a7441P0213l81o9261m7544L6813P3204J1799o5572n4505K7865P3136K1991
$$ -17441 52772 52391 -16870 -64414 -27601 45603 57402 -8170 -62675 -34810 38326 60317
1834F0317n7967o1320J7709P3049L0649n0796o5326O337P0190M0856m4295o9283
$$ 60317 2350 -58970 -41261 31788 62437 11641 -53685 -47348 22842 63698 19403 -49880
1846d9880k458O5882M7953l3646p2086j3654O2890N4769k5005p1574k3437N6121
$$ -49880 -52338 13544 61497 27851 -44235 -57889 5001 59770 34765 -36809 -60246 -4125
1858d125O1687j5469p0837l1797M8904O4696m830o8224m1447M1894O8003L553
$$ -4125 57562 42093 -28744 -60541 -11637 53059 48229 -19995 -61442 -19548 48455 52008
1870E2008o4623m8128L2061P0661J4353o1049n4930K3675O9920K4747n3438o1262
$$ 52008 -12615 -60743 -28682 41979 56332 -4717 -59647 -35972 33948 58695 5257 -56005
1882e6005J3373O9821L2668m5913o3856K037O6630M2416l8869o7174o697O1737
$$ -56005 -42632 27189 59857 13944 -49912 -47875 18755 61171 22302 -44872 -51569 10168
1894A0168M8398k8667o8947j7482N7537N5424k0250o7958k6598N0041O1215j0059
$$ 10168 58566 29899 -39048 -56530 1007 56431 36181 -31777 -58375 -8334 52881 42822
1906D2822o7404l4012M3120O3452N06o3878m3093L5702O6239Q118n9350m9007
$$ 42822 -24582 -58594 -15474 47978 48484 -15394 -58487 -22785 43454 51572 -7778 -56785
1918e6785K6392O7774J7705n5576n4810J8375O6324K7721m8344o0898Q993O5445
$$ -56785 -30393 37381 55086 -490 -55300 -36925 29399 57120 8776 -52122 -43129 22316
1930B2316L4933m0837o2594j878O2480M3578l3752o5215j0102N7463M9504k4230
$$ 22316 57249 16412 -46182 -48060 14420 57998 24246 -40969 -51071 6392 55896 31666
1942C1666o6415k0064N3197N4386j5550o4521k9198M5612N9885o266o3443l5935
$$ 31666 -34749 -54813 -1616 52770 37220 -27301 -56499 -10887 48998 42732 -20711 -56646
1954e6646L8368O2103M457n9581m4690L1002O3674J2405n4198m9674K0809O4558
$$ -56646 -18278 43825 48282 -11299 -55989 -24987 38687 51092 -3106 -52780 -31971 32587
1966C2587K1587n0547n4389J3114O2733K9794m3304n9695L777O2283L6793l6108
$$ 32587 54174 3627 -50762 -37648 25085 54879 11575 -48120 -44343 17940 54733 18625
1978A8625o1178n834N8206M5027k8270o2830j3695N2503N0272j9237o3364k2559
$$ 18625 -42553 -48387 9819 54846 26576 -36254 -49949 2554 52826 33589 -29775 -52334
1990e2334M7780N4239j0901o1356l2043M0910N8871j608o0310l7611L2842O0670
$$ -52334 -4554 49685 38784 -22572 -54615 -13705 45166 43558 -16752 -54363 -21521 39149
2002C9149Q587n5961m5388K5589O1906J6475m9744n0158J5987O1264K5252m4970
$$ 39149 47736 -8225 -53613 -28024 33882 50357 613 -49545 -33558 27706 52958 7988
2014G988n4304Q001N8999L2595l7856n8463r42N7186L8669l0434n9509j0321N3445
$$ 7988 -46316 -38315 20684 53279 15423 -43040 -43982 13204 51873 21439 -38070 -48391 5054
2027E054M5958k3176o0097j7686M8289N0227j3470o0493k5734M2676N4322o513
$$ 5054 51012 27836 -32261 -49947 -1658 48569 35099 -25394 -51128 -8452 45870 39357
2039C9357n7551l3498L5834N7652K120n6341l8923K8464N8826J1299n2233m6055
$$ 39357 -18194 -51692 -15858 41794 43914 -12427 -51350 -22886 35940 47239 -4994 -51049
2051e1049K1428N9677J8980m5819n0724J2363N8934K7179m0785n3313M138N5844
$$ -51049 -29621 30056 49036 3217 -47507 -35144 23790 50969 10184 -43129 -38991 16853
2063A6853L3975l3180n6606m099N3497L9231k6019n7298j3390M9453M6105j9175
$$ 16853 50828 17648 -38958 -43057 10440 49671 23652 -33646 -47036 2417 48522 29347
2075B9347n8001j9900M3319N0453r836n7371k7996L8874N2532k181n3378l5187
$$ 29347 -28654 -48554 -5235 45218 35382 -21989 -49985 -11111 41421 39240 -14138 -49325
2087d9325L1309N6225M910n1656l9745K4230N6346J3829m8124m5602J7566N6840
$$ -49325 -18016 38209 43119 -8537 -48282 -24052 32294 46123 -2001 -47603 -30037 26803
2099B6803K0604m1915m9917Q656N6286K8541l6870n2271Q72N2822L5236k9723
$$ 26803 47407 5492 -44425 -35769 20517 49058 12188 -40083 -39211 13611 48847 19124
2111A9124n4885o474M9662L9834k2445n4875j5596M5468M5568j4755n5659k2164
$$ 19124 -35761 -42235 7427 47261 24816 -30059 -45655 -187 45381 30626 -25033 -47197
2123d7197L9676M9388o095n4555k9102L4272N1738J275n0479l6073K6775N4174
$$ -47197 -7521 41867 35772 -18783 -47885 -13613 38125 39400 -11079 -47152 -20377 33797
2135C3797R300m7817m0276J9390N4377J6646m3588m5792J3118N3830K2823l7600
$$ 33797 43097 -4720 -44996 -25606 28771 45417 1829 -43963 -30845 22985 45808 8208
2147H208m9360M951N2680L0322l2459n1167k716M9078L6883k4919n3613j0195
$$ 8208 -41152 -36201 16479 46801 14342 -36825 -39541 9537 46420 21501 -32112 -42307
2159d2307M6410M0568j7865n2618j8371M1331M5742j1311n3108k3725L5162M9008
$$ -42307 4103 44671 26806 -25812 -44183 -2852 42890 31579 -21529 -45254 -10092 38916
2171C8916k952n1355l1067L0582N0570M300m7256l7102K2982N2699J1641m3512
$$ 38916 35964 -15391 -46458 -15876 34694 38994 -8262 -45364 -22382 30317 41958 -1554
2183a554m0759J5573N1470J9654l9114m5570R038N0638K5023l3138m8457Q02M9221
$$ -1554 -42313 -26740 24730 44384 5270 -40300 -31262 19376 44399 11261 -37196 -36394 12827
2196A2827L1954k8318m9853o452M5717L7692k0616n1525j3346M2386M1019j3330
$$ 12827 44781 16463 -33390 -39842 5875 43567 22951 -28574 -41920 466 41485 28155
2208B8155n0697k0436L7300M5661p287n0315k5612L1122M7895Q14m8383l2231
$$ 28155 -22542 -42978 -5678 39983 32696 -17619 -43231 -12109 35786 36600 -11783 -44014
2220d4014K6143M8936P556m3828l8090J9082N0732J4638m0418m1160J1752M9538
$$ -44014 -17871 31065 38621 -5207 -43297 -24215 26517 41155 737 -40423 -28671 20867
2232B0867K2095l5271m5051N362M7975K6717k8901m7146k648M6214L2459k3849
$$ 20867 42962 7691 -37360 -31998 15977 42694 13793 -33353 -36001 10213 42672 18823
2244A8823m8274r564M1959L7882j6619n0051j5639L8549M1411r659m8339k2894
$$ 18823 -29451 -39015 2944 40826 24207 -25844 -41483 -2934 38477 28818 -19521 -42415
2256d2415L3364M5673m018m6222k7620K7090M6757L889m4560l3464K2775M7070
$$ -42415 -9051 36622 32604 -13618 -41238 -14148 32609 36498 -8062 -41526 -18751 28319
2268B8319J0005m0333l8259J5167M8535J6543l6489m1568Q723M6916K3647l1847
$$ 28319 38324 -2009 -40268 -25101 23434 39977 3488 -38080 -29357 17559 41206 9359
2280I359m4018K121M5155K7873k5190m5877n047M3040L3310k0801m6153j1660
$$ 9359 -34659 -32538 12617 40490 15300 -30577 -35624 7416 40726 19925 -26228 -37888
2292c7888L8780L7853j3538m7414j7566L4684M0773o393m5850k4406L0177M3812
$$ -37888 892 38745 25207 -22207 -39773 -5089 35684 29291 -16559 -40965 -10788 33024
2304C3024n14m3117k9262K3729M5278P289m1362l3826J8280M5314J3182l7067
$$ 33024 32510 -10607 -39869 -16140 29138 36427 -4935 -38761 -20481 24833 38015 948
2316I48l8373J1509M5985J8906l3140m0943M604M4649K5371k7659m3929j051M2194
$$ 948 -37425 -25916 20069 38975 5835 -35108 -30504 14145 39516 11857 -32072 -33123 9071
2329I071K9742k1387m4576q185L9700L3895j6674m4256j4092L4947L8336j0478
$$ 9071 38813 17426 -27150 -35335 4365 38260 21586 -22670 -36762 -1815 36521 26043
2341B6043m4844j9419L1030M0234l457m3047k5852K6101M3128K378m0244k9919
$$ 26043 -18801 -38220 -7190 33044 29587 -13460 -39312 -13211 29917 32295 -7949 -37868
2353c7868J9836M4094R620l7778l4274J4418M3789J4862l2621l8552Q238M3599
$$ -37868 -18032 26062 35682 -2096 -36370 -21952 21837 36699 4078 -34474 -26236 17363
2365A7363K0136k9092m0480J652M1653K6662k4114m3187l557L8970L0759j8061
$$ 17363 37499 8407 -32073 -30421 11232 37894 13780 -29407 -32964 6006 36765 18704
2377A8704m3292j0647L6353L4701j2835m2549j5921L1380L7899o843m2348k1302
$$ 18704 -24588 -35235 1118 35819 22984 -19565 -35486 -4106 33793 26950 -15398 -36700
2389c6700K7315L9672p2m0534k7103K2663M1816N054l7399l1057J6699M2606J1954
$$ -36700 -9385 30287 30215 -10319 -37422 -14759 27057 32111 -5288 -36345 -19646 22960 34914
2402C4914l5002l4448J1326M2062J7225l0177l7715M934M1330K1919k5687l9716
$$ 34914 -88 -34536 -23210 18852 36077 5900 -31815 -26881 14449 36368 10681 -29035
2414b9035j143L9096K7580k1185m1306o603L6090L1166j4522m1635j3343L3161
$$ -29035 -30178 8918 36498 15313 -25993 -32596 3494 34660 20138 -21497 -34840 -1679
2426a679L4764r438m0476j8540K8330L7859k910m0003k2966K3810L8608L093l7665
$$ -1679 33085 23647 -16829 -35369 -7039 30820 27910 -12093 -35059 -11249 27359 30452 -7213
2439g213k8259J9291M0818P366l4892l0989J2907M0950J4083l2049l4616Q294
$$ -7213 -35472 -16181 24637 32003 -2889 -33878 -20971 19979 34062 2013 -32603 -24309
2451b4309M0088J8564k6572l7506K463L8840K3286k2702l8373l147L5954K8129
$$ -24309 15779 34343 7771 -29735 -27272 11568 34854 12152 -26221 -29368 6586 34715
2463C4715j7827m0091q566L3493L0966j1671m0322j4567L0297L4318o644l8667
$$ 34715 16888 -23203 -31769 1724 32690 21019 -19303 -33870 -3573 30745 24101 -14566
2475a4566j9915K4935L7927q06l7908k3851K1254L7588N639l4595k9128J6177
$$ -14566 -34481 -9546 28381 27575 -10333 -34184 -12930 24658 30297 -4298 -33426 -17249
2487a7249L9437R787l2154l1013J0107L8752J5607k8737l4702N673L7425K0296
$$ -17249 22188 31975 -179 -31192 -21085 17667 33274 4537 -30165 -24492 12933 33229
2499C3229k3812l7177m21L6716K4190j9494l6728o414L3487K9209j5140l7952
$$ 33229 9417 -27760 -28181 8535 32725 13231 -23497 -29911 3576 32785 17645 -20307
2511b0307j0698L0778L1231r089l8157j6513K7389L4170m073l6379k1488K2734
$$ -20307 -31005 -227 31004 21915 -16242 -32755 -5366 28804 24731 -11648 -33136 -10402
2523a0402L6683J367l5445k4740J8140L6328P697l1772k9255J2832L8029J1830
$$ -10402 26281 27648 -7797 -32537 -14397 21931 29628 -2144 -31399 -18567 19462 31292
2535C1292k8935l1523P152L7253J6992k5790l4119K450L5818K1255k0447l6591
$$ 31292 2357 -29166 -22014 15239 32231 6441 -27678 -25228 10590 31845 11398 -25193
2547b5193k924L4105K5270j6015l6460q441L0698K9698j1435l7040j2479K7369
$$ -25193 -28117 5988 31258 15243 -21217 -29658 1040 30738 19303 -17737 -30216 -2847
2559b847L1612o098l5899j8321K4605L3767k111l4576k2038J9615L5672L585l2640
$$ -2847 28765 22667 -13232 -31553 -6948 26819 24708 -9868 -31906 -12291 23381 26966 -5674
2572e674k5400J5150L5587R565k9610k9446J0652L6264J3237k5944l1561N077
$$ -5674 -31074 -15924 19663 29228 -382 -29828 -19176 17088 30325 4381 -27180 -22103
2584b2103L5028J8684k3365l3250OL3023K2472j8062l5080n289L1472K5927j3598
$$ -22103 12925 31609 8244 -25006 -25000 8023 30495 12433 -22647 -27936 3536 29463 15865
2597A5865l5025j0629K8762K9465q371l5074j4671K4828L1606l331l4253j9013
$$ 15865 -19160 -29789 -1027 28438 20067 -15007 -29678 -4850 26756 23425 -10828 -29841
2609b9841K1200L3224Q80l1866k3396J6836L4270O007l0411k6428J2671L4255
$$ -29841 -8641 24583 25463 -6403 -29799 -12963 21307 27314 -3097 -29525 -16854 17401
2621A7401J0932k7270k9448P771L4603J5151k3481l1049K291L3321J9907k0139
$$ 17401 28333 1063 -28385 -20614 13989 29140 5659 -25390 -23099 10222 30129 9990
2633I990l2651j912L0808K3500j5399l4519p097K9279K6422j1079l3912j2279
$$ 9990 -22661 -24573 6235 29735 14336 -20183 -27280 1999 28421 17342 -16570 -28849
2645b8849K5756K9619n807l3746j5792K1833L1021m83l2289k0569J8789L2346
$$ -28849 -3093 26526 20719 -13027 -28819 -6986 24035 23552 -8737 -29306 -10517 21829
2657B1829L480k9667k3771J3857L3396P726k7550k6554R566L2914J3090k4834
$$ 21829 25309 -4358 -28129 -14272 19124 26850 -700 -27254 -17688 15226 28316 3482
2669C482k9827N411L2480J6768k0888l0808k00L1293K1086j7390l2188m003K8639
$$ 3482 -26345 -20934 11546 28314 7426 -23382 -23582 7711 28797 11407 -20781 -24784 3855
2682C855K4127j2788l2948r025K7025K6510q795l2118j3748K3551K9229m240l1750
$$ 3855 27982 15194 -17754 -26779 246 26756 17961 -14157 -27905 -4354 24875 20635 -11115
2695a1115j6828J9438L0733J265l0222k1283J6164L1817N169k7631k4537J1858
$$ -11115 -27943 -8505 22228 23493 -6729 -28012 -11848 19969 25138 -2493 -27030 -15172
2707a5172L2148R648k5445k6741P332L1508J3809k2067k9084L026L0627J7749
$$ -15172 16976 26624 1179 -25562 -18230 13278 27087 5020 -24064 -21038 9589 27338
2719B7338j8659l0174k420K9503K1809j5128l0793o301K6573K4376j0212l1142
$$ 27338 8679 -21495 -23915 5588 27397 12269 -18524 -24825 1748 26124 15912 -15230
2731a5230j0784K4448K6644o233l0877j4759K1136K8722j799l0222j8005J7079
$$ -15230 -26014 -1566 25078 18845 -12032 -26791 -5655 23067 21268 -8954 -26959 -9880
2743i880L0225L112k8565k1944J3920L0818O913k5650k4637R602L1049J1032k3350
$$ -9880 20345 23457 -5108 -27052 -13132 17686 24599 -1051 -25688 -16086 14963 25995 2645
2756B645k6240M898L0137J5075j9991k8656Q92K9164J8317j6404k9344m196K7266
$$ 2645 -23595 -18697 11440 26515 6524 -22132 -21240 7924 26241 9837 -19507 -23703 3563
2769C563K2261j2822l0103p474K4494K4673q395k9786j2064K2539K6531m531k8889
$$ 3563 25824 13002 -17101 -24575 -81 24592 16197 -13589 -25653 -3114 23417 18886 -10003
2782a0003j5898J9095K8579j92k8786j8396J5074K9086M562k6538k2247J1726
$$ -10003 -25901 -6806 21773 21581 -7205 -25601 -10527 18559 23121 -3417 -25664 -13938
2794a3938K9668Q293k3709k4375O898K9965J2636k1286k6431L328K8609J6274
$$ -13938 15730 24023 314 -24061 -17163 12802 25438 4152 -22279 -18951 9658 25932
2806B5932j7998k8138p96K7352J8687j3779k9006n427K5506K2433j1042k8823
$$ 25932 7934 -20204 -21000 6352 25039 11260 -17746 -23173 2333 24766 13724 -15099
2818a5099r039K2462K4622o305k8796j2746K0053K5883j698k7346j6913J6647
$$ -15099 -24138 -1676 22946 16641 -12155 -24901 -4848 21035 19337 -8009 -24922 -8275
2830h275K7603K060k6205j9185J2526K8462O197k4526k2644R450K8423R562k1443
$$ -8275 19328 21388 -4817 -24002 -11476 16986 23183 -1343 -23987 -14537 13886 23448 2005
2843B005k4910N330K7965J3717j8521k5889O88K6817J7414j5125k7794k797K5712
$$ 2005 -22905 -17575 10390 24107 5586 -20303 -19615 7202 24616 9491 -18303 -21100 4612
2856D612J9507j1808k7837p121K3269K2661q476k7401j0900K0133K4889l708k7835
$$ 4612 24119 12311 -15526 -22647 622 23283 14807 -12594 -23494 -3361 21528 17820 -10015
2869a0015j4445J7905K5964N8k5905j7602J4656K7143L415k4180j9949J0416K7557
$$ -10015 -24460 -6555 19409 19467 -6438 -24040 -9384 17759 21174 -3006 -22955 -12539 15018
2882A5018P885k2358k2937P661K6761J1280j9550k4747K956K7092J4720j6965
$$ 15018 22903 545 -22392 -14731 12030 23310 3760 -20987 -18031 9061 23781 6816
2894F816k5766j140K5360J8066j3208k7123m293K3690K0454r596k7068q420K1555
$$ 6816 -18950 -20090 5270 23336 10128 -16995 -21288 2402 22856 13260 -13808 -22228 -673
2907f73K2840o687k6417j1697J8367K4660k460k6122j5338J5979K5258J747k4519
$$ -673 22167 15480 -10937 -22634 -4267 20393 17933 -8189 -23527 -7548 17710 19457 -5062
2920e062j8241J2159K6739N465k2743j9948Q128K6628R421k0695k2486N249K5882
$$ -5062 -23303 -11144 15595 21060 -1683 -21631 -13503 13125 22546 1851 -20635 -15386 10496
2933A0496J2045j7287k4434R68K5477J5733j5123k5200k829K3742J8581j1217
$$ 10496 22541 5254 -19180 -18212 7265 22998 7875 -17325 -20154 3588 22169 10952
2945A0952k6516n772K1935K0930p609k5914j0170J9288K3213m061k5066j3376
$$ 10952 -15564 -21336 599 21529 13920 -11994 -22164 -2876 20337 16276 -8790 -22166
2957b2166J6755K3964K64k5185j6221J4237K4590L513k2549j9030R804K5966O595
$$ -22166 -5411 18553 18817 -6368 -22589 -8352 16238 19751 -2798 -21828 -12024 13942 20537
2970B0537k0445k0898O412K5306J0729j8576k2220L237K4537J3528j5309k4254
$$ 20537 92 -20806 -14394 10912 21641 3065 -19155 -15918 8619 22147 6838 -17416
2982a7416o29K3667J6149j2546k4578m149K1617J8848r195k5379p157J9577K0920
$$ -17416 -18045 5622 21771 9225 -15353 -19502 2115 20963 11768 -13611 -20768 -1191 19729
2995A9729n334k4693j1346J7481K3064k173k4106j3737J4202K3884J605k3050
$$ 19729 14395 -10298 -21644 -4163 18901 16728 -7378 -21115 -6913 16971 18576 -4474
3007d474j6494J1452K4079N147k1191j9500Q330K4557Q842j9401k0904M418K4324
$$ -4474 -20968 -9516 14563 19710 -1481 -20981 -12651 11906 20748 1347 -19557 -15139 9185
3020I185J2110j6577k2835J510K3357J4436j3274k3563k440K2193J6708j0478
$$ 9185 21295 4718 -18117 -16607 6750 21186 7912 -15651 -18091 4102 20810 10332
3032A0332k3445n957J9567J9622p261k4542q685J7847K0643l635k3253j2207J5301
$$ 10332 -13113 -19070 497 20119 12858 -11684 -20369 -2522 18121 14486 -8767 -20974 -5673
3045e673K2559l51k2470j4690J2567K3640L109k1564j6908R714K3282O201j9169
$$ -5673 16886 16535 -5935 -20625 -8058 15582 18691 -2873 -19781 -10067 13215 19416 247
3058B47j9773O817K3151R466j7357k0519K665K2740J3149j4749k2460n30K1894
$$ 247 -19526 -12709 10442 19908 2551 -17968 -15303 7437 20586 5837 -16623 -17153 4741
3071D741J5164j1109k3211m040K0727J7211q652k2732p075J8320J9582n770k2972
$$ 4741 19905 8796 -14415 -18455 2272 19483 10831 -11901 -18976 -656 18926 13156 -9816
3084i816j0079J6608K0627k270k1912j3449J4134K2386M60k1161j5052J0421K2780
$$ -9816 -19895 -3287 17340 15070 -6842 -20291 -6157 16229 16689 -4472 -19524 -9103 13677
3097A3677M381j9891j7177Q121K2396P293j7479j9054M453K2565J0021j5428k0383
$$ 13677 18058 -1833 -19010 -10889 11507 18800 1321 -17733 -13280 9285 19306 3878 -16505
3110a6505J081K2043J3328j3282k1806j462K0277J5405r696k2326n165J9302J7330
$$ -16505 -15424 6619 19947 6665 -15141 -16603 3674 19079 9383 -12943 -18108 1194 18524
3123A8524p290k1641q155J6681J9383l726k2092j0604J4398K0312p26k0896j3555
$$ 18524 11234 -10407 -18562 -1881 17502 13776 -8316 -18920 -4522 15790 15064 -5832 -19387
3136a9387J1973K1767K261j9323j5765Q616K2018N747j8389j7638O367K1544Q959
$$ -19387 -7414 14353 16614 -2709 -18474 -9858 12160 17907 -482 -18120 -11753 9791 18750
3149A8750j6028j9721L268K1501J1243j3833k0444l18K0822J3838j1606k1355
$$ 18750 2722 -16999 -13731 7770 19013 5180 -15264 -15582 5240 19078 7472 -13883
3161a3883k647J9024J5440p759k1887o144J7453J7911n580k1437q914J5400J9149
$$ -13883 -16530 2494 17934 10175 -11712 -17856 -403 17508 11928 -9509 -18423 -3023 16126
3174A6126j943k0763j1785J3086K0110J081j9664j4713J0552K1242L053j8118
$$ 16126 14183 -6580 -18365 -5279 14831 15912 -3752 -18465 -7913 13329 16382 -1736
3186a736j6157P542K1163O918j7232j7681M636K0525R714j4194j9372J605K0747
$$ -1736 -17893 -10351 10812 17730 498 -17183 -12547 7978 17692 3498 -15874 -14269 6478
3199F478J1590j2197j9707j344J8989J4498r757k0838l934J7644J6135p319k0897
$$ 6478 18068 5871 -13836 -15180 3809 18307 8550 -12288 -16222 1422 17557 10238 -10659
3212a0659o999J6223J7757m134k0731r487J3741J9417j010k0149j1864J1520J9928
$$ -10659 -17658 -1435 16322 12188 -8543 -18030 -4289 15128 14118 -6031 -17895 -6375 13553
3225A3553J918j8359j4765R056K0506M628j7234j5908N876K0689P427j5524j7971
$$ 13553 15471 -2888 -17653 -8597 11909 16537 -697 -16605 -10729 9960 17387 1863 -16108
3238a6108L317K0039J0339j3184j9188O37J9411J1855j0565j9516k171J7706J4830
$$ -16108 -12791 7248 17587 4403 -14785 -14148 5263 17118 6553 -12963 -15134 2572 17402
3251A7402q536k0005m818J6389J5991n081k0123q238J4707J7717l007j9208j0679
$$ 17402 8866 -11139 -15957 432 16423 11342 -8781 -17019 -2312 15405 12398 -6810 -17489
3264a7489J2199J9181J55j8944j2333J0288J9233L068j7136j4959P602J9741N402
$$ -17489 -5290 13891 14046 -4898 -17231 -6943 12290 15358 -1778 -16737 -9135 10606 16008
3277A6008j5314j6383M677J9318Q584j3894j7749K062J8718J0646j1189j9236
$$ 16008 694 -15689 -11012 8306 16890 2996 -14753 -12691 6027 16673 5484 -13752
3289a3752r85J8290J3030r153j9653l377J6532J5441o584j9503o040J4667J6352
$$ -13752 -14737 3553 16583 7430 -12223 -15600 932 16373 9789 -9714 -15754 -1087 15265
3302A5265l391j9271q992J3257J7426j268j8531j1269J0844J8668J254j7448j3000
$$ 15265 11874 -7397 -16389 -3132 14294 13026 -5505 -16774 -5930 12738 13992 -3456 -16456
3315a6456Q587J8934L949j5844j4986O268J8918O218j3980j6286L376J8543R375
$$ -16456 -7869 11065 15014 -830 -15816 -9548 9370 15588 1608 -14678 -11302 7241 16616
3328A6616j2685j7661O22J8088J1683j0391j8560k160J6877J3520q010j8199n072
$$ 16616 3931 -13730 -13108 4980 16663 6272 -12288 -14448 2429 15949 7939 -10260 -15332
3341a5332J5245J5434n297j8811o952J3623J6098k112j8184r722J2092J7087k75
$$ -15332 -87 15347 10050 -8761 -15713 -2090 14008 11896 -6288 -16010 -3918 13169 12894
3354A2894j7024j1632R218J8293K477j6559j3238P170J7969N635j4921j5447M855
$$ 12894 -4130 -15762 -6544 11749 14226 -2333 -15571 -8401 9568 15203 282 -15165 -10310
3367a0310J8120P564j2696j5961J201J7745J0006j0832j7402m71J6761J1851q682
$$ -10310 7810 15374 2678 -13283 -12082 5663 15669 4837 -12565 -13036 3725 15576 6894
3380F894j8101l045J5830J3623o083j8449n725J4266J5045l938j7807q152J2513
$$ 6894 -11207 -14252 1578 15201 9118 -9331 -15056 -790 14255 10317 -7490 -15642 -3129
3393c129J6172p93j7530j0161J0547J6885J235j6086j2204P598J7926L811j5216
$$ -3129 13043 12250 -5280 -15441 -4894 11991 13226 -2860 -15064 -7466 10460 14271 -945
3406i45j3708N794J7587O284j3526j5772L362J7603Q141j1483j6220N83J6930
$$ -945 -14653 -8859 8728 15012 1486 -14286 -10924 6679 14820 3337 -12883 -12300 4630
3419D630J0701j0203j6666j442J5764J2286p445j7521m349J5095J3533n002j7336
$$ 4630 15331 5128 -11538 -12980 2784 15070 7625 -9896 -14245 850 14383 9381 -7955
3432g955o800J3221J5308l177j7097q352J0671J6250j14j6236j0881R291J6757
$$ -7955 -14755 -1534 13774 10597 -6500 -14852 -4181 12069 11955 -4281 -15162 -5871 10886
3445A0886K162j4935j2568O900J7498M127j3991j3821M758J6773O748j2303j5365
$$ 10886 13048 -1887 -14455 -7555 9943 14070 79 -13742 -8984 7789 14537 2234 -13131
3458a3131K146J6668Q926j0490j6110o2J5508J1290q835j6450k554J4436J3086
$$ -13131 -10985 5683 14609 4119 -11991 -12053 3455 14745 5910 -10540 -13094 1342 14428
3471A4428o155j7488m581J3728J3593m075j6213p463J1784J5175j744j6012r452
$$ 14428 8273 -9215 -13796 -68 13525 9450 -6763 -14226 -2442 12733 10989 -5023 -14475
3484a4475R908J5735J154j5717j1398Q218J6482L180j4021j2851N387J6815N073
$$ -14475 -4567 11168 12322 -3395 -14793 -6575 9907 13087 -934 -13785 -8398 8417 13490
3497A3490j2424j3793K912J6057P911j1142j5251J276J5701R390q845j6063j615
$$ 13490 1066 -12727 -9815 6242 14153 3011 -12240 -10964 4737 14127 5282 -10781 -12396
3510a2396J4928J1583p525j6121l678J3997J2772n041j6416n784J2154J3748k166
$$ -12396 2532 14115 6590 -9531 -13209 788 13560 8519 -7897 -13681 -1527 12221 10055
$$ [...]
8191g30
##END NTUPLES=NMR FID
##END=
