##TITLE=1H_CA-8559-1
 CDCl3, 8 sc, 
 4.2.2019
##JCAMPDX= 6.0         $$ Bruker NMR JCAMP-DX V2.0
##DATA TYPE= NMR FID
##DATA CLASS= NTUPLES
##ORIGIN= UXNMR, Bruker Analytische Messtechnik GmbH
##OWNER= root
$$ XWIN-NMR		Version 3.5
$$ Mon Feb  4 16:06:05 2019 Russian Standard Time (UT+4h)  she@DPX200
##.OBSERVE FREQUENCY= 200.1313
##.OBSERVE NUCLEUS= ^1H
##.DELAY= (6, 6)
##.ACQUISITION MODE= SIMULTANEOUS
##.ACQUISITION SCHEME= undefined
##.AVERAGES= 8
##.DIGITISER RES= 18
##SPECTROMETER/DATA SYSTEM= spect
##.PULSE SEQUENCE= zg30
##.SOLVENT NAME= CDCl3
##.SHIFT REFERENCE= (INTERNAL, CDCl3, 0, 15.7039)
##AUDIT TRAIL= $$ (NUMBER, WHEN, WHO, WHERE, WHAT)
$$ ##TITLE= Audit trail, XWIN-NMR		Version 3.5
$$ ##JCAMPDX= 5.01
$$ ##ORIGIN= Bruker BioSpin GmbH
$$ ##OWNER= she
$$ F:/spectra/data/she/nmr/H-F/1/audita.txt
$$ ##AUDIT TRAIL=  $$ (NUMBER, WHEN, WHO, WHERE, WHAT)
(   1,<2019-02-04 16:05:09.78 +0400>,<she>,<DPX200>,
      <created by zg, POWCHK disabled, PULCHK disabled
       configuration hash MD5:
       00 E9 B6 7A A2 85 ED C7 34 08 36 98 17 FE 4E 26
       data hash MD5: 16K
       94 9D 2E D6 6E 2F 05 0E A0 EA 7A 0C D1 CC DD 5C>)
$$ ##END=
$$ 
$$ hash MD5
$$ A4 AF 99 C6 8D 77 8C 1A 1A 9C 46 16 93 BD F6 2F
##$RELAX= 
##$RELAX= 
##$RELAX= 
##$RELAX= 
##$RELAX= 
##$RELAX= 
$$ Bruker specific parameters
$$ --------------------------
##$DU= <F:/spectra>
##$EXPNO= 1
##$NAME= <H-F>
##$PROCNO= 1
##$TYPE= <nmr>
##$USER= <she>
##$AMP= (0..31)
100 100 100 100 100 100 100 100 100 100 100 100 100 100 100 100 100 100 
100 100 100 100 100 100 100 100 100 100 100 100 100 100 
##$AQSEQ= 0
##$AQ_mod= 1
##$AUNM= <au_zg>
##$AUTOPOS= <>
##$BF1= 200.13
##$BF2= 200.13
##$BF3= 200.13
##$BF4= 200.13
##$BF5= 200.13
##$BF6= 200.13
##$BF7= 200.13
##$BF8= 200.13
##$BYTORDA= 1
##$CFDGTYP= 0
##$CFRGTYP= 5
##$CHEMSTR= <none>
##$CNST= (0..31)
1 1 145 1 1 1 1 1 1 1 1 1 1 1 1 1 1 1 1 1 1 1 1 1 1 1 1 1 1 1 1 1 
##$CPDPRG= <>
##$CPDPRG1= <>
##$CPDPRG2= <>
##$CPDPRG3= <>
##$CPDPRG4= <mlev>
##$CPDPRG5= <mlev>
##$CPDPRG6= <mlev>
##$CPDPRG7= <mlev>
##$CPDPRG8= <mlev>
##$CPDPRGB= <>
##$CPDPRGT= <>
##$D= (0..31)
0 1.2 0 0 0 0 0 0 0 0 0 0.03 0 0 0 0 0 0 0 0 0 0 0 0 0 0 0 0 0 0 0 0 
##$DATE= 1549281909
##$DBL= (0..7)
120 120 120 120 120 120 120 120 
##$DBP= (0..7)
150 150 150 150 150 150 150 150 
##$DBP07= 0
##$DBPNAM0= <>
##$DBPNAM1= <>
##$DBPNAM2= <>
##$DBPNAM3= <>
##$DBPNAM4= <>
##$DBPNAM5= <>
##$DBPNAM6= <>
##$DBPNAM7= <>
##$DBPOAL= (0..7)
0.5 0.5 0.5 0.5 0.5 0.5 0.5 0.5 
##$DBPOFFS= (0..7)
0 0 0 0 0 0 0 0 
##$DE= 6
##$DECBNUC= <off>
##$DECIM= 32
##$DECNUC= <off>
##$DECSTAT= 4
##$DIGMOD= 1
##$DIGTYP= 9
##$DL= (0..7)
0 120 120 120 120 120 120 120 
##$DP= (0..7)
150 150 150 150 150 150 150 150 
##$DP07= 0
##$DPNAME0= <>
##$DPNAME1= <>
##$DPNAME2= <>
##$DPNAME3= <>
##$DPNAME4= <>
##$DPNAME5= <>
##$DPNAME6= <>
##$DPNAME7= <>
##$DPOAL= (0..7)
0.5 0.5 0.5 0.5 0.5 0.5 0.5 0.5 
##$DPOFFS= (0..7)
0 0 0 0 0 0 0 0 
##$DQDMODE= 0
##$DR= 18
##$DS= 0
##$DSLIST= <SSSSSSSSSSSSSSS>
##$DSPFIRM= 0
$$ [...]
##$SUBNAM2= <"">
##$SUBNAM3= <"">
##$SUBNAM4= <"">
##$SUBNAM5= <"">
##$SUBNAM6= <"">
##$SUBNAM7= <"">
##$SUBNAM8= <"">
##$SUBNAM9= <"">
##$SW= 20.0189088683792
##$SWIBOX= (0..15)
0 0 2 0 0 0 0 0 0 0 0 0 0 0 0 0 
##$SW_h= 4006.41025641026
##$TD= 16384
##$TD0= 1
##$TE= 0
##$TE2= 300
##$TE3= 300
##$TEG= 300
##$TL= (0..7)
0 120 120 120 120 120 120 120 
##$TP= (0..7)
150 150 150 150 150 150 150 150 
##$TP07= 0
##$TPNAME0= <>
##$TPNAME1= <>
##$TPNAME2= <>
##$TPNAME3= <>
##$TPNAME4= <>
##$TPNAME5= <>
##$TPNAME6= <>
##$TPNAME7= <>
##$TPOAL= (0..7)
0.5 0.5 0.5 0.5 0.5 0.5 0.5 0.5 
##$TPOFFS= (0..7)
0 0 0 0 0 0 0 0 
##$TUNHIN= 0
##$TUNHOUT= 0
##$TUNXOUT= 0
##$USERA1= <user>
##$USERA2= <user>
##$USERA3= <user>
##$USERA4= <user>
##$USERA5= <user>
##$V9= 5
##$VALIST= <valist>
##$VCLIST= <CCCCCCCCCCCCCCC>
##$VD= 0
##$VDLIST= <DDDDDDDDDDDDDDD>
##$VPLIST= <PPPPPPPPPPPPPPP>
##$VTLIST= <TTTTTTTTTTTTTTT>
##$WBST= 1024
##$WBSW= 4
##$XGAIN= (0..3)
0 0 0 0 
##$XL= 0
##$YL= 0
##$YMAX_a= 286267
##$YMIN_a= -378257
##$ZGOPTNS= <>
##$ZL1= 120
##$ZL2= 120
##$ZL3= 120
##$ZL4= 120
##$ABSF1= 10
##$ABSF2= 0
##$ABSG= 5
##$ABSL= 3
##$ALPHA= 0
##$AQORDER= 0
##$ASSFAC= 0
##$ASSFACI= 0
##$ASSFACX= 0
##$ASSWID= 0
##$AUNMP= <proc_1d>
##$AZFE= 0.1
##$AZFW= 0.1
##$BCFW= 1
##$BC_mod= 2
##$BYTORDP= 1
##$COROFFS= 0
##$CY= 11.3945322036743
##$DATMOD= 1
##$DC= 2
##$DFILT= <>
##$DTYPP= 0
##$F1P= 18.9103706918063
##$F2P= -1.10871071338519
##$FCOR= 0.5
##$FTSIZE= 0
##$FT_mod= 4
##$GAMMA= 1
##$GB= 0.15
##$INTBC= 1
##$INTSCL= 1
##$ISEN= 128
##$LB= 0.24
##$LEV0= 0
##$LPBIN= 0
##$MAXI= 10000
##$MC2= 0
##$MEAN= 0
##$ME_mod= 0
##$MI= 1.114404
##$NCOEF= 0
##$NC_proc= 0
##$NLEV= 6
##$NOISF1= 3.799351
##$NOISF2= 2.8
##$NSP= 1
##$NTH_PI= 0
##$NZP= 0
##$OFFSET= 15.70392
##$PC= 1
##$PHC0= -9031.927
##$PHC1= 4.60004
##$PH_mod= 1
##$PKNL= yes
##$PPARMOD= 0
##$PSCAL= 0
##$PSIGN= 0
##$REVERSE= no
##$SF= 200.130013532006
##$SI= 16384
##$SIGF1= 3
##$SIGF2= 2
##$SINO= 400
##$SIOLD= 16384
##$SREGLST= <1H.CDCl3>
##$SSB= 0
##$STSI= 0
##$STSR= 0
##$SW_p= 3612.71676300578
##$SYMM= 0
##$S_DEV= 0
##$TDeff= 0
##$TDoff= 0
##$TI= <>
##$TILT= no
##$TM1= 0
##$TM2= 0
##$TOPLEV= 0
##$USERP1= <user>
##$USERP2= <user>
##$USERP3= <user>
##$USERP4= <user>
##$USERP5= <user>
##$WDW= 1
##$XDIM= 8192
##$YMAX_p= 0
##$YMIN_p= 0
$$ End of Bruker specific parameters
$$ ---------------------------------
##NTUPLES= NMR FID
##VAR_NAME=  TIME,          FID/REAL,        FID/IMAG
##SYMBOL=    X,             R,               I
##VAR_TYPE=  INDEPENDENT,   DEPENDENT,       DEPENDENT
##VAR_FORM=  AFFN,          ASDF,            ASDF
##VAR_DIM=   8192,          8192,            8192
##UNITS=     SECONDS,       ARBITRARY UNITS, ARBITRARY UNITS
##FACTOR=    0.0002496,     1,               1
##FIRST=     0,             0,               0
##LAST=      2.0444736,     0,               0
##MIN=       0,             -378257,         0
##MAX=       2.0444736,     286267,          0
$$ Real data points
##PAGE= N=1
##DATA TABLE= (X++(R..R)), XYDATA
$$ [...]
1837a8n3P1J63k30j67J44OP1K15O7m63K13r2Q2m7j22L99N7j66j58K09k87m7J8
1861a35j0J87M8j32j08l3L02l0L8k69j4M49l31J71P8n4j3j15k06J43j6l8P4K07
1885A93j23Oj48N2j96J80J6J40o5k48J78J11j77J92j38k9K75j29O5j01K2jO2j00
1909C7k08O3K73l18R0J00J11k01j37J41J21J38k60J19q9N3m7k84J78J0k49L41
1931a8K9J0Q7m03J89J57P8R6r6j34j5J1j56L39k70q9K65k11Q2K2K38j56rj14j04
1956a72J32n1k6J25j85o5K88j97J70R0k7j84J28j07J00Q8o2j77o1M32k00j11L1
1979d1J94o9K5j1j66J38k11K19R3r6J70k02j17pj7J3J31J05k94J31oO2j89J99
2003E4R0j78n7J30j80K8K56j53K6p3J99j49P7j99K64l1j21J05k10J30l3J00j65
$$ plain form
1837 -18 -71 0 163 -67 -234 -90 -84 -13 202 269 -194 19 -73 9 -38 -160 239 296 130 -28 181 -106 -153 -135
1861 -135 -145 42 90 -42 -150 -183 119 89 127 -142 -156 293 -38 133 211 157 144 29 -177 -34 -50 -88 -14 193
1885 193 70 76 -72 -20 -216 -36 -20 120 55 -193 -15 96 -81 111 -27 -56 219 90 155 54 76 75 137 37
1909 37 -171 -108 165 -153 -63 37 148 -53 -190 -49 72 210 -50 69 -20 33 -14 -298 -120 -110 -359 -18
1931 -18 11 21 108 -295 -106 51 129 225 129 -5 -20 -9 -165 174 -96 -185 80 -131 -49 -27 211 55 46 -68 -172
1956 -172 -40 -91 -117 8 -177 -242 46 -151 19 109 82 -102 26 -81 19 107 45 -132 -193 239 39 -72 -41
1979 -41 153 84 109 98 -68 70 -141 78 171 75 245 43 -74 -81 -98 -85 46 151 -143 -12 -18 44 -145 54
2003 54 144 -34 -91 39 -141 -113 143 -10 16 -57 142 -7 70 -129 135 104 -17 88 -122 8 -25 75 -90
2026i0l6K71m8k76J09K16k14K20m2J59m07J69j05J38k42J41K06J05n12L66n3J21
2048A96k34P9k65K15J31o5K29k91j13K5K67k60K31l38N20k29k54L30l02J56K00
2069B28k38j15K06n1K4o5m24K38L58k82K74k28J47J7l80K67j68o9K99nj16p0k2
2092a75k7M07j59J69k21O9j00KJ8j64L73o59L19K28k74K29j04p7L49o5j4l35L09
2115I8j76k05M52k28K3j55L50j50k4j57P2J94k71K13L8r8J60j65O8j47N5K0p8
2138a11J89M44m45k99J06L7L84l56K11j33P6k48R3L9P6j81k9n2K12J35j48K21
2160B21o0j49J56k49n1K16RM1J3P7k82j7o2K89n3r5j04J9j14R4q8K8L37j33p2
2185b9p9LK09k16R9k88P9j36M49p6L5j88J62j01M1j8r9J39O5m1%N4j37J77Q1j48
$$ plain form
2026 -90 -126 145 97 -179 -70 146 -68 152 110 269 -138 31 -74 64 -178 -37 169 274 -238 128 75 196
2048 196 -38 41 -224 -9 122 57 286 -5 -118 -93 174 -86 145 -193 327 98 -156 174 -128 28 228
2069 228 -10 -125 81 30 54 -11 -435 -197 161 -121 153 -75 72 89 -291 -24 -192 -261 38 33 -83 -153 -175
2092 -175 -202 205 46 215 -6 63 -37 -35 -17 -181 192 -467 -148 80 -194 35 -69 -146 203 138 124 -211 98
2115 98 -78 -283 169 -59 -36 -191 159 9 -15 -172 -100 94 -177 36 74 -24 136 -29 39 -108 -53 -33 -111
2138 -111 78 522 77 -222 -116 -79 305 -51 160 27 103 -145 -52 -13 63 -118 -147 -199 13 148 0 221
2160 221 161 12 168 -81 -132 84 93 134 147 224 -58 -75 -137 152 99 4 -100 -81 -195 -101 -189 -161 176 43 -29
2185 -29 -108 -105 104 -112 -13 -301 -222 -358 91 15 50 -138 24 -77 -36 -54 -153 -14 51 10 10 64 -73 104 185 37
2211C7p5j01P0R5l43O35m52K19k31J82J23l33K18j53O7K51l49J8J38o0J23o5j3
2234AK30k76L8j06J64J41k52J71k25L10K5p9J30k14o6K77l83J90P0l0j90OJ39
2257G1k14K56J43m73r8M92j26j75K6P5rk42M40l30J49L25j09k19P1J77k27n8K23
2280A68m30L78j91K7R8k97K43q6K30R4k61j28M4N5m7K71k58K58k69J8Rqj45K21
2304fL7l33K38k6J35n7L53m80L14k05J86k43K99n23L33l36M55j26k5J01m71L61
2326a9L71k15j62jp9K41J54j57l92L27k21J40o4j03K45n3n0L19m20O1Jk32L49
2349D0N0M7k54J95j65J28k78p1J02J61N1J7L0k50J00R7l2o7l68Q5L76k5q0P8J52
2374A19l1j00K3L6K27k58k2J60k86J54j65J14N1l1Q7k22J78n6L32j4j68J8k41
$$ plain form
2211 37 -38 -139 -69 26 -317 318 -134 85 -146 36 159 -174 44 -109 -42 209 -140 -122 16 -44 79 14 1
2234 1 231 -45 -7 -113 51 192 -60 111 -114 196 221 142 272 58 -8 269 -114 76 146 116 -74 -68 71
2257 71 -143 113 256 -217 -315 177 51 -124 -98 -23 -32 -274 166 -164 -15 310 201 -18 53 230 3 -55 168
2280 168 -262 116 -75 -48 50 -247 -4 -90 140 234 -27 -155 -111 -56 -103 168 -90 168 -101 -83 -74 -82 -227 -6
2304 -6 31 -302 -64 -90 45 -12 341 -139 175 -30 156 -87 212 -311 22 -314 141 15 -10 91 -380 -19
2326 -19 352 137 -25 -26 -105 136 290 133 -259 68 -153 -13 -77 -180 65 12 -38 281 -139 -78 -77 -309 40
2349 40 90 137 -117 78 -87 41 -237 -308 -206 -45 6 23 53 -197 -97 0 -32 -99 -467 -382 -6 -31 -111 -33 119
2374 119 88 -12 11 47 274 16 -6 154 -132 22 -143 -29 22 -9 78 -144 34 -22 310 296 128 146 -95
2397i5K46l5J19n50M83j65KR7q9o6j84Q1J2J56P4J73m13J47K19j26K8j85j65Q1
2421a55J98j5P1n5j10K92j61n6l8K12j50k74K74j55L5K33l01Q3J07q7j48K09r
2444@n6Q5L1j34K06j27j45O7J04J6j44J00j25J44k75L51j63k5N06l86J36l48J98
2467A6K48k22m36L84m9j8l1K67j23q4J00k56LK20Q7l53Q2J83l9k14J96o0J87J61
2491B49l64J84k19L50j57k07K71j57K96n84J08N5k0K74k64L80k05K6ql03K37q
2513f6M6J51l62K69k5j23K41k84k0K93l10L42j54j16j16K48k03m6K89K5j60P0
2535a1R0p6K7J63j42j74M13j89o2m11M22K4l4j34J40q2J85l14J12p1L01j61P2
2558H8M6k99R1o5K26Pk75J9K45k38K24j50J68QO3k34K5j52K13j35L46l99L23m09
$$ plain form
2397 -95 151 116 235 -315 168 3 5 102 13 -53 -237 -156 -144 12 86 259 -154 -7 212 86 114 -71 -236 -155
2421 -155 43 28 99 44 -66 226 65 9 -29 183 33 -241 33 -122 -87 146 -155 -72 35 -52 -200 9 0
2444 0 -56 29 60 -74 132 5 -140 -73 31 47 -97 3 -122 22 -253 98 -65 -90 416 30 166 -182 16
2467 16 264 42 -394 -10 -59 -77 -108 159 36 -48 52 -204 -201 19 106 -247 -165 18 -21 -235 -39 -99 88 249
2491 249 -115 69 -150 200 43 -164 107 -50 246 -338 -230 -175 -195 79 -185 195 -10 16 8 -295 -58 -66
2513 -66 -20 131 -231 38 13 -110 131 -153 -173 120 -190 152 -2 -118 -234 14 -189 -235 54 79 -81 -11
2535 -11 79 3 30 193 51 -123 290 101 39 -372 50 74 40 -94 46 -36 149 -165 -53 -124 177 16 88
2558 88 134 -165 -74 -139 87 94 -181 -162 83 -155 69 -81 87 95 158 -76 -51 -203 10 -125 221 -178 145 -264
2582b64J80L29j36Rk91J67P3j48J84p0L5j83K41j54J39j08j62N8K61j45p6J7k29
2605b73M12o5P5k01K3K28k46j13J76n4J74j63j57K12L0k51k6M89l24J30l60R0
2627a94q0J32p4J58k1l5Q5K16n88O21l13Q5O1L2J01l41J59K99j7k15j92j84N28
2650B23m35M4P7M19l60l0J86Jj0N1q4j40K96l33J96p0m1J26j02j2J46J27l08k8
2674f1N6j15R4L3j3j24Q3%LnJ4J42l21P0r6J52n5p6Q1o2K89k58K50O7l67L11j04
2701a2Lj90L44n8m9o7J32k12L93l47P4Kq0L7K45j61j64K33j85j62K28N2k29K31
2725E8J49k85K29k85P1P5m0j6J67Mj79q5P0o3R6j02J18K15k50j86M22k82n6J72
2749A7l32M47O3j70k23J07L5j45L60j62K10k11O4j54j90M55r7J80m65M15j10Q6
$$ plain form
2582 -264 -84 245 109 118 -173 -6 67 -81 103 33 68 -115 126 -28 111 3 -159 -101 160 15 -61 -44 -273
2605 -273 139 74 149 -52 -29 199 -47 -160 16 -38 136 -27 -184 28 58 -193 -219 270 -54 76 -284 -194
2627 -194 -274 -142 -216 -58 -79 -114 -29 187 -401 220 -93 -8 53 85 186 -155 4 303 286 71 -121 -305 223
2650 223 -212 -168 -91 328 -32 -62 124 125 115 166 82 -58 238 -95 101 31 -10 116 14 2 148 275 -33 -61
2674 -61 -5 -120 -26 7 -6 -130 -47 -47 -44 -49 -35 107 -214 -144 -240 -88 -143 -219 -138 -200 89 -169 81 148 -219 92 -12
2701 -12 -9 -199 145 87 38 -29 103 -109 284 -63 11 13 -67 -30 215 54 -110 123 -62 -224 4 56 -173 58
2725 58 207 -78 151 -134 -63 12 -28 -44 123 127 -52 -137 -67 -130 -34 -136 -18 197 -53 -239 183 -99 -155 17
2749 17 -315 132 195 25 -198 -91 -56 -201 159 -3 207 -4 60 -94 -284 171 74 254 -211 204 94 180
2771A80k33j37J36J90M7k78K60j65k44J61j13k21O10j12K36l66l0P9J90n6P7k62
2793e1K3O5J8J05j83K36k60N2J37j35J52n8j0o1L2L3j41K20j08P5j83J28JR7R2
2818B76j58J28k06r0j69L30Pm5J4l06J85J5J51j9l13J69K35l48r4Q2k2M16m30
2841a92L45k91J69j70J94j3J36J15k16j7r4J07Q1j22n1L05k17o0m8P7q9J04r1
2864c8J29kq1K8j49O8J54k04oJ45j7l25J93J70q9k71K01j21K72j13Q2J5L26k74
2888I3J44l32J37j99J14J81j10q9L03j96j16J51k50J41m6N4np4J29J3O7P8j82
2911FJ49K1r2n8J57j54k8p6J06l19J68L1l5m4k77K84K54M2m9J74m38J25L61m11
2935a03L07k69p9L29k34M4o2Q6K38k8k11M4j59J45n8L6l3J72k2j89J78k71O1q8
$$ plain form
2771 180 -53 -190 -54 136 183 -95 165 0 -244 -83 -196 -417 193 81 317 -49 -79 0 190 134 211 -51
2793 -51 -28 37 55 160 -23 213 -47 5 142 7 159 101 91 30 62 95 -46 174 66 141 -42 86 87 184 276
2818 276 118 246 40 -50 -219 111 118 73 87 -219 -34 -19 132 113 -200 -31 204 -144 -238 -156 -178 238 -192
2841 -192 153 -138 31 -139 55 42 178 293 77 60 -34 73 154 32 -19 286 69 9 -39 38 -51 53 -38
2864 -38 91 89 8 36 -113 -45 109 -95 -101 44 27 -298 -105 65 -24 -295 -94 -215 57 -56 26 41 367 93
2888 93 237 -95 42 -157 -43 138 28 -61 242 46 -70 81 -169 -28 -74 -20 -25 -99 30 43 110 188 6
2911 6 155 176 84 26 183 29 1 -75 31 -288 -120 -89 -124 -168 -445 -161 93 135 86 260 -178 -53 308 -103
2935 -103 204 -65 -144 185 -49 -5 -67 19 257 229 18 62 -97 48 -10 26 -7 165 143 -46 132 -139 -78 -166
2959a66O9J43k0j45J95o3r3J34J23J4j75JK3j6j52J78k04J85J19l38K84j3l18
2982b35L90l85L89J4k2k12J17Q2k97M9M0Q0J29k17K93j85K9n2k94K86M0j18k3
3005a02k9j88M35N2K0k57M13l53Q7j8K05n26J78m8J53o2j27M7K02K55l39J4j19
3028a07K97m09J76oMN6N9L9o2l80K26K36M6l22j64M53j78j02J0R9n3K00k16R8
3052@r4Q5L16j96n8j06O7M1o2L3M1j64J98K31m52l4j53J27Q7P6R8j52O6K05k64
3077f4K18j22K71m28R5R8L6N0k7j65j2o0J77O8l29N13n99M41j10j72K1O3O9k5
3101GM2j10M5l5ol7J78j18J33P3k45J31l8l25L24N9j87P3J97K8m45R7M60l99k12
3126c10J21J60K40o4p1m58M59j60N4K40l6l00J8j36K89OK32l14J7J52r2j2P3j98
$$ plain form
2959 -166 -97 46 26 -119 76 13 -80 54 177 191 16 17 40 24 -128 50 -154 31 150 -188 96 83 -235
2982 -235 155 -230 159 173 151 -61 56 138 -159 -110 -70 10 139 -78 215 30 59 7 -287 -1 39 -79 -102
3005 -102 -131 -319 116 168 188 -69 344 -9 78 60 265 -261 -83 -131 22 -40 -167 -120 82 337 -2 12 -107
3028 -107 190 -219 -43 -49 -45 11 70 109 47 -333 -107 129 175 -147 -311 142 -36 -138 -128 -29 -82 118 -98 0
3052 0 -94 -9 307 111 53 -53 14 55 -7 26 67 -97 101 332 -120 -154 -307 -180 -93 -17 81 -71 -5 200 -64
3077 -64 154 32 303 -125 -30 68 104 154 127 -38 -50 -110 67 135 -194 319 -280 161 51 -121 -100 -37 32 7
3101 7 49 -61 -16 -51 -57 -94 84 -34 99 172 -73 58 20 -305 19 78 -109 -36 161 189 -256 -159 301 -98 -310
3126 -310 -189 -29 211 147 76 -382 77 -83 -29 211 175 -125 -107 -243 46 52 284 -30 -13 139 47 35 108 -90
3150i0j7O6J86j78j36J10j13K04j12M4M80n73J68j82L75j97n0n9K0J8j11J56j09
3173a00K02k42K82l90L19M8o1m1K4J3j28j07J59j07R2K0P2K3M0j0k24J22N9Jj34
3198f8K31l78K91j37J54o9k08l1M07l99J6K90ml1j61K52j56k96K36K9l9p9K96
3221A46o1k88O6L25l53J33J29r7Kl4M60l04K04k25k15J45J51j53k21n6J82J41
3243G7j09r0K61k9j5k95R4j3O6r5K21K3m4j69K02l3j01O8j38l6J99J57j24m5o9
3268c7K2j27K31j37J58L6k79jr5j4nO6j03L51Q4l70L59q0J48m06J15J27j45K99
3292A97l34K47m3j16N5n6M0k3j14j43M77l9l56N04k84J74K9k41J87k2j20P9k5
3315G3o2J37j40J38p2j15K4j07K97J7mj26j11j22J6L78j52N9R3j97o9R4n3l4l0
$$ plain form
3150 -90 -107 -41 145 -33 -169 -59 -172 32 -80 -36 444 -129 39 -143 232 35 -15 -74 -54 -36 -147 9 -100
3173 -100 102 -140 142 -248 71 119 58 17 41 54 -74 -181 -22 -129 -37 -17 55 78 118 108 -116 6 65 66 -68
3198 -68 163 -215 76 -61 93 24 -184 -215 192 -207 -191 99 95 64 -97 155 -1 -297 -61 -32 -71 -150 146
3221 146 85 -203 -137 188 -165 -32 97 0 2 -32 428 124 328 103 -112 33 184 31 -190 -246 -64 77
3243 77 -32 -122 139 110 95 -200 -106 -119 -53 -148 73 96 52 -117 85 52 -49 19 -119 -155 44 201 77 32 -37
3268 -37 -15 -142 89 -48 110 146 -133 -134 -229 -243 -248 -182 -285 66 150 -220 139 59 207 -199 -84 43 -102 197
3292 197 -137 110 67 -49 6 -50 -10 -33 -147 -290 187 148 -208 296 12 186 215 -26 161 139 19 98 73
3315 73 11 148 8 146 74 -41 -17 -124 173 190 186 60 -51 -173 -157 221 69 128 221 24 -45 49 -4 -38 -68
3340f8mJ20o7j11j64K31M2M3j53K03j33Rq9M0K28k21K20o5r3M6J0jl88M14j13
3365f4k55L68j08J57k6j53R3k83K27N2l9r2O7R6J9J80o5l7l83K30J28o4k67K09
3389a0k93M64m5j45j54J53J29k30K16N5l00K51k39K01k0j43J83p0l4K57k44P6
3411E8n4J6J03k57J69NP9k31K06j14k27L21j91k23J34J57j49J23P8P2n6j93O7
3434a07J27o2L79l02l3K9j02J95m7k1rk59L84j2k73O4L6J18M6k4j06l5J37M9m02
3459b30K60j12J56j9j55j83K18K1K5K94j10j53LKK01k86K76pk46K47n1k21QL82
3483C20l01l53N80m50K29j27Q7j0j21R6o0J38j06K54k96N8p3J24m7k91K15O6P8
3506A0N7k13J74m09L75P2O6O1k47Q3n9J94l2k09J06j87L20j39j23M22l49Q4k47
$$ plain form
3340 -68 -72 48 -19 -130 -294 -63 -21 22 -131 72 -61 -52 -141 -101 127 -94 126 61 -32 14 24 23 -365 49 -64
3365 -64 -319 49 -59 98 72 -81 12 -271 -44 8 -31 -123 -56 40 59 239 174 137 -246 -16 112 48 -219 -10
3389 -10 -303 161 116 -29 -183 -30 99 -131 85 140 -160 91 -148 53 33 -110 73 3 -31 226 -18 58
3411 58 4 20 123 -134 35 40 119 -112 94 -20 -247 74 -117 -340 -206 -49 -198 -75 3 75 19 -174 -107
3434 -107 20 -42 337 35 2 31 -71 124 77 56 47 -212 172 160 -113 -49 -13 105 151 127 21 -14 123 172 -230
3459 -230 30 -82 74 55 -100 -283 -65 -44 -19 275 165 12 15 17 218 -68 208 201 -45 202 151 -70 -62 320
3483 320 19 -334 246 -204 25 -102 -15 -25 -146 -50 -110 28 -78 176 -120 -62 -135 -11 -58 -349 -134 -68 10
3506 10 67 -146 28 -381 -6 66 132 193 -54 29 -30 164 132 -77 29 -158 162 23 -100 322 -27 57 -190
3529a90K40k1jo2k00K65r3j54J17R9mj12O0K81j93m7J53l9j56n0J41l6l02M46
3553A42K0j74O7l09L75j49M66n49K68j87J41m5j37M37l49o2J90n7r5Oj36K33Q2
3576A78m9O4k39k35K58N8l5j0k76M7J83k16J41m4L40k39O4J85k20K39k34q3o9
3599a92L92k62K9Lq2O8j06J63L6K49m31J83K4N1Q0k77M52k30n02K91J21J39k97
3622i8J31K1o1k9Q1K57j56L6j39J20m42L35j5M8j12J37m05K61rq9j05K36R8l44
3646b43R4L36rm22M06r1r1J01j31J54o2j10m5M3pk19L74j59QJ61J74l08J51k64
3670a59j2L18k94K06q1j95Q9j8K31M3l66J67Q4j05%P5n4k16J53j39L11r8J58J24
3694B22l20J51Pr2J50j05o4K65q1P1k80L9L58m24M2J71j60O5l92L45J93k72N43
$$ plain form
3529 -190 50 29 28 -34 -234 31 -62 -216 -99 0 -4 -116 -56 225 32 -15 138 99 -57 -107 34 -2 -304 142
3553 142 162 -12 55 -254 121 -28 438 -111 157 -30 111 66 -71 366 17 -45 145 88 -7 -1 -137 96 178
3576 178 129 193 -46 -281 -23 35 0 -10 -286 -239 -56 -272 -131 -175 165 -74 -10 175 -45 194 -40 -123 -192
3599 -192 200 -62 -33 -30 -112 -44 -150 13 49 298 -133 50 74 125 205 -72 380 150 -352 -61 60 199 -98
3622 -98 33 54 -7 -36 45 302 146 182 43 163 -279 56 41 89 -23 114 -291 -30 -39 -128 -233 3 101 -243
3646 -243 -149 187 178 -244 162 71 -20 81 -50 104 42 -68 -113 -70 -77 -296 78 -81 -73 88 262 -46 105 -159
3670 -159 -171 147 -147 59 -22 -217 -128 -146 85 128 -238 -71 13 -92 -92 -17 -71 -287 -134 -273 38 -60 98 222
3694 222 -98 53 60 -32 118 13 -51 214 133 204 -76 -37 321 -103 -61 110 -50 15 -377 -32 161 -111 432
3717D32l92m9J74m35K53K42k76P2J42k77M4J79m9J27m15kK78k85L25R3j91K3J61
3740A74k33K12j00l6j40J32j44J4J67M3j5k09R6J64r4Q7N8j47l8j2J16j56N5O4
3764E8j9J33k4j91J1J7m3R7q7L9K03j19K38k22k2j21Lr5k36K58L19j41J33j30
3788E9K03j69l00L13r7J08k19J46o5Q9M5j06j9K9K9k1l3N3l15L00J71l16L53j93
3812D5k75L21j00J48l4M7j20R9j65k00K27K54m35J24l2J4M4rj9k93L43j9m32N32
3836F5J16j91j4j14O5K56k13m9k26J16L11Lj88j2J60k60k0R0J93n9p1J30n1j08
3860g1J66K8k27q2K50J16m87L58P7l53L62j29n5J76j74J7Q5M4j55J84r0j98m3
3883b01J22J25j48K21j47J28j94J10J47k02N9qj87K11L3N7J18j38k36K43L6J5
$$ plain form
3717 432 40 -9 165 -270 -17 225 -51 21 163 -114 -70 109 60 187 -228 -230 48 -237 88 181 -10 13 174
3740 174 -59 153 53 17 -123 9 -135 -121 46 89 74 -135 -39 125 31 118 176 29 -9 -21 95 -61 -6 58
3764 58 39 172 148 -43 -32 -15 -58 39 -48 -9 194 75 313 91 69 -52 -49 -144 -380 -122 197 56 189 59
3788 59 262 93 -207 106 9 117 -102 44 -21 68 113 7 -12 17 46 25 -8 45 -270 30 201 -115 238 45
3812 45 -230 91 -9 139 105 152 32 131 -34 -234 -7 247 -188 -64 -96 -82 -38 -47 -66 -359 -16 -35 -467 65
3836 65 181 -10 -24 -138 -73 183 -30 -79 -305 -189 122 125 -63 -75 85 -175 -195 -105 88 29 -42 88 37 -71
3860 -71 95 123 -104 -186 64 180 -307 51 128 -225 137 8 -47 129 -45 -28 57 101 -54 130 40 -158 -201
3883 -201 -79 46 -102 119 -28 100 -94 16 163 -39 20 12 -175 36 69 126 244 106 -130 113 149 164
3905A64L1l05Q9N7l0j33K09M3J11l88m7M18j03j64N3R1J98j75J9j24K2Ll8J04
3929A05k5j47K3O2O3l28N64l82J83J8m9n3J4l0J63k65R5j59J66J10k29m1k8M89
3953C19k61L1j51J96p2L3k40K99j02J01k77L83l19J59p5P6k96J06j8J12j6l9J80
3976A29j34m5j03L33l4l2j29k41K66k24K50J85m12L89l88J26K4k06J60P8J09j51
3998e0K02q1j63M04l80R4j29N9J65O1K05m51j54K45l7p8r6L23J83m73j71J77K26
4021H1j50j27O1P2m8k20M32l34K23r0K16j75pJ1R6k25L04kJ4l03K47j32k41L09
4045A2R2J25k05pJ29M1k46J60N0K02l06j23j49K90o3k85L40j09K53j33k4r7J98
4068A45j47K12j79j34J18J6N5k17j67L11m8M9P3j01P3r7K32j55k11L34R3k59j12
$$ plain form
3905 164 195 -110 -21 36 6 -127 82 125 236 -152 -199 219 116 -48 5 96 294 119 138 14 36 39 1 105
3929 105 80 -67 -44 18 81 -247 317 -65 118 136 87 34 48 18 181 -84 11 -148 18 128 -101 -142 -170 319
3953 319 58 89 -62 134 62 95 -145 154 52 153 -124 259 -60 99 24 100 -196 -90 -108 4 -12 -51 129
3976 129 -5 -50 -153 180 146 114 -15 -256 10 -214 36 221 -191 198 -190 -64 -40 -246 -86 -8 101 -50
3998 -50 152 71 -92 312 -68 26 -103 -44 121 182 387 -64 -218 27 -10 -88 -184 139 322 -151 -322 -145 81
4021 81 -69 -196 -135 -63 -111 -331 101 -233 -10 -100 116 -59 -66 -55 41 -184 120 118 132 -171 76 -56 -297 12
4045 12 104 229 24 17 146 187 -59 101 151 353 47 -76 -225 65 2 -283 57 -52 201 68 44 -53 145
4068 145 -2 210 31 -103 15 31 86 -131 -298 13 -35 14 87 -14 59 -38 194 39 -172 162 255 -4 -116
4091a16L70k45k24L07J81k98P6J7j92J87o4J69nj90j46n9K67k6J71j68j99J59
4113b8k5J75j42J33l10K87n8K9k04L0L8J8R5J28o6O5j05r7K50m78M69m14J84M0
4137A4L9p3K4q1K44k14k18J42l5L65k98K22mr8J13l74R9L36p9k5k60Q0m5K19L5
4162A28Kj78K5J51j77Q7m2j14M96p18R6K77Ql8n9J60r5Jl3K46J5j62q7P5r0k65
4188b91O36m32K23K4R3k33o8N6j98J56J56j79Q6r0j22L27j60K86j58k2r9N1m5
4211cJ7R8j02k35L06L5j57L21o58J94P0J02j71O1J34j9K1OJ69J84k33j13K83l71
4235f1k1L20j18k38L71l89j9M8K72k09j62K71j39L19l66J28K33j20l46J21k18
4256c23L56j56J0O3j5%l8J09j59j72K07j31M55l32J51k09J82J19l75K80O8R0q0
$$ plain form
4091 -116 254 9 -215 92 273 -25 51 68 -124 63 -1 168 163 -27 -173 -232 35 9 180 12 -187 -28
4113 -28 -53 122 -20 113 -197 90 32 61 -143 -113 -75 -57 38 166 100 165 60 -37 213 -265 204 -210 -26 14
4137 14 53 -20 4 -77 167 -47 -265 -123 -158 207 -91 131 127 29 142 -232 -133 203 124 99 -161 -81 -126 93 128
4162 128 130 -48 -23 128 -49 38 -4 -118 378 -340 -244 33 41 3 -56 104 9 10 -23 223 238 76 -11 64 -26 -291
4188 -291 345 -87 136 160 253 20 -48 8 -190 -34 122 -57 29 -61 -183 144 -16 270 112 90 -9 42 -3
4211 -3 14 112 10 -225 81 116 -41 280 -378 -184 -114 -12 -183 -122 12 -7 14 20 189 373 140 27 310 -61
4235 -61 -82 238 120 -118 253 -136 -155 -107 165 -44 -206 65 -74 245 -121 7 240 120 -226 -105 -323
4256 -323 33 -123 -113 -50 -65 -65 -103 6 -153 -325 -118 -249 206 -126 25 -184 -2 117 -258 22 90 180 100
4279A00k42K29j02J58o1j30J83r4Q6n4j45k2K57jj48J66k47J3P1l08L36k55q7
4302b97K61R7M7j40J7K0p0o5K90j42j10Q3j52J01J76o6M9o3J26m17N61k64o0K89
4326B71k66N3q3J45j6n3k37K80J40j04r3r3N5L19k42J97l13N3O0j4q6m1M0J47
4350A19R7k76J50J81m80J04k1K46L1j28K37l50K42l15n9Q7K75r5j89L27k29m3
4372h9K51j03R6L8l95J97QK13k99o3Q5J05l52J80J11m4l08N28k76K69l3k50J14
4395a7l31O75m28j16J69j09Q9J80l79J50j10K29lK09on29K78r6n9L34j45k0k21
4418b56L60l29N26j23k55m3p5J14L23k33l4j1jJ20JK0k62J31J14m3%j27O3R3p2
4443AK71k35N9k06K70k42K21k00K79j65j21K2K03l86J13K66l79K45L4l0J42J51
$$ plain form
4279 100 -142 87 -15 143 82 -48 135 41 127 73 -72 -94 163 162 14 180 -67 -54 17 -291 45 -210 -297
4302 -297 -36 61 108 -32 -15 5 -65 -130 160 18 -92 -9 -161 -60 116 50 99 36 162 -255 306 42 -18 271
4326 271 5 58 -25 120 104 51 -186 94 234 130 37 -56 -1 318 76 273 -40 13 73 59 -27 -68 -28 119
4350 119 216 -60 90 271 -209 -105 -126 120 151 23 260 -90 152 -163 -222 -135 140 45 -144 183 -46 -89
4372 -89 162 59 155 193 -202 -5 3 216 -83 -146 -61 44 -308 -128 -17 -61 -369 159 -117 152 119 -131 -17
4395 -17 -348 327 -101 -217 -48 -157 -68 112 -267 -117 -227 2 -1 208 202 -327 -49 -145 -204 130 -15 -35 -256
4418 -256 104 -225 301 178 -77 -120 -195 -81 242 9 -25 -36 -37 83 84 104 -158 -27 87 44 44 -83 -20 73 1
4443 1 272 37 96 -110 160 -82 139 -61 218 53 -68 -46 157 -229 -116 150 -229 16 50 20 162 313
4465C13m78j4K00J5j56J92l44K19j86K14J17l5P4k09J80k21J39L9j20M7j59J14
4487e9k7M2Q5%J99m62J81K08l84J08K43j45J18l00K59Q7m1j64J11J54k25K23k44
4510c3N0l24M64n9k4k29Q6n3j84L01j22J36R9j39j16J60q0K01M6j77j11k1oJ88
4534E3L8o5m7o5J19j33O7l41L06J93k3M7jk06R3J17O2k52o1K65m44J89k9k8J73
4559B7j32J71M1j32L7M1j11K5J60Q9O0k78kO9J00k02Rl70N93K8j3j42o0k8j06
4584a26L00k60J52k40K9L12k10j08R9R3k29k1J26K06k9K5k53J40lO2j71J95Nj29
4608c5L36l13j90K01R6l08J98l96N86k14K01J06o80O02j09J53n8o39N19k34N16
4629C38m52m1J46P0j01M3j51O6L18q4k16Q6J01k85J69J13k05R2j71PR3K12l27
$$ plain form
4465 313 -165 -179 21 36 -120 72 -272 -53 -239 -25 92 57 131 -78 102 -119 20 59 -61 -14 -173 -59
4487 -59 -86 -44 41 41 240 -222 -41 167 -217 -109 134 -11 107 -193 66 153 112 -52 59 213 -12 211 -33
4510 -33 17 -307 157 98 74 -155 -69 -122 -306 -5 -127 9 108 -31 -147 13 -67 134 180 3 -108 -129 -135 53
4534 53 91 26 -21 -86 33 -100 -33 -374 -68 125 102 149 148 -58 35 152 214 -38 -99 166 -278 -89 -118 -146 27
4559 27 -105 66 107 -25 12 53 -58 -33 127 216 276 -2 -4 65 165 -37 -28 -398 195 223 210 68 8 -20 -126
4584 -126 174 -86 66 -174 -145 167 -43 -151 -52 41 -188 -209 -83 123 94 119 -134 6 3 65 -106 89 94 -35
4608 -35 301 -12 -202 -1 95 -213 -15 -411 175 -39 162 268 -412 190 81 234 176 -463 56 -178 338
4629 338 -114 -155 -9 61 -40 3 -148 -82 236 152 -64 22 123 -162 7 120 -85 7 -164 -157 -64 148 -179
4652a79L9N6o6J72K0k05J77r1p0K13J71l42L47k64MQKJ77l03J30MJ13M1o1q1j04
4678i2K00pk80Q5l1l3Q6J4J5J28k99Q4p9J83M6L0L2j21l31O54j89k11J30N9j6
4703E7j41j03L34O5J3j32Q7j26K9l0J26k33K19j48Q3K53k42rj83P9k9k51J65k14
4727c31M50jlk60L38j93J61P8l52R4m4JJ41l52J70J96J26k55r2J06L6k40L12m5
4751D1q8K39l16j8j70J81K56j30O3j5j98L36j44K72k15l84M52k86J33J22l7K28
4773C22k51K00r4q9j86K25k74K26J05j49k6j5J36k58k18N36j21r0N6P6l08r4J09
4796a82J28p2M27j69q5k84L38j61J78L4l09K89m9j32OJ24L34l70M0l0J09k71R5
4819a2J83J7k32K03p2j13J43j15k27J77J84j31J82k51O6O8j12P6J03k41k5NK04
$$ plain form
4652 -179 -140 -84 -150 22 42 -163 14 -77 -147 66 237 -105 242 -22 -18 -10 -8 169 -134 -4 0 113 154 93 12 -92
4678 -92 108 101 -179 -94 -125 -158 -72 -58 -43 85 -214 -130 -209 -26 20 50 82 -39 -370 284 95 -116 14 73 57
4703 57 -84 -187 147 212 225 93 180 54 83 53 179 -54 165 17 100 353 111 102 -81 -2 -31 -282 -117 -331
4727 -331 119 118 115 -145 193 0 161 239 -113 -19 -63 -62 79 -273 -103 93 219 -36 -128 -22 14 -226 86 41
4751 41 -47 192 -124 -142 -312 -131 125 -5 58 43 -155 181 37 309 94 -290 162 -124 9 131 94 322
4773 322 71 271 177 88 -98 127 -147 79 184 35 9 -6 130 -128 -346 190 69 -21 35 111 -197 -291 -182
4796 -182 -54 -126 301 132 47 -237 101 -60 118 152 -157 132 83 -49 -43 81 415 45 85 55 164 -107 -12
4819 -12 171 188 -44 159 87 -26 117 2 -225 -48 136 5 187 -64 2 70 -42 34 137 -104 -129 -124 80
4842H0k01j69M19L4J64l93j69K76q1K47k52K9J71l43M1L33j23k36J21N4L9r4J08
4865E5n5J7RO0j00n2K01k12J67J51r8p8nr5J65J2l80K81k3r0j41N9O6k90N07j
4891A30k00K08k02R8J69q2k83L84m95K23J03kJ6N6j16k1l2K25J00k05j74J78o5
4914A3K1J8O7j90J15R2J40l17j6J07k10L33l55K89j60p7J87j43O9J59J80k97R0
4937A15j24m7K23k01J25n7j65P6k3j2j10K8K98j90K09K2k25J54P3j91N4q0P6j3
4961A5j02N7m6L73k80k45L58q1q9J35K65l78j7Q7kk66K54Nr0J47p5K3j8Lj1J22
4987A44j47J03r2R5Q4l58L55k50k3O1J48l22J84j66l7J75J79L1k60J65n0K36J11
5010C66k61O5Nk63J19nk6j1k81K51l3K51Pj00n5p8l9%j03J87J12N9k36q5j6J89
$$ plain form
4842 80 -121 -290 129 163 327 -66 -235 41 -40 207 -45 -16 155 -188 -147 186 63 -173 -52 2 41 -53 55
4865 55 0 17 26 86 -14 -66 135 -77 90 241 143 65 60 -35 130 142 -238 43 20 -70 -211 -152 -86 -376 131 130
4891 130 -70 138 -64 34 203 121 -162 222 -273 -50 53 51 67 123 7 -14 -46 179 279 74 -100 78 13
4914 13 34 52 119 -71 44 136 276 -41 -57 50 -160 173 -182 107 -53 -130 57 -86 -17 142 322 25 115
4937 115 -9 -56 167 -34 91 34 -131 -55 -78 -90 -200 -172 126 -64 145 167 -58 96 169 -22 32 -48 28 15
4961 15 -87 -30 -76 297 17 -228 130 49 -40 95 360 -18 -35 52 50 -216 38 43 -47 100 25 48 30 33 22 144
4987 144 -3 100 8 103 187 -171 184 -66 -89 -28 120 -202 -18 -184 -221 -46 133 164 -96 69 19 255 366
5010 366 105 170 175 -88 31 26 0 -11 -292 -41 -74 177 184 84 29 -49 -88 -88 -191 -4 108 167 -69 -154 -170 19
5036A9Q3J20j07Kj93J20R4j41M6j13Q9j76J13l69M48k55M17k83M22n33K25n5O5
5059C8Lj52K46n3l00J47j79L47J20l12J29RJ8j81N5K93m8m02L67Oo4k26J42k00
5083a97K75m32M19L25l29k84L41nN7q5k89M37k01j0j97M00n3k06j73J42K03k95
5105a57K89j23K24l74J06r2kM82k79q0LO2l24K79qm2L97m38K58k99J62j76m6K64
5129H6q6J99k21m1K60l33K78J8k11J50l87K31J00J46j41j00J43k5j44k50P14n10
5151a24Q8K19k33J16k2j70k2J41M7k17J65j32K22p0J48p7j10N8j37J05J9j50P7
5174e9K1O5k9M08l74m4p8J34mp2j89M46l01j37L40j05J64j45Q0n4q1L3j32J36
5198B3J51j36Q8o7j43J58j36R4J68k90Q7J64p8k6l5j21K89j62j59j44M57j81n7
$$ plain form
5036 19 102 222 115 117 -76 44 138 -3 43 -70 19 -157 -44 -413 35 -220 197 -86 336 -197 28 -27 38
5059 38 41 -111 135 82 -218 -71 -250 97 217 -95 34 43 61 -120 -65 228 180 -222 145 151 87 -139 3 -197
5083 -197 78 -354 65 390 61 -223 118 113 170 85 -204 233 32 22 -175 225 172 -34 -207 -65 138 -157
5105 -157 132 9 233 -141 -35 -127 -129 353 74 -6 -3 59 -265 14 6 -36 361 -77 181 -118 44 -132 -178 86
5129 86 0 199 -22 -63 197 -136 142 160 -51 99 -288 -57 43 189 48 -52 91 66 -78 -328 386 -124
5151 -124 -36 183 -50 66 44 -126 -148 -7 40 -177 -12 -144 78 8 156 79 -31 27 -110 -5 14 -136 -59
5174 -59 -38 27 -2 406 32 -12 -90 44 40 -32 -221 225 -76 -213 127 22 186 41 121 67 -14 19 -113 23
5198 23 174 38 126 59 -84 74 -62 32 200 -90 -3 161 83 57 22 -99 190 28 -131 -275 182 1 -56
5221e6O8j44K97k86J76m3j51J34r8K09p8LoK07k30N6O0j78n9R1k9K55l7k63M9
5246e3Pm2k2QJ90k19J44J66k47K03k55K08j64M7m3m7L16n2j16J68j44J98m78L76
5270A49j4J2O7o33M48qp3K05j68K4j8J30J27l74K53r8Q1M0j57j13J88k4N3j44
5294d7K6jM1K87k58j8q2K03j2J46k64J32o5j19J73L25m18J62l69K33q1p7j20L84
5318A81k70L5j90M94l43K71n8KLm6Q7j16J3RO9k55l9J12k77J63j2j09J45J00K0
5343a1J78j12J74m28o0J45jK37k05P1J32j90R0j06j41K09J61k87j28L86m5l34
5365b65L66k10Q9K26k66O5J57m3k80J95q4o8L9L5l72O44j59K7k10r7J37K71j88
5388Il43M51M3p2j04J14j16k1L7J45k9L9l10K21p7k2K66j83J7j39r8n9K82L2O2
$$ plain form
5221 -56 12 -132 165 -121 55 12 -139 -5 -103 106 28 31 25 232 2 58 118 -60 -119 -28 -57 198 161 -102 -53
5246 -53 -46 -88 -110 -102 88 -131 13 179 -68 135 -120 88 -76 -29 -72 -119 197 145 29 197 53 251 -227 149
5270 149 135 147 214 -419 29 21 -52 153 -15 9 -9 121 248 -126 127 29 110 150 -7 -120 68 44 97 -47
5294 -47 -21 -22 19 306 48 30 -52 151 139 285 21 153 88 -31 142 467 49 211 -158 75 -6 -83 -203 181
5318 181 -89 -54 -244 250 -93 178 120 122 125 79 166 50 63 72 141 -114 -153 -41 -318 -155 -167 -276 -131 -31 -11
5343 -11 167 55 229 -199 -259 -114 -115 122 -83 -12 120 -70 20 -86 -227 -18 143 -144 -272 114 69 -265
5365 -265 101 -109 -20 206 -60 5 162 119 -161 34 -50 -118 -79 -44 -416 228 69 96 -114 -211 -74 197 9
5388 9 -334 117 160 88 -16 98 -18 -39 -2 143 114 153 -157 64 -13 -35 231 48 65 -74 -172 -231 51 83 145
5413A45n6j19k52K36J89N1q7r5q2J77p4J25k88m8K87L8J21l30R2p8J05j27j19
5436a89J25J77k64J20n0N2M3P2q1j2J66j61J59J7ql21J42l5q0J29K34k02k13o
5460a86J22J63j24O4k99K35K37K16n25j5J18j67K16O1k83K95j52J42k70L36j48
5481C6%J30m24K32k7J8J39Rj7j78J5M33n85L39K7q0J80j11j55J27r1J26l01P0
5505h8J17j59J5R0Q6k0p8mj8J5J43M9j22j80K15N0q8j10J01o6R8q6K07j80j33
5530a46J74l56J73K90Q8j24q9p8q2P1j8K56l91K94k82M21j05O7m0L0k37J60j59
5553h3N0J69n5J84k61p2m6L3J62l31L44N2k46L13k76N8l23L93j80L42j58j06K2
5576a5jj19P2q9L11k73J4k7J40Q4k3q6k6J4K09j02k03J17K80l83K32r8n2J33j61
$$ plain form
5413 145 89 -30 -282 -46 143 194 107 12 -70 107 33 158 -130 -178 109 147 268 -62 30 -48 57 -70 -189
5436 -189 -64 113 -151 -31 -81 -29 14 86 5 -7 159 -2 157 174 166 -155 -13 -48 -128 1 235 33 -180 -186
5460 -186 -64 99 -25 39 -260 -25 212 428 -97 -112 6 -161 55 116 -167 128 -24 118 -152 184 36
5481 36 36 166 -258 -26 -53 -35 104 113 96 -82 -67 366 -219 120 147 67 247 136 -19 108 17 143 -158 -88
5505 -88 29 -130 -115 -25 61 41 -37 -41 -59 -44 99 148 26 -154 61 111 23 -87 14 -52 46 -40 167 -13 -146
5530 -146 28 -328 -155 135 223 99 10 -68 -150 -79 -97 159 -232 62 -220 201 96 163 123 153 -84 76 -83
5553 -83 -33 136 81 265 4 -68 -114 -81 81 -250 94 146 -100 213 -63 -5 -328 65 -115 227 69 -37 -15
5576 -15 -16 -135 -63 -152 159 -114 -100 -127 13 97 74 -12 -38 -24 185 83 -120 -3 277 -106 126 28 -24 109 -52
5601e2N4J21j80O7j19J39k9J21k61K37l25L58m6K1o8l05J63Pj75L86N3l54M80
5624B93k73j48J12O5j72M21k94J4j87j63L01R7o0MJ97k57j03J69N7j13J21r3K1
5647Ik90J35M7J40k4j45o4K52L51l39J81j41K6k9l06K57P6J35m0j99J52k56N2
5670b0K29l10P8j48K2L16k8j79K12k36l17K69l2K75J36m40L05j86l65M46j7k1
5692a1O4j24m8j71L87N5l8l60M43l04P7o7K4K41j25n7L8J13j11o4M1K31k72l2
5716g0M18k99q6l6J44p5k6p1k2K46j76k6J40j17m6N5r4N46n49L39k51pJ27K45
5740C09m54J77O4J2k98K80P2o2O4J50l99j11J2J67m0L5O9K01j7j43P8k39Rj06
5764a70J66p4O9q2L7J47m7m9k7K0k30J03Q3N1p0M02k47l6j1q6J33p3J18o0m5K32
$$ plain form
5601 -52 2 123 -57 10 -109 30 1 122 -139 98 -227 131 85 106 38 -267 -104 -97 -272 114 167 -187 293
5624 293 20 -128 -16 49 -123 298 4 18 -169 -332 -31 66 6 10 207 -50 -153 16 73 -40 81 -12 9
5647 9 -281 -146 -99 41 17 -128 -192 60 411 72 253 112 138 109 -197 60 136 271 231 32 184 -72 -20
5670 -20 209 -101 -23 -171 -149 167 139 -40 172 -64 -381 -112 -144 131 267 -173 132 -54 -419 27 10 -11
5692 -11 53 -71 -119 -290 97 152 114 -246 197 -107 -30 -97 -73 168 43 -14 24 137 26 -38 3 234 -38 -70
5716 -70 348 49 -37 -73 71 -4 -30 -101 -123 123 -53 -79 61 -56 -102 -47 -141 405 -144 195 -56 -63 64 309
5740 309 -145 32 96 108 -190 90 162 100 164 314 -85 -196 -184 -17 -57 -22 47 248 231 88 166 -73 -64 -170
5764 -170 -4 -78 -9 -91 -54 93 46 -3 -30 -10 -240 -137 -54 -3 -73 329 82 46 35 -51 82 9 127 67 22 254
5790B54k35J06J30l31J54J3l1j64J07L6p1J79j82K78k72k33L59k55J75k43K22
5811dj79J40J04k80K86k08J53j89K35L6r9M1m7k5N3J7K87j68l65L41J33j66q7
5834Ij56R1P1j53J84k21K81r8P6j36k08K20j00J91J96k26ML45m67k05L36K54q7
5857B01j67P9m4J36k77P1j79P5J43J01l26L8K65K5Mo6l4j44N8m4K44l87M67k19
5881B0J88k26J26p2j48J51K15l07j6K92J3m92K91J39k02j53r3J16K91j10j59M2
5903i4N7K60l15J40j90n9M34o7l28K8R4Q5j45R6J69J07m42J91J58M0k53j3q2K11
5927H2m4J61k43P8M0J73l47O7K42q0j37n1j5k6p5K9R2q1L42l47M81o27J68J5J93
5952I0m39K65mN4P6J02n6j96O4j7j17j70L30J23J37o7l84NL40r1o2k05J52N0J61
$$ plain form
5790 254 19 125 255 -76 78 91 60 -104 3 39 -32 147 -35 243 -29 -262 97 -158 17 -226 -4
5811 -4 -183 -43 61 -219 67 -141 12 -177 58 94 -5 36 -11 -36 17 34 321 153 -212 129 262 96 9
5834 9 -147 -56 15 -138 46 -175 106 8 84 -52 -260 -40 -140 51 247 21 25 370 -97 -302 34 288 201
5857 201 34 113 69 205 -72 -1 -180 -105 38 139 -187 -149 116 141 145 79 45 -99 -41 -85 159 -228 239 20
5881 20 208 -18 108 36 -112 39 254 -53 -69 223 236 -256 35 174 -28 -181 -274 -158 133 23 -136 -94
5903 -94 -37 223 -92 48 -142 -201 233 166 -162 -134 -40 45 -100 -4 165 272 -170 21 179 219 -34 -47 -129 82
5927 82 38 199 -44 34 74 247 -100 -33 209 129 -8 -59 -74 -100 -175 -146 -54 -135 207 -140 341 -286 -118 -103 90
5952 90 -349 -84 -88 -34 42 144 88 -108 -44 -61 -178 -348 -18 105 242 175 -209 -204 136 45 -17 -222 -70 -20 141
5977A41k38R4P9m3J1m5k85M31p2K07k52k3K66k72J47j2l51J69oJJ55k61R8K61
6001B00r0q6r5J3p4O6j63M21n57L17J44j57K71m15k0K85l18K52J33l24J2M42m53
6024a96J94j05J25K15k14o3p7j91K30J63J1J51k83j4J91j16o9Q6r0qP6jo5Q1k9
6049BL4l14L22j14k7r6K80k20J05J33j01m7j19l6K54L7p2j29K58j94N1p6k79J56
6073a92K08P5j31j22p7M10p9j19J0j73K94j55J75j21kK31k36p9j06K05n3J12R8
6096A73j34n3J31j75k86L19K31j44J2J54l39K92l63P0J57j10k51M97k56K47j42
6117C0J9j79J30jmJ29k09K39j34k49L08o6J46ok99j23O17l42n9N3R2l56L41J24
6141B01l16M2j02Q4L29k68l7k68L16K19J11l58%PJ12k84K04j7K1K55l22J04k09
$$ plain form
5977 141 -97 -3 76 33 44 -1 -286 145 73 280 28 5 271 -1 146 134 -217 -48 -54 -53 102 -159 -61 200
6001 200 110 24 -71 -58 -132 -66 -229 192 -365 -48 96 -61 210 -205 -225 60 -258 -6 127 -197 -185 257 -196
6024 -196 -2 -107 18 233 19 -44 -121 -312 -82 81 92 243 -40 -54 137 21 -48 38 -52 -60 16 15 -50 31 2
6049 2 36 -278 44 -70 -97 -193 87 -133 -28 105 4 -43 -162 -198 56 93 21 -108 150 -44 7 -69 -348 -192
6073 -192 16 91 -40 -162 -239 171 92 -27 -17 -190 104 -51 124 3 1 232 -4 -83 -189 16 -37 75 173
6096 173 39 -14 117 -58 -344 -25 206 62 74 228 -111 181 -182 -112 45 -65 -316 181 -75 172 30
6117 30 49 -130 0 -1 -5 124 -85 154 20 -229 79 13 159 153 -146 -269 348 6 -53 0 92 -264 77 201
6141 201 -115 -73 -175 -91 238 -30 -67 -335 -19 200 311 -47 -47 -40 72 -212 -8 -25 -4 251 -71 33 -176
6164a76K21j50K4K09l41K26K01r2m52N05J59k04m70K53O4J05L2K21l39k79M92
6185B09j35K85l72l4J53q3J13j73J01N7l46K73r3k6m9K30l5M1n2j3m2P2Q6j7j97
6210d7Q1j65L12m06Q7Q9M0J14l9o0l6j51L36k91Q2j72J34K25l70L32j14j8J18
6233H1J82l23RK14j60J42j73K11k67J91n4M6j17l5J24k44K6J59j33K34o6l02L67
6256A12r8m5O6j96K55O9l8l14J87j30PK73j02l5j47J19r5K6Q3j37N1L4K14j47
6280A2rL3l6J33q0j77J8L1j19J55L05j15j50l3K65o3k32M02n61J90J37N9m77L81
6304F9k71K7l1M24k74K40o4P6L2k25K63j17j20o7K56n27M19J2k88K12j24k60K89
6327d9J56J1k61j20K50j44J48J60j73j41m7L94o7om7K79k15j0j4L5l34J58n5o4
$$ plain form
6164 -176 45 -105 -81 128 -213 13 214 122 -330 175 334 130 -340 -87 -23 82 114 335 -4 -283 209
6185 209 74 359 -13 -47 106 23 136 -37 64 121 -225 48 -45 -71 -120 110 75 116 64 51 9 81 167 150 -47
6210 -47 34 -131 181 -225 -138 -49 -9 105 66 6 -30 -181 155 -136 -54 -226 -92 133 -237 95 -19 -37 81
6233 81 263 -60 -51 163 3 145 -28 183 -84 107 53 99 -18 -53 71 -173 -147 12 -121 113 47 -255 112
6256 112 14 -31 35 -161 94 163 125 -189 -2 -132 -125 148 46 11 -136 -17 -112 -86 -3 -140 -89 -55 159 12
6280 12 3 36 0 133 53 -124 -106 -75 -194 -39 266 151 1 -32 233 170 -62 340 -221 -31 106 165 -312 69
6304 69 -202 -175 -206 218 -56 184 120 196 228 3 266 149 29 -38 218 -309 110 122 -166 46 -78 -338 -49
6327 -49 107 118 -143 -263 -13 -157 -9 151 -22 -163 -210 184 117 111 64 343 128 118 104 139 -195 -37 -92 -156
6351a56J67k60K55p0q9K20Kj82J34Q4oj84J65j05l7o3L32k72j8n7L46k47K91l50
6375a00j60J09J99j93J63k1L2n8j5mL8n8K46k43m1j9R5J01k63J10L20k60kK10
6399A86j97N4Nq6j25K77k2P0r3J61j87m4K0j1J73M9l63j02M21P1j76q9K15k31
6423b4p2J50k55R6K10m3j16k5m9M8k04J34M2K55j35j30Q2J84l0j61N7j85M13k13
6447B9j83m2J34n4J83m44M24j58k3J05j0r9J71p7J18J02k64pK68j48n2k2K62j96
6471A7PK45k65J35j51J37n7l12J20R0J32O3k54J45k8k34L12l12L41k54Q6J57k54
6494a34K55J32k58j09J29j6P8l5O3j41l7j63K83j24O5j16J48L1%j4k8Lj57J97
6518E2m5J54k27J35P5j69J3Q2j75R8R4j78R2O7q8J47j32m2m1K52r7j87J82Rj52
$$ plain form
6351 -156 11 -249 6 -64 -153 67 69 -113 21 105 99 -85 80 -25 -62 -125 207 -65 -83 -140 206 -41 250 -100
6375 -100 -260 -151 48 -145 18 -3 29 -29 -44 -48 -10 -68 178 -65 -106 -125 -30 71 -192 -82 238 -22 -24 186
6399 186 -11 43 48 -38 -163 114 92 162 69 230 43 -1 19 8 181 230 -133 -235 186 257 81 -8 207 -24
6423 -24 -96 54 -201 -105 105 62 -54 -79 -128 -80 -284 -150 -108 147 12 -118 -36 148 118 -43 14 -171 242 29
6447 29 -154 -196 -62 -116 67 -377 47 -111 -134 -29 -39 -138 33 -44 74 176 -88 -95 173 25 -27 -49 213 17
6471 17 24 269 4 139 -12 125 68 -244 -124 -34 98 161 -93 52 24 -210 102 -210 131 -123 -37 120 -134
6494 -134 121 253 -5 -114 15 -1 77 42 105 -36 -73 -236 47 -77 -12 -128 20 51 51 37 9 12 -145 52
6518 52 7 161 -66 69 144 -25 -12 70 -105 -7 87 -91 1 68 -20 127 -5 -47 -88 164 67 -120 62 71 -81
6543h1K02r0L8q1R7J31j94k50K32L23k39L4oj84J30J47k66L2J34k27k14K36m3
6566a39J45J8q4M1J31q0q5O0N3j03K12n9L6k6K8k25K70j93o6j00L0J70R3q9j17
6591g9K57j12m00L90k38P1R2J29J02j07j48J9O6Q3k00P6q1J90r7j46L25l20p5
6614b03J91J81j32j61J47j57R1o6J09M4K04j50q4K12k54O2j34J0K24j95P3l3J53
6637A32j74nj2pL07k94o5k24M71j12L07n57K09n3m2O9J80l08K59Nk4l29J89j59
6661b37J61J82J40j75j25J49m3Q7R2k57Q8o9K35o0k87L17l84J83j08J24j09J92
6683I6J33j60j51JJ5K40q5j07J09lO8j48L22j93j53o5J67J10j83l1J85k4LK7j95
6708b2J92m09J62J79k65J55K02R1k55j05L61k05l9p8l00N21P8j00K6j68j09Qk88
$$ plain form
6543 -81 121 31 69 -12 85 216 22 -228 4 327 88 122 116 -68 62 209 -57 -25 109 -118 -332 -96 -139
6566 -139 6 24 -60 -19 112 32 -53 7 60 -43 169 110 146 120 148 -77 193 0 -66 -166 -136 34 127 38 -79
6591 -79 178 66 -334 56 -182 -111 -19 110 212 105 -43 -24 42 125 -75 1 -80 110 13 -133 192 -128 -203
6614 -203 -12 169 37 -124 23 -134 -43 -109 0 44 248 98 14 226 -28 34 -100 -90 134 -61 12 -21 132
6637 132 -42 -47 -59 -66 241 -53 -118 -342 129 17 324 -233 -24 -77 -119 -50 130 -178 81 86 62 -267 -78 -237
6661 -237 -76 106 246 71 -54 95 52 139 231 -26 62 -7 228 168 -119 198 -186 -3 -111 13 -96 96
6683 96 229 69 -82 -81 -66 174 89 -18 91 88 156 8 330 137 -16 -81 86 196 13 -18 167 143 146 173 -22
6708 -22 170 -239 -77 102 -163 -8 194 285 30 -75 286 81 42 -36 -336 185 263 163 189 21 -88 -80 -368
6731c68L91K12l71L84k98oK25j25k67J2M55l23k9K88qj78J35Mk42J82j35r4Q3
6754g3J01J43l03L20P6N1l48N5j22KJ12J99l57j76L7J59l3K52k74L4K87l30J25
6777f3j42M33l49M29k82Q2j92O8lj4Q2o0R5m2j38K64k01j35o9K34qj80J37j86
6801b40L00j32M7J02J63k62J50j71K13j65K83k98l51M84q4k87K28M6J14N9j0P8
6823B67r8n3j21j07R4QQ2j41L58M2m41O6J2N8k21K04J40n08K39n4J25j85J84k2
6847g2O6rJ05k4k67M08r5r0J98j88q9oj47K7J60o8j35P6r1K32Qk71L62J30p1j32
6873A7N6k70K87k37K84q3K4k33L56j78K51k79J47m08J26J97l56J49J00K66l71
6894a55M5K36k30J51o3K38k21r2K32j47k71K45o7L42l95J72J41k38R7Ql4m13K26
$$ plain form
6731 -368 23 235 -136 248 -50 -56 169 44 -223 -211 244 -79 -108 180 172 -6 129 133 -109 73 -62 -156 -73
6754 -73 28 171 -132 188 264 315 -33 22 -100 -98 14 213 -144 -320 -283 -124 -157 95 -179 -145 142 -188 -63
6777 -63 -205 228 -121 308 26 108 -84 -16 -19 -33 49 -11 84 42 -96 168 -33 -168 -237 -3 -11 -191 -54 -240
6801 -240 60 -72 -25 77 240 -22 128 -43 170 5 288 -10 -361 123 39 -248 -20 26 140 199 189 267
6823 267 169 116 -5 -112 -18 -10 72 -69 289 331 -110 -44 -32 26 -195 9 149 -359 -120 -174 -49 -234 -50 -72
6847 -72 -6 -15 90 66 -201 207 112 22 220 32 -57 -63 -210 -183 -23 -91 -226 -150 -241 -9 -1 -272 90 220 149 17
6873 17 73 -197 90 -147 137 54 78 -155 201 23 274 -5 142 -266 -140 57 -299 -150 -50 216 -155
6894 -155 -110 126 -104 47 -16 222 1 -91 141 -6 -277 -32 -99 243 -152 20 161 -77 20 28 -6 -419 -193
6917a93M8P7j35J68J17k31K23O3Jl37Q5K63j49Q7J86l86L23m07JK04J6J54J55
6940C33k77j68K99k79q5K81j15r3J74k15J25K0j23K3L22j47j73P0L2Q3L0J67n0
6963B34j12k24j69K88r6J79Q7k30j42n3K19L71m90K27lj26k46K86R9j87K08k5
6985I5l28L22k35J20J9n8J28m73O32l8j77J35j51J16j62j26J75k3k7q1K22j16
7007c1j9j30K25k44k0K84l54K72P4j30J75J1l09K51j21J11l6j13M6n0J68O4j99
7030g5L22j13j89lJ04J92m0m50K17lK17k64o1M47k05k1r8j4K5j44J52n2J5K71
7054B30l5l83M54l92j4L19k22J9J45r3N1j80R8J8k37R5J72L1J25k91M2K15m9p7
7078D1p6J71j47j04K9K13r7K6O6k35P2p2K00L27n25K52j62j31L05r2q6J60n8k07
$$ plain form
6917 -193 -145 -68 -203 -35 82 -149 74 137 138 -199 -114 149 0 87 273 -113 210 -197 -196 8 24 178 333
6940 333 56 -112 187 -92 -177 104 -11 -104 70 -145 -20 0 -123 -100 222 75 -98 -28 4 87 117 284 234
6963 234 122 -102 -271 17 -79 100 187 -43 -185 -238 -19 352 -138 89 86 -40 -286 0 99 -88 120 95
6985 95 -233 89 -146 -26 -7 -65 63 -410 222 184 7 142 -9 107 -55 -181 -6 -29 -56 -137 85 -31
7007 -31 -50 -180 45 -199 -219 65 -289 -17 57 -73 102 113 -196 55 -66 45 9 -104 -58 -108 60 124 -75
7030 -75 247 134 -55 -58 46 238 198 -252 -35 -38 179 -85 -146 301 96 75 -23 -37 -12 -156 -4 -56 -41 230
7054 230 195 -188 266 -126 -140 179 -43 -24 121 28 79 -101 -3 15 -222 -127 45 76 201 -90 -48 167 118 41
7078 41 -35 136 -11 -115 -86 127 30 56 122 -113 -41 -113 87 414 -111 141 -21 -152 153 61 -25 135 77 -130
7102a30Q5J17p2lL3j60K48k01J35J75k71K11l9j91J10m6K94l60K34J1k09j40J07
7125f2m32N17j14K4PJ78o2J83k93J64l17K53j99L00j63O4L12l38K55m1k35k21
7147b20J73nj73L32q4j55O4R2m1J41J51k00p5m98O74j98n9L5o9J55l07N51k06
7170G8k76J58K30k58P8q3K69j81J64j57o2K71l72J30k7Nj94K5J69L15q4k99J68
7193F7j20J33N3j81J92j12J0J0j1o8p4J4q1K73j56j43K19j14RQ1J01j58M6J21
7217A11J47k14K7k55k5L82M3k09L2k91P0R6J31J1l40L86k7l29N58n73K14oO9R2
7241A00j53K11j35j87N38m32O0j39J02J59k68K71o9r6K1O0q5L0J49l62L43k3r2
7264CK96m57K08Q9l33J92J01O4k1Rk3N0l09J84P6k25J14l05L87m6k15K18K9j87
$$ plain form
7102 -130 -45 72 0 -3 30 -130 118 -83 52 227 -44 167 128 -63 47 1 295 -65 169 180 -29 -169 -62
7125 -62 -494 23 -91 -67 -60 118 56 239 -54 110 -207 46 -153 147 -16 48 360 22 277 236 1 -220
7147 -220 -47 -52 -225 107 23 -132 -68 24 -17 124 275 75 0 -498 176 -22 -81 -46 -115 40 -267 284 78
7170 78 -198 -40 190 -68 10 -73 196 15 179 22 -40 231 -141 -11 -38 -33 -227 -202 -33 282 198 -101 67
7193 67 -53 80 133 -48 144 32 42 52 41 -27 -101 -87 -168 105 -51 -194 25 -89 -80 1 102 -56 -10 111
7217 111 258 44 71 -184 -209 173 216 7 39 -252 -182 -86 45 56 -284 102 75 -254 304 -269 -55 -61 8 100
7241 100 -53 158 23 -164 374 -58 2 -137 -35 124 -144 127 58 -38 -17 43 -42 -12 137 -225 118 95 3
7264 3 299 -158 50 139 -194 -2 99 163 142 151 128 178 -131 53 129 -96 18 -287 100 54 -161 57 86 -101
7288a01J26j6j92K33o0n6R1r9J66j13Q6j02%J85J43o0k15m3q5RO6%N4J28J0k69
7314a14J19K61l45J4R9j9l8q6J22j55L24q5k46P5R8%Qp7N4K4J15K12k43l63K84
7339C8j30J96K1l19L68j63j14J29J70n50M39k69L19M5k10P8j57J67j82J68k51
7360b07R9J59P1P5k61jJ52l2N1k66L2K38J97l92M5Q3o8j77J94j60R1J3j06K80
7384A10j61J0pQ1J8j44l4N0K00k34K45k58K52k33K85j46K6j17lo8L14j55j25L21
7408B27k49K04N4r9Q6m5l12P3K16K1q9j03Q7j09J58j15k30K18j50J74n7J13k23
7431a50K57M1l43K17l64L46J50l90K83J00k84O7P7J23l46O66l37m6k33K42j48
7452g2K09J15j10Nk37L5J76j57Q3J5m1J6JkN5o9J47o0m5k66J82j5K01p9k46L04
$$ plain form
7288 -101 25 9 -183 50 -10 -66 25 -74 92 -21 65 -37 -37 148 291 231 16 -27 -112 -103 -37 -37 17 145 155 -114
7314 -114 5 266 -79 -65 34 15 -23 -109 13 -142 182 97 -149 -74 24 24 32 -45 9 33 148 360 117 -246 38
7339 38 -92 104 125 -194 174 11 -103 26 196 -354 85 -184 135 180 -30 48 -109 58 -124 44 -207
7360 -207 -108 51 122 197 -64 -65 87 55 106 -160 -128 110 307 -85 -40 43 -25 -202 -8 -168 -77 -64 -170 110
7384 110 -51 -41 -48 33 51 -93 -127 -77 123 -111 134 -124 128 -105 180 34 60 -57 -60 -128 186 31 -94 227
7408 227 -22 182 236 137 223 178 -134 -61 155 176 87 -16 71 -38 120 5 -225 -7 -157 17 -40 73 -150
7431 -150 107 148 -195 22 -342 4 154 -236 47 147 -137 -70 7 130 -216 450 113 67 -166 76 -72
7452 -72 137 252 142 147 -90 -55 121 -36 47 62 21 37 38 36 91 22 169 109 64 -202 -20 -35 166 87 -159 145
7478A45M6k51K6K33k95P8P8JL6l44Q9L02k07J39q1N4l1J66o70L60J13q3J50k98
7502b44K71n1J1j22J91J83j68l19L04j36Q2J83p3k03L90l86m1L13j27p1%Nk00
7525b08L42k4l55K24P7o7o3J77l8j93L82m30jJ39N4J35m47O8J76M7o5j73L4M8
7549a61K23L2m4K61l09J18o3Q2P4k52J74n7j59K67j47r6J20l3Q7P1q2j22J58j1
7573A31R4l06K98m69J81K8Q6J38m29K55R7m1m29K81j04N24n10K22k82J60n7j31
7595b63L96M7j72j28M7J0J72j36j51K67q6k12K01O9k59K31j4P9k66p4K17J5j85
7618a95k2K29l03L37O9q6j70M28k58k21O5J50K44M5k27O1q5J7k28K84k78l8K99
7641A17k44L31n3O8k48L9r8M18m13J43j55J18L5m3J28k85K57j05q6P6M7J82qP4
$$ plain form
7478 145 191 -60 -34 199 -96 -18 60 61 97 -247 -158 144 -63 76 -5 49 18 184 -486 -126 -13 -96 54 -244
7502 -244 27 -24 -13 -135 56 239 71 -248 56 -80 2 185 112 -91 299 -87 -128 185 58 -13 -13 -8 -208
7525 -208 134 110 -245 -21 56 -11 -74 103 65 -128 254 -176 -177 -38 16 151 -296 -228 -52 -5 -70 -243 -209 -161
7549 -161 62 94 50 311 2 120 57 139 213 -39 135 78 -81 186 39 -57 63 30 117 188 106 -16 142 131
7573 131 225 -81 217 -252 -71 -43 43 181 -248 7 104 63 -366 -85 -189 335 -175 47 -235 -75 -132 -263
7595 -263 133 180 8 -120 -73 -63 109 -27 -178 89 3 -209 -8 61 -198 33 19 98 -168 -242 -25 -10 -195
7618 -195 -217 12 -291 46 115 29 -141 287 29 -192 -127 23 267 312 85 146 61 78 -150 134 -144 -182 117
7641 117 -127 204 151 219 -29 10 -88 330 -83 60 -95 23 58 15 143 -142 115 10 -76 0 47 229 221 295
7665B95j54k68J78j87K69j65K69k17P5k02L2L0K33j95k25K56J10k13J59mk43J44
7687b3o4J41j89L8m9N2J53j24K57j49p4r2J10m1J3J98j89m6N0j15j07L64Kj21
7711en8J23K90n20J83k52M45k28p2J05k31K43l1o4R3j58m5K17m70O62j83n2j45
7734a53%J84K38m33r2l9L28l9k1J84k13J37j37q8Q7L5j27K61k21rK98Km2M4k32
7759d8J01r9K83j08j02j37JP2R4m1j34L33j23K24l37mM66m03j73K48n7m8qn2Q7
7784C5o1L86m42mO4l4J37p0JJ80k1j42j28J59k81J89j26K71j09q0r4N70l05Q2
7808A77j9j98m6jJ84N8p6l2J12j42n5J50N5l34J12Q3R2k68L61o2m94K31Lq7L94
7833A98l50M90j93L0l33K06K94k91m3J0k6o6J51J8l1M1j32o5O6m9j22L77k53K24
$$ plain form
7665 295 141 -127 51 -136 133 -32 237 20 95 -107 -75 -45 188 -7 -232 24 134 -79 80 76 -167 -23
7687 -23 -87 54 -135 -97 -146 -94 59 -65 192 43 -31 -123 -13 -54 -41 157 -32 -78 -28 -143 -250 114 116 -5
7711 -5 -63 60 350 -170 13 -239 206 -22 -94 11 -220 23 -8 -72 21 -137 -182 35 -435 227 44 -8 -153
7734 -153 -153 31 269 -164 -256 -295 33 -6 -27 157 -56 81 -56 -144 -57 -22 -149 112 -109 -118 180 182 140 184 -48
7759 -48 53 -46 237 129 27 -110 -109 -37 57 16 -118 215 92 316 -21 -25 441 38 -135 113 56 8 0 -52 35
7784 35 -26 360 -82 -86 -22 -56 81 11 12 192 171 29 -99 60 -221 -32 -158 113 4 -76 -170 400 95 177
7808 177 158 -40 -86 -87 97 155 79 47 159 17 -38 112 167 -167 -55 28 120 -148 213 151 -343 -112 -109 -196 198
7833 198 -152 338 145 175 -158 48 342 51 8 18 -8 -74 77 95 64 105 -27 -92 -26 -75 -197 180 -73 151
7857A51j30Q1LN4j80J35MQ7k31J89P3k31k61L69O4l41J08P4O5j49o1K0J88J15
7881A96j20Q5q9m1L1oq4J68Ll08J05L22k69n4K3p4K37j38q7J07J03j37K33j45
7905F1j53J04k21K92j90K50l8J24l22L61k20k29L07k37L1J01j78J92L37m29O6
7926Ij60J0J14p9k14L67j08J22k49K35n3n6M7Q5J1k95K03J85k21K10l33n0O6J43
7950a1O4l01K40l3j18L3M15l96J36k69L29k1k99J7K53p1j26J49J16j97J51M0j43
7973d2N7j47Q1N9J90l13P9K01j17J27J8k93j40N6R6o2K7J92j46R4J26k23K41k06
7997d5J05o1J96o0n94M75Pl04M08r7j32r0k7K99n8p8L8j38M7L50k28j26L42k6
8021B03k07j20L58j66Lj09R5k51k5K58J06L7m07J13m1M14j49j1J70k90j16K49
$$ plain form
7857 151 21 102 105 159 -21 114 118 205 -26 163 236 5 -256 113 177 -164 -56 18 83 -66 -127 -107 81 196
7881 196 76 161 72 31 62 56 -28 140 143 -165 -60 262 -7 -61 -38 -112 125 -13 -100 7 110 -27 206 61
7905 61 -92 12 -209 83 -107 143 105 229 -93 268 48 -181 126 -111 -80 21 -157 35 372 -57 9
7926 9 -151 -141 -27 -106 -320 47 -61 61 -188 47 -6 -62 -15 70 81 -214 -11 174 -47 163 -170 -220 -154 -11
7950 -11 53 -248 -8 -41 -159 -126 289 -107 29 -240 89 68 -231 -214 39 -32 -158 -9 107 -90 61 101 -42
7973 -42 15 -132 -51 8 198 -115 -36 165 48 175 193 -100 -240 -184 -88 -150 -123 69 -77 17 143 -80 161 -45
7997 -45 60 -1 195 135 -459 16 23 -281 127 30 -102 -192 -219 80 22 -56 -18 -156 -109 241 13 -113 229 203
8021 203 -4 -124 234 68 71 -38 57 -194 -219 39 145 182 -225 -112 -153 261 112 101 271 -19 -135 114
8043A14o2J6l8k62K09j82J83J06q9Q5l02K96Q2j47O1j88J57k01K03O7p1n4m5J11
8067D9j93O9k1L52l10l8K06P6m7j89R5o6P8K0j45q7M8K67j35J95j9n3r3K1j85
8092a05J56J45j37j41J07J38l3k30Q3K98l49J34p9O2k32K20o4j71J22K98m79J04
8114a53L35j91p0J80q2R1M3k7j45K30l01J55n3J04Q9n03L64j86J28n8j20n3Q9
8137a34K80n2J18p9l6r5j19n3J85P7j00K18n06J35Rk2J11Q6P0j47l7J29Mj72k00
8162c30M80K0k50L62n19L65j51J69l28R9n1J85J00j4k78P5J7l0L30k00K0J03p1
8185A03p3o6K28l38J19J13
$$ plain form
8043 114 52 68 30 -232 -23 -205 -22 84 -5 80 -222 74 156 9 70 -118 39 -162 41 108 37 -17 -62 49
8067 49 -144 -75 -96 256 -54 -92 114 190 143 -46 49 -17 61 81 -64 -151 -103 164 29 224 205 152 59 80 -105
8092 -105 51 196 59 -82 25 163 130 -100 -17 281 -68 66 -13 49 -183 37 -27 -198 -76 222 -257 -153
8114 -153 182 -9 -79 101 19 110 153 126 -19 211 -90 65 12 116 205 -298 66 -120 8 -50 -170 -223 -134
8137 -134 146 94 212 133 97 2 -117 -170 15 92 -8 210 -296 -161 -152 -174 -63 23 93 -54 -91 38 42 -130 -330
8162 -330 150 170 -80 282 -237 128 -23 146 -182 -83 -134 51 151 137 -141 -66 -49 -79 251 51 71 174 103
8185 103 30 -36 192 -146 -27 86
8191H6
$$ Imaginary data points
##PAGE= N=2
##DATA TABLE= (X++(I..I)), XYDATA
0@%%%%%%%%%%%qJ6j6J6j6K4l2L2m0M8n6P2q4R7j13J32j52J74k00K28k60K94l34
34a78L78m24M75n32N95o65P39q23R16j010J115j234J363j503J655j823K009k212
52a159K437k690K975l293L655m074M561n137N829o676P745r145J1064j3863J8332
67A0561k6596M6751j81884k27089M78311J86213k23089j5720K00571j30643j64577
78d7191J51688P1798k52405n0969K31855k032k37868K8012J54151j05767j18981
89a77709J48832N1735j71692P020J89956j5983r0647J35795J17586j28463o5160
100A270J13388k6822j57481L7650J13012j05988j09189J36477Q2504j49631l7603
111a02413J57876n920j46776M7368J13745r1658p4604J31751O2070j10150K854
$$ plain form
0 0 0 0 0 0 0 0 0 0 0 0 0 -8 8 -8 8 -8 16 -16 16 -24 24 -32 40 -44 53 -60 72 -80 94 -106 122 -138 156 -178
34 -178 200 -224 251 -281 314 -351 388 -435 481 -529 586 -648 715 -788 867 -956 1053 -1159
52 -1159 1278 -1412 1563 -1730 1925 -2149 2412 -2725 3104 -3572 4173 -4972 6092 -7771 10561
67 10561 -16035 30716 -151168 -378257 100054 286267 63178 47458 248029 117386 -47191
78 -47191 104497 176295 -76110 -127079 104776 102744 -135124 -107112 47039 -58728 -177709
89 -177709 -28877 22858 -148834 -141814 48142 32159 -58488 77307 194893 66430 1270
100 1270 114658 87836 -69645 -31995 81017 -24971 -134160 2317 84821 -64810 -102413
111 -102413 55463 49543 -97233 -49865 63880 -27778 -102382 29369 91439 -18711 -15857
122a5857J16938m4331j21246N4209P8215j00549o7155J11601M2397j01860Q839
133c8799J07962l3395p9510P2226N5630j02108m5403Q5970j013q5900L1360P9583
145D6603m7232n9304O4298L7538p9598j8503Q6309K306p2235K9838O6412m4329
157A2103l6920P1800K6815p1578q864N1429l5807o7523L1273M2205m7191l0448
169f2706N1504J7003m7933R762O1252j1287m2508L5249L5504m4971j6235N4675
181C9309N923m5287J4475L7049l4301m1996K3450J3127m4604j7623L3198n5l2146
194d9481J9250M2619j4100k0491L7525K3320l3373n250L3700q000l0592J5763
206A0890K3752j9976j7653J7287J119l2187j1480J6603p567k2296J2901K2890
$$ plain form
122 -15857 101081 56750 -64496 -10287 67928 -32621 -99776 11825 54222 -47638 -38799
133 -38799 69163 35768 -43742 28484 84114 -17994 -63397 22573 21560 -64340 -32980 46603
145 46603 -629 -59933 4365 41903 -37695 -56198 30111 32417 -39818 -9980 56432 12103
157 12103 -24817 46983 73798 2220 -6644 44785 8978 -58545 -27272 14933 -32258 -62706
169 -62706 -11202 5801 -42132 -32370 28882 17595 -24913 10336 45840 869 -15366 39309
181 39309 45232 -55 14420 51469 17168 -24828 -1378 11749 -32855 -50478 -17280 -17335 -49481
194 -49481 -30231 12388 -1712 -22203 15322 38642 5269 19 33719 25719 -4873 10890
206 10890 34642 14666 -2987 14300 15419 -16768 -28248 -11645 -19212 -41508 -28607 -5717
218e717j1805n991L0181J5518j4295P419J9909j4920k1181J0302R145j5311n398
231b144J4109j512k0681k902J2177q899j7427J0034J2558j3953m530K3183R162
244I175q591J1569J8050r924j5281N141L254j3828n881R325o46j3729L25J2071
258A030m562j1475Q523R354j1978m231J4908K798r235R011J3381n420p789N758
272A0073J243j1853n868N906j041j0413J232J0525k284p506Q712Q044q129j781
286c140J1388k171r111M367O466n387l631N934J306q615m858M845m06o644K964
301f693R361l851m937Q967N550p305P56R280k774q495K163K547o445l136N304
316B92P30o734l039M265m64m831N202Q164l189k070Q062K522n965K065N555m251
$$ plain form
218 -5717 -17522 -23513 6668 22186 7891 15310 35219 20299 -882 9420 18565 3254 -2144
231 -2144 11965 10453 -10228 -13130 -953 -9852 -27279 -17245 -4687 -18640 -23170 13 9175
244 9175 584 12153 30203 20279 4998 10139 13393 -435 -6316 3009 2363 -11366 -11041 1030
258 1030 -3532 -15007 -6484 2870 -9108 -13339 1569 4367 -4868 4143 17524 12104 4315 10073
272 10073 11316 -537 -6405 -499 -1540 -11953 -10721 -196 -2480 -9986 -1274 6770 -1359 -3140
286 -3140 8248 6077 -3034 1333 7799 2412 -1219 4715 6021 -2594 -7452 -2607 -3013 -9657 -6693
301 -6693 2668 -1183 -6120 2847 8397 1092 1848 11128 8354 -141 2022 4569 -1876 -5012 292
316 292 1022 -5712 -8751 -4486 -4950 -9781 -4579 3585 396 -1674 6388 8910 2945 5010 10565 6314
332F314n232K497n70o163j690L294r73n082k43L361j562l309M650O029j856J2
348e23P575J249l231L037K906n497l207J647j926m783j133J351j585l077O31K522
364d044j183j519L696K694l256J732N741P74p04M926J150m627j327J423k586l877
380i87n80k15k445k590R84K279o20l75L870N02l284R56L263%J92L924Q39j807
398C906M21M66j345j194n85j881j683k169l97L93qO84K321L04m47J553M89j410
416e82Q41J630r51l75J250O5n02N03K03n54q49r71o41p08j155m5Q41N59L81K008
436I48O69j011O29m20j482N36qr38J85N46p56N87J565P58M7J0n25j479n14o59
456a312K71J455L54m28R55q13j001R63N8j539o0n15j701NJ870L70J629K754M13
$$ plain form
332 6314 1082 3579 3009 -3154 -4844 -1550 -2523 -7605 -7848 -4487 -6049 -9358 -4708 1321 -535 -523
348 -523 7052 8301 5070 8107 11013 5516 2309 3956 2030 -2753 -3886 -2535 -4120 -7197 -6566 -4044
364 -4044 -5227 -6746 -3050 -356 -3612 -1880 3861 4635 3931 8857 10007 5380 4053 5476 2890 -987
380 -987 -1567 -1782 -4227 -6817 -5833 -3554 -4174 -4549 -679 -177 -3461 -2505 758 758 950 4874 5713 3906
398 3906 4327 4793 3448 2254 1669 -212 -1895 -4064 -4461 -4068 -4076 -3392 -1071 -767 -1214 339 828 -582
416 -582 259 1889 938 563 1813 1878 1376 1879 2082 1528 679 -292 -933 -1641 -2796 -2841 -2000 -1441 -1060 948
436 948 1617 606 1235 815 -667 -131 -139 -1077 -892 -346 -1102 -515 1050 1808 1855 1865 1340 -139 -653 -1312
456 -1312 -1041 414 768 340 1295 482 -519 444 502 -1037 -1097 -1612 -3313 -3308 -1438 -1068 561 3315 3728
475C728j100j39o51r06l49n56J75n50j219j03J459j66q2R09q35k235l30K97k38
494b891J042K199J070J360K76K95l5l84j154n29j372j220n89M87m74O57J342n9
512B1j033N21k43j986K35J257j78L53K153R54Q15L34K97k59j373j496k99o19j376
531a922l54J056n12J59J683K97q04n63j60r60k32J210Q80Q53Q71J002L51p1k81
550B503J2n22j728j052p61j384L79J779N3l81J104n59q56N24K10j23mN70L57O03
570G24Q22N55R20M6o69l68j418j845o95L36p28L16J264l62j25J065O53j2l14j44
590B1m03M8K98K02N69L84N72P01k87j200l23q21j223j31k3k83O21J113K77M18
610E30N18j19o27k68j28n33k66k40M32Q30Q67L16L01o44m6m04n11j117L38M54
$$ plain form
475 3728 2628 2489 1838 932 583 27 202 -348 -1567 -1670 -211 -377 -459 450 -385 -2620 -2950 -2653 -2891
494 -2891 -1849 350 1420 2780 3056 3351 3316 2932 1778 1249 -123 -1343 -1932 -1445 -1919 -1262 80 21
512 21 -1012 -491 -734 -2720 -2485 -1228 -1406 -1053 1100 2054 2869 3203 3500 3241 1868 372 73 -546 -1922
531 -1922 -2276 -1220 -1732 -1573 110 407 -397 -960 -1120 -2080 -2312 -1102 -222 631 1502 2504 2855 2784 2503
550 2503 2515 1993 265 -787 -1548 -2932 -2553 -774 -721 -1102 2 -557 -1413 -889 -679 -802 -806 -236 121 724
570 724 1546 2101 3021 3067 2398 2030 612 -1233 -1928 -1592 -2320 -2004 -740 -1102 -1227 -162 491 479 165 21
590 21 -382 -334 -36 166 735 1119 1691 2392 2105 905 582 -239 -1462 -1593 -1616 -1899 -1278 -165 112 530
610 530 1048 929 302 34 -94 -627 -893 -1133 -701 129 996 1312 1613 969 923 519 8 -1109 -771 -317
630c17j23J81Q25l93j56P42j56p97o31n66m41m6N49J041P32l6L37Q09m49n86O72
651A191r6j167K17O1q40r0J059P1k14j8n72p51m44K46N5M29OP37R95J6QJ057l80
674A576l95K39l54j560R2J01r0o3R3K01k53l79lK20o60n7P11j1L67K58J116k42
696I07J92O71m32n44j9j12j118l83K00nj48L25K36j96l22m54P90r7j50L69P30
717D40n39M72Q73M5k2J35r6j073l72j64k17o80N58M14k46n71M93K12j32l42R37
738A25J53q06N22P37k59m8N96J44m88o00M85n21n33l10M56j11l21J91M71l64K5
759d56R93qq11L0P13l00o3O12l03n45N91Lk89n34K37K76m34l62K69J88r2m1N96
782B70p9j88K14o2r0l45K97k53j87K70l4J66j86M25M29o21j54L83k7j45q1M09
$$ plain form
630 -317 -440 -259 566 173 17 759 603 -194 -825 -1391 -1832 -1878 -1329 -288 444 408 745 1554 1105 519 1191
651 1191 1095 -72 145 206 -634 -724 335 406 192 174 -398 -1149 -1593 -1347 -1292 -863 -857 -120 875 891 899 1956 1576
674 1576 1181 1420 1066 -494 -402 -301 -391 -454 -361 -160 -413 -792 -795 -575 -1235 -1292 -581 -592 -225 33 1149 907
696 907 1099 1770 1338 794 775 663 -455 -838 -638 -643 -791 -466 -230 -426 -748 -1202 -412 -509 -659 -290 440
717 440 -99 373 1246 1291 1269 1404 1308 235 -137 -301 -518 -1198 -640 -226 -472 -1043 -550 -338 -470 -812 125
738 125 278 -528 -6 731 472 424 1020 1164 676 76 561 40 -493 -803 -347 -458 -779 -588 -117 -481 -456
759 -456 537 529 -282 -252 461 161 98 710 407 -138 453 456 167 -367 -130 146 -288 -650 -381 -193 -285 -326 270
782 270 191 3 217 155 65 -280 17 -236 -423 -153 -187 -21 -207 218 647 26 -128 255 228 83 2 411
804D11n62k00O20j3p19J80K61l75j89K60k40J81Q2L95N9l05L1Q10J05q96L98L39
826F33o31K89J31l90p8Ml78k8j00j45M39j30k33M94K82j01J5L82k43j1N89r3m35
849B62j00M37n50k79J82j07k32k84J10L39n69J76J85K26j8L46L39n0n04N34J91
870F34k45p0M45l43l47P3k48n11O7L44k98K7p4J98K66j70K22M21k51j93M29j39
892B37j87L35J21l03k4K6k45k1JJ37k01m04J46J48j4j54M85m0n4J42K22nn11R4
916f9N03o10NJ66R1r1k3K2k3J2k6K84j16l70K90j7O0j58L3J53j88J71l2k83k09
941d25M67k00n1J63l6J70K1j02M65m74M6L06m0m78L76o8j63L7j34J8q3J60P5l54
965c04L07k25L00k08m5K92K25l01K91r4l31J03Q3Jj91n5J64l46l3J99P8J34k10
$$ plain form
804 411 -151 -351 269 256 -463 -283 -22 -397 -586 -326 -566 -385 -303 92 151 -154 -123 687 792 -104 294 633
826 633 2 291 422 32 -46 -42 -420 -448 -548 -693 -254 -384 -617 -123 159 58 73 455 212 201 790 697 262
849 262 162 599 49 -230 -48 -155 -387 -671 -561 -222 -791 -615 -430 -204 -222 124 463 413 -91 443 634
870 634 389 319 764 421 74 147 -101 -612 -545 -201 -499 -472 -546 -348 -82 -252 -30 391 140 -53 376 237
892 237 50 385 506 203 179 205 -40 -61 -60 77 -124 -528 -382 -234 -248 -402 83 43 -11 131 353 348 -163 -69
916 -69 434 -176 -171 -5 86 -5 -28 -6 -29 -17 -43 241 125 -245 45 28 88 -70 -37 116 -72 99 67 -216 -425
941 -425 42 -158 -209 -46 -82 88 109 7 472 -2 44 350 310 -168 208 140 -23 14 -120 -102 -185 -25 50 -304
965 -304 3 -222 78 -130 -175 117 342 41 332 238 -93 10 93 94 -97 -152 12 -334 -367 -168 -90 44 -166
988a66o3M8L7O2J19J36n4M3J70op1m3K28l32k66m2J0J11j83J86k2l0J81RK5k1
1014F6l1J91J4k44J72k73M52j86j33M6j46M27n85P4k68L54n3M2J2R0r3J27K79
1037C34k36q6J37q8J57o6j78J24k49M33k25j78j33L75k26k1j33M6O0J03Q4K30
1059B64k7l46L6K13r6O9j54O8p3OM5k50K82l1j20J46j16j91R1j12J60L79k39j9
1083a5p2j16L08k03J64R5j54R3j24qM1J9j57J93l48L42o3m8l9l1K04J51k12l31
1107c11J64R7r7J52j00L6j13L14j18j88L06k35J38K80k40J30j88p2P5R2j28K8
1129B2J66n12L00m2J04k19K45K19J5n08R4J80k16K60K7Rl36M00Mj88j29J55j38
1152h8n4J10j58N54o70L92m51L94j57qJ18K49l19K72j45K29r6L2k16l1J29k63
$$ plain form
988 -166 -229 -181 -144 -82 37 173 119 162 332 326 255 212 440 108 -158 -200 -190 -79 -262 -76 -98 -128 53 62 87 66
1014 66 35 226 240 -4 168 -105 347 161 28 74 -72 355 -230 -156 -424 -70 -123 -81 -69 21 -72 55 334
1037 334 98 12 149 61 218 152 -26 98 -151 282 57 -121 -254 121 -105 -126 -259 -213 -153 -50 34 264
1059 264 237 -109 -73 140 44 113 -41 27 -46 -40 5 -245 37 6 -114 32 -84 -275 -184 -296 -136 243 4 -15
1083 -15 -87 -203 105 -98 66 161 7 100 -24 -32 9 28 -129 64 -284 58 -5 -53 -92 -123 81 232 20 -311
1107 -311 -147 -50 -147 5 -95 -59 -172 142 24 -164 142 -93 45 325 85 215 27 -45 30 122 -6 22
1129 22 188 -324 -24 -66 38 -181 64 283 298 -210 -116 64 -152 108 135 144 -192 208 212 24 -105 50 -88
1152 -88 -142 -32 -190 364 -306 86 -365 29 -128 -136 -18 231 -88 184 39 268 172 204 -12 -43 86 -177
1174a77P6J46j70Q3P0p8m7K90m1k09K51k52L48k82m1O3O3q6J94p5k25k67K03n1
1198b14Q0J90j42q2j19M08k12JJ62j06n5L78k46J4lK8L06l50J5k76K76j24N0m
1222b5j68K78j04J44q9P4k16j9Q7p7L98l16J79l14j1R6K16K9j79j20J14oL5q0
1246g4O0k08L21l00K57k6M9k50J00J48j77J34j34M23n24L93j95r6K97o4o6n8n9
1269d9nq0J40J39k45o9J73n6K3J67j34j62K59k98K23k09L37k02P1k76J19K42l11
1292b03J72k35K13K4k11K12k05L37k78R3K58k54J62L4p9J08m08L70k91M3L45m49
1314b42N06l11J62J25j16j02q7q7L39j13m4j31m9J96q0p0J83j92l1l6J90K06j53
1337F3j05K47j98j38K08k08J82KPl29M12j42k6o0J16m9j1l1O6R0K11K6l19Q1J10
$$ plain form
1174 -177 -101 45 -125 -42 28 -50 -97 193 152 -57 194 -58 290 8 -33 30 93 7 201 126 -99 -366 -163 -214
1198 -214 -134 56 -86 -168 -287 121 -91 -90 72 -34 -89 289 43 57 54 82 388 38 53 -223 53 -71 -21 -25
1222 -25 -193 85 -19 125 36 110 -106 -125 -38 -115 283 -33 146 -168 -179 -83 133 162 -17 -137 -23 -29 6 -74
1246 -74 -14 -222 99 -201 56 30 79 -171 -71 77 -100 34 -100 323 -201 192 -3 -99 198 134 68 10 -49
1269 -49 -54 -134 6 145 -100 -169 4 -52 -29 138 4 -158 101 -197 26 -183 154 -48 23 -253 -134 108 -203
1292 -203 -31 -266 -53 -29 -240 -28 -233 104 -174 -81 177 -77 85 119 40 148 -260 110 -181 -138 207 -242
1314 -242 264 -47 115 240 124 22 -65 -152 187 74 30 -101 -150 46 -34 -104 79 -113 -144 -180 10 216 63
1337 63 -42 205 7 -131 77 -131 51 53 60 -269 143 1 -25 -85 31 -18 -29 -60 6 96 307 333 14 95 205
1362B05j23j19K21m16L31K2m8m39N02j92M25m94j15K02p8Q7O1k84K95k93M08l42
1384a84K01j24j09l1J54M09k34j78M1oJ80j98n8J32J95l06K79l25jm5R4J68q6
1407c2J54l47K13j31J31r6K40O9r2m5j76J83m1j19J45J98o6j62j25K25l72K96
1429E0J02m61J29K94k68J26J37L0k5M2R6j36K06m46K2J27K6k99J98K00l79K37
1451HJ67R2l04J70q1k61J94k8j1J43L0k21j9J51j93L70l93P3K68m2k59m2J95J25
1475A32j19j36q2l0K71j66L68Q1j43j91J0j7L7J27l33K31K53l75Q0J40j77j1J61
1498A11J36l43n9M44j91k11k8Q0j98L54q3j23P8j15M12m08M6L1r5K41j53J74K2
1521A22j73J33Q1k23O9K89l93q1j2J51KJ1J59m36K67j9j09J80o9j78J99J80k03
$$ plain form
1362 205 82 -37 184 -232 99 121 73 -366 136 -56 369 -125 -240 -38 -116 -29 32 -252 43 -250 158 -184
1384 -184 17 -107 -216 -247 -93 316 82 -96 -55 -61 119 -79 -137 -5 190 -116 163 -162 -163 -208 -114 54 -32
1407 -32 122 -225 -12 -143 -12 -108 132 201 109 64 -112 71 30 -89 56 254 188 26 -99 126 -246 50
1429 50 152 -309 -180 114 -154 -28 109 139 114 156 252 116 322 -124 -102 25 51 -248 -50 150 -229 8
1451 8 175 267 -37 133 52 -209 -15 -43 -54 89 119 -102 -121 30 -163 207 -186 -113 155 113 -146 -188 7 132
1475 132 13 -123 -205 -235 36 -130 238 319 176 -15 -5 -22 15 142 -191 40 293 -82 -2 138 -39 -50 111
1498 111 247 -96 -155 289 98 -113 -141 -61 -259 95 12 -111 -33 -148 264 -144 -98 -67 -162 79 -74 100 122
1521 122 -51 82 163 -60 9 298 -95 -176 -188 -37 -35 -24 135 -301 -34 -53 -162 18 -51 -229 -30 150 -53
1544e3kj63J89Q9L9k25J69ro2J66k71l2J53O7j51J22J18Q6l22l6K89J39m26J01
1568b5rK5j60m2J95mJ10J9j13Q7J18l63J60j01K47p9k36R2jOm1J36k8LO4J37l44
1595a47K30PJ7Q1J70l46qq8J3j28K74k29J72L5k66K06L6L8m4N1J3R4Q6j67P9k09
1621c0J17k80m4M43l86K15j3j12K33j11k0l7J27k07QK46j04K2o0kJ28j64J79N2
1645B00l84L58l28J48p5JM0J82k32J55l51K23J26k49L27m6k16J26J1K0J39j98
1667b3J19K2l55K72q6K87k71K3Jp3P6o4J54k31J45K80k83j25N8j4L2jj0o7L3k31
1693c32L48k09M54Q1m44K44k28R2J99l26n4K19o5mn6oJ50j06R2Qk0o6J24k8j43
1718g6p0R9L36j77l2J87k47l99J77l1P1L17k06P6o2O2j03L59l35O3j33K38P1k32
$$ plain form
1544 -53 -55 -218 -29 60 99 -126 43 34 -28 138 -133 -165 -12 55 -96 26 144 230 -92 -128 161 300 -126 -25
1568 -25 -34 -9 -169 -211 -16 -20 90 109 -4 83 201 -162 -2 -103 144 65 -171 -79 -80 -74 -115 21 -7 -4 60 197 -147
1595 -147 83 90 107 188 358 12 4 -84 -71 -199 75 -154 18 53 -213 -7 29 67 23 74 87 181 267 100 179 -30
1621 -30 87 -193 -237 206 -180 35 22 -90 143 32 12 -25 102 -105 -97 149 45 67 7 5 133 -31 148 200
1645 200 -184 174 -154 -6 -81 -80 -40 142 -90 65 -286 -63 63 -186 141 95 -121 5 16 36 175 -23
1667 -23 96 118 -237 35 -51 236 -35 -12 -11 -84 -8 -72 82 -149 -4 276 -7 -132 -74 -88 -56 -57 -67 -134 -101 -332
1693 -332 16 -193 261 342 -102 142 -86 6 205 -121 -175 44 -21 -25 -81 -87 63 -43 49 57 37 -29 95 67 -76
1718 -76 -146 -47 289 112 80 267 20 -379 -202 -233 -162 155 -51 25 -37 25 -78 281 -54 9 -124 114 185 -47
1742d7j02J07M1K71l22K8K72j86L1r6L20k47n4J42J92n32L24j60J04j61l2J72
1764F5P9k79J52r8j12R3P1n2K22k99J93J76l55j90K00J31k99M01lj78K3J34n7
1787A8q5j01J63lqM0k37P3L76k53k18M78k13Po5K21k45n4K69l09L79l79P3L67
1811B94k46m7j74L77j93l25M27k61N7Q7j67J31o5K6K49p2nk6k67J74l2J08j56
1834a06R5J49J24n63M34r8k76K10M3J22m0M9q0k05J90L3k02L47%k39j45LJ83K08
1858B36j74J7j29K53m46Q7K54n8J72l53J19J0L7K4j91J46N6J0k52K19K69k83Q6
1881A09j64J84p4Qnk40L21k69J68k09p6J36n8J0j08K50J8p6J9K48j59N2Ll93N58
1906B53j8J14l26j62Q0J40n1pM3K4O9k61p1j5R3J18K0j15K9m6J42r8o9J28K76
$$ plain form
1742 -47 -149 -42 -1 270 -52 -24 248 62 93 -3 317 70 16 158 350 -182 142 -18 86 -75 -107 65
1764 65 144 -135 17 -81 -193 -100 -29 -81 141 -158 35 211 -144 -334 -134 -3 -302 99 96 -82 -59 75 18
1787 18 -67 -168 -5 -8 -16 24 -213 -140 236 -17 -235 243 30 37 -28 193 -52 -106 163 -146 233 -146 -73 294
1811 294 48 1 -173 204 11 -314 113 -148 -91 -4 -171 -40 -105 -79 170 98 93 67 -200 -26 -58 50 -106
1834 -106 -11 138 262 -301 133 35 -241 -31 12 134 94 143 63 -142 48 81 -121 226 226 -13 -158 -155 28 236
1858 236 62 79 -50 203 -243 -156 98 40 212 -141 -22 -12 25 49 -142 4 60 70 -182 37 306 23 109
1881 109 -55 129 55 63 58 -182 139 -130 38 -171 -247 -111 -169 -159 -267 -17 1 -75 -56 192 33 85 88 -305 253
1906 253 235 349 23 -139 -59 81 30 23 66 90 159 -102 -173 -188 -95 23 43 -72 -43 -89 53 -45 -114 14 290
1931B90k87L37l03QK75j55N4j01q2p4J26J61j12k00J24r6l7J95j74p4K31j36o8
1954i8J66k9L8k68R8j4N1J93J95l57l5K27l46L44p4ok51K44k74J29L12k96J75
1977A24p3m5P4j81M09l75K82j30j00m1l32N71k26J31J1l31L18P4j36m2J23J0j42
2000b7O4M5l8l8L3l4J50j6j44j16l5R4N9J4j03J34k11K46k5p0n6L74l64K01rm07
2026b79K68j12l7K87l21l2J40J37M8J87j65k51Q0N2j78K82j03J0K24l47J3L57
2048B60k41Kn5J06N2L8l55Q6J07K24r9q9L40o30O2L31k49P2l8j86K00J53l03M8
2072a64R5M44m97L80k53M1Q4k93J61J27L2k17L8oLO1j28K16q1q4j32K22n6J28
2096A21j34p7K21q5jM12l73J03p0P0l33J59J02j84j3j31J5J42jj51K42k7kL3j06
$$ plain form
1931 290 3 340 37 45 320 165 219 118 36 -38 88 249 137 -63 61 -35 -72 123 -51 -125 106 -30 -98
1954 -98 68 39 77 -191 -93 -107 -56 137 332 -25 -60 167 -179 165 91 85 -166 78 -196 -67 245 -51 124
1977 124 51 6 80 -101 308 -67 215 85 -15 -56 -388 183 -43 88 99 -232 86 160 24 -18 105 115 -27
2000 -27 37 82 44 6 39 5 155 139 -5 -121 -156 -62 -3 11 -92 42 -169 77 52 -18 -74 300 -64 137 128 -279
2026 -279 -11 -123 -160 127 -194 -226 -86 51 99 286 121 -130 -50 2 -176 106 3 13 237 -110 -97 260
2048 260 19 21 -34 72 124 162 -193 -107 0 224 125 36 376 -254 -192 139 -110 -38 -76 -262 -62 91 -212 -164
2072 -164 -69 375 -122 258 5 46 130 -163 -2 125 157 -60 -22 -28 -25 36 -92 124 43 -41 -173 49 -7 121
2096 121 -13 -90 131 46 45 457 84 187 117 187 -146 13 115 -69 -82 -213 -198 -56 -57 -208 34 7 5 38 -68
2121f8J39j26K43j48O2l6J3j84N2N6R8r6p9M2J76J40m15J08j9L17l26O0Q3j0K15
2146B97j24k69K59j35m49N37j02r1j91J45K07pq8J12j99J69l8k25K60o0J96J42
2168C46l69Q9p9Q2j52J38J37q2j19j74J65K6j31L9o1K77k65N9pj6J60o0j64N2
2192a09L02J6l46K98j44J23q4r2O0l11M64j45r6m0J98k23L73l16K8k4J57k1j9
2215D9k96L35j3j61L6l3O0j33Q2KK71j87M6k46L14m69K89J08m7Q4k4J59k54R2
2239F4k05P8K79k50K4k06Q1J99q1J08j9k59N2J99j22K27j11P0l82M17q3l44L39
2262G5j53o0J29j27L39j39J18j78L5j48K89n24J34k1K37pJ20n1j54j33J07L98
2284B86l30J22P8m67J43K67n1J12k29J95l2j44O9k22M1L67q4j62J68l76L62r6
$$ plain form
2121 -68 71 -55 188 40 102 66 79 -105 -53 3 101 5 -74 -32 144 284 -131 -23 -42 275 -51 9 92 82 297
2146 297 173 -96 163 28 -421 116 14 -77 -268 -123 84 77 -11 101 -98 71 33 -192 68 8 204 346
2168 346 -23 66 -13 69 -83 55 192 110 -9 -183 -18 8 -123 -84 -145 132 -133 -74 -81 -97 63 3 -161 -109
2192 -109 193 209 -137 161 17 140 56 -36 24 -287 177 32 -64 -104 94 -129 244 -72 -44 -68 89 68 49
2215 49 -247 88 75 -86 -50 -83 -23 -156 -74 -72 199 12 58 -188 126 -343 -54 54 7 91 67 226 -28 64
2239 64 -141 -63 216 -34 -10 -216 -135 64 -17 91 72 -187 -135 64 -58 169 58 128 -254 163 80 -264 75
2262 75 -78 -138 -9 -136 203 64 182 4 39 -109 180 -344 -210 -231 6 -1 119 68 -86 -219 -112 286
2284 286 -44 78 156 -311 -168 99 48 160 -69 126 94 -50 19 -203 -162 205 121 -41 127 -249 113 17
2306A7J63l41K86L0k58O3J3J47l71J45J11J92m80O20l43J43k28k0J10j61R1kJ75
2329A02l70O0L93j83q9J55j73L8P3j30m0L2N1j35J12j10J79Q6J30k6j67N4k22
2352a80j47L38k2l76L95J8k23K16p5L4j31J29N5k11J53j74J85K19o6j54k1l7J95
2375A20k33J61no1J00P6k44Q1K01j50M1J12k27lk08J90r3K39J20r6r9k0l10Q5
2399b23Q9K30j97nK81k23l4J5j05P8O0j19K73k00j12J73%Q4J46j08j48q6L19l45
2423a57q6O8L28l47J54P3Q1k16M8P1M4l3M2k85J61M7j34K88j50O2k13J28l49J20
2447b55L17j10J8j03J1L37j54j27O2n6JL0J02j37R0l6Pp6J48k16M42k68J46k97
2471a24R0J12K49j95Nj77j08K02j05J17R3j36k32K53j34J78J9k47K14j15k04J30
$$ plain form
2306 17 180 -161 125 155 -103 -40 -27 120 -251 -106 5 197 -283 337 -6 137 -91 -111 -1 -162 -71 -73 102
2329 102 -268 -208 185 2 -87 68 -105 -67 6 -124 -164 -132 -81 -216 -104 -214 -35 51 181 155 -12 42 -180
2352 -180 -327 11 -11 -387 8 26 -197 19 -56 -22 -153 -24 31 -180 -27 -201 -16 203 137 -17 -38 -75 120
2375 120 -113 48 43 -18 82 158 -86 -5 196 46 87 199 -28 -31 -239 -49 -142 97 217 121 22 2 -308 -223
2399 -223 -134 96 -101 -106 175 -48 -82 -67 -172 -94 -34 -153 120 -80 -192 -19 -19 65 211 103 -45 -131 188 -157
2423 -157 -243 -175 153 -194 -40 33 114 -102 -54 17 61 28 70 -215 -54 -7 -141 147 -3 59 -154 -26 -375 -255
2447 -255 62 -48 -30 -133 -122 215 61 -66 -4 -60 -59 -29 73 -64 26 -10 -3 -79 69 -147 295 27 173 -124
2471 -124 -34 78 327 132 137 -40 -148 54 -51 66 159 23 -209 44 -90 88 107 -140 74 -41 -245 -115
2493a15o8J43q6o2L07j11J8j57J09K29m28K3K44k14q5K43P8J65m12J00j06K91
2515A06J26k18L47m49K56n08O06l17NJ08j96J78n5L13k11j26J77l85L6K75l3J74
2537B09m3k40P3k3RK9p6J1J00K32j41j30j24K6K38k31L15n23L31K6J14j75p1L0
2561c4Q5R8m5j28J55j05L7k17J12J44j77L29l44K51l66M00j68l23M78J65l18j13
2583h4J07nr1R2k26Q6j05M00j75j05L06k01j52L75k91%j20L3J51k16L02j81R6
2606dn7j8P9m1J68m17L99l5l2j18p0K8lO4L3K46l02n3R7l56K70Q7k0J28j15k00
2632b42J58J94K4k00K75l85K15j91K70k24R1P3O7J45j93J99k28J42k30K01m5J5
2654A31j11K4Q2J62N6l50K00pj32J63l26p9K3K57k83R9K09j17J13k9j92M2J9J36
$$ plain form
2493 -115 -183 -40 -126 -188 119 8 26 -131 -22 207 -221 -198 46 -168 -253 -10 68 233 -179 -79 -185 106
2515 106 232 14 361 -88 168 -340 266 -51 -46 62 -134 44 -11 302 91 -35 142 -243 -207 68 35 209
2537 209 166 -74 -1 -24 -15 14 -62 -51 49 281 140 10 -114 -88 150 -81 234 -289 42 68 182 7 -64 -34
2561 -34 51 149 104 -24 131 26 63 -154 -42 102 -75 254 -90 161 -205 195 27 -296 182 347 29 -84
2583 -84 23 18 -73 19 -207 -121 -226 174 -1 -106 200 -1 -153 222 -69 -69 -189 -156 -5 -221 81 -100 -4
2606 -4 -61 -79 0 -41 127 -290 109 74 42 -76 -146 -118 -121 -57 -24 222 -80 -133 -36 -392 -122 -35 -55 73 -42 -242
2632 -242 -84 110 134 -66 209 -176 39 -152 118 -106 -15 58 125 270 77 276 48 190 -40 161 116 131
2654 131 20 44 126 288 344 -6 194 187 55 218 -108 -187 -164 93 -190 -91 118 1 114 85 -107 -65 -46 90
2678I0k05J74N0m15K89r0K16j54J16j89J16m3J33j88Q1J55l25J02K01q1j41J00
2700hJ85k04j21J12J17Q7r9j27Q6p8J8J15l0M9jl98J22K72Pm6l26K52K9P1k13
2725a29K34o9j2L6j25J73q3l49L63j32O9L3RJ94l07K32K1l33M19l35N0j81Q8L92
2749B58j24l11L22j19r0Q9K3p1M1Q9k79M8K94k41m9k44N86r2k26O6jl6P2P0O7
2774A42l65J53k85L40J71k69q5L68m4j65J04j77J93j46Q7j9J21l86N76k22J26
2795B18k14L43j70n2l7m1j18M9j43O8j57N7J96P1J4o5Q4k52K11q8L4O9l21Q2K34
2820G2j37MR4l6R3m6Q0j60m3J66L5R6k22J02j75J22J0J17r7j82m3J96Q8k0j03
2845A1k09K83M7K7p8r1J8k8J05L3p5k49J36L4k62M12j34m7m4N9J6o5L7M42o77
$$ plain form
2678 90 -115 59 109 -306 -17 -107 109 -45 71 -118 -2 -45 88 -100 -19 136 -189 -87 114 33 -108 -8
2700 -8 177 -27 -148 -36 81 168 69 -58 28 -50 -32 83 53 102 101 -297 -175 97 104 58 -268 -16 13 84 -129
2725 -129 105 36 24 60 -65 108 25 -324 39 -93 -24 9 18 212 -95 137 158 -175 244 -91 -41 -222 -134 258
2749 258 134 -177 145 26 -64 25 48 -23 18 107 -172 -124 170 -71 -120 -364 222 130 -96 -30 -31 -67 5 75 142
2774 142 -223 -70 -355 -15 156 -113 -198 170 126 -39 65 -112 81 -65 22 3 124 -262 314 92 218
2795 218 4 347 177 125 88 47 -71 -22 -165 -97 -254 -197 -1 70 84 19 103 -149 62 -26 8 77 -244 -162 72
2820 72 -65 -61 33 -3 90 44 124 -36 -79 87 122 218 -4 98 -77 45 55 172 75 -107 -150 46 134 114 11
2845 11 -198 85 132 159 81 -10 8 -20 85 118 43 -206 -70 -36 -298 114 -20 -67 -111 -52 -36 -101 -64 378 -299
2870b99K45J51l65J85L04k11o0o4m7K09K7n8j02J11K3O1j57P6j65N32m53j38P4
2893a21K15j55k4L9K57k29N1j62J01J29k22k5J22J42j61j25K32j63J25j70N0J46
2915E2MJ70l03K36m00L35r1P1N2L8p7J11r2k19q6K11j7j85L4K62k59L1L93l21
2939e0K63Jk71K20Op0K4j32N3j11R6j24L06j82O1n2k4p4J20o6q3J6l4K22J2o3
2965F4L6O1k74L36m42J36K0j7J83m7l65L08l45K61L32k09j08J30lj21P6k37J29
2988i6J39J73p8r0M9m5Q7N9j2k60J23m7j70j36K64K21k2p4q1p8K88N8l32J02n1
3013io6J62l4m23K00M15n19J93N3r3O4j56K7m6M03k93O2P7K04J43m21K65k66k8
3037h6M9N3k0N3P1q4k03J5K37l23J27J9n0L67k48l2k28M98p9j23n8kj6j04j20
$$ plain form
2870 -299 -54 97 -268 -83 221 10 -50 -114 -161 48 75 17 -85 26 49 110 -47 29 -136 396 -57 -195 -121
2893 -121 94 -61 -85 -46 211 -18 33 -129 -28 101 -121 -146 -24 118 -43 -168 64 -99 26 -144 -94 52
2915 52 56 226 -77 159 -241 94 3 74 126 164 87 198 106 -113 -199 12 -5 -190 -156 106 -153 -122 271 -50
2939 -50 213 214 -57 163 169 99 123 -9 44 -67 29 -95 211 29 90 38 14 -60 60 -6 -89 -73 -107 115 127 64
2965 64 100 161 -113 223 -219 -83 -63 -80 103 56 -309 -1 -346 -85 247 38 -70 60 57 -64 12 -225 -96
2988 -96 43 216 138 48 97 52 139 198 186 -74 49 2 -168 -304 -40 181 159 85 4 -74 214 272 -60 42 -9
3013 -9 -75 87 53 -370 -170 245 -274 -81 -28 -121 -57 -213 -186 -232 171 -122 -60 17 221 364 -57 208 -58 -86
3037 -86 -37 16 -4 49 120 36 -167 -152 85 -238 -111 -92 -142 225 -23 -55 -283 215 136 13 -45 -47 -63 -167 -287
3062b87J85m1P6l2L31k45O0m2J58j83J4K2N5k86Q8J27J6r7J45p2J86j19j34J52
3086G7j43J84k02R2j05Q7N4k91K07j48J64j71k8J33P5J82l07j19L79N8k30l8j2
3109a02j4r0K44o7j88J41N7Jm2L05l39K6Lj61J93Q7J57k01j29j93L41N4N1k42
3133a08N2J35J7P1K6l31P1J31P7k01L9l74M71n8j48J29O8o9J9k53K34j4R4N4k60
3158a28J60j06K97j19k6j63J75K9k63J6J63N3k12Q4n1K28k35L6j14J86Rn2J17
3181H4j40L3l27M35K04j34l99L27l43M44m56K91K8q4o2R4K1N2j90K23o2oL7k40
3205a70K26k29J97k69M79p8m9j93J72j16j25R4j15J59Ko1K74j44M4J69l60R1n0
3228e2Q6P6l83K77K61j92J2Q1l97J38R8r3k8K79k37L40l92Q0R3nJ28k44j4J13
$$ plain form
3062 -287 -102 -143 -67 -99 232 -13 47 5 163 -20 -6 16 71 -215 -127 0 16 -81 64 -8 178 59 -75 77
3086 77 -66 118 -84 8 -97 -10 44 -247 -40 -188 -24 -195 -223 -90 -15 167 -140 -259 120 178 -52 -90 -102
3109 -102 -116 -206 38 -29 -217 -76 -19 -18 -60 245 -94 -68 -65 -226 -33 54 211 10 -119 -312 29 83 134 -108
3133 -108 -56 79 96 167 193 -138 -67 64 141 -60 -21 -395 76 18 -130 -1 67 -2 17 -236 -2 -16 78 132 -128
3158 -128 32 -74 223 104 78 -85 90 119 -144 -128 35 88 -124 -40 -91 137 -98 -62 -176 10 19 -33 84
3181 84 -56 -23 -350 85 289 155 -244 83 -260 184 -272 19 47 -37 -99 -5 16 68 -122 101 39 33 70 -170
3205 -170 56 -173 24 -245 234 156 107 -86 86 -30 -155 -61 -176 -17 -15 -76 198 54 98 267 -93 -2 -52
3228 -52 34 110 -273 4 265 73 85 166 -231 -93 5 -88 -116 163 -74 266 -126 -46 47 42 170 -74 -88 25
3252B5K03l12Q6k75K44J32n4NJ35l6j69J19m0r1L2j90k7L83j14Q7J97k22n6J59
3276B21m3p4l53M41m6J0k60q4M06o8o3k21O3L13J6j24p2j40J59r9N0p8j70K96
3300H0K2k62J21J32k57M23n12J89J9K72k82K87k96K12k97K83L1P4l68L10q1K10
3322C10m22J53k46K14k64J50M38l58J19j49L11l46J71N6R4p6l59J49J39r9J37
3343A22p0O6k71l0J60k44M02k63J32J42j10m1j26J22n2L19k78o8m8K49jj60N8
3366A0Q6l2n3K4Q5k60j11K40J26j27J19k25P5j16K96j55O3O7oj90M4K12Oj52l20
3391b94K72K4j87J42N9K06l39M9J76m2j03r0J92k15J98L6n1l5m29M35K7rk9M5
3415C8l3n9l3l1M39l95K76j08k69Q0j47L27l11P4K29j19J64j27K2k2M5q2Q5j21
$$ plain form
3252 25 228 -84 2 -273 -29 103 49 54 189 153 -16 103 63 -28 4 -186 -213 170 56 143 340 118 62 221
3276 221 178 104 -249 192 146 156 -104 -188 218 150 87 -134 -71 242 258 134 62 -78 81 -18 32 -46 -216 80
3300 80 102 -160 -39 93 -164 259 -253 -64 -45 227 -55 232 -64 148 -149 134 165 239 -129 181 100 310
3322 310 -112 41 -205 9 -255 -105 333 -25 94 -55 256 -90 81 137 231 155 -204 -55 84 -15 122
3343 122 52 118 -153 -183 -23 -267 135 -128 4 146 36 -5 -131 -9 -61 258 -20 -88 -136 113 112 -48 10
3366 10 96 64 11 35 120 -140 -251 -11 115 -12 107 -118 -43 -159 137 -18 45 112 106 -84 -40 172 178 26 -294
3391 -294 -22 2 -185 -43 16 222 -117 -68 108 66 -37 -127 65 -150 48 84 33 -2 -431 4 31 22 -7 38
3415 38 5 -54 -87 -118 321 -74 202 94 -175 -95 -242 85 -226 -152 77 -42 122 -5 17 -5 40 -42 43 -78
3439g8J93k95L09j13O2j62q3M6J57j38K3K33p5n0N0l92L70p6K1J26o7j77n5K59
3463H8M4q6K1O9k68K47j66o1J55l1q6k07K78j45p6J4K43PK26l61L51l16k09K62
3487gR1NRj25r0J44o0J1J40p3m0K60k65oK9k3K97l57R1J47l25L14j60j26J48l22
3513b93M12k5N5k77J46R6j53M4j18m5J84j01M70m82M7N9j0o8K77k24j18k02K44
3536h2J06Pj24K30j67o7m0K73%k3l73K82Ok2J72l29J43K1j60l3O5N2n8K78j7q5
3562E5K9lq4j62N1J02K5J50j87k7j13k56K68q3M00k05R3r6o6Kq6K47j42j94K38
3587d4j66J60Q8n3J62P1n3l0k9o5j59Q1M4J07N1k37J21J20K0k45O6J60l42K45
3611G3j00R6M9k9m3k74L45PKn7m1J42j60RM4q9J82k49K53l21N1L69l78K5L36l03
$$ plain form
3439 -78 115 -180 129 16 78 -84 -167 -121 36 -102 -79 154 79 29 79 -313 57 -19 2 128 61 -116 -171 88
3463 88 132 46 67 136 -132 115 -51 -112 43 12 -74 -281 -3 -148 -224 -210 33 40 266 -95 256 -60 -269 -7
3487 -7 84 89 98 -27 -117 27 -33 -22 118 45 5 265 0 -6 23 0 297 -60 31 178 -147 167 7 -119 29 -293
3513 -293 119 94 149 -128 18 114 -39 5 -113 -158 26 -75 395 -87 -40 19 9 -59 218 -6 -124 -326 -82
3536 -82 24 31 -93 137 -30 -97 -137 136 136 113 -260 22 28 6 178 -151 -8 13 -147 -180 -115 -63 -121 157 140 55
3562 55 84 81 -3 -165 -114 -12 13 163 -24 -51 -164 -420 -152 -235 165 -40 53 -43 -109 -107 -193 54 -88 -282 -44
3587 -44 -210 -50 38 -15 147 218 165 135 106 41 -118 -37 7 114 165 -72 49 169 189 -56 10 170 -172 73
3611 73 -27 69 118 89 46 -228 117 124 126 69 28 170 10 19 63 -26 156 -93 160 -161 -110 259 -119 -94 242 -61
3637f1J58j90K16j72p5J13r4J25k96K20K6J78j70k7q0Q6K54k5J13k92r9J81j93
3660a04kR5o8J21k9p2J24J02k9j97J75p5o0J09j40n0K99m7k39K12l9k52M2P1%
3685e3o9J00J91k75q6mK55j18P4l6J44l40O1L86k16J07J2j67k82O1K66n5n6J57
3709E7Ojl1r3J06K03l75l0o3J65R7j18R5k01J84j10J87k17R7j71L92l90K55L9
3733H3P5j02j14N4L1J59l42J02K13j28j27K13%l27o7M40m6k3J0j66rK78j80j31
3757a04L31j45j78J49Q7m34J72j5J44N9K18n44K34O0j34M7J2l1K6K03o6Q9k89
3780a09J34L6J08L4r8r1q5q5N8NM3L0J20J47j28q5J09j00P5k33j1L85n3j66l25
3805b85M22r6j43Q5J99L5n5l49L00M7K8R7j61m7k83pL88k03L1L04l48K07l0j38
$$ plain form
3637 -61 97 -93 123 -49 -124 -11 -105 20 -276 -56 -30 148 -22 -49 -129 -43 211 186 299 7 -92 89 -104
3660 -104 -106 -11 -79 42 13 -59 65 167 138 -59 116 41 -19 90 -50 -100 199 152 -87 125 86 -166 -124 -53 -53
3685 -53 -122 -22 169 -106 -192 -196 59 -59 15 -21 123 -217 -156 230 14 121 133 -34 -316 -255 11 -44 -100 57
3709 57 63 62 31 -62 44 247 -128 -158 -221 -56 41 -77 18 -183 1 -109 78 -139 -42 -213 179 -211 44 83
3733 83 158 56 -58 -4 27 186 -156 -54 159 31 -96 117 117 -210 -277 163 117 94 104 -62 -71 207 27 -104
3757 -104 227 82 -96 53 140 -294 -122 -137 7 66 284 -260 -26 34 -100 -53 -41 -72 -46 157 91 180 -109
3780 -109 25 61 169 203 105 14 -71 -156 -98 -93 -50 -20 100 247 119 34 143 43 118 -115 -126 259 206 40 -285
3805 -285 137 41 -102 -17 182 217 162 -187 113 160 188 285 124 77 -206 -213 175 -28 3 307 -41 166 136 -2
3829bm11O55j56qJ65l68L80n60L05J08m41K94K6j70J17j67N29k28L45m99J49j37
3851g4j98K90j16K69J19l66k39K50K7j41K85m19L02j70J60P1R4p9k72M24j06r4
3873A7J2n0j62J6L01j07J7K8k65J03Q0J63k69J48p9o2J49j98J67o0P6J5pj07J48
3898G4J8l08J18j29L55j03J25Pj69K31n1l17N35n7l47mK9j91N0Q3K00r8j13Np0
3923a27K98m62K56K04Nk14K12m8j30J39l93qJ12J60O0j72J26k20J78n3J70j62
3945f9L6K05j58K29m51K11K4k94L04j44p6J97j51K39o0j46K45k11Q8r1l36N67
3967A58k09J18r6NJ64Q3k08j58K58j36q9L99k57l4j79j5J98O6j34J13J00j1K05
3990C41m49J64j48J12P3j05l0J05M4l23J63R3m3K62m35Q6R7Nk20J93K27l48P4
$$ plain form
3829 -2 -413 242 86 78 243 -125 255 -305 0 108 -333 -39 -13 -183 -66 -233 296 68 413 -86 63 -74
3851 -74 -272 18 -98 171 290 -76 -315 -65 -38 -179 106 -313 -11 -181 -21 50 144 65 -207 217 111 17
3873 17 29 -21 -183 -167 134 27 44 72 -193 -90 -10 153 -116 32 -47 -109 40 -158 9 -51 25 40 33 -74 74
3898 74 92 -216 -98 -227 128 25 150 157 -12 219 168 -149 386 329 -18 -22 7 -184 -134 -51 149 51 -62 -57 -127
3923 -127 171 -291 -35 169 174 -40 172 124 -6 133 -260 -268 -156 4 64 -108 18 -202 -24 -77 93 -69
3945 -69 -33 172 14 243 -208 3 27 -267 37 -107 -183 14 -137 102 42 -104 141 -70 18 -73 -409 158
3967 158 -51 67 -29 -24 140 223 15 -143 115 -21 -110 289 32 -2 -181 -196 2 68 -66 47 147 136 341
3990 341 -108 56 -92 20 93 -12 -42 63 107 -216 -53 40 -3 259 -176 -90 7 12 -208 -15 212 -136 -62
4013f2j18L06j58mK36q3q8q0K25N1L3l58O5J38k07L7J8JnL80k71l3m7O2o5N8J75
4040B06l08p5J8J31L3J9J49k67J00R4m7m5R6k51O6K04m5j61L6N4J9j22k5K12l45
4065b54J98J92J44k95j73J51J6K50k15N0k76L88l57M5M32j2q1j47O0O1l0K19l18
4088D8L1j8j86K70J9k58J17J73q8M0k82K81N4q3n08K99R2o2J46r2L1Pj80P4P4
4113aJ47j78l8J97j35n3J97k2j72J37j31n0J4J96j39lm1K85k89j28M3M05l06K50
4137A85K5k87K33k80L07q2j6N4l4K5O6l12J12J93k79M80k33q5K19j02k71p6K21
4160F3j26j77J85M2Kj40R6p9M12l65k13L95j42O3j56K26k37J58k00K4P3K17o8
4183E3r1j11K62j55R7K47k09j99K23jRP4j97J31M1j41o1K0q4k4P5L8j80J89J05
$$ plain form
4013 -62 -180 126 -32 -36 200 117 29 -51 174 225 258 -100 -35 103 -104 -67 -49 -48 -53 327 56 23 -24 38 -27 31 206
4040 206 -102 -177 -159 -28 5 24 173 -94 6 100 53 8 104 -147 -81 123 78 -83 -47 7 26 -96 -121 91 -254
4065 -254 -56 136 280 -15 -188 -37 -21 229 14 64 -212 176 -181 -136 296 284 203 56 116 177 147 366 48
4088 48 79 61 -125 145 164 -94 23 196 108 148 -134 147 201 118 -390 -91 1 -61 85 -7 24 31 -149 -75 -1
4113 -1 146 -32 -70 127 -8 -61 136 114 -58 79 -52 -102 -88 108 -31 -34 -75 210 -79 -207 -164 241 -65 185
4137 185 210 -77 156 -124 183 101 85 139 105 130 196 -116 -4 189 -90 390 157 72 291 189 -82 -158 63
4160 63 -63 -240 -55 -13 -11 -151 -55 -134 278 -87 -300 95 -47 16 -140 86 -151 7 -193 -169 -96 121 53
4183 53 -38 -149 113 -42 55 302 93 -106 117 116 125 199 2 133 174 33 -28 -8 -92 -116 -41 -3 -183 6 111
4208A11k02k8J84j04L12m46J4K64k90K62l8j26J73k27L5K35R6k51l0J78J95k94
4230B3l1J93l68K63J6j71j11J86j16L9R0J01j95l9M6k13M35j94j96L32j88Q9n0
4253e9j12M01k25J16J05j42l85lK18L31o6k50L12l64n7O5J12j00m3J11N4j14O6
4276b9K08j22o8L5J10j68J50N0j71J17k89J77P3j98M4J51R8J2l16M13l97K15j92
4299i7j7J34j1lJ66p0m58J40J90J77j51J53k25J50p4J22l24K24p6J46J9J14pl89
4323a67L40j80J72r3k63J69n4K84k43J47l73K72o6j44L3J49j09K9O5J14p7n5q0
4346a30L18J4m87J56J35J21j31j07K12j8l04J32n9K14n6j55j13K89j7J38j05P3
4368A20J7qj27l0J5N2p2J43J07p6k49l6K07o7J15k60K16J0k82K45m7J78k89Qj96
$$ plain form
4208 111 -91 -119 65 -39 273 -173 -159 105 -185 77 39 -87 86 -141 -106 129 225 -26 -56 122 317 23
4230 23 -8 185 -183 80 96 -75 -186 0 -116 -77 13 114 -81 -120 -74 -287 148 -46 -242 90 -98 -9 -59
4253 -59 -171 230 5 121 226 84 -301 -304 -86 245 179 -71 241 -123 -180 -115 -3 -103 -146 -35 19 -95 -29
4276 -29 179 57 -11 24 134 -34 116 166 -5 112 -177 0 73 -125 -81 70 168 180 -136 277 -120 95 -97
4299 -97 -114 20 9 6 172 102 -356 -216 -26 151 0 153 -72 78 4 126 -198 26 -50 96 115 229 222 -167
4323 -167 173 -7 165 72 -191 -22 -76 208 -35 112 -261 11 -55 -199 -166 -17 -126 -97 -32 82 5 -50 -130
4346 -130 188 202 -285 -129 6 127 -4 -111 101 83 -221 -89 -148 66 10 -145 -258 31 14 152 47 120
4368 120 137 129 2 -28 -13 39 -33 110 217 141 -108 -144 63 -4 111 -149 67 77 -205 40 -7 171 -118 -110 -306
4393c06L34P7m7j80J34j97J07K29q8j18O4k63K05J83j1l6j92K05j39j05J87o5
4415b2j29J54l9R4J36m79L52o5j59K09l55L95k89L67l12K69k28j3K65k9l79K92
4437C5l74K74K23k07Q0K78j35k78P2K70m62M1R3K2l6j41J60R3k45M30q3j97j19
4460b06J24J90l3o5J74l1M5k80J11J06m53L96N7k7nj92P7j2k68L71k9r6m4J89
4484I9q6K51l12J65l46L24k56K76j38J15j87J11o0j00p8J85J17K41k19r1J8q9
4506f0q7LJ88M5jq8j35J06K23N7m04P9J32j53K32j32m1J57j22j29R9J12O4k70
4530a25j41J43J49p5j67K02L64n49K69r6j97J09J01L4p7J76r7q7K36k24J16j25
4552f1K34j14l7j0L6j15Qm7K50k98L29m14J79R4M2nk79L62j45j2p6J08M0j71R5
$$ plain form
4393 -306 28 105 58 -122 12 -185 -78 151 63 -55 9 -254 -49 134 123 87 -105 100 -39 -144 43 -22
4415 -22 -151 3 -36 58 194 -285 67 2 -157 52 -303 92 -197 170 -142 127 -101 -114 151 122 -257 35
4437 35 -339 -65 158 -49 31 309 174 -104 -32 238 -224 -183 -90 -68 -104 -245 -85 8 -237 193 110 -87 -206
4460 -206 -82 108 75 10 184 153 198 -82 29 135 -318 78 135 108 103 -89 -12 -24 -292 79 50 -46 -90 99
4484 99 13 264 -48 117 -229 95 -161 115 -23 92 -95 16 -44 -144 -222 -37 80 321 102 11 29 -60
4506 -60 -147 -144 44 89 88 0 -135 -29 194 251 -153 -74 58 -95 137 5 -36 121 -1 -130 -31 81 145 -125
4530 -125 -266 -123 26 -49 -216 -14 350 -199 70 -26 -223 -114 -13 21 -56 120 23 -64 172 -52 64 -61
4552 -61 173 59 22 12 48 -67 -59 -106 144 -154 175 -239 -60 34 76 71 -208 154 9 -3 -79 29 69 -102 -7
4577gj51L33o9r7J24j80M2j39L77j40j29j25P3jK94R0n8j13j87J79j96K53p5K9
4601A27L8l6j47N0L4p5J19P9l4k33L42l38j13K07j89n0J56J78k21O4o6P4k04M49
4625B11j04K7j11j80OQ5r5L47k35K31K4m23J56P7p2J80q8J54J57j94j03l9J08
4648A19j45K55k66J84L0n29M22k39J64R0k0J16p0j27M7l9J50j65j43K02J28K3
4670A87j18q8L0L5J04q6q9K9J62j98J61o4j93J08k08K83j37K0K26k95J50J63j83
4693aj12R9k8K7J08J05j81J92l95M11m77K46j33J74k0m9J34mP3l15j1R5Q0k76
4717b58J68K21k08NK25j01r4J31k9j92R8K49k67L9n2Q6P7q3j47J78k0Q1j46K19
4741A80m35O2M19l93K17M0k5O2l88L31m35L44K37j78J7k41M91k65j55J19k52M48
$$ plain form
4577 -7 -158 175 106 9 133 -47 -5 -144 233 93 -36 -161 -88 -89 205 295 237 124 -63 116 -80 173 98 127
4601 127 165 129 -18 32 66 -9 110 189 155 -78 264 -74 -187 20 -169 -219 -63 115 -106 -42 -108 -34 -238 211
4625 211 107 134 23 -157 -151 -66 -161 186 -49 182 206 -217 -61 16 -56 124 36 190 347 153 50 11 119
4648 119 -26 229 -37 147 177 -352 70 -169 -5 85 65 181 111 -16 31 -8 142 -23 -166 36 164 187
4670 187 69 -19 11 46 150 64 -25 4 166 -32 129 65 -128 -20 -228 55 -82 -62 164 -131 19 182 -1
4693 -1 -113 -14 -42 -15 93 198 17 209 -186 225 -252 -6 -139 35 15 -34 100 96 169 -146 -157 -62 18 -258
4717 -258 -90 131 -77 -72 153 52 -42 89 60 -132 -34 215 -52 -13 -65 21 98 15 -132 46 26 107 -39 180
4741 180 -255 -193 226 -167 50 90 65 127 -261 70 -365 -21 216 38 55 -186 305 40 -115 4 -248 200
4763B00l88J85J77j99KL31k78j91K75L9k2k57L27k91R7j78K50l4l5j61J02J51
4785A02n0Q2m8P5k20j13K27k36K07J7j5k52J61l2j36K21M57l91J74l99L07K43
4807C81n72J32J4N5j03L20k92J10j69K07j44k25L73K24n71J46J52J22P3m23pp4
4829b71L35K2R1M6k33p7P6J2p0k7K15p4j07O3k09m3L67l78L01N1Qj81J58N0l9
4854H6J19l30K44J22p5o3l2j88l6K38l1J7j01J81J00l87R9j12J52k41K21R4o3
4877A4p2P9P4J42k48l4J88p6l09L29j0q1J43j54j0L2j93L26m22K99jj69K6p5J52
4902e0J4J84k75P2K76j86o9l9N9j0l6J30J63j50Jo1r3K84K3l47J97K5p9q2J46
4927I7J7m0j92L31j7J05m81K42Q2k72m0J36j47Q8j98N70l93J56mJ7l2k42K41R2
$$ plain form
4763 200 -188 -3 174 -25 -23 308 30 -161 114 153 131 -126 201 -90 7 -171 79 45 10 -151 -49 102
4785 102 52 134 86 161 -59 -172 55 -181 26 43 28 -224 -63 -95 -231 -10 447 56 230 -169 138 381
4807 381 -191 -59 -45 10 -93 227 -65 45 -124 83 -61 -286 87 311 -260 -114 38 160 233 -190 -197 -271
4829 -271 64 86 177 223 -10 -87 -11 1 -69 -96 119 45 -62 1 -208 -251 116 -262 39 90 98 -83 75 125 86
4854 86 205 -125 119 241 166 103 71 -117 -153 85 54 71 -30 151 251 -136 -37 -149 3 -238 -17 77 14
4877 14 -58 21 95 237 -11 -45 143 67 -242 87 77 -4 139 -15 -25 7 -186 140 -282 17 16 -153 -127 -202 -50
4902 -50 -36 148 -127 -55 221 35 -34 -73 -14 -24 -60 70 233 83 84 23 -70 214 237 -110 87 112 33 -49 97
4927 97 114 74 -118 213 196 301 -180 62 144 -128 -168 -32 -179 -91 -289 281 -112 44 40 57 25 -217 24 116
4951A16j04m1J38j44J16lq7K4j04R9O0j44Q9M1j07j02O9L22j09l26N68j71k31
4974c1J31k36K47K0No6k51K38L0q9j4p7N2O9q4J01P5q9l42P7L32j86j73L60j97
4999i8K17k64K36R2l94L89l09P4K14j25j87J03Q4j26P7K11j26j87J8M9J61l36
5021b27K21l8J52j91L35j43k46r2M01j65q0n9J86m0J53j97k25P1R9kK84j73Rm7
5045a4j53j7M9M29m96l8K06Q3P0j88k18K23J82m3j52K13j82N9j09j49l7K19J53
5068I0j34k1J83l54L10k23J12J51j85J25j07J96p5O4k32l3K40J32j71o9J86J42
5090C27l42K13l72K53j31J32J02k67K42r2j66j27L83j71j4P8Pr7k97J1L38N6k8
5113C8p2Q8K68l33L19j00Rk82l0J38j01R5k86K96q6K5J40j09l5M4j32K32k2q1
$$ plain form
4951 116 12 -29 109 -35 81 78 -9 15 -89 10 70 -74 15 56 -51 -153 -84 238 129 -197 371 200 -31
4974 -31 100 -136 111 131 136 70 -181 57 87 -2 -16 -93 -41 28 -56 45 120 31 -311 -234 98 -88 -261 99 -98
4999 -98 119 -145 91 183 -211 178 -131 -57 157 32 -155 -52 32 -94 -17 194 68 -119 -101 -52 109 -227
5021 -227 -6 -44 108 -83 252 109 -137 -229 172 7 -73 -132 54 14 167 -30 -255 -184 -85 -87 197 24 33 -14
5045 -14 -167 -184 -135 294 -202 -240 -34 49 119 -69 -287 -64 118 75 -77 136 -46 13 -96 -245 -282 -63 90
5068 90 -44 -65 118 -236 74 -149 -37 114 -71 54 -53 143 68 132 -100 -133 107 239 68 -1 185 327
5090 327 -15 198 -174 79 -52 80 182 -85 157 65 -101 -228 155 -16 -30 48 55 -42 -339 -328 10 66 38
5113 38 -34 54 322 -11 308 208 217 -65 -95 43 -58 37 -249 47 -39 -14 126 17 -18 26 -106 126 104 23
5137B3j53J6J35j57r5Q6O3J13j51J44p6K10j6k22J32n2j33o2J23M2J07J0j84K37
5161A40K11n19J82k16K84o2k19J53j28K01J56r4j04K03l88L56k08M2j27M5J04
5182A2J24k7j33j60J13L9o6J41k7J31j15k7Lj30J50L4l83j15N57k6k96j14J61
5205a54n8J54J80l47K01k84N57j52j80j9J0K96k46Q8J56m2M8l00r6j2K08k22K23
5228Ink16J60Q6k44L80L4k87O7J63k73Q5R7p1K0n6J87j9k02K2J73j25K14l10Q6
5253b5j11n0k3M5M35l5j51k24J61J71l47J39oj38K18j49K15j61r8J08J44R2k57
5276d7K94m63K52j35J03K48k41K4M1j13J72j00j86P5j82J87J59Q8k20pR1O2j81
5299g9l0j08K12p2j73L48k03J26j9j26J35o7M6R4Om13O0J44L89l97p5M45m05K96
$$ plain form
5137 23 -130 -114 21 -136 -231 -145 -82 31 -120 24 -52 158 142 -80 52 0 -133 -195 -72 -30 77 87 -97 140
5161 140 351 -168 14 -202 82 20 -199 -46 -174 27 183 89 -15 188 -200 156 -52 -10 -137 -92 12
5182 12 136 109 -24 -184 -71 -32 -98 43 16 147 32 5 8 -122 28 62 -321 -436 121 95 -201 -315 -154
5205 -154 -212 -58 122 -225 -24 -308 249 97 -83 -102 -92 204 -42 46 202 160 208 -92 -188 -200 8 -214 9
5228 9 4 -212 -52 34 -210 170 204 -83 -16 147 -126 -41 56 -15 5 -51 136 117 -85 -63 110 -15 199 -111 -25
5253 -25 -136 -186 -209 -164 271 236 85 -139 22 193 -154 -15 -21 -159 59 -90 125 -36 -134 -26 118 210 -47
5276 -47 247 -216 36 -99 4 252 11 35 76 -37 135 35 -151 -76 -258 -71 88 176 -44 -51 40 102 -79
5299 -79 -109 -217 -5 -77 -250 98 -105 21 2 -124 11 -56 -10 84 90 -323 -263 -119 270 -127 -202 243 -162 134
5323A34r8M8J38k00l08J18K1K10j50oK74j86Lj6N7J08j58k32J78K11o7r8J15k98
5347b02J32L14n17K63q2J3J90Ok45J08P1K58k81L9Q6l06J95jk01L2Q2R7j21Mm7
5372a13L24k57j75J63J08J83k06j07J2k81J21O35l73l60P3K88J12J64j30m22K67
5393B6lJ10K5j73K9J44l5J54j10l37K03L9k07J48j1k47M02r9J22l77J55R8j54
5416i8k4J85N8m25L28j23P1K11n9k01J65l46M33l46J60j07K18k09Q7J13Qn3j64
5439a18K99k25K05l45M13l46J2K2J00m4j13J15k3J30J08k56J51q8j37n6L35j66
5461b7K45j01j84k4nR3k09L67L5K9j8k58J0j00J09j82L41N8j29J55l00j9J32j18
5485a00J02J0M1q2K13j06l4j66Q0L5jN6J0p5lo4J57k83K59J20q2j15n7K36j14
$$ plain form
5323 134 36 84 222 22 -286 -168 -147 63 -87 -93 181 -5 -2 -18 39 147 -11 -243 -65 146 79 -19 96 -202
5347 -202 -70 244 -273 -10 -92 -79 111 117 -128 -20 51 309 28 67 153 -153 42 41 -160 -128 -46 51 -70 -66 -113
5372 -113 211 -46 -221 -58 50 233 27 -80 -68 -349 -228 407 34 -326 -253 35 147 311 181 -241 26
5393 26 23 133 158 -15 14 158 123 277 167 -170 33 72 -135 13 2 -245 157 58 180 -197 -42 56 -98
5416 -98 -122 63 121 -304 24 -99 -28 183 124 -77 88 -258 175 -171 -11 -118 100 -109 -22 91 99 46 -118
5439 -118 181 -44 161 -184 229 -117 -105 -83 17 -27 -140 -25 -48 82 190 -66 85 -3 -140 -196 139 -27
5461 -27 218 117 -67 -91 -96 -3 -212 155 190 219 201 -57 -47 -147 -38 -220 121 179 50 205 -95 -114 18 -100
5485 -100 2 12 53 -29 184 78 44 -122 -42 -7 -8 48 58 -17 -20 -84 73 -210 49 169 87 -28 -85 151 37
5510C7m8j02j6K54j98j25R7q5J52J80M9k98K56n2j35J24Ol21M22j0l46J48j17
5533a28J03O0L22n97L00p5k3J87j44K0j19J80l87J23J39K24k10K90k62k60K73
5554A6j60n7L71k78M1J39j65j73N01j35J9q1j73j26K09j08J41J02J1p4j35K67
5576A52k09J25nk68J68j56K24K7j49J15l0k54J66J79j34L5K8O4j28k2N7Q9J04
5599A78l60k2J93J04k18K05j74J32j28R9j25RK46O1k88N23l23j28j24j75L99j79
5621i5n7K10J56q9j11k7K1J18j05j71J82Or0l6J40k92J55qj80M37l27K86k92K08
5645C9j36J33L3n9j8j25K52k06J78m3j69r0K86m1j83n3K53j78J42j52N6J87j81
5668g5K41k82J02q7K19j25j70K13l2n1k32K07L3k8l6J50k53K47l31L23k15K84
$$ plain form
5510 37 -11 -113 -129 125 -73 -198 -101 -186 -34 146 195 -103 153 101 -34 90 96 -225 197 187 -159 -11 -128
5533 -128 -25 35 357 -240 60 -15 -38 149 5 25 -94 86 -301 -178 -39 185 -25 265 3 -257 16
5554 16 -144 -201 170 -108 -67 72 -93 -266 235 100 119 38 -135 -261 -52 -160 -19 83 94 20 -115 152
5576 152 -57 68 63 -205 -37 -193 31 58 -91 24 -6 -260 -94 85 -49 -14 14 78 -50 -72 -15 74 178
5599 178 -182 -204 -11 93 -125 80 -94 38 -90 9 -116 -107 139 200 -88 435 112 -16 -140 -315 84 -95
5621 -95 -152 58 214 125 14 -13 8 126 21 -150 32 38 -52 -88 52 -240 -85 -93 -273 164 -163 123 -169 39
5645 39 -97 36 69 10 -8 -133 119 -87 91 48 -121 -211 75 34 -149 -202 51 -127 15 -137 -81 106 -75
5668 -75 166 -116 -14 -101 118 -7 -177 36 4 -47 -279 -72 -39 -67 -103 47 -206 41 -290 33 -182 102
5690A02k14N0Jj63K11p1J87k3j76K9o2Q3K22r1k09J15p2K21LM6R0l27N0j63L46
5715A85j47M0K08l23l21M15p5m7J69o8J80k07j10m7J10j69K68j6j26p8K11r1P
5738c2j8K61k52k67K92J91R9p9k17J67k27l8j24M62k82J64l06K38j5P7p6j19K1
5761h0K13j18m7k5J27j23K6NK3K91l78J3j60J37K63l44P0l9J89P9l92L18P1j84
5785f5k3J46K4k25J22m5m2J12k35N5L52J90n08l6j21L81P5K1Q2l27o2m9J45K82
5809B49k76J34q1k0o7M64j89l31J44J8k9j66rJ94q2L14j21k93j04K49j7K1K92
5832B94k06n5N3j59j21J82L2j13K96k50J02Q6m4j3M5j68q0O2O0K35k0l50Q2K27
5856A77j40k2k9J02o6j06M0J24Kj97M14Nk69q3K61j75j01j09K99m8m11M47Q1m50
$$ plain form
5690 102 -112 -62 -61 -224 -13 -84 103 80 -96 -67 -129 -46 176 85 -124 -9 -81 140 143 189 279 -48 2 -161 185
5715 185 38 78 286 -37 -358 57 -18 -65 104 36 216 9 -101 -148 -38 -207 61 45 -81 -159 52 -39 -32
5738 -32 -50 211 -41 -308 -16 175 274 195 -22 145 -82 -120 -244 218 -64 100 -206 32 17 94 18 -101 -80
5761 -80 133 15 -32 -57 70 -53 -27 -22 1 292 -86 -73 -233 -96 167 -177 -107 -146 43 122 -270 48 119 -65
5785 -65 -88 58 82 -143 -21 -66 -108 4 -231 -176 176 366 -142 -178 -299 82 157 178 260 -67 -129 -178 -33 249
5809 249 -27 107 26 6 -61 403 214 -117 27 45 16 -150 -159 35 -47 267 146 -147 -251 -2 -19 2 294
5832 294 88 33 86 -73 -194 -12 20 -93 203 -47 55 141 97 84 129 -39 -119 -57 3 238 218 -132 -50 177
5856 177 37 15 -14 88 22 -84 -44 80 82 -115 299 304 35 -48 213 38 -63 -172 127 79 -332 115 196 -254
5880b54J90k22J62L05j64j92K04k05J06o7J9J16j02J78j41L9J08n2J89k85O3n6
5902f1O9o3j17K90j06K01m93M76l6k89N2Q9Kq4J89j29K04m11L41k61O32l85j65
5925e5j73K01l1J06O6n2j92l8J86l4J4J90r9j40K18l67J33O3N6k32NL08r1K24
5949B66l50J56n8J13o6m7j35J98o6m0J6J00q1l33M23j61L04l03L5P2l6j89K46
5972F4k20j0J2K16l00l1M14k05L14m67n1J13p7M65l41N9L04l99m8J04J65J8l09
5995b10M52j20k34J15j86K67k6K8j62L92l26k7J27l7L6l23K98j96J47L23m68K7
6017a03k4K84J68j81l46j03J27R6K10N1j09r8J20j83K38k62j2J14K50l19r9L5
6039a46L71k52J6L65m12K47k87J51j1J33k46M8J41j75O2Q7J8M6m4k6J53l96J42
$$ plain form
5880 -254 -64 -286 -124 181 17 -175 29 -176 -70 -137 -118 -2 -104 74 -67 -28 80 28 217 -68 -5 -61
5902 -61 8 -55 -172 118 12 213 -280 196 160 -129 -77 12 14 -70 119 -10 194 -217 124 -137 495 110 -55
5925 -55 -228 -27 -58 48 114 62 -130 -168 18 -16 -2 188 89 -51 167 -200 -67 -4 52 -180 -175 133 42 266
5949 266 -84 72 14 127 61 14 -121 77 11 -29 -13 87 6 -327 96 -65 239 -64 -29 43 7 -182 64
5972 64 -156 -166 -154 62 -238 -269 145 -60 254 -213 -264 -151 -228 237 -104 -45 259 -140 -188 -84 81 99 -210
5995 -210 242 122 -112 3 -183 84 58 86 -76 316 -10 -37 90 53 89 -234 64 -132 15 338 -130 -103
6017 -103 -127 157 325 144 -202 -305 -178 -82 128 179 70 -28 92 -91 147 -115 -127 -13 237 -82 -181 -146
6039 -146 225 -27 -11 354 -58 189 -98 53 42 175 -71 -23 118 -57 5 92 110 156 112 86 239 -157 -15
6062a5J23r1J6k53L31j07k7k31J23m1p5L12J46r2k90K38M9j6j07J95p7Rl76K66
6086A0j8m5j07L69k89o9L60n2j04k41P1J10K36n27L08Jr0K83J30m34J7J4J92L
6110A28K65l28r0j2J05j43r2L86j64k1qj52J78j90l7L44m02K93k30J88N5O1N0
6133A84k29k9JK27m55L16J63k71L9R0l25M6l8L73j90K08J34k94o8J2M6R6J00l58
6157b22K28j62L45j7J46j95l12J65J0m8k6O7n7Q9p0l28M83j54Q1l4k02L24j62
6180e1J32j02M6l4K8o9j45K50j85R3j03K47o2P2l30L52j41l23M03n7J24j72o1
6203h8K40k58k23N05r7j01k29L25r3J11Q0j80Q8P4k09O3q2L1J42n5q4J03J9j25
6227d3J17q9jj2K81q0p9j15n9K15l63L62k68O6P7P2l6m36L65m3J70j7O4j01l4
$$ plain form
6062 -15 108 17 33 -220 111 4 -23 -254 -131 -172 -247 65 211 119 -171 67 116 100 -7 188 111 120 -256 10
6086 10 -8 -53 -160 209 -80 -149 211 159 55 -186 -115 -5 231 -296 12 13 -77 206 336 -98 -81 -67 125 128
6110 128 393 65 -25 -37 68 -75 -167 219 55 34 26 -126 52 -138 -175 169 -233 60 -170 18 73 134 184
6133 184 -45 -74 -73 154 -301 15 178 -93 -54 36 -289 -243 -281 92 -98 110 244 -50 -118 -106 -60 36 136 -222
6157 -222 6 -156 189 172 318 123 -189 -24 -14 -62 -88 -21 -78 11 -59 -387 96 -58 23 -11 -213 111 -51
6180 -51 81 -21 25 -9 19 -50 -195 55 -130 -37 -140 107 45 117 -213 139 -2 -325 78 21 145 -27 -88
6203 -88 152 -106 -329 176 79 -22 -251 74 -19 92 172 -8 80 154 -55 8 -74 -43 99 44 -40 63 82 -43
6227 -43 74 -15 -16 -28 253 173 94 -21 -80 135 -228 134 -134 -68 9 81 45 -391 -26 -69 101 84 148 47 13
6252A3n4Q5o4J70l84K95k9j58R3K14l11Q6N5J61j20mJ5l7j98M4L64j92m0m5j31
6277a72J32j33K20J37k25M6k32K23p3k03L43p1n8J56j84J82k13O5K7N7J79l55
6299a52mJ81j59K7N4J26K0m1k09K17k6j30l5L4j0M53j81j03K16L2j09m4r4j53
6323i0l2J15K59k08q2RJ16R5j93J1n5j7m0J49j4j23J40J44j19R0l58L38j14q9
6347f8J2m9K06J34o8k71L22k78J00J26m94K81m3J05l27L88k04K87l41J88K82n22
6369b34K29m2k1L41m06J2L16j9l5m0j50p6K82j91n3o3R7J19L6J37l85K23k17K0
6393a20J03k9K00k86J89r3o9J57J31j36K26l46j81J72J36Q1M3k39j9k0P5j59J13
$$ plain form
6252 13 -41 44 -20 150 -234 61 32 -126 -33 181 -130 -44 11 172 52 48 63 26 -172 -128 236 44 4 -41 -172
6277 -172 -40 -173 47 184 -41 5 -227 -4 -77 -280 63 -8 -66 90 -94 88 -125 -60 -33 24 203 -152
6299 -152 -156 25 -134 -107 -53 73 93 52 -157 60 34 -96 -131 -97 -107 346 165 62 278 310 201 157 63 -90
6323 -90 -122 -7 252 44 -38 -29 87 182 -11 0 -55 -72 -112 37 23 -100 40 184 65 155 -203 135 21 -68
6347 -68 -56 -105 101 235 167 -104 218 -60 40 166 -328 -47 -90 15 -312 76 -128 159 -182 6 288 -234
6369 -234 -5 -47 -68 273 -133 -121 195 176 141 101 -49 -125 157 -34 -87 -150 -53 66 102 239 -146 77 -140 -120
6393 -120 -17 -46 154 -132 57 -36 -105 52 183 47 273 -73 -254 -82 54 135 178 -61 -80 -100 -25 -184 -71
$$ [...]
8191a33
##END NTUPLES=NMR FID
##END=
