##TITLE=1H_CA-8555-2
 CDCl3, 8 sc, 
 4.2.2019
##JCAMPDX= 6.0         $$ Bruker NMR JCAMP-DX V2.0
##DATA TYPE= NMR FID
##DATA CLASS= NTUPLES
##ORIGIN= UXNMR, Bruker Analytische Messtechnik GmbH
##OWNER= root
$$ XWIN-NMR		Version 3.5
$$ Mon Feb  4 14:08:07 2019 Russian Standard Time (UT+4h)  she@DPX200
##.OBSERVE FREQUENCY= 200.1313
##.OBSERVE NUCLEUS= ^1H
##.DELAY= (6, 6)
##.ACQUISITION MODE= SIMULTANEOUS
##.ACQUISITION SCHEME= undefined
##.AVERAGES= 8
##.DIGITISER RES= 18
##SPECTROMETER/DATA SYSTEM= spect
##.PULSE SEQUENCE= zg30
##.SOLVENT NAME= CDCl3
##.SHIFT REFERENCE= (INTERNAL, CDCl3, 0, 15.7039)
##AUDIT TRAIL= $$ (NUMBER, WHEN, WHO, WHERE, WHAT)
$$ ##TITLE= Audit trail, XWIN-NMR		Version 3.5
$$ ##JCAMPDX= 5.01
$$ ##ORIGIN= Bruker BioSpin GmbH
$$ ##OWNER= she
$$ F:/spectra/data/she/nmr/H-F/1/audita.txt
$$ ##AUDIT TRAIL=  $$ (NUMBER, WHEN, WHO, WHERE, WHAT)
(   1,<2019-02-04 14:06:36.37 +0400>,<she>,<DPX200>,
      <created by zg, POWCHK disabled, PULCHK disabled
       configuration hash MD5:
       00 E9 B6 7A A2 85 ED C7 34 08 36 98 17 FE 4E 26
       data hash MD5: 16K
       23 77 80 3B F2 C1 4E A4 51 B4 59 5B 8D 52 98 5B>)
$$ ##END=
$$ 
$$ hash MD5
$$ B2 E7 37 F0 68 05 4A 41 2D 9C 27 CB 08 EB 44 C9
##$RELAX= 
##$RELAX= 
##$RELAX= 
##$RELAX= 
##$RELAX= 
##$RELAX= 
$$ Bruker specific parameters
$$ --------------------------
##$DU= <F:/spectra>
##$EXPNO= 1
##$NAME= <H-F>
##$PROCNO= 1
##$TYPE= <nmr>
##$USER= <she>
##$AMP= (0..31)
100 100 100 100 100 100 100 100 100 100 100 100 100 100 100 100 100 100 
100 100 100 100 100 100 100 100 100 100 100 100 100 100 
##$AQSEQ= 0
##$AQ_mod= 1
##$AUNM= <au_zg>
##$AUTOPOS= <>
##$BF1= 200.13
##$BF2= 200.13
##$BF3= 200.13
##$BF4= 200.13
##$BF5= 200.13
##$BF6= 200.13
##$BF7= 200.13
##$BF8= 200.13
##$BYTORDA= 1
##$CFDGTYP= 0
##$CFRGTYP= 5
##$CHEMSTR= <none>
##$CNST= (0..31)
1 1 145 1 1 1 1 1 1 1 1 1 1 1 1 1 1 1 1 1 1 1 1 1 1 1 1 1 1 1 1 1 
##$CPDPRG= <>
##$CPDPRG1= <>
##$CPDPRG2= <>
##$CPDPRG3= <>
##$CPDPRG4= <mlev>
##$CPDPRG5= <mlev>
##$CPDPRG6= <mlev>
##$CPDPRG7= <mlev>
##$CPDPRG8= <mlev>
##$CPDPRGB= <>
##$CPDPRGT= <>
##$D= (0..31)
0 1.2 0 0 0 0 0 0 0 0 0 0.03 0 0 0 0 0 0 0 0 0 0 0 0 0 0 0 0 0 0 0 0 
##$DATE= 1549274795
##$DBL= (0..7)
120 120 120 120 120 120 120 120 
##$DBP= (0..7)
150 150 150 150 150 150 150 150 
##$DBP07= 0
##$DBPNAM0= <>
##$DBPNAM1= <>
##$DBPNAM2= <>
##$DBPNAM3= <>
##$DBPNAM4= <>
##$DBPNAM5= <>
##$DBPNAM6= <>
##$DBPNAM7= <>
##$DBPOAL= (0..7)
0.5 0.5 0.5 0.5 0.5 0.5 0.5 0.5 
##$DBPOFFS= (0..7)
0 0 0 0 0 0 0 0 
##$DE= 6
##$DECBNUC= <off>
##$DECIM= 32
##$DECNUC= <off>
##$DECSTAT= 4
##$DIGMOD= 1
##$DIGTYP= 9
##$DL= (0..7)
0 120 120 120 120 120 120 120 
##$DP= (0..7)
150 150 150 150 150 150 150 150 
##$DP07= 0
##$DPNAME0= <>
##$DPNAME1= <>
##$DPNAME2= <>
##$DPNAME3= <>
##$DPNAME4= <>
##$DPNAME5= <>
##$DPNAME6= <>
##$DPNAME7= <>
##$DPOAL= (0..7)
0.5 0.5 0.5 0.5 0.5 0.5 0.5 0.5 
##$DPOFFS= (0..7)
0 0 0 0 0 0 0 0 
##$DQDMODE= 0
##$DR= 18
##$DS= 0
##$DSLIST= <SSSSSSSSSSSSSSS>
##$DSPFIRM= 0
$$ [...]
##$SUBNAM2= <"">
##$SUBNAM3= <"">
##$SUBNAM4= <"">
##$SUBNAM5= <"">
##$SUBNAM6= <"">
##$SUBNAM7= <"">
##$SUBNAM8= <"">
##$SUBNAM9= <"">
##$SW= 20.0189088683792
##$SWIBOX= (0..15)
0 0 2 0 0 0 0 0 0 0 0 0 0 0 0 0 
##$SW_h= 4006.41025641026
##$TD= 16384
##$TD0= 1
##$TE= 0
##$TE2= 300
##$TE3= 300
##$TEG= 300
##$TL= (0..7)
0 120 120 120 120 120 120 120 
##$TP= (0..7)
150 150 150 150 150 150 150 150 
##$TP07= 0
##$TPNAME0= <>
##$TPNAME1= <>
##$TPNAME2= <>
##$TPNAME3= <>
##$TPNAME4= <>
##$TPNAME5= <>
##$TPNAME6= <>
##$TPNAME7= <>
##$TPOAL= (0..7)
0.5 0.5 0.5 0.5 0.5 0.5 0.5 0.5 
##$TPOFFS= (0..7)
0 0 0 0 0 0 0 0 
##$TUNHIN= 0
##$TUNHOUT= 0
##$TUNXOUT= 0
##$USERA1= <user>
##$USERA2= <user>
##$USERA3= <user>
##$USERA4= <user>
##$USERA5= <user>
##$V9= 5
##$VALIST= <valist>
##$VCLIST= <CCCCCCCCCCCCCCC>
##$VD= 0
##$VDLIST= <DDDDDDDDDDDDDDD>
##$VPLIST= <PPPPPPPPPPPPPPP>
##$VTLIST= <TTTTTTTTTTTTTTT>
##$WBST= 1024
##$WBSW= 4
##$XGAIN= (0..3)
0 0 0 0 
##$XL= 0
##$YL= 0
##$YMAX_a= 90967
##$YMIN_a= -128455
##$ZGOPTNS= <>
##$ZL1= 120
##$ZL2= 120
##$ZL3= 120
##$ZL4= 120
##$ABSF1= 10
##$ABSF2= 0
##$ABSG= 5
##$ABSL= 3
##$ALPHA= 0
##$AQORDER= 0
##$ASSFAC= 0
##$ASSFACI= 0
##$ASSFACX= 0
##$ASSWID= 0
##$AUNMP= <proc_1d>
##$AZFE= 0.1
##$AZFW= 0.1
##$BCFW= 1
##$BC_mod= 2
##$BYTORDP= 1
##$COROFFS= 0
##$CY= 11.3945322036743
##$DATMOD= 1
##$DC= 2
##$DFILT= <>
##$DTYPP= 0
##$F1P= 18.9103706918063
##$F2P= -1.10871071338519
##$FCOR= 0.5
##$FTSIZE= 0
##$FT_mod= 4
##$GAMMA= 1
##$GB= 0.15
##$INTBC= 1
##$INTSCL= 1
##$ISEN= 128
##$LB= 0.24
##$LEV0= 0
##$LPBIN= 0
##$MAXI= 10000
##$MC2= 0
##$MEAN= 0
##$ME_mod= 0
##$MI= 1.114404
##$NCOEF= 0
##$NC_proc= 0
##$NLEV= 6
##$NOISF1= 3.799351
##$NOISF2= 2.8
##$NSP= 1
##$NTH_PI= 0
##$NZP= 0
##$OFFSET= 15.70392
##$PC= 1
##$PHC0= -9024.69
##$PHC1= 7.800042
##$PH_mod= 1
##$PKNL= yes
##$PPARMOD= 0
##$PSCAL= 0
##$PSIGN= 0
##$REVERSE= no
##$SF= 200.130013532006
##$SI= 16384
##$SIGF1= 3
##$SIGF2= 2
##$SINO= 400
##$SIOLD= 16384
##$SREGLST= <1H.CDCl3>
##$SSB= 0
##$STSI= 0
##$STSR= 0
##$SW_p= 3612.71676300578
##$SYMM= 0
##$S_DEV= 0
##$TDeff= 0
##$TDoff= 0
##$TI= <>
##$TILT= no
##$TM1= 0
##$TM2= 0
##$TOPLEV= 0
##$USERP1= <user>
##$USERP2= <user>
##$USERP3= <user>
##$USERP4= <user>
##$USERP5= <user>
##$WDW= 1
##$XDIM= 8192
##$YMAX_p= 0
##$YMIN_p= 0
$$ End of Bruker specific parameters
$$ ---------------------------------
##NTUPLES= NMR FID
##VAR_NAME=  TIME,          FID/REAL,        FID/IMAG
##SYMBOL=    X,             R,               I
##VAR_TYPE=  INDEPENDENT,   DEPENDENT,       DEPENDENT
##VAR_FORM=  AFFN,          ASDF,            ASDF
##VAR_DIM=   8192,          8192,            8192
##UNITS=     SECONDS,       ARBITRARY UNITS, ARBITRARY UNITS
##FACTOR=    0.0002496,     1,               1
##FIRST=     0,             0,               0
##LAST=      2.0444736,     0,               0
##MIN=       0,             -128455,         0
##MAX=       2.0444736,     90967,           0
$$ Real data points
##PAGE= N=1
##DATA TABLE= (X++(R..R)), XYDATA
$$ [...]
$$ plain form
2074 370 752 -2 -546 376 907 -7 -660 -156 -219 -1039 -55 1380 116 -393 228 269 -159 98 722 -605
2094 -605 -1282 -688 10 404 140 716 300 -639 -338 951 252 -175 115 283 -788 -47 1386 445 -601
2113 -601 -346 -400 -1108 -700 416 123 -541 -323 450 427 43 811 550 -897 -938 275 582 -216 361 871
2133 871 -442 59 800 776 -736 -220 27 -703 -425 232 242 -165 -354 539 319 -424 521 652 -160 -888
2153 -888 150 565 -109 727 856 -116 -845 167 447 -23 48 -60 -86 -560 131 837 239 -718 -379 -160
2173 -160 -1066 -380 818 279 -393 132 957 264 724 1263 -300 -999 -415 -37 -167 14 247 269 -861
2192 -861 -394 609 112 -434 -486 -188 -849 -356 931 921 178 100 641 -199 -43 402 198 -617 -703 90 177
2213 177 -270 426 502 -417 -686 206 214 -545 -273 325 -631 -494 457 659 -186 -9 -179 -311 -438 314 790
$$ packed form
2074C70L82p54n44R22N31r14o53N04o3q20R84J435j264n09O21M1m28K57O24j327
2094f05o77N94O98L94k64N76m16r39L01J289o99m27K90J68j071P41J433r41j046
2113f01K55n4p08M08J116k93o64K18P73k3l84P68k61j447m1J213L07p98N77N10
2133H71j313N01P41k4j512N16K47p30K78O57J0m07j89Q93k20p43R45J31q12p28
2153h88J038M15o74Q36J29r72p29J012K80m70P1j08k6m74O91P06n98r57L39K19
2173a60r06O86J198n39o72N25Q25o93M60N39j563o99N84L78j30J81K33K2j130
2192h61M67J003m97n46n2K98o61M93J287j0p43p8N41q40J56M45k04q15q6P93Q7
2213A77m47O96P6r19k69Q92Qp59K72N98r56J37R51K02q45J77j70j32j27P52M76
$$ plain form
2234 790 507 -193 165 500 -266 253 867 -492 -1516 -627 24 -397 -106 587 -107 -91 221 982 388 -175
2254 -175 437 97 -590 -188 870 553 -314 -18 156 -717 -230 255 -458 -925 -624 199 -392 107 745 323
2274 323 -606 -405 236 59 -78 63 253 -666 -577 749 487 -126 23 272 -444 -409 597 389 -490 -376
2294 -376 32 -290 -115 182 34 -527 -1090 -189 433 -104 491 1220 123 -288 925 713 -104 -251 51
2313 51 -893 -1234 -41 336 -519 -233 -153 -206 -343 173 676 107 -541 8 433 256 144 866 80 -867 -396
2334 -396 375 -375 -200 199 -286 -424 34 652 346 35 -77 -1 -676 -836 339 335 -674 -385 389 -146
2354 -146 -230 834 210 -589 -211 503 123 -18 852 417 -671 -414 31 235 -733 -841 -438 -937 -784 311
2374 311 772 -82 311 869 101 2 793 767 -217 -358 -7 -299 -292 87 513 -99 -573 7 412 -156 -371
$$ packed form
2234G90k83p00L58L35p66N19O14j359j024Q89O51m21K91O93o94J6L12P61n94n63
2254a75O12l40o87M02J058l17q67K96J74q73M87M85p13m67L01Q23n91M99O38m22
2274C23r29K01O41j77j37J41J90r19Q9J326k62o13J49K49p16L5J006k08q79J14
2294c76M08l22J75K97j48n61n63R01O22n37N95P29j097m11J213k12q17j47L02
2313E1r44l41J193L77q55K86Q0n3j37N16N03n69o48N49M25j77j12P22p86r47M71
2334c96P71p50J75L99m85j38M58O18l06l11j12P6o75j60J175mj009K89P74n35
2354a46q4J064o24p99L78P14l80j41Q70m35j088K57M45K04r68j08M03m99J53J095
2374C11M61q54L93N58p68r9P91k6r84j41L51k92PL79M26o12m74N80M05n68k15
$$ plain form
2395 -371 405 -260 -570 156 1013 -4 -176 -91 -638 -700 -104 388 -65 -253 -38 525 152 282 757 218
2415 218 -649 -809 -1 -232 -271 646 -196 -1073 -397 282 1 -161 348 85 -463 23 784 551 129 137 328
2436 328 -74 -301 49 -60 -896 -877 -116 -532 -285 458 455 -322 125 458 195 -130 449 207 -61 -293 347
2457 347 399 62 -774 -260 -445 -876 160 537 -125 -316 221 -172 -169 562 398 -447 -782 -350 -150 -368 295
2478 295 704 366 -328 171 865 265 -205 380 -199 -938 -164 806 -163 -451 -28 -358 -694 -268 573 5
2498 5 -455 -123 286 -23 -76 833 666 -188 -165 426 -11 -301 292 -97 -889 -286 492 132 -309 55 -138
2519 -138 -510 -367 375 786 -15 -36 503 150 -92 630 641 -378 -797 61 -105 -277 326 436 -165 -278
2539 -278 212 527 -42 -104 -121 -373 -663 106 718 291 -199 382 50 -625 182 761 -121 -459 20 22 -298
$$ packed form
2395c71P76o65l10P26Q57j017j72Q5n47o2N96M92m53j88K15N63l73J30M75n39
2415B18q67j60Q08k31l9R17q42q77O76O79k81j62N09k63n48M86P61k33m22QJ91
2436C28m02k27L50j09q36J9P61m16K47P43lp77M47L33k63l25N79k42k68k32O40
2457C47N2l37q36N14j85m31J036L77o62j91N37l93LP31j64q45l35M32K00k18O63
2478B95M09l38o94M99O94o00m70N85n79p39P74R70r69k88M23l30l36M26Q41n68
2498Em60L32M09l09n3R09j67q54K3N91m37k90N93l89p92O03P78l60m41L64j93
2519a38l72J43P42M11q01k1N39l53k42P22J1j019m19Q58j66j72O03J10o01j13
2539b78M90L15n69o2j7k52k90P69O12m27m90N81l32o75Q07N79q82l38M79Kl20
$$ plain form
2560 -298 416 339 -128 -603 -425 6 -5 -458 146 235 -480 -170 485 154 -63 443 224 -503 266 587 72
2581 72 -57 246 -69 21 -163 129 -139 -369 -412 -81 -20 84 211 388 -334 -126 471 345 -75 198 165 -743
2603 -743 -268 647 377 82 76 -114 -215 -259 210 235 -40 -670 -237 370 -180 245 549 13 -147 120 185 -89
2625 -89 401 284 -256 -425 225 369 421 -182 -133 -194 -778 -200 391 337 -633 35 -55 -259 401 779 -71 -493
2647 -493 105 14 -167 662 847 415 -113 23 364 191 -491 -261 -193 -762 -551 44 201 -406 -110 -104 -280
2668 -280 -13 508 201 -44 106 149 94 239 597 263 -42 -346 214 51 -167 -121 220 -363 -447 183 364
2689 364 -256 -23 -277 -398 -425 -225 227 239 192 -88 87 164 158 564 -104 -287 30 246 -151 224 474 -110
2711 -110 -687 124 40 -208 36 -11 -163 -765 155 663 437 233 739 341 -94 80 570 -110 55 -158 -23
$$ packed form
2560b98P14p7m67m75J78M31j1m53O04Q9p15L10O55l31k17N06k19p27P69L21n15
2581G2j29L03l15R0j84K92k68k30m3L31O1J04J27J77p22K08N97j26m20K73l3r08
2603g43M75R15k70k95oj90j01m4M69K5k75o30M33O07n50M25L04n36j60K67O5k74
2625h9M90j17n40j69O50J44N2o03M9o1n84N78N91n4r70O68r0k04O60L78q50m22
2647d93N98r1j81Q29J85m32n28J36L41j73o82K30O8n69K11N95J57o07K96Oj76
2668b80K67N21l07k45J50M3n5J45L58l34l05l04N60j63k18M6L41n83q4O30J81
2689C64o20K33k54j21k7K00M52J2m7k80J75P7oM06o68j83L17K16l97L75K50n84
2711a10n77Q11q4k48K44m7j52o02R20N08k26k04N06l98m35J74M90o80J65k13J35
$$ plain form
2732 -23 -278 -160 418 -295 -410 -385 -50 -295 111 127 78 27 46 124 438 183 89 223 -786 -253 362 422 -460
2755 -460 52 -153 -286 -37 478 324 -246 -585 -162 -148 -103 183 334 -186 -298 246 419 -51 346 622 -203
2776 -203 -303 595 306 -54 204 -34 40 -403 -235 257 -293 -374 -392 -60 11 -129 748 267 -180 96 736
2797 736 -99 -16 419 40 -598 -196 168 94 -28 -213 -350 -486 -478 69 111 -216 -153 271 -314 181 491 232
2819 232 -359 -103 -53 -157 123 708 335 -319 187 135 -23 39 209 -155 -611 -416 -102 92 -394 -317 390
2840 390 -606 -166 529 351 -172 23 489 35 262 438 349 102 -381 -214 -106 60 -28 -124 -308 -546 -287
2861 -287 485 -53 36 88 -199 -582 257 531 242 384 308 -34 -216 -20 411 180 -372 -33 51 -57 45
2882 45 128 -45 -287 -337 204 109 34 324 -395 -431 -34 74 36 203 165 13 160 257 206 428 -35 -154 94
$$ packed form
2732b3k55J18N78p13j15K5L35k45M06J6m9n1J9P8L14k55r4J34j009N33O15O0q82
2755d60N12k05j33K49N15j54n70l39M23J4M5K86J51n20j12N44J73m70L97K76q25
2776b03j00Q98k89l60K58k38P4m43J68M92n50q1j8L32P1j40Q77m81m47K76O40
2797G36q35Q3M35l79o38M02L64p4j22j85j37j36QN47M2l27O3M24n85M95L10k59
2819B32n91K56N0j04K80N85l73o54N06n2j58O2J70l64m56J95L14J94m86P7P07
2840C90r96M40O95j78n23J95M66m54K27J76q9k47m83J67J08J66q8r6j84k38K59
2861b87P72n38Q9N2k87l83Q39K74k89J42p6l42j82J96M31k31n52L39Q4j08J02
2882D5Q3j73k42n0N41r5p5K90p19l6L97J08l8J67l8j52J47R7n1K22m63j19K48
$$ plain form
2905 94 -348 -219 100 90 -699 -361 -20 -376 -116 182 78 -175 -117 240 428 374 184 215 -241 -249 277 566
2927 566 -27 -439 167 -289 -254 -139 73 -154 -79 -57 -422 -106 160 167 -50 -3 149 416 157 -154 514 272
2949 272 -135 -174 433 -17 59 173 -422 -319 65 71 -33 -194 -243 -205 -350 46 280 308 -213 -207 416 195 45
2972 45 402 -116 -504 -92 74 -74 178 202 -147 -365 -352 45 242 -223 -135 -78 -307 -238 23 259 -333 53
2994 53 431 68 136 472 167 -455 -103 210 2 90 293 30 -376 -236 -198 286 191 -240 -109 50 -487 63
3016 63 372 75 -49 -36 -72 -9 392 521 131 -21 85 -276 -6 35 -101 -16 -254 -91 160 16 25 231 -116
3039 -116 -553 -152 145 494 100 387 -327 -385 9 398 55 19 82 -274 -261 -193 330 218 -241 -402 91 -87
3061 -87 -348 228 261 -654 -187 38 312 39 595 236 -85 29 219 383 -43 -36 -74 -63 17 2 247 -239 -303
$$ packed form
2905I4m42J29L19j0p89L38L41l56K60K98j04k53N8L57J88n4j90L1m56qN26K89
2927E66n93m12O06m56L5J15K12k27P5K2l65L16K66Pk17M7J52K67k59l11O68k42
2949B72m07l9O07m50P6J14n95J03L84Oj04j61m9L8j45L96K34K8n21OO23k21j50
2972D5L57n18l88M12J66j48K52K4l49k18J3L97J97m65Q8N7k29O9K61K36n92L86
2994E3L78l63O8L36l05o22L52L13k08Q8K03k63m06J40L8M84r5m31J31J59n37N50
3016F3L09k97j24J3l6O3M01J29l90j52J06l61K70M1j36Q5k38J63K51j44RK06l47
3039a16m37M01K97L49l94K87p14n8L94L89l43l6O3l56J3O8N23j12m59j61M93j78
3061h7k61N76L3r15M67K25K74k73N56l59l21J14J90J64m26Pl8J1Q0j5K45m86o4
$$ plain form
3084 -303 -206 -69 -396 541 -45 -200 -486 0 347 -7 262 -88 -251 -59 -68 236 40 -213 161 -116 -280
3105 -280 377 146 -62 -316 -332 20 -247 227 386 -22 88 -268 188 40 184 221 69 -319 -229 -146 -9
3126 -9 254 15 -156 -476 51 510 -6 -104 113 -138 -187 -55 218 304 -183 -193 53 143 -111 271 371 -448
3148 -448 76 367 188 -135 228 84 -485 -214 -10 172 -3 181 -99 -168 -188 -52 472 -195 -251 -51 118
3169 118 -216 423 344 -42 -72 173 151 -16 159 359 -389 -130 -143 -17 -38 217 211 -85 -239 -121 625 107
3191 107 -14 463 -51 -416 281 591 107 -515 242 3 96 264 481 -47 -135 -261 -43 74 55 23 31 -293
3213 -293 -199 171 219 -184 480 -26 -229 63 545 98 93 40 -111 -154 -223 162 199 -59 -502 -153 -141 -65 189
3236 189 297 -337 -436 505 77 237 649 243 -48 23 150 48 126 -21 -2 -158 -103 -310 238 -100 -294 -217
$$ packed form
3084c03R7J37l27R37n86j55k86M86L47l54K69l50j63J92rL04j96k53L74k77j64
3105b80O57k31k08k54j6L52k67M74J59m08J10l56M56j48J44L7j52l88R0Q3J37
3126iK63k39j71l20N27M59n16r8K17k51m9J32K73Q6m87j0K46R0k54L82J00q19
3148d48N24K91j79l23L63j44n69K71K04J82j75J84k80o9k0J36N24o67n6K00J69
3169A18l34O39p9l86l0K45k2j67J75K00p48K59j3J26k1K55ok96j54J18P46n18
3191A07j21M77n14l65O97L10m84o22P57k39R3J68K17n28q8j26K18J17j9l2Ql24
3213b93R4L70M8m03O64n06k03K92M82m47nn3j51m3o9L85L7k58m43L49J2P6K54
3236A89J08o34r9R41m28J60M12m06k91P1J27j02P8j47J9j56N5k07N48l38j94P7
$$ plain form
3258 -217 -22 -29 378 278 -214 -212 187 -119 29 162 138 -29 -190 242 416 163 -228 -124 -103 -338 -227 360
3280 360 206 -77 -3 177 -415 -63 256 -91 -386 159 -75 280 432 310 117 -128 -216 44 197 35 74
3301 74 -80 -306 -214 242 395 -38 16 23 -597 -103 277 209 165 -6 52 14 171 198 49 167 -180 -118 196 91
3325 91 -46 280 -48 -220 133 21 -391 257 141 -395 -393 52 -49 -12 92 -207 -5 -95 197 537 431 -168
3347 -168 -219 127 -436 133 127 -128 -400 -223 -20 -377 -68 196 -247 -311 100 140 225 95 32 209 91 -79
3369 -79 506 301 -47 10 75 -118 -2 274 87 -458 -195 204 -93 -184 -45 -9 -155 -353 -233 317 -72 240
3391 240 109 132 30 433 286 -86 35 41 -239 -333 236 -154 -336 -31 -220 -248 -398 145 250 -181 -324 25
3413 25 340 177 23 244 -133 -217 278 332 -77 144 237 -258 -160 -153 221 -431 -13 118 -256 99 -173 202
$$ packed form
3258b17J95pM07j00m92KL99l06J48J33k4j67j61M32J74k53l91J04K1k35J11N87
3280C60j54k83P4J80n92L52L19l47k95N45k34L55J52j22j93k45q8K60J53j62L9
3301G4j54k26R2M56J53m33N4Po20M94L80o8m4j71N8l8J57K7j49J18l47O2L14j05
3325I1j37L26l28j72L53j12m12O48j16n36KM45j01L7J04k99K02r0K92L40j06n99
3347a68n1L46n63N69ok55k72J77K03l57L09K64m43o4M11M0Q5j30o3J77j18j70
3369g9N85k05l48N7O5j93J16K76j87n45K63L99k97r1J39L6j46j98J20N50l89L12
3391B40j31K3j02M03j47l72J21Ok80r4N69l90j82L05j89k8j50N43J05m31j43L49
3413B5L15j63j54K21l77q4M95N4m09K21R3m95R8PL74o52M18J31l74L55k72L75
$$ plain form
3435 202 28 -356 -156 11 75 120 -26 -45 -99 90 72 31 79 -27 -134 -404 -60 151 416 -59 -289 -190 -4
3458 -4 -178 309 132 -272 98 288 -154 257 349 -111 -32 172 87 172 142 293 103 -59 -253 111 266 -511
3480 -511 -304 240 -507 -193 56 284 47 -9 413 -88 292 128 252 148 103 11 163 231 207 168 -170 -450
3502 -450 -132 41 -87 -46 -2 -156 -315 -53 163 3 -37 235 -299 -2 144 270 218 -160 -44 114 278
3523 278 102 393 174 -626 -159 -66 -90 11 317 -106 -144 -193 3 213 456 184 164 -120 77 201 209 -110
3545 -110 -157 124 74 -44 141 149 -386 40 40 -170 -11 24 -284 -84 -300 -122 -207 253 204 44 22 -31 163 268
3569 268 -47 -17 258 -80 -311 299 4 -115 39 -49 -67 -51 327 -27 102 59 -139 98 156 235 130 184 -339
3592 -339 0 236 -18 -38 128 -265 -204 167 141 -6 -12 -103 -302 -61 -166 95 241 -163 3 128 -84 115
$$ packed form
3435B02j74l84K00J67O4M5j46j9n4J89j8m1M8j06j07k70L44K11K65m75k30R9J86
3458dj74M87j77m04L70J90m42M11R2m60P9K04q5Q5l0J51j90j62j94L64J55p77
3480e11K07N44p47L14K49K28k37n6M22n01L80j64J24j04m5r2J52O8k4l9l38k80
3502d50L18J73j28M1M4j54j59K62K16j60m0K72n34K97J46J26n2l78J16J58J64
3523B78j76K91k19q00M67R3k4J01L06m23l8m9J96K10K43k72k0k84J97J24Ql19
3545a10m7K81n0j18J85Qn35M26%k10J59L5l08K00k16J78q5M60m9j60k2n3J94J05
3569B68l15L0K75l38k31O10k95j19J54q8j8J6L78l54J29m3j98K37N8P9j05N4n23
3592c39L39K36k54k0J66l93O1L71k6j47or1j99K41j05K61J46m04J66J25k12J99
$$ plain form
3614 115 304 316 -157 50 366 158 -259 425 107 14 -135 326 -32 42 -176 -36 -209 -354 -25 203 -141
3635 -141 -254 78 -212 -141 408 -29 -129 43 44 -18 44 288 40 -417 -191 -273 -3 169 -52 76 40 -79
3657 -79 -60 123 -198 -248 97 -286 -149 303 -8 -126 -128 106 -19 75 157 140 89 -139 170 28 290 -73 -321
3680 -321 75 -733 -114 -37 -131 -109 195 -70 -121 241 275 499 27 76 33 -11 -140 34 137 -227 -441 -166 196
3703 196 -172 129 4 -477 -306 42 -136 135 401 -152 -117 -72 -90 195 279 -10 -160 -262 -163 180 53 -3
3725 -3 -17 -95 -342 -443 392 156 -309 -229 85 93 87 -110 -19 -40 283 31 183 168 182 -11 -300 -73 -63 136 93
3750 93 -549 -224 -93 -156 -215 67 -321 -180 -321 -56 404 265 256 327 53 -1 112 97 -84 -106 206 -272 -150
3773 -150 -59 -371 -100 -195 121 -253 -226 -89 200 -106 7 -199 -144 -167 -140 321 -57 -45 58 134 -58 291 83
$$ packed form
3614A15J89J2m73K07L16k08m17O84l18r3j49M61l58P4k18J40j73j45L29K28l44
3635a41j13L32k90P1N49m37j00J72Jo2O2K44k48m57K26q2K70J72k21J28l6j19
3657g9J9J83l21n0L45l83J37M52l11j18kK34j25R4Q2j7n1k28L09j42K62l63k48
3680c21L96q08O19P7r4K2L04k65n1L62L4K24m72M9m3m4j29J74J03l64k14K75L62
3703A96l68L01j25m81J71L48j78K71K66n53L5M5j8K85Q4k89j50j02R9L43j27n6
3725cj4p8k47j01Q35k36m65Q0L14Qoj97R1k1L23k52J52j5J4j93k89K27J0J99m3
3750I3o42L25J31o3n9K82l88J41j41K65M60j39rP1k74n4J13j5j81k2L12m78J22
3773a50R1l12K71r5L16l74K7J37K89l06J13k06N5k3K7M61l78J2J03P6j92L49k08
$$ plain form
3796 83 -70 -205 74 -164 77 122 -172 -243 -164 -239 -132 198 -140 -325 -152 100 258 279 -186 184 140 -17
3818 -17 99 130 246 -321 -15 -307 -388 60 -262 17 -315 107 -79 185 82 31 86 53 -123 -18 457 83
3840 83 -455 -329 -31 -136 416 145 -180 -20 28 -418 -200 165 -121 158 23 -224 -259 334 -84 87 202
3861 202 -163 54 280 39 388 -3 42 150 75 575 -9 -33 145 -90 -79 -125 125 -2 -300 -185 -102 94
3883 94 -108 24 71 -59 106 357 135 153 188 -111 -24 -44 -62 181 32 94 -159 197 -309 -133 149 -286 -141
3906 -141 253 -28 -18 63 347 -269 -24 188 -13 254 367 -40 179 -5 11 142 121 6 -157 -95 -306 -60
3928 -60 189 -59 -332 -89 -252 -59 406 292 122 -24 -130 140 173 -5 178 368 -507 -19 114 -34 -82
3949 -82 109 -98 -451 -172 193 18 -58 -366 -238 -273 363 126 240 -66 2 -49 108 322 270 286 -4 -284
$$ packed form
3796H3j53j35K79k38K41M5k94p1P9p5J07L30l38j85J73K52J58K1m65L70m4j57
3818a7J16L1J16n67L06k92q1M48l22K79l32M22j86K64j03n1N5l3j76J05M75l74
3840H3n38J26K98j05N52k71l25J60M8m46K18L65k86K79j35k47l5N93m18J71J15
3861B02l65K17K26k41L49l91M5J08p5N00n84k4J78k35J1m6K50j27k98J15Q3J96
3883I4k02J32M7j30J65K51k22J8L5k99Q7k0j8K43j49O2k53L56n06J76K82m35J45
3906a41L94k81J0Q1K84o16K45K12k01K67J13m07K19j84J6J31k1j15j63O2k11K46
3928f0K49k48k73K43j63J93M65j14j70j46j06K70L3j78J83J90q75M88J33j48m8
3949h2J91k07l53K79L65j75p6l08J28l5O36k37J14l06O8n1J57K14n2J6k90k80
$$ plain form
3971 -284 0 132 29 -165 58 -283 41 95 -118 62 -19 -92 -122 -140 305 126 -97 -43 -160 281 -14 -14 410
3994 410 -142 -254 207 -135 196 234 17 -198 -190 -135 131 93 -150 224 -55 -318 -156 142 292 117 34 308
4016 308 -157 -40 207 -94 -35 -106 -212 -129 -45 260 37 -36 -105 -81 75 -24 71 122 21 -140 123 -57 -92 97
4040 97 37 -265 138 518 72 29 -266 119 -177 -119 -232 -11 -120 -166 -174 54 -79 164 337 52 -213 178
4062 178 86 45 59 -104 -242 131 260 247 180 -39 -53 -325 59 12 92 69 -107 -217 29 54 -178 276 -148
4085 -148 -22 80 154 397 177 236 -144 -197 -244 71 -14 -194 -256 45 -225 11 0 -56 -52 76 -78 -209 127
4108 127 237 183 -78 321 -50 50 152 197 -222 105 -64 -86 80 -140 -263 53 -291 -44 382 305 169
4129 169 -60 99 55 -44 10 21 -118 163 -24 81 105 56 109 101 73 -89 215 -105 -184 -36 -189 -320 228 -95
$$ packed form
3971b84K84J32j03j94K23l41L24N4k13J80q1p3l0j8M45j79k23N4j17M41k95%M24
3994D10n52j12M61l42L31L8k17k15QN5K66l8k43L74k79k63J62K98J50j75q3K74
4016C08m65J17K47l01N9p1j06Q3Q4L05k23p3o9K4J56r9R5N1j01j61K63j80l5J89
4040I7o0l02M03L80m46m3k95L85k96N8j13K21j09m6qK28j33K43J73k85k65L91
4062A78r2m1J4j63j38L73J29j3o7k19j4k72L84m7Q0k3j76j10K46K5k32M54m24
4085a48J26J02P4K43k20N9l80n3m7L15q5j80o2L01k70K36j1n6MJ28j54j31L36
4108A27J10n4k61L99l71J00J02M5m19L27j69k2J66k20j23L16l44K47M26p7j36
4129A69k29J59m4r9N4J1j39K81j87J05K4m9N3qk8j62L04l20p9J48j53j31N48l23
$$ plain form
4153 -95 -165 82 -44 -103 140 362 64 213 184 -63 141 -87 111 221 -228 -259 -373 90 45 -138 -82 -648
4175 -648 -273 -42 308 -25 339 190 -149 -303 -235 -58 -41 61 28 -142 120 -88 25 -49 -190 -66 83
4196 83 -57 202 28 -190 78 -114 -10 200 -155 92 -318 -306 -111 33 23 263 244 113 65 -10 270 171
4218 171 -137 1 66 -378 45 216 119 -75 -111 -192 -127 279 -216 111 -11 -83 176 258 91 -75 466 -113
4240 -113 -497 163 32 -281 -6 -105 -113 -151 162 165 198 335 116 59 -100 39 208 209 -161 -338 -261 -73 229 86
4264 86 167 1 -109 62 242 359 57 45 36 27 15 -48 -148 -183 -41 -269 47 206 213 -169 356 21 84 -14 120
4289 120 -8 -154 -40 72 -77 -87 225 -319 -295 -135 -210 52 -124 -33 19 -146 -309 344 212 -25 274 227
4311 227 -41 -150 313 102 148 -120 -98 -29 89 -61 -117 65 -253 27 145 140 66 -57 71 -254 3 297
$$ packed form
4153i5p0K47j26n9K43K22k98J49k9k47K04k28J98J10m49l1j14M63m5j83N6n66
4175f48L75K31L50l33L64j49l39j54O8J77J7J02l3j70K62k08J13p4j41J24J49
4196H3j40K59j74k18K68j92J04K10l55K47m10J2J95J44j0K40j9j31m8p5K80r9
4218A71l08J38O5m44M23J71r7j94l6q1O5M06m95L27j22p2K59Q2j67j66N41n79
4240a13l84O60j31l13K75r9ql8L13LL3J37k19n7j59J39J69Jl70j77P7J88L02j43
4264H6Q1j66j10J71J80J17l02j2rrj2o3j00l5J42k28L16J59Pl82N25l35O3r8J34
4289A20j28j46J14J12j49j0L12n44K4J60p5K62j76R1N2j65j63O53j32k37K99m7
4311B27k68j09M63k11M6k68K2O9J18j50n6J82l18K80J18np4j23J28l25K57K94
$$ plain form
4333 297 19 38 18 -63 91 229 -33 296 42 -33 -72 179 -79 134 -260 -217 -86 75 7 -67 216 -124 -180
4356 -180 395 -11 -44 -110 58 -44 2 -251 117 182 -330 86 128 -45 -138 219 -98 -285 -37 -77 127 16
4378 16 -9 63 -161 119 -136 -192 71 205 -37 23 -124 487 13 -139 -31 166 -169 -46 152 49 -321 -308
4400 -308 -18 -455 -7 217 -47 -22 -51 -117 -62 123 -40 38 97 -376 107 -97 334 -103 -123 -223 -282 242 123
4423 123 80 -55 -339 -298 34 116 -242 289 -14 127 167 341 147 173 -176 -266 147 64 194 19 70 -22 -292
4446 -292 36 134 206 -30 -124 43 34 -236 63 49 -95 -199 -71 205 183 172 218 -79 -81 -211 -121 -137 -128 -130 -75 -143
4472 -143 -57 -227 66 -45 -40 67 -118 56 398 46 63 81 -96 -105 303 149 -177 163 152 133 302 151 20
4495 20 -16 -22 -114 -169 -171 70 -92 -48 -159 -201 238 182 115 -131 -110 -98 42 91 156 186 -228 -142 54 -81 48 98
$$ packed form
4333B97k78J9k0q1J54J38k62L29k54p5l9K51k58K13l94M3J31J61o8p4K83l40n6
4356a80N75m06l3o6J68j02M6k53L68O5n12M16M2j73r3L57l17j87K48m0K04j11
4378A6k5P2k24K80k55n6K63J34k42O0j47O11m74j52J08J97l35J23J98j03l70J3
4400c08K90m37M48K24k64K5k9o6N5J85j63P8N9m73M83k04M31m37k0j00n9N24j19
4423A23m3j35k84M1L32Q2l58N31l03J41M0J74j94K6l49r0M13q3J30j75N1r2k70
4446b92L28R8P2k36r4J67rk70K99j4j44j04J28K76k2j1M6k97kj30R0j6RkN5o8
4472a43Q6j70K93j11NJ07j85J74L42l52J7J8j77rM08j54l26L40j1j9J69j51j31
4495B0l6or2n5kK41j62M4j11m2M39n6o7k46K1J2J40M9O5L0m14Q6J96j35J29N0
$$ plain form
4521 98 -193 -357 -87 87 -318 253 260 -356 92 120 225 140 -9 -65 179 38 203 -37 291 272 -406 58
4543 58 -243 35 -144 -161 -342 -234 -205 3 33 61 -269 -114 -153 90 65 98 120 -81 -186 28 68 -254 -85
4566 -85 -115 -112 -216 -59 -112 -93 -95 29 33 -117 58 109 -71 -43 136 -27 -82 314 59 373 -3 -91 323 21 -133
4591 -133 -137 -14 -71 69 151 -20 -190 -207 -291 4 79 -75 -173 160 94 208 156 130 114 19 43 -172 124 -80 39
4616 39 123 181 -232 -25 -144 -352 -62 -142 -208 62 -160 -138 -120 158 96 -7 302 33 20 107 -78 29 -273
4639 -273 153 -116 -113 87 -379 117 57 -195 88 -210 -121 117 103 -68 37 -31 -12 -132 -51 101 227 116 -111
4662 -111 153 -83 71 -59 321 28 51 -285 -121 -42 163 -121 -212 -105 -148 -317 303 127 -100 309 -134
4683 -134 -241 -185 348 105 81 156 70 41 63 130 -92 65 -168 -115 -97 -256 -30 143 -193 -14 71 134 77 112
$$ packed form
4521I8k91j64K70J74m05N71Po16M48K8J05q5j49n6K44j41J65k40L28j9o78M64
4543E8l01K78j79j7j81J08K9K08L0K8l30J55l9K43k5L3K2k01j05K14M0l22J69
4566h5l0Lj04J57n3J9kJ24Mj50J75N1j80K8J79j63n5L96k55L14l76q8M14l02j54
4591a33mJ23n7J40Q2j71j70j7q4K95P5j54r8L33o6J14n2k6j6r5K4k15K96k04J19
4616C9Q4N8m13K07j19k08K90q0o6K70k22K2J8K78o2j03L09k69j3Q7j85J07l02
4639b73M26k69LK00m66M96o0k52K83k98Q9K38j4j71J05o8J9j20Q1J52J26j11k27
4662a11K64k36J54j30L80k93K3l36J64P9K05k84r1J07m3j69O20j76k27M09m43
4683a34j07N6N33k43k4P5q6k9K2O7k22J57k33N3J8j59K26J73l36J79Q5O3n7L5
$$ plain form
4707 112 119 -265 -207 308 -24 26 213 -206 -167 -75 -225 168 232 -5 -143 -94 -475 -129 314 -58 -365 -26 -95
4730 -95 292 -43 -115 -37 12 85 -7 192 134 84 147 56 94 -33 99 -151 -105 -66 -127 105 -116 -42 -347 -240 -117
4755 -117 -96 390 -16 -99 157 -89 118 62 -8 -57 -186 -319 178 -79 -110 45 34 -118 -263 208 340 -133
4777 -133 43 67 -364 308 55 259 364 -28 -68 -44 315 -61 10 -120 -26 -126 303 323 -279 102 294 -84
4799 -84 -178 194 376 107 84 -170 60 314 -82 58 113 32 112 217 64 -116 -100 127 -201 -30 -70 -2 15
4822 15 -151 -60 -77 -147 -31 210 220 129 77 65 -79 -8 -27 48 76 50 -76 -178 -25 -66 6 -15 72 -171 34 -127
4848 -127 97 -414 123 -204 -235 100 49 206 -111 -88 99 118 161 256 24 151 157 -82 -102 -96 105 107 47 -5 54
4873 54 73 -136 -236 -107 182 52 -78 -175 -164 -185 0 33 160 106 -205 71 -131 -176 -49 -212 203 -47 -273
$$ packed form
4707A12Pl84N8N15l32N0J87m19L9R2j50L93O4k37j38M9l81L46M43l72l07L39o9
4730i5L87l35p2P8M9P3r2J99n8n0O3r1L8j27J32k50M6L9o1K32k21P4l05J07J23
4755a17K1M86m06q3K56k46K07n6p0m9j29j33M97k57l1J55j1j52j45M71J32m73
4777a33J76K4m31O72k53K04J05l92m0K4L59l76P1j30R4j00M29K0o02L81J92l78
4799h4r4L72J82k69k3k54K30K54l96J40N5q1Q0J05j53j80J6K27l28J71m0O8J7
4822A5j66R1j7p0J16K41J0r1n2j2j44P1j9P5K8k6j26j02J53m1P2k1Q7k43K05j61
4848a27K24n11N37l27l1L35n1J57l17K3J87J9M3R5k32J27Ok39k0OK01Ko0n2N9
4873E4J9k09j00J29K89j30j30r7J1k1J85L3J27n4l11K76k02m5J27j63M15k50k26
$$ plain form
4896 -273 128 -172 177 81 -160 -137 93 218 9 186 88 -85 -193 163 -112 408 188 -172 -289 -251 -117
4917 -117 27 -133 -71 59 -223 102 -173 250 -107 7 140 -19 206 -156 -201 156 -125 -99 229 3 24
4938 24 -29 -27 7 -5 -54 -204 -156 58 -40 -23 -174 21 44 -212 45 15 -99 42 -142 -84 297 70 27 249 366
4963 366 -13 106 -180 58 19 -26 -243 139 -90 -150 33 41 340 -91 44 -126 21 131 74 107 31 -208 27
4986 27 122 -102 -9 -117 -63 216 22 120 -116 463 -90 -172 197 -63 24 -130 -58 -225 87 -79 -84 -11 180 320
5010 320 234 -126 -165 146 126 -266 -274 96 129 -109 22 -14 50 71 -7 66 12 -105 -82 -50 168 -105 244 -47 -161
5035 -161 218 0 -281 107 92 3 -231 67 -50 182 -49 132 100 -222 -100 -172 129 -103 147 122 3 96
5057 96 78 133 47 209 93 -280 276 208 -349 -25 -68 107 206 -37 128 81 -298 -219 140 -23 -35 98 170 -87
$$ packed form
4896b73M01l00L49r6k41K3K30J25k09J77r8j73j08L56k75N20k20l60j17L8J34
4917a17J44j60O2J30k82L25k75M23l57J14J33j59K25l62m5L57k81K6L28k26K1
4938B4n3KL4j2m9j50M8K14r8J7j51J95K3k56K57l0j14J41j84N8L81k27m3K22J17
4963C66l79J19k86K38l9m5k17L82k29o0J83QK99m31J35j70J47J10n7L3p6k39K35
4986B7R5k24R3j08N4K79j94R8k36N79n53q2L69k60Q7j54P2j67L12j66nP3J91J40
5010C20q6l60l9L11k0l92qL70L3k38J31l6O4K1p8P3n4j17K3L2K18k73L49k91j14
5035a61L79k18k81L88j5q9k34K98j17K32k31J81l2l22J22p2L01k32K50k5j19R3
5057I6j8N5q6J62j16l73N56o8n57L24m3J75R9k43J65m7l79P9L59j63j2J33P2k57
$$ plain form
5081 -87 -149 -208 143 170 -91 -93 -72 -183 256 147 10 -26 -63 -40 -124 -27 201 239 -222 -119 25 294 42 -72
5105 -72 259 53 145 -28 -28 -26 -129 -109 295 -110 -212 -52 9 17 -5 32 129 256 88 -335 57 128 74 61 51 -131
5131 -131 -94 -308 178 35 90 136 250 -151 -153 -106 -78 -243 164 -89 35 -68 -46 187 110 90 -43 104 73 329
5155 329 319 -102 -27 -33 13 247 -136 1 -378 -130 -172 94 87 153 42 95 -4 107 43 225 -268 -161 93 41
5179 41 49 -42 181 57 -16 -131 33 -167 -61 75 -35 318 -144 9 -9 221 -51 -126 -129 190 -1 61 103 77
5203 77 151 96 94 76 -79 -163 63 -183 109 -9 41 160 60 -248 -593 -158 203 101 258 -139 135 86 34
5226 34 -150 -40 195 -21 38 -61 -61 -64 -264 -173 -172 -377 104 -177 -210 -140 -72 121 -211 -69 -58 -164 -9 212 -147
5251 -147 -254 28 125 147 49 -97 -178 28 3 -72 -97 27 -238 -28 -156 -76 -22 -366 64 223 -101 -10 -72 42
$$ packed form
5081h7o2n9L51K7k61kK1j11M39j09j37l6l7K3q4R7K28L8m61J03J44K69k52j14
5105g2L31k06R2j73%Kj03K0M04m05j02J60O1Qk2L7R7J27j68m23L92P1n4j3j0j82
5131a31L7k14M86j43N5M6J14m01kM7K8j65M07k53J24j03K2K33p7k0j33J47l1K56
5155C29j0m21P5oM6K34l83J37l79K48m2K66pO6j11N3r9J11o4J82m93J07K54n2
5179D1Qr1K23j24p3j15J64k00J06J36j10L53m62J53j8K30k72p5lL19j91O2M2k6
5203G7P4n5kj8j55q4K26k46K92j18N0J19j00l08l45M35L61j02J57l97K74m9n2
5226C4j84J10K35k16N9r9%lk00R1Jk05M81k81l3P0O8J93l32J42J1j06J55K21l59
5251a47j07K82R7K2r8j46q1K06k5p5k5J24k65K10j28Q0N4l44M30J59l24R1o2J14
$$ plain form
5275 42 -48 50 162 104 8 270 -112 5 234 344 92 -64 57 32 63 31 -144 -11 -97 -254 -193 252 -128
5298 -128 -168 71 102 -1 -45 43 95 68 -305 189 -372 -207 -83 81 -44 14 47 -231 60 21 -95 -20 -32 -83
5322 -83 291 29 -105 -259 -200 -110 -13 -328 -39 174 -208 -182 34 -80 21 -162 -46 75 -95 54 189 -103
5344 -103 308 132 -259 6 284 -282 -107 119 127 386 339 215 -224 -113 52 -11 -149 328 -116 -214 -113 -155
5366 -155 -362 71 -169 60 -299 150 -122 -85 38 63 250 107 351 -219 247 -170 160 -86 331 -108 -17
5387 -17 -82 -149 83 -33 -306 -102 245 20 -56 39 -91 77 64 -168 -268 158 -31 -219 285 -9 -1 -104 63
5410 63 -44 21 4 80 170 42 303 -248 281 -218 -72 210 194 260 -66 119 11 -134 -162 176 169 139 -55 31
5434 31 -125 259 -143 -74 -71 -34 -212 -110 -2 -163 167 -79 -30 81 -44 168 121 4 130 30 220 66
$$ packed form
5275D2r0R8J12n8r6K62l82J17K29J10k52j56J21k5L1l2j75J33q6j57O1M45l80
5298a28m0K39L1j03m4Q8N2k7l73M94n61J65J24J64j25N8L3k78K91l9j16P5j2n1
5322h3L74k62j34j54N9R0R7l15K89K13l82K6K16j14J01j83J16J21j70J49J35k92
5344a03M11j76l91K65K78n66J75K26QK59m7j24m39J11J65o3j38M77m44r8J01m2
5366a55k07M33k40K29l59M49k72L7J23K5J87j43K44n70M66m17L30k46M17m39R1
5387a7o5o7K32j16k73K04L47k25p6R5j30J68j3k32j00M26j89j88N04k94Qj03J67
5410F3j07O5j7P6R0j28K61n51N29m99J46K82j6O6l26J85j08j45k8L38pl0j94Q6
5434C1j56L84m02O9LL7j78J02J08j61L30k46M9J11j25K12m7j17J26j00J90j54
$$ plain form
5456 66 60 13 172 -121 17 -83 -201 65 90 162 -59 113 110 196 -10 3 193 186 -366 109 66 -118 42 -31 33
5481 33 -108 137 241 23 -345 -108 296 19 225 -110 -66 -131 -27 -89 -38 -210 132 -135 -115 23 199 273
5503 273 7 -120 233 41 -54 402 -242 -150 -115 4 -51 32 -287 165 -278 -199 -25 -156 24 -220 -86 -200
5525 -200 300 167 -122 198 -33 62 -57 121 -23 64 -293 -55 -160 -4 125 5 106 -148 -90 -280 56
5546 56 126 57 145 -40 -276 97 -10 -85 44 48 -138 -127 -173 99 -33 -89 14 -41 -154 187 -22 -107 -66 332
5570 332 -30 -86 197 -83 261 -103 76 -134 15 -301 147 180 -66 172 -114 -188 -28 221 -287 81 116
5591 116 54 -322 -81 -29 -39 -12 -27 52 -237 113 -157 68 -5 1 -83 -35 9 -164 99 12 -7 -182 57 -120 -113
5616 -113 -18 -15 -11 10 -95 39 -56 -30 240 -86 51 -21 6 -45 -227 174 191 9 -4 -183 -31 16 115 84 19 -15
$$ packed form
5456F6om7J59k93J38j00j18K66K5P2k21J72lQ6k06J3J90pn52M75m3j84J60p3O4
5481C3j41K45J04k18l68K37M04k77K06l35M4o5J04o2N1j72L42k67K0J38J76P4
5503B73k66j27L53j92r5M56o44R2L5J19n5Q3l19M52m43P9J74j31J80k44J34j14
5525b00N00j33k89L20k31R5j19J78j44Q7l57K38j05J56J29j20J01k54N8j90L36
5546E6P0o9Q8j85k36L73j07p5J29Mj86J1m6K72j32n6J03n5j13L41k09q5M1L98
5570C32l62n6K83k80L44l64J79k10J49l16M48L3k46K38k86p4J60K49n08L68L5
5591A16o2l76K41N2j0K7j5P9k89L50k70K25p3Oq4M8M4j73K63q7j9j75K39j77P
5616a13R5LMK1j05J34r5K6K70l26J37p2K7n1j82M01J7j82j3j79J52M7R9l1o5l4
$$ plain form
5642 -15 -139 -59 -169 -134 -269 22 -46 30 133 -93 134 49 -4 -75 213 -300 24 -38 49 43 -134 -15 23 -201
5666 -201 -50 104 252 -37 -226 -146 62 -16 -117 -54 -243 157 94 218 -126 -66 -323 39 -163 41 -104 75
5688 75 83 60 37 -5 -39 33 -84 158 205 -169 100 8 -108 175 223 97 135 -85 -54 193 177 121 189 56 49 163
5714 163 -57 47 -164 -221 -4 -365 -111 295 -80 222 158 92 -12 -54 -91 -269 -70 63 116 43 104 97 -52
5737 -52 42 -54 139 -170 -51 288 25 83 155 -68 -211 197 -59 28 29 -71 174 -285 345 -203 -55 36 -81
5760 -81 -226 211 57 81 -32 0 53 42 -193 -165 85 -51 -34 156 91 103 115 240 37 240 27 -289 -28
5783 -28 331 132 -95 -18 4 -55 -62 -151 49 131 -314 -241 180 -62 70 19 -47 75 -57 116 69 95 130 -141 134
5808 134 -149 89 113 327 -40 176 -63 38 304 -197 133 -6 -144 -33 161 -44 67 177 -118 -45 138
$$ packed form
5642a5j24Q0j10L5j35K91o8P6J03k26K27q5n3p1K88n13L24o2Q7oj77J19L8k24
5666b01J51J54J48k89j89Q0K08p8j01O3j89M00o3J24l44O0k57L62k02K04j45J79
5688G5Qk3k3m2l4P2j17K42M7l74K69r2j16K83M8j26L8k20L1K47j6n6O8j33pJ14
5714A63k20J04k11n7K17l61K54M06l75L02o4o6j04m2l7j78J99J33N3p3O1pj49
5737e2R4r6J93l09J19L39k63N8P2k23j43M08k56Q7Jj00K45m59O30n48J48R1j17
5760h1j45M37j54K4j13L2N3j1k35K8K50j36J7J90o5J2J2J25k03K03k13l16K61
5783b8L59j99k27P7K2n9pq9K00Q2m45P3M21k42J32n1o6J22j32J73m7K6L5k71K75
5808A34k83K38K4K14l67K16k39J01K66n01L30j39j38J11J94k05J11J10k95P3J83
$$ plain form
5829 138 -116 -360 6 68 45 -115 138 26 39 171 -66 -80 27 259 -8 -86 -110 70 -77 -15 241 -67
5851 -67 235 141 -374 -177 146 -43 -138 -86 -129 -63 52 303 -154 15 233 -52 36 49 -69 -175 231 -72 43
5874 43 106 34 -137 -48 -295 -325 167 -160 -143 -287 -214 -58 -276 -157 91 -138 -89 69 98 -13 109 -60 6
5897 6 332 -176 12 -130 -110 77 -14 148 -176 237 181 -64 -67 -108 129 -203 135 13 -129 -189 -52 -13 21 92
5921 92 -252 76 -147 46 -247 -51 128 5 -124 -219 -168 -182 -43 -124 -186 30 -68 -139 -312 -144 38 -1 260
5944 260 -128 11 -175 -7 -58 -109 178 197 213 150 -177 -103 146 -86 -19 -213 21 43 -44 -3 12 92 175 -113
5968 -113 -9 -31 -118 -92 306 -153 -50 -279 -297 71 90 148 -182 196 110 -304 -285 31 -109 -168 97 10 -42 246
5992 246 156 -216 -17 147 -186 221 114 22 -16 41 10 -65 -15 -107 114 -121 -249 -190 -17 -336 90 -153 96
$$ packed form
5829A38k54k44L66O2k3j60K53j12J3J32k37j4J07K32k67p8k4J80j47O2K56l08
5851f7L02r4n15J97L23j89r5N2m3O6J15K51m57J69K18k85Q8J3j18j06M06l03J15
5874D3O3p2j71Q9k47l0M92l27J7j44P3J56k18J19K48k29M9J58K9j11J22j69O6
5897FL26n08J88j42K0J87r1J62l24M13n6k45lm1K37l32L38j22j42o0J37L9L4P1
5921I2l44L28k23J93k93J96J79j23j29r5N1j4J39q1o2K16r8p1j73J68J82l9K61
5944B60l88J39j86J68n1n1K87J9J6o3l27P4K49k32O7j94K34K2q7M1J5Q0Q3k88
5968a13J04k2q7K6L98m59J03k29j8L68J9N8l30L78q6m14J9L16j40n9K65q7n2K88
5992B46r0l72J99J64l33M07j07r2l8N7l1p5N0r2K21k35j28N9J73l19M26k43K49
$$ plain form
6015 96 -123 -44 -157 -163 -7 274 36 -139 141 -194 155 59 195 291 -105 -28 -239 -107 -137 197 31 -126 -92
6038 -92 -160 -116 -141 28 -100 49 -5 228 -121 -98 -60 223 199 110 62 306 -513 -238 -80 -246 150 -193 249
6061 249 28 -20 66 -249 80 64 -214 -101 116 17 86 -1 -122 72 -315 -19 13 -7 306 -44 151 -1 67
6084 67 -159 -118 -65 -210 17 -160 -9 184 34 173 279 -97 19 281 -212 144 64 -152 -52 -137 -221 -134
6106 -134 62 -271 -153 232 61 -138 -14 -97 127 76 46 -266 116 -80 54 -7 -150 -25 -42 -258 -188 61
6128 61 -34 -269 -55 -118 -115 -118 -2 49 64 -65 1 -11 211 -187 45 124 -63 -269 -138 -87 -54 -64 -6 -97 201 -135
6154 -135 72 116 -161 44 -270 119 15 -145 88 107 -10 277 -25 -195 244 -126 157 102 -268 -125 -170
6175 -170 143 -36 -294 35 -54 88 -118 -91 150 16 76 -90 -66 67 4 107 108 -262 -3 86 276 -73 -63
$$ packed form
6015I6k19P9j13oJ56K81k38j75K80l35L49r6J36R6l96P7k11J32l0L34j66j57L4
6038i2o8M4k5J69j28J49n4K33l49K3L8K83k4q9m8K44q19K75J58j66L96l43M42
6061B49k21m8Q6l15L29j6k78J13K17r9O9q7j21J94l87K96L2k0L13l50J95j52O8
6084F7k26M1N3j45K27j77J51J93j50J39J06l76J16K62m93L56q0k16J00q5q4Q7
6106a34J96l33J18L85j71j99J24q3K24n1l0l12L82j96J34o1j43J25j7k16P0K49
6128F1r5k35K14o3LlJ16N1J5j29O6j2K22l98K32P9j87k06J31N1L3j0N8r1K98l36
6154a35K07M4k77K05l14L89j04j60K33J9j17K87l02j70M39l70K83n5l70J43m5
6175a70L13j79k58L29q9J42k06K7K41j34O0j66K4J33o3J03Jl70K59Q9J90l49J0
$$ plain form
6198 -63 175 -37 182 43 64 -235 -78 -116 -80 111 173 137 -214 -154 12 75 -12 176 -80 150 159 40 -29 65
6222 65 16 355 -33 -72 237 169 15 -59 -71 250 -426 -174 -1 -44 79 -221 -88 212 -124 111 13 15 115
6245 115 143 -37 -81 219 -82 -170 -58 -46 69 14 35 92 -63 -110 -290 -266 -30 -291 40 -187 -224 -162 -138 43
6269 43 -97 -192 -114 46 -197 -15 -48 -37 81 26 -135 145 -224 -314 -91 177 198 231 109 123 -113 61 366
6292 366 -27 203 91 -140 -150 -73 0 79 -75 -208 -327 44 -164 46 -290 -186 -3 119 85 31 -221 23
6314 23 30 -278 230 24 49 184 135 -133 -105 -163 44 -20 -158 -76 -270 127 330 -59 293 -135 -16 41 -105
6337 -105 -3 178 -169 -205 131 -110 13 -23 71 25 -83 -44 -27 80 92 -126 -265 -201 -94 -107 -326 -85 282
6360 282 -6 -28 -119 250 -82 -55 21 -55 -284 -15 -164 -28 78 8 -277 -27 114 -118 104 -24 104 136
$$ packed form
6198f3K38k12K19j39K1k99J57l8L6J91O2l6l51O0J66O3q7J88k56K30Rj19o9R4
6222F5m9L39l88l9L09o8j54p4j2L21o76K52J73m3J23l00J33L00l36K35r8KJ00
6245A15K8j80m4L00l01q8J12J2J15n5K1N7j55m7j80K4K36k61L31k27l7O2K4J81
6269D3j40r5P8J60k43J82l3J1J18n5j61K80l69r0K23K68K1L3j22J4k36J74L05
6292C66l93K30j12k31j0P7P3P9j54j33j19L71k08K10l36J04J83J22l4n4k52K44
6314B3Pl08N08k06K5J35m9k68K8n8K07o4j38Q2j94L97K03l89L52m28J19N7j46
6337a05J02J81l47l6L36k41J23l6R4m6j08L9J7J07J2k18j39O4J07j3k19K41L67
6360B82k88k2r1L69l32K7P6p6k29K69j49J36J06p0k85K50J41k32K22j28J28L2
$$ plain form
6382 136 200 -18 83 9 -393 -237 -24 -66 -34 -113 -21 157 134 32 157 -284 15 -44 -199 -127 -201 -132 -148 -187
6406 -187 37 30 36 0 34 -26 190 173 101 -17 120 -225 37 111 35 -261 95 209 100 43 178 -271 38 -199
6430 -199 -303 -36 80 -171 -82 -186 109 111 -31 303 287 61 89 -27 -48 170 181 -181 6 235 -2 -90 265
6453 265 -66 96 -195 -104 -243 2 -73 -177 115 25 4 -12 -133 -97 40 -85 -19 49 -75 94 133 51 -13 -134
6477 -134 45 -178 -270 66 -212 -9 -176 -38 -44 154 97 -46 8 -183 154 -99 -6 -158 -100 72 -83 -276
6499 -276 175 -247 -124 -63 -222 -130 -164 -5 -16 8 106 -163 -160 -15 -73 -168 -152 10 -38 144 339 318 160 23
6523 23 1 56 292 -87 -113 -165 13 -89 3 182 102 107 120 -30 -12 55 39 -243 124 67 -63 199 -147 50 133
6548 133 -69 132 147 -265 26 155 4 -282 -43 -43 -193 -54 -24 -343 -29 68 -43 -98 -182 167 75 69 21 -136
$$ packed form
6382A36O4k18J01p4m02J56K13m2L2p9R2J78k3j02J25m41K99n9j55P2p4O9j6l9
6406a87K24pOl6L4o0K16j7p2j18J37l45K62P4p6k96L56J14j09n7J35m49L09k37
6430a99j04K67J16k51Q9j04K95Kj42L34j6k26K8j16k1K18J1l62J87K29k37q8L55
6453B65l31J62k91R1j39K45p5j04K92r0k1j6j21L6J37j25O6O8j24J69L9q2o4j21
6477a34J79k23r2L36k78K03j67J38oJ98n7j43N4j91L37k53R3j52N8J72j55j93
6499b76M51m22J23O1j59R2l4J59j1K4R8k69LJ45n8r5J6J62m8J82J95k1j58j37
6523B3k2N5K36l79k6n2J78j02R2J79q0NJ3j50J8O7j6k82L67n7j30K62l46J97Q3
6548A33k02K01J5m12K91J29j51k86K39%j50J39L0l19L14R7j11n5q4L49r2om8j57
$$ plain form
6572 -136 231 78 237 250 -238 -44 -112 -38 328 85 17 -88 153 -66 270 334 90 100 -54 240 160 335
6594 335 285 13 -69 -208 -145 192 -97 -159 -131 -277 198 -21 -20 -77 50 179 59 242 194 56 197 -114 208
6617 208 -64 95 236 -22 44 -191 -168 179 -31 121 -34 24 107 23 214 -84 239 102 235 17 -141 43
6639 43 -19 -10 -252 -99 213 26 341 -164 92 132 25 122 -81 -193 399 -141 360 46 -200 173 174 -83 -115
6662 -115 -103 -23 -44 140 164 156 -325 149 309 -3 108 -19 -89 -124 -105 -77 -342 48 -1 163 38 236 111 188
6686 188 373 -89 102 289 -7 -121 226 -266 53 -73 -70 -25 -68 -40 -189 87 21 219 259 -74 -178 156
6708 156 124 -136 -133 -48 -1 -122 195 86 -201 277 129 -152 16 -40 123 -142 -90 -217 285 32 -194 43
6730 43 12 -167 -86 -182 49 197 81 -34 8 132 195 168 90 -160 64 120 -49 94 -130 57 33 291 135
$$ packed form
6572a36L67j53J59J3m88J94o8P4L66k43o8j05K41k19L36O4k44J0j54K94q0J75
6594C35n0k72q2j39O3L37k89o2K8j46M75k19Jn7J27J29j20J83m8j38J41l11L22
6617B08k72J59J41k58O6k35K3L47k10J52j55N8Q3q4J91k98L23j37J33k18j58J84
6639D3o2Rk42J53L12j87L15n05K56M0j07R7k03j12N92n40N01l14k46L73Jk57l2
6662a15J2Q0k1J84K4qm81M74J60l12J11j27p0l5J9K8k65L90m9J64j25J98j25P7
6686A88J85m62J91J87k96j14L47m92L19j26LM5m3K8j49K76o6J98M0l33j04L34
6708A56l2k60LQ5M7j21L17j09k87M78j48k81J68n6J63k65N2j27N02k53k26K37
6730D3l1j79Q1r6K31J48j16j15M2J24O3k7p8k50K24N6j69J43k24J87k4K58j56
$$ plain form
6753 135 19 -71 40 48 -32 80 66 -108 -204 -48 191 118 -114 175 -131 96 -50 -208 145 138 -112 -45 -130 0
6777 0 41 -272 200 -117 -199 -17 -15 20 -179 111 245 23 -202 -133 16 -114 182 73 -392 -24 16 18 -28 96
6801 96 51 -228 314 250 -81 -284 -45 -34 99 -52 71 245 -41 -168 -50 -85 57 122 172 136 -66 -119 127
6824 127 243 250 44 -136 -20 -145 -115 89 -54 -150 -41 -157 -97 11 -137 -234 34 341 -242 -106 181 -300
6846 -300 -178 166 70 -262 239 -272 -119 28 -120 -235 -167 110 -94 -59 -223 -40 -88 -93 -115 -235 119 -357
6868 -357 -158 30 -14 -22 -29 -24 -83 -230 232 -238 -164 60 -212 -17 143 -53 171 -4 -148 39 192 -194 126
6891 126 424 2 -90 15 102 -70 69 -11 132 94 -45 245 173 -105 -100 -185 72 146 37 -172 -102 -288 -82
6914 -82 147 -296 72 122 232 0 74 -13 228 -168 100 172 -275 4 94 -125 150 144 -201 174 -46 -185 -46
$$ packed form
6753A35j16r0J11Qq0J12j4j74r6J56K39p3k32K89l06K27j46j58L53pk50O7q5J30
6777@M1l13M72l17q2J82KL5j99K90J34k22k25O9J49j30K96j09m65L68M0Km6J24
6801I6m5k79N42o4l31k03K39J1J33j51J23J74k86j27J18l5J42O5N0l6k02n3K46
6824A27J16Pk06j80J16j25L0K04j43r6J09j16O0J08j48r7K68L07n83J36K87m81
6846c00J22L44r6l32N01n11J53J47j48j15O8K77k04L5j64J83m8nk2j20L54m76
6868c57J99J88m4qpNn9j47M62m70P4K24k72J95J60j96K24j75j44J87J53l86L20
6891A26K98m22r2J05Q7j72J39q0J43l8j39K90p2k78Nq5K57P4j09k09P0j86K06
6914h2K29m43L68N0J10k32P4q7K41l96K68P2m47K79R0k19K75ol45L75k20j39J39
$$ plain form
6937 -46 259 -178 331 164 -121 -83 -41 37 -7 59 84 -298 -135 307 -224 -64 -255 50 -7 34 -36 -75 18 -124
6961 -124 120 89 48 -34 -232 174 -8 -154 19 -29 -327 126 168 -183 200 -209 -167 -224 -171 4 -169 -222 94
6984 94 -158 -46 9 9 136 -264 -212 -184 1 -156 -329 13 200 -254 49 -46 -292 56 294 -25 297 17
7006 17 -126 247 -109 -33 -200 144 -58 -82 -46 -179 -81 76 57 -76 -26 194 -126 -213 -82 172 -148 12 -12
7029 -12 -218 33 -21 -61 38 107 346 105 -154 330 -9 111 -41 -151 2 -21 184 87 -138 168 51 -258
7051 -258 94 -237 -380 -37 163 4 95 -7 14 -236 76 -380 168 80 17 -149 57 -133 -216 1 20 -74
7073 -74 28 -76 87 189 -17 0 -321 167 -86 -27 75 -43 101 35 -74 56 241 -171 -80 138 -94 180
7095 180 156 157 86 -263 -160 219 184 41 -436 36 -164 27 49 255 -226 13 -151 -166 101 -70 37 -105
$$ packed form
6937d6L05m37N09j67k85L8M2P8m4O6K5l82J63M42n31J60j91L05n7M1p0l9R3j42
6961a24K44l1m1q2j98M06j82j46J73m8k98M53M2l51L83m09M2n7N3J75j73n3L16
6984I4k52J12N5%J27m00N2K8J85j57j73L42J87m54L03r5k46L48K38l19L22k80
7006A7j43L73l56P6j67L44k02k4L6j33R8J57j9j33N0K20l20q7J31K54l20J60k4
7029a2k06K51n4m0R9O9K39k41k59M84l39J20j52j10J53k3K05r7k25L06j17l09
7051b58L52l31j43L43K00j59R1j02K1k50L12m56N48q8o3j66K06j90q3K17J9r4
7073g4J02j04J63J02k06J7l21M88k53N9J02j18J44o6j09J30J85m12R1K18k32K74
7095A80k4Jp1l49J03L79l5j43m77M72k00J91K2K06m81K39j64j5K67j71J07j42
$$ plain form
7117 -105 88 -76 100 -140 -177 110 98 161 -63 113 32 31 -17 -10 282 -35 -138 -200 105 365 -32 -60 137 140
7141 140 6 28 -174 -264 338 239 -38 -162 93 125 -57 127 148 -146 84 -20 243 233 -245 -7 -31 -109 -38
7164 -38 18 276 -101 -111 155 -87 -44 -119 376 -99 -150 -16 -23 -163 -195 29 -24 83 -42 90 -62 -49 176 282
7188 282 188 93 -20 56 81 -50 163 145 -62 79 60 -357 0 -88 -343 -129 -13 -44 -119 99 76 231 150 120
7212 120 -159 81 140 33 102 -79 -208 109 52 -226 34 61 -29 84 -147 -92 -186 37 11 -301 -165 -12 80
7235 80 83 76 -105 -168 165 99 319 -104 271 13 -110 37 187 214 -63 -57 -132 113 11 112 199 295 -18 -34 -147
7260 -147 6 99 204 -236 -51 -168 140 -386 -24 132 140 -211 -8 -143 -118 136 -128 -52 265 -67 4 50
7282 50 90 107 232 -297 45 123 -294 91 -117 44 -27 141 -255 -147 -20 236 136 193 115 75 113 -114 -83
$$ packed form
7117a05J93j64J76k40l7K87j2O3k24J76q1jm8PK92l17j03o2L05K60l97k8J97L
7141A40j34K2k02r0O02r9k77j24K55L2j82J84K1k94K30j04K63j0m78K38k4p8P1
7164c8N6K58l77j0K66k42M3p5M95m75n1J34pj40l2K24n3J07j25J32j52J3K25J06
7188B82r4r5j13P6K5j31K13j8k07J41j9m17L57q8k55K14J16l1p5K18k3J55q1l0
7212A20k79K40N9j07O9j81j29L17n7k78K60K7r0J13k31N5r4K23k6l12J36J53R2
7235H0Lpj81o3L33o6K20m23L75k58j23J47J50K7k77Op5K45j02J01Q7R6l13j6j13
7260a47J53R3J05m40J85j17L08n26L62J56Ql51K03j35K5K54k64P6L17l32P1M6
7282E0M0J7J25n29L42P8m17L85k08J61p1J68l96J08J27K56j00N7p8m0L8k27L1
$$ plain form
7305 -83 -88 40 -23 90 179 178 139 -220 199 -73 280 8 -118 120 -45 -5 -69 265 -147 -153 23 -47 42 25 16 -214
7331 -214 20 -43 -107 -97 -145 159 -122 -153 -65 13 -96 -346 131 -46 37 66 123 23 -281 323 -140 80 89 45
7355 45 -167 -211 88 -92 59 -17 -124 166 23 -109 -138 -191 -221 -380 -258 249 296 -114 68 -21 -9 -66 172
7378 172 -199 -177 31 87 279 308 -89 273 -81 31 -77 -10 14 -49 -186 24 -183 -261 253 -242 -100 -231
7400 -231 -236 64 -121 -17 45 -28 -55 -122 26 -41 15 82 -47 154 -14 77 -59 93 171 -118 32 -245 -213 210
7424 210 35 113 -153 126 -224 233 102 -72 54 -36 -48 -213 -76 -123 -135 121 89 -101 60 44 -226 -78
7446 -78 -284 -81 74 -192 -264 62 -135 -314 92 122 143 -22 -102 -92 -118 167 62 149 -145 145 190 222 -5
7469 -5 -134 -185 -142 -123 -41 2 232 46 -30 157 -97 39 -45 -36 107 70 205 339 -5 -69 312 77 -118 42
$$ packed form
7305h3nJ28o3J13Q9jl9l59M19k72L53k72j26K38j65M0o4L34m12oJ76p0Q9j7rk30
7331b14K34o3o4J0m8L04k81l1Q8P8j09k50M77j77Q3K9N7j00l04O04m63K20Rm4
7355D5k12m4K99j80J51p6j07K90j43j32k9n3l0j59J22N07M7m10J82q9J2n7K38
7378A72l71K2K08N6J92K9l97L62l54J12j08O7K4o3j37K10k07p8N14m95J42j31
7400b31nL00j85J04O2p3k7o7J48o7N6O7j29K01j68R1j36J52P8k89J50k77L2M23
7424B10j75P8k66K79l50M57j31j74J26r0j2j65J37m7j2K56l2j90J61j6k70J48
7446g8k06K03J55k66p2L26j97j79M06L0K1j65q0J0k6K85j05Q7k94K90M5L2k27
7469ej29n1M3J9Q2M3K30j86p6J87k54J36q4RJ43l7J35J34l44o4L81k35j95J60
$$ plain form
7493 42 -52 -367 206 -88 -122 148 -116 139 -156 -152 9 -36 -275 -38 -13 106 163 -13 107 -57 79 125 -33
7516 -33 -193 -194 258 92 63 301 194 138 104 -41 -65 -4 26 3 232 -133 85 -83 98 -51 35 39 -1 -39 167
7541 167 151 94 -81 -36 196 -24 -38 131 52 82 126 -261 443 92 -87 -211 -35 265 -148 131 -129 -8
7563 -8 129 155 -106 -274 -285 -289 -17 109 0 39 103 -237 -193 45 109 61 193 215 -356 51 96 134 53 120 -178
7588 -178 136 56 -128 274 -30 91 -83 172 101 -131 -38 199 266 -68 152 -282 237 -265 -104 83 174 95
7610 95 -90 229 57 -139 84 -174 -2 -206 -214 199 85 10 -187 -57 -193 -307 -94 113 -370 -42 16 85
7632 85 175 30 -33 13 -129 -74 49 41 144 229 182 77 7 81 -64 -31 39 171 -218 45 -249 152 -209 55
7656 55 -107 -30 209 -44 12 95 32 58 -125 -27 -25 -84 26 -169 -94 91 55 -254 14 56 -99 -296 8 -101
$$ packed form
7493D2r4l15N73k94l4K70k64K55k95MJ61m5k39K37K5J19N7j76J20j64J36M6j58
7516c3j60jM52j66k9K38j07n6l4j45k4O1L0k3K29l65K18j68J81j49Q6Mm0l8K06
7541A67j6n7j75M5K32k20j4J69p9L0M4l87P04l51j79j24J76L00m13K79k60J21
7563hJ37K6k61j68j1mK72J26j09L9O4l40M4K38O4m8J32K2n71M07M5L8q1O7k98
7588a78L14q0j84M02l04J21j74K55p1k32R3K37O7l34K20m34N19n02J61J87R1p9
7610I5j85L19j72j96K23k58J72k04qM13j14p5j97J30j36j14K13K07m83L28N8O9
7632H5R0j45o3M6j42N5J23qJ03Q5m7j05p0P4j45L3P0J32l89K63k94M01l61K64
7656E5j62P7K39k53N6Q3o3K6j83R8Kn9J10j95P5J85l6l09K68M2j55j97L04j09
$$ plain form
7680 -101 110 50 -97 -128 93 -245 124 -56 -320 -132 -7 412 160 -191 -9 44 44 27 152 -197 -136 -134 220
7703 220 87 29 38 -81 -38 -221 69 -29 165 -218 -108 10 202 306 143 -325 -165 -151 -4 -157 105 -80
7725 -80 -203 109 -82 170 -35 21 -50 102 -162 -3 -130 95 75 86 -59 -100 116 64 93 -283 -272 -124 -295
7748 -295 -248 3 284 -146 118 -112 -87 81 95 -2 47 3 -165 -100 127 -102 60 76 137 65 -35 119 107 135
7772 135 58 63 -12 155 -33 -252 113 -153 125 203 92 -122 46 168 42 -241 -52 10 -20 95 -200 -62
7794 -62 3 -195 24 -45 167 29 -372 -144 -150 -119 -24 -35 136 22 24 -22 -178 136 -109 35 164 264 -223 143
7818 143 -112 26 -1 112 115 -28 -65 34 135 244 -9 157 66 123 11 65 228 -327 132 40 -117 42 83
7841 83 -130 -202 -9 -114 -192 -102 -86 -38 -50 165 -30 -45 20 157 116 39 224 -197 160 -120 -34 -94 -131 90 -126
$$ packed form
7680a01K11o0j47l1K21l38L69j80k64J88J25M19k52l51J82N3%j7J25l49O1KL54
7703B20j33n8Rj19M3j83K90r8J94l83J10J18J92J04j63m68J60J4J47j53K62j85
7725h0j23L12j91K52k05N6p1J52k64J59j27K25k0J1j45m1K16n2K9l76J1J48j71
7748b95M7K51K81m30K64k30K5J68J4r7M9m4j68O5K27k29J62J6O1p2j00J54j2K8
7772A35p7Np5J67j88k19L65k66K78P8j11k14J68J22j26k83J89O2l0J15k95J38
7794f2O5j98K19o9K12j38m01K28oL1R5j1J71j14Km6j56L14k45J44J29J00m87L66
7818A43k55J38k7J13Lj43l7R9J01J09k53J66r1N7j12N4J63n55M59r2j57J59M1
7841H3k13p2J93j05p8R0J6M8j2K15j95j5O5J37m1p7J85m21L57k80Q6o0l7K21k16
$$ plain form
7866 -126 -74 166 306 94 67 280 -158 -180 -28 71 -7 44 93 227 -139 248 192 -252 -125 270 19 242 -9
7889 -9 8 -106 -3 109 -16 -153 15 98 -61 -114 -21 -209 -144 16 82 -58 11 95 96 -146 93 50 -305 107
7913 107 225 -22 -21 -185 -90 109 -27 222 -365 -80 -278 35 -73 -70 101 0 -34 -27 32 6 212 -311 -94
7936 -94 232 84 121 -7 255 145 53 -109 -119 289 -84 -73 124 242 63 121 198 165 49 219 287 -28 20
7959 20 152 248 16 224 174 200 -54 44 53 148 106 -395 -54 66 -90 86 -186 276 -135 -169 285 21 4 3
7983 3 10 16 3 -55 -80 126 -56 4 95 -47 149 -77 -81 65 154 -2 41 -64 205 61 -449 -189 -294 233 16
8008 16 110 8 36 117 42 -24 50 90 105 225 -25 89 -137 -39 -19 -98 -229 68 -61 83 -16 460 46 18 -46
8033 -46 -266 -63 98 -19 -262 -212 14 -143 -112 104 -165 243 105 -73 -252 -263 228 381 315 173 123 -291
$$ packed form
7866a26N2K40J40k12k7K13m38k2J52R9p8N1M9J34l66L87n6m44J27L95k51K23k51
7889iJ7j14J03J12j25j37J68Q3j59n3R3j88O5J60O6j40O9Q4Jk42K39m3l55M12
7913A07J18k47Jj64R5J99j36K49n87K85j98L13j08LJ71j01l4PN9k6K06n23K17
7936i4L26j48L7j28K62j10r2j62j0M08l73J1J97J18j79N8P7l3j16J70O8l15M8
7959B0J32R6k32K08n0K6k54R8RR5m2n01L41J20j56J76k72M62m11l4M54k64j7j
7983CPOj3n8k5K06j82O0R1j42J96k26mJ46Q9j56M3j05K69j44n10K60j05N27k17
8008A6R4j02K8Q1p5o6P4M0J5J20k50J14k26R8K0p9j31K97j29J44r9M76m14k8o4
8033d6k20K03J61j17k43N0K26j57L1K16k69M08j38j78j79j1M91J53o6j42n0m14
$$ plain form
8055 -291 -51 -158 327 -134 45 22 -60 -149 115 132 133 122 -1 -24 70 4 79 70 -139 -42 83 -61 103 -30 358
8080 358 100 -22 316 168 -305 -47 118 -9 47 -137 -248 -215 -16 -11 178 7 139 90 -190 71 -187 122
8102 122 -250 40 -49 74 -3 -60 -37 58 -141 18 32 -179 52 -214 54 -52 11 -14 -13 -117 15 -114 -112 -175
8126 -175 215 -187 75 245 53 306 81 -3 38 93 122 -5 30 -186 179 36 -216 -57 -175 -38 -62 36
8148 36 98 81 -52 -327 185 220 -161 -142 -127 -6 -70 31 -3 229 162 38 20 -114 -32 -160 16 43 51 -237 -3
8173 -3 85 149 189 -58 -94 -52 93 16 122 -145 -112 146 2 -356 87 -121 -252 -106
$$ packed form
8055b91K40j07M85m61J79k3q2q9K64J7Jj1j23k3R4o6P5rk09R7J25j44J64j33L88
8080C58k58j22L38j48m73K58J65j27N6j84j11L3J99NJ89j71J32m9k80K61k58L09
8102A22l72K90q9J23p7n7K3R5j99J59J4k11K31k66K68j06O3k5Jj04J32j29Ko3
8126a75L90m02K62J70j92K53k25q4M1N5K9j27L5k16L65j43k52J59j18J37k4R8
8148C6O2j7j33k75N12L5l81J9J5J21o4J01l4K32o7j24j8j34Q2j28J76K7Qk88K34
8173cQ8O4M0k47l6M2J45p7J06k67L3K58j44l58M43k08j31J46
8191a06
$$ Imaginary data points
##PAGE= N=2
##DATA TABLE= (X++(I..I)), XYDATA
$$ plain form
0 0 0 0 0 0 0 0 0 0 0 0 0 0 0 0 0 0 0 0 8 -8 8 -8 8 -8 13 -16 16 -16 24 -24 27 -32 35 -40 46 -51 59 -66 74 -80
40 -80 90 -99 111 -121 134 -147 163 -179 197 -218 240 -264 291 -323 357 -397 441 -494 555 -627
60 -627 718 -829 973 -1166 1443 -1861 2571 -4003 7963 -39621 -128455 17642 90967 8824
74 8824 1204 68869 18080 -45732 24160 77716 -5867 -45085 28833 33055 -56147 -46691 26684
87 26684 -6761 -66178 -19217 6101 -43740 -12945 71011 36909 -27609 16715 51235 -9407
99 -9407 -26207 25063 3510 -60684 -27699 37860 12643 -11078 49870 56023 -31346 -33098 48341
112 48341 21714 -59374 -31544 4017 -52206 -51737 36239 34300 -38305 -14797 43524 7624 -26580
125 -26580 35313 61571 -11905 -32362 34904 36273 -17984 4975 32807 -33780 -59331 13880
$$ packed form
0@%%%%%%%%%%%%%%%%%%Qj6J6j6J6j6K1k9L2l2M0m8N1n9O7p5Q6r7J10j25J40j54
40h0J70j89K10k32K55k81L10l42L76m15M58n04N55o14O80p54Q38r35J049j182
60f27J345j547J802k139K609l304M432o574J1966m7584q8834J46097P3325q2143
74H824p620O7665n0789o3812O9892N3556q3583l9218P3918M222q9202R456P3375
87B6684l3445n9417M6961K5318m9841L0795Q3956l4102o4518M4324L4520o0642
99i407j6800N1270k1553o4194L2985O5559k5217k3721O0948O153q7369j752Q1439
112D8341k6627q1088K7830L5561n6223M69Q7976j939p2605K3508N8321l5900l4204
125b6580O1893K6258p3476k0457O7266J369n4257K2959K7832o6587k5551P3211
$$ plain form
137 13880 18820 -47617 -22688 36060 -8589 -51271 9615 43869 -12081 -26760 23594 13850
149 13850 -30575 11755 69885 21815 -29346 11866 26523 -26213 -16468 27729 -20716 -70159
161 -70159 -9766 36545 -6422 -13376 36149 21849 -31668 -11807 29835 -1264 -34912 -4221
173 -4221 4746 -33651 -10718 52480 30277 -19588 14007 38227 -13147 -16891 40752 20423 -46762
186 -46762 -29477 16150 -8967 -31061 5210 9463 -38430 -31475 25424 20725 -13765 16229 41489
199 41489 -7854 -21003 38661 35405 -28710 -21144 17280 -12370 -31998 17607 32912 -13415
211 -13415 -20063 13891 3085 -25296 -923 16700 -26113 -42122 9818 25589 -8877 9236
223 9236 45848 5866 -31352 11676 32811 -11674 -21099 7354 -8357 -29474 8459 36694
$$ packed form
137A3880M940o6437K4929N8748m4649m2682O0886L4254n5950j4679N0354r744
149A3850m4425M2330N8130m8070n1161M1212J4657n2736R745M4197m8445m9443
161g0159O0393M6311m2967o954M9525j4300n3517J9861M1642l1099l3648L0691
173d221Q967l8397K2933O3198k2203m9865L3595K4220n1374l744N7643k0329o7185
186d6762J7285M5627k5117k2094L6271M253m7893O955N6899m699l4490K9994K5260
199D1489m9343j3149N9664l256o4115P566L8424k9650j9628M9605J5305m6327
211a3415o648L3954j0806k8381K4373J7623m2813j6009N1940J5771l4466J8113
223I236L6612l9982l7218M3028K1135m4485r425K8453j5711k1117L7933K8235
$$ plain form
235 36694 873 -21090 8398 10824 -23042 -9786 25097 -4771 -40501 -2600 24504 -11979
247 -11979 -12918 29609 13855 -26971 -2702 28563 5499 -4678 23235 13671 -25471 -13059 23070
260 23070 3297 -31858 -12486 2941 -26746 -20611 32392 27387 -16992 -2952 26053 335
272 335 -12891 17304 10201 -30037 -19648 15704 7396 -6432 18792 25804 -13360 -22052 15434
285 15434 14980 -22420 -16401 6081 -17820 -26339 19003 29604 -8459 -7156 19234 2491 -15343
298 -15343 11027 19856 -12800 -18598 9379 6770 -15743 3749 26700 -6034 -34054 37 21954
311 21954 -4524 -5367 17775 -2619 -24823 7602 25511 -8839 -20607 3697 -1256 -20175 3424
324 3424 31258 9171 -13556 7939 18559 -9085 -10709 14858 -1847 -33981 -12678 13536
$$ packed form
235C6694l5821k1963K9488K426l3866J3256L4883k9868l5730L7901K7104l6483
247a1979r39M2527j5754m0826K4269L1265k3064j0177K7913r564l9142J2412L6129
260B3070j9773l5155J9372J5427k9687O135N3003n005m4379J4040K9005k5718
272C35j3226L0195p103m0238J0389L5352q308j3828K5224P012l9164q692L7486
285A5434m54l7400O019K2482k3901q519M5342J0601l8063J303K6390j6743j7834
298a5343K6370Q829l2656n798K7977k609k2513J9492K2951l2734k8020L4091K1917
311B1954k6478q43K3142k0394k2204L2425J7909l4350j1768K4304m953j8919K3599
324C424K7834k2087k2727K1495J0620k7644j624K5567j6705l2134K1303K6214
$$ plain form
336 13536 -3702 -4668 23225 12075 -17888 -3172 18505 -1633 -16376 3701 4319 -20998 -11133
349 -11133 26390 22157 -9398 -3026 13589 -6176 -14227 11910 6535 -24545 -13445 11117 -4353
362 -4353 -12503 16021 18017 -14723 -14890 14200 13168 -4146 6454 15884 -7444 -16842 10680 14593
376 14593 -14825 -14364 3683 -12401 -21100 12718 23205 -6098 -5255 18080 5169 -15005 4701
389 4701 17593 -11317 -27900 -2891 10945 -2935 3714 22613 4272 -16851 5356 18482
401 18482 -8149 -13919 7065 -5854 -26027 -449 23352 2947 -10982 4839 5487 -11806 -3935
414 -3935 14939 2264 -17237 -2516 12707 -958 -408 21113 8976 -19450 -5668 15161 -3201
427 -3201 -12226 8535 3928 -21914 -12025 13602 5052 -12919 -3166 4988 -9137 -5614 21227 19553
$$ packed form
336A3536j7238r66K7893j1150k9963J4716K1677k0138j4743K0077O18k5317R865
349a1133L7523m233l1555O372J6615j9765q051K6137n375l1080J1100K4562j5470
362d353q150K8524J996l2740j67K9090j032j7314J0600R430k3328r398K7522L913
376A4593k9418M61J8047j6084q699L3818J0487k9303Q43K3335j2911k0174J9706
389D701J2892k8910j6583K5009J3836j3880O649J8899j8341k1123K2207J3126
401A8482k6631n770K0984j2919k0173K5578K3801k0405j3929J5821O48j7293P871
414c935J8874j2675j9501J4721J5223j3665N50K1521j2137k8426J3782K0829j8362
427c201r025K0761m607k5842R889K5627q550j7971R753Q154j4125L523K6841j674
$$ plain form
441 19553 -4792 846 16544 -1591 -13061 8475 7420 -23892 -20786 5012 638 -8335 11048
454 11048 17161 -5287 -9515 10714 9942 -9290 -5924 4543 -11325 -18721 8515 18957 -4361
467 -4361 -4949 14907 3119 -12941 7388 19061 -5473 -14557 3551 3781 -8905 1137 12130
480 12130 -6600 -20606 -3115 7365 -7096 -5289 13208 3236 -15432 3345 21849 3161
492 3161 -6757 9158 3986 -14208 -377 19318 4681 -10348 -695 2053 -12575 -8835 7857
505 7857 -1802 -22365 -9157 10842 1130 -1892 19777 17164 -9039 -4045 15571 3067 -11005
518 -11005 447 510 -17331 -10486 13652 10645 -5479 1136 9874 -4719 -10060 9945 10473 -14792
532 -14792 -14297 5320 -2052 -11751 7115 12790 -10539 -11775 9766 8828 -1761 8145 14723 -2913
$$ packed form
441A9553k4345N638J5698j8135j1470K1536j055l1312L106K5798m374q973J9383
454A1048O113k2448m228K0229p72j9232L366J0467j5868p396K7236J0442k3318
467d361n88J9856j1788j6060K0329J1673k4534r084J8108K30j2686J0042J0993
480A2130j8730j4006J7491J0480j4461J807J8497r972j8668J8777J8504j8688
492C161r918J5915n172j8194J3831J9695j4637j5029R653K748j4628L740J6692
505G857r659k0563J3208J9999r712l022K1669k613k6203M994J9616j2504j4072
518a1005J1452O3j7841O845K4138l007j6124O615Q738j4593n341K0005N28k5265
532a4792M95J9617p372r699J8866N675k3329j236K1541r38j0589R906O578j7636
$$ plain form
546 -2913 -9449 8726 12490 -7439 -10279 1664 -8084 -20274 -568 13728 -4184 -10180 7236
559 7236 4874 -8689 4183 14798 -3604 -12811 3489 8089 -2222 4213 17051 4413 -13318
572 -13318 -2090 9566 -5448 -12987 1512 -2553 -18888 -4385 16318 4911 -5372 7768
584 7768 6958 -9141 -2152 13613 2032 -14168 -3984 6362 -4053 -4676 12487 10806 -10289
597 -10289 -6467 11016 3377 -6316 7417 7821 -13872 -11397 8036 2259 -11517 -2374 1981 -11404
611 -11404 -9537 11521 14350 -1481 -46 11815 3624 -6402 7148 11206 -9782 -14623 2064
624 2064 122 -8865 5217 12161 -6240 -11381 5764 6811 -6922 -3655 4816 -6099 -12860 4099
638 4099 15038 1545 -3850 8833 3946 -9183 1787 13305 -3458 -13133 1905 2917 -8975
$$ packed form
546b913o536J8175L764j9929k840J1943r748j2190J9706J4296j7912n996J7416
559G236k362j3563J2872J0615j8402r207J6300M600j0311O435J2838j2638j7731
572a3318J1228J1656j5014p539J4499m065j6335J4503K0703j1407j0283J3140
584G768q10j6099O989J5765j1581j6200J0184J0346j0415o23J7163j681k1095
597a0289L822J7483p639r693J3733M04k1693K475J9433n777j3776R143M355j3385
611a1404J867K1058K829j5831J435J1861q191j0026J3550M058k0988m841J6687
624B064j942q987J4082O944j8401n141J7145J047j3733L267Q471j0915o761J6959
638D099J0939j3493n395J2683m887j3129J0970J1518j6763r675J5038J012j1892
$$ plain form
651 -8975 1013 13869 -333 -13158 -976 7676 -2963 -4349 7553 2363 -13059 -4399 11275
664 11275 1781 -7986 3891 4642 -10166 -2290 16461 7478 -6043 3524 7653 -6201 -6806 6453
678 6453 1942 -14476 -10728 2308 -1221 -4866 8432 11310 -5416 -5273 10087 5167 -6980 2123
692 2123 5495 -10753 -10231 9089 9054 -3853 -171 7059 -2239 -7607 4674 8416 -6112 -9669 1489
707 1489 -388 -7732 3752 11546 -4790 -10390 4550 5574 -5513 2032 10617 -2789 -10194 3174
721 3174 8642 -2381 -3098 4367 -2184 -10564 627 12214 943 -6067 4712 3535 -9815 -1859
735 -1859 11188 -2302 -15121 -2879 5096 -3405 -13 12079 5619 -6960 -882 9312 1744
748 1744 -5748 1623 1446 -11402 -7238 9262 5427 -5553 2420 6499 -6260 -5294 8530 4513
$$ packed form
651h975R988J2856j4202j2825J2182Q652j0639j386J1902n190j5422Q660J5674
664A1275r494r767J1877P51j4808P876J8751q983j3521R567M129j3854o05J3259
678F453m511j6418L748J3036l529l645J3298K878j6726J43J5360m920j2147R103
692B123L372j6248N22J9320l5j2907L682P230r298n368J2281L742j4528l557J1158
707A489j877p344J1484P794j6336n600J4940J024j1087P545Q585j3406p405J3368
721C174N468j1023p17P465o551q380J1191J1587j1271p010J0779j177j3350P956
735a859J3047j3490j2819J2242P975q501L392J2092o460j2579O078J0194p568
748A744p492P371j77j2848M164J6500l835j0980P973M079j2759R66J3824m017
$$ plain form
762 4513 -8542 -4686 1995 -3553 -3255 7245 6492 -5829 -4847 5938 3121 -3785 4872 8334 -6281
777 -6281 -8334 6809 5916 -6146 -1143 4621 -6568 -8966 5769 8596 -2738 -2722 3977 -693 -6430
792 -6430 2246 7566 -4776 -10458 1432 3931 -4267 2842 12609 1809 -6945 3793 6982 -3423
806 -3423 -2642 3610 -4545 -11335 -1813 6401 -476 -3359 4267 2308 -7172 -1573 9961 2647 -8042
821 -8042 -271 3695 -4929 -940 10924 3840 -8172 -1448 5725 -926 -1710 5755 1782 -8535 -4410
836 -4410 5181 1038 -5601 503 2421 -7925 -6639 7737 6327 -4116 658 5225 -3543 -3590 8086
851 8086 5114 -6295 -4570 2986 -259 -2138 6220 7762 -3647 -6638 3182 2982 -6038 -2419 2767
866 2767 -7466 -10692 2844 6362 -1595 972 7258 -62 -3816 5859 8570 -1320 -4521 1810 37
$$ packed form
762D513j3055L856O681n548K98J0500p53j2321R82J0785k817o906Q657L462j4615
777f281k053J5143q93j2062N003N764j1189k398J4735K827j1334J6O699m670n737
792f430Q676N320j2342n682J1890K499q198P109R767j0800q754J0738L189j0405
806c423P81O252q155o790R522Q214o877k883P626j959r480N599J1534p314j0689
821h042P771L966q624L989J1864p084j2012O724P173o651p84P465l973j0317M125
836d410R591m143o639O104J918j0346J286J4376j410j0443M774M567q768m7J1676
851H086k972j1409J725P556l245j879Q358J542j1409k991R820k00r020L619N186
866B767j0233l226J3536L518p957K567O286p320l754R675K711r890l201O331j773
$$ plain form
881 37 -5387 297 6929 -1530 -9141 -367 3907 -3625 -1157 6362 -1745 -8867 786 5886 -1854 -1926
897 -1926 4719 -96 -6537 242 8832 4065 -2076 2958 3634 -4491 -2246 6956 1366 -9045 -3616
912 -3616 1499 -5054 -3559 7013 2748 -7104 -1999 5001 -483 -2466 3521 3001 -5380 -3871 6387
927 6387 6297 -539 2403 5500 -3015 -4779 5494 4148 -6706 -4945 484 -5545 -6354 3536 4475 -4433
943 -4433 -4213 2974 2395 -660 3943 6675 -1792 -5554 3072 5245 -2199 -262 4695 -3388 -7334 3141
959 3141 6649 -2128 -2399 2754 -2005 -6752 357 5128 -2798 -7200 -1261 1180 -2822 1542 8646
974 8646 2694 -4844 1989 6518 -700 -586 5883 -567 -8423 -1291 5174 -707 -3091 1622 124
989 124 -5861 -2206 5076 1406 -5291 -1532 2080 -2980 -1824 7452 5232 -4235 -465 5993 582
$$ packed form
881C7n424N684O632q459p611Q774M274p532K468P519q107p122R653N100p740p2
897a926O645m815o441O779Q590m767o141N034O76q125K245R202n590j0411N429
912c616N115o553J495J0572m265r852N105P000n484j983N987n20q381J509J0258
927F387r0o836K942L097q515j764J0273j346j0854J761N429o029q09R890R39q908
943d433K20P187n79l055M603K732q467l762Q626K173p444J937M957q083l946J0475
959C141L508q777k71N153m759m747P109M771p926m402N939K441m002M364P104
974H646n952p538O833M529p218J14O469o450p856P132O465n881k384M713j498
989A24n985L655P282l670o697L759L612n060J156R276k220r467L770O458n411
$$ plain form
1004 582 -557 5619 3279 -5994 -4296 2304 -106 -3642 -397 882 -4878 -5388 3409 4612 -1891
1019 -1891 -305 4204 -1962 -4610 4683 5519 -3318 -2725 2923 -425 -2096 4703 6284 -1639 -3565
1034 -3565 1603 1337 -3103 -925 2150 -3938 -8526 58 4448 -1752 -1026 4822 127 -4788 3192
1049 3192 7438 297 -2355 2057 198 -3935 592 5418 69 -5132 -1215 2068 -2584 -1868 4781
1064 4781 319 -7632 -3014 3639 -658 -2124 3711 1133 -5028 -111 6400 3222 -696 1647 1769
1079 1769 -3028 -2267 4056 2262 -4775 -3428 1256 -2542 -3036 4517 3791 -4621 -2630 3340 126 -1948
1095 -1948 2974 2305 -4281 -3312 2978 3215 -439 1498 3525 -1811 -3907 3294 4937 -3124 -3899 944
1111 944 -2502 -5656 1748 4400 -2666 -3561 2448 1382 -1499 2775 4742 -902 -4314 204 2842
$$ packed form
1004E82j139O176k340r273J698O600k410l536L245J279n760n10Q797J203o503
1019a891J586M509o166k648R293Q36q837N93N648l348j671O799J581p923j926
1034c565N168k66m440K178L075o088m588Q584M390o200P26N848m695m915P980
1049C192M246p141k652M412j859m133M527M826n349n201L917L283m652P16O649
1064D781m462p951M618O653m297j466N835k578o161M917O511l178l918K343J22
1079A769m797P61O323j794p037J347M684l798m94P553p26q412J991N970l214k074
1095a948M922o69o586R69O290K37l654J937K027n336k096P201J643q061p75M843
1111I44l446l154P404K652p066q95O009j066k881M274J967n644l412M518K638
$$ plain form
1126 2842 -1005 -965 3140 -210 -5365 399 5467 -198 -2245 2149 -571 -5651 -539 3905 -968
1141 -968 -3661 -18 778 -2247 535 5787 2772 -3140 -499 3554 -15 -1800 3244 1175 -5949
1156 -5949 -3024 2910 223 -2087 2169 999 -4241 -1538 4092 2116 -1694 -790 883 -2596 -2502 3545
1172 3545 4105 -2392 -2057 3091 821 -1824 3632 3664 -4318 -4089 1148 -176 -3018 897 1791 -3056
1188 -3056 -3477 2419 4157 99 124 2393 -838 -3441 1538 4537 -1378 -3247 1482 -26 -3034 2039
1204 2039 4603 -1501 -4034 368 725 -1867 7 2556 -1604 -4910 -557 3355 570 -951 3385
1219 3385 1456 -3199 756 5437 786 -2431 1011 -317 -4494 -1006 3380 -114 -3541 -528 1139
1234 1139 -662 -370 3047 1989 -3556 -2393 2534 240 -1594 2767 2319 -3194 -1437 4593 2316
$$ packed form
1126B842l847M0M105l350n155N764N068n665k047M394k720n080N112M444m873
1141i68k693L643P96l025K782N252l015n912K641M053l569j785N044k069p124
1156e949K925N934k687k310M256j170n240K703N630j976l810R04J673l479R4O047
1172C545N60o497L35N148k270k645N456L2p982K29N237j324k842L915Q94m847
1188c056m21N896J738m058K5K269l231k603M979K999n915j869M729j508l008N073
1204B039K564o104k533M402L57k592J874K549m160l306M353L912k785j521M336
1219C385j929m655L955M681m651l217L442j328m177L488M386l494l427L013J667
1234A139j801K92L417j058n545J163M927k294j834M361m48n513J757O030k277
$$ plain form
1249 2316 -1028 1382 888 -3374 -3031 1586 1437 -2814 -2211 315 -1047 -2042 2745 4232 -1364 -2302
1265 -2302 2665 1649 -1369 2852 3396 -2312 -3158 1481 1720 -1099 369 1597 -1725 -3196 759 3014
1281 3014 -628 -2501 207 -1137 -4226 312 3918 -83 -2640 1990 1957 -872 2415 5129 134
1296 134 -3344 -145 1029 -1288 -962 1531 -292 -3981 -1573 2850 297 -1784 845 -20 -4100 -1362
1312 -1362 3728 950 -2260 1131 1875 -866 922 4568 2133 -1880 -1119 901 -498 -1523 1080
1327 1080 453 -4331 -3825 862 176 -2644 898 2014 -2475 -1618 3793 3036 -209 638 1641 -1339
1343 -1339 -1670 1582 2535 -874 -1875 918 700 -1630 1284 3101 -2285 -4443 -59 -128 -2744 5
1359 5 2040 -1808 -2668 1937 2906 717 949 2396 310 -2059 668 3636 610 -1735 758 302 -2710
$$ packed form
1249B316l344K410m94m262L43M617j49m251O03K526j362r95M787J487n596r38
1265b302M967j016l018M221N44n708q46M639K39k819J468J228l322j471L955K255
1281C014l642j873K708j344l089M538L606m001k557M630l3k829L287K714m995
1296A34l478L199J174k317L26K493j823l689K408M423k553k081K629q65m080K738
1312a362N090k778l210L391P44k741J788L646k435m013P61K020j399j025K603
1327A080o27m784N06M687o86k820L542J116m489Q57N411p57l245Q47J003k980
1343a339l31L252R53l409j001K793k18k330K914J817n386k158M384o9k616K749
1359EK035l848q60M605R69k189K32J447k086k369K727K968l026k345K493m56l012
$$ plain form
1376 -2710 -311 2832 -890 -4314 -1104 110 -2281 -201 2773 -177 -2694 -130 2392 1202 614
1391 614 2771 2011 -1708 -405 3842 1561 -1754 -135 -224 -4281 -3070 1986 143 -3242 -956 672
1407 672 -1324 -298 3032 2023 -2023 -1738 1145 589 -1003 1570 2643 -1732 -1241 3052 2959 -305
1423 -305 993 1574 -2781 -2827 916 587 -2327 -1716 -343 -1729 -2093 1029 2570 -525 -1856 1404 1945
1440 1945 -227 1870 4210 172 -2026 1094 1709 -1373 -366 1280 -1687 -3506 -261 1246 -1014
1455 -1014 -1540 46 -896 -2776 -660 2763 861 -1345 1112 2261 195 1302 4214 1237 -2433
1470 -2433 -374 749 -1807 -1111 1476 34 -2646 -1196 1527 691 -915 587 421 -3043 -2689 1863
1486 1863 956 -1510 430 1758 -692 203 3723 2144 -859 51 1220 -405 -628 1358 1013 -2360
$$ packed form
1376b710K399L143l722l424L210J214k391K080K974k950k517K564K522j190n88
1391F14K157p60l719J303M247k281l315J619q9m057J211N056j843l385K286J628
1407F72j996J026L330j009m046K85K883n56j592K573J073m375M91M293r3l264
1423c05J298N81m355m6L743l29k914O11J373j386l64L122J541l095j331L260N41
1440A945k172K097K340m038k198L120O15l082J007J646k967j819L245J507k260
1455a014n26J586r42j880K116L423j902k206K457J149k066J107K912k977l670
1470b433K059J123k556O96K587j442k680J450K723q36j606J502j66l464L54M552
1486A863r07k466J940J328k450Q95L520j579l003R10J169j625k23J986l45l373
$$ plain form
1502 -2360 -3205 -818 -328 -2324 -698 1121 -1894 -2393 2266 2921 206 1248 2245 -491 -1343 1941
1518 1941 2260 -386 -1041 452 -177 -1257 537 1733 -787 -3348 -1092 -84 -1956 -412 1954 -671
1534 -671 -2315 1057 2444 142 599 1801 -355 -2379 -160 2004 772 -529 476 762 -1305 -159
1550 -159 2459 447 -2661 -1254 181 -1783 -977 1752 561 -2296 -806 1264 36 148 2060 1477
1566 1477 -810 -79 2611 2036 -25 250 531 -2272 -2843 589 245 -2705 -1378 730 -1085 -1171 2234
1583 2234 2075 -1153 -791 643 -14 -547 1439 1845 -341 -1353 1140 1994 -311 253 1485 -1196 -3008
1600 -3008 306 1361 -1193 -634 766 -777 -1938 1038 1739 -131 -1464 7 253 -679 715 2943
1616 2943 851 -1601 420 1445 -678 -55 1749 -275 -2709 -359 1604 -402 -418 354 -904 -2427
$$ packed form
1502b360q45K387M90j996J626J819l015m99M659O55k715J042R97k736q52L284
1518A941L19k646o55J493o29j080J794J196k520k561K256J008j872J544K366k625
1534f71j644L372J387k302M57J202k156k024K219K164j232j301J005K86k067J146
1550a59K618k012l108J407J435j964Q06K729j191k857J490K070j228J12J912n83
1566A477k287P31K690n75k061K75K81k803n71L432l44k950J327K108j815q6L405
1583B234j59l228L62J434o57n33J986M06k186j012K493Q54k305N64J232k681j812
1600c008L314J055k554N59J400j543j161K976P01j870j333J471K46r32J394K228
1616B943k092k452K021J025k123O23J804k024k434K350J963k006j6P72j258j523
$$ plain form
1632 -2427 -1107 1147 527 -1116 65 1217 -206 261 3422 1944 -1409 -666 1013 -1312 -1342 1263
1648 1263 367 -2247 -1013 1318 469 -97 651 380 -1845 -1925 851 1655 -730 -79 1391 -553 -1282
1665 -1282 1868 1931 -909 -1113 801 -616 -1046 1122 1358 -864 -1528 -21 -94 -887 93 904 -1004 -2089
1683 -2089 612 2081 348 56 1465 -581 -2334 85 1630 -261 -785 871 196 -552 560 1889
1699 1889 178 -1545 -877 -252 -1319 -731 754 384 -1807 192 2023 72 -164 1679 269 -2194
1715 -2194 -728 1383 24 -628 605 263 -1147 -692 1158 544 -1487 -1133 -45 -690 -1054 1733 1421
1732 1421 -1470 -529 1168 -273 -305 1124 1013 -1177 -953 1110 941 207 223 379 -1232 -1606 169 1087
1750 1087 -757 -1024 606 -22 -873 1620 2460 -282 -1045 13 -448 -1464 449 1043 -572 -1050 778
$$ packed form
1632b427J320K254o20j643J181J152j423M67L161j478l353P43J679k325l0K605
1648A263q96k614J234K331q49n66P48k71k225q0K776Q04k385O51J470j944p29
1665a282L150O3k840k04J914j417m30K168K36k222o64J507p3p93R80Q11j908j085
1683b089K701J469j733k92J409k046j753K419J545j891n24J656o75p48J112J329
1699A889j711j723O68O25j067N88J485l70k191J999J831j951k36J843j410k463
1715b194J466K111j359o52J233l42j410M55J850o14k031L54J088o45l64K787l12
1732A421k891R41J697j441l2J429j11k190K24K063j69p34J6J56j611l74J775R18
1750A087j844k67J630o28q51K493Q40k742p63J058m61j016J913N94j615m78J828
$$ plain form
1767 778 1486 395 517 1289 -390 -2313 -633 1183 -509 -812 846 -173 -1607 359 1834 -3
1783 -3 -769 161 -140 -834 753 1999 1267 -742 -628 484 -584 -1275 687 338 -2450 -913 801 358
1801 358 -356 1129 618 -1583 -760 1260 775 -276 207 557 -434 -222 1335 1196 -919 -1383 -200 -1010
1819 -1010 -1302 666 1025 -772 -685 1204 762 300 1031 611 -1282 -1629 77 560 -185 -34 678 -262
1837 -262 -1047 930 2061 -65 -768 418 -404 -992 669 1889 -374 -1487 -136 -228 -1250 230 670
1854 670 -466 -1104 179 1630 786 612 1467 330 -1643 -572 682 -549 -1438 189 -469 -1689 339
1871 339 1397 565 -955 -234 14 -623 -220 1238 1007 -874 -392 1029 537 -105 700 472 -1874 -1632
1889 -1632 407 89 -661 666 857 -807 -295 1389 1106 -461 -864 -272 -866 -990 385 1291 -651
$$ packed form
1767G78P08j091J22P72j679j923J680J816j692l03J658j019j434J966J475j837
1783cp66R30l01o94J587J246p32k009J14J112j068o91J962l49k788J537J714m43
1801C58p14J485n11k201Q23K020m85j051M83L50r91K12J557j39k115m64J183q10
1819a010k92J968L59j797Q7J889m42m62P31m20j893l47J706M83p45J51P12r40
1837b62p85J977J131k126p03J186q22n88J661J220k263j113J351r2j022J480M40
1854F70j136o38J283J451q44j74Q55j137j973J071J254j231q89J627o58j220K028
1871C39J058q32j520P21K48o37M03J458k31j881M82J421m92o42Q05k28k346K42
1889a632K039l18p50J327J91j664N12J684k83j567m03N92n94j24J375R06j942
$$ plain form
1906 -651 -1191 532 74 -440 550 1544 -217 -958 1088 984 -12 377 429 -1269 -1471 -738 239 -805 -531
1925 -531 298 262 -607 958 2373 1028 -788 343 -83 -1325 134 850 -174 -1055 -454 375 -236 245
1943 245 839 -243 -1375 -731 865 672 -74 657 570 -954 -376 1498 170 -1081 -395 -301 -943 -75
1961 -75 1093 687 -205 -273 248 118 119 669 679 -1283 -1322 466 440 -431 225 508 -1264 -1225 743 468 -190
1982 -190 689 911 -67 151 1339 1445 -62 -954 -287 -775 -1244 -308 199 -345 -1412 366 753 61 1017
2001 1017 999 -440 -1101 79 214 -91 177 465 -470 -959 -116 899 192 -704 48 -97 -1009 -182 1434
2020 1434 730 -903 94 140 -810 -478 577 -254 -1184 -480 642 436 219 761 924 -782 -577 726
2038 726 600 -431 102 200 -727 -405 1052 205 -713 -496 -319 -1327 -824 530 692 -388 -347 553 795
$$ packed form
1906f51n40J723m58n14R90R94j761p41K046j04r96L89N2j698k02P33R77j044K74
1925e31Q29l6q69J565J415j345j816J131m26j242J459P16j024q81O01Q29o11M81
1943B45N94j082j132O44J596j93p46P31q7j524N78J874j328j251O86R4o42Q68
1961g5J168m06q92o8N21j30JN50J0j962l9J788k6q71O56K83j772L9J968k75o58
1982a90Q79K22r78K18J188J06j507q92O67m88m69R36N07n44j067J778L87o92R56
2001A017j8j439o61J180J35l05K68K88r35m89Q43J015p07q96P52j45r12Q27J616
2020A434p04j633R97M6r50L32J055q31r30P04J122k06k17N42J63j706K05J303
2038G26j26j031N33R8r27L22J457q47r18K17J77j008N03J354J62j080M1R00K42
$$ plain form
2057 795 315 693 1071 -685 -1467 56 326 -462 369 763 -444 -1131 985 655 -458 131 46 -528 -582
2076 -582 220 1113 13 -654 -175 118 -562 186 1118 -318 -1003 378 755 284 453 942 -196 -930 -588
2095 -588 122 -611 -601 -190 -372 -450 -35 932 453 -361 -100 141 -568 -161 1132 514 -462 422 620 232
2115 232 189 443 7 -1038 -814 -148 224 -250 -6 600 -490 -472 703 654 -626 -213 382 -734 -461
2134 -461 1128 1015 -112 -318 263 -662 -329 273 452 -518 -982 205 429 -164 292 797 -359 -1277 -185
2153 -185 152 -287 -234 778 -452 -377 544 1302 94 188 81 -69 -611 -324 779 274 -492 5 612 3
2173 3 -47 522 -326 -1606 -765 199 -270 335 802 -63 -549 206 965 756 -44 40 37 -649 -208 774 593 -701
2195 -701 -603 -100 -473 -695 584 113 -804 -301 497 437 175 809 555 -563 -702 12 334 -275 -171 269
$$ packed form
2057G95m80L78L78j756p82J523K70p88Q31L94j207o87K116l30j113N89q5n74n4
2076e82Q02Q93j100o67M79K93o80P48R32j436o85J381L77m71J69M89j138p34L42
2095e88P10p33J0M11j82p8M15R67m79q14K61K41p09M07J293o18r76Q84J98l88
2115B32m3K54m36j045K24O66L72m74K44O06j090J8J175m9j280M13N95j116K73
2134d61J589j13j127k06N81r25L33O02J79r70m64J187K24n93M56N05j156r18J092
2153a85L37m39N3J012j230P5R21P58j208R4j07j50n42K87J103n05p66M97O07o09
2173Cn0N69q48j280Q41R64m69O05M67q65m86P55P59k09q00Q4lo86M41R82j81j294
2195g01R8N03l73k22J279m71r17N03P98o0k62O34k54j118j39P14L22o09J04M40
$$ plain form
2215 269 -417 -375 886 1138 -218 -152 295 -587 -638 197 593 -456 -392 -2 -122 -109 195 640 50 -1019
2235 -1019 -109 465 353 146 1170 318 -559 231 737 -223 -470 -394 -759 -898 -316 205 -13 -302 -181 -104
2255 -104 -346 346 968 632 -276 -7 888 141 392 765 112 -1217 -614 236 -466 -596 122 137 -602 -16
2275 -16 528 716 -278 -39 -433 -756 -560 493 586 -787 -206 492 56 -9 975 767 -398 -615 98 -87
2295 -87 79 280 276 -542 -972 61 115 -651 -402 -192 -750 -745 404 1477 37 232 693 -15 -450 770
2315 770 684 -397 -385 -321 11 -116 -118 198 -330 -1021 -629 292 -151 -27 335 482 -373 249 1384 236 13
2336 13 -46 -341 -1048 -334 -30 44 -406 141 329 220 -126 700 347 -823 -1028 225 -124 -613 288 173
2356 173 -619 -253 461 232 200 214 349 1 136 677 875 252 31 183 -406 -794 -90 85 -1032 -980 143
$$ packed form
2215B69o86M2J261K52j356O6M47q82n1Q35L96j049O4L90j20J3L04M45n90j069
2235a019R10N74j12k07J024q52q77P90N06r60k47P6l65j39N82N21k18k89J21P7
2255a04k42O92O22l36r08K69Q95p47K51L73o53j329O03Q50p02j30P18J5p39N86
2275a6N44J88r94K39l94l23J96J053R3j373N81O98m36o5R84k08j165k17P13j85
2295h7J66K01mq18m30J033N4p66K49K10n58NJ149J073j440J95M61p08m35J220
2315G70q6j081J2O4L32j27kL16n28o91L92R21m43J24L62J47q55O22J135j148k23
2336A3n9k95p07P14L04P4m50N47J88j09l46Q26l53j170k05J253l49m89R01j15
2356A73p92L66P14k29l2J4J35l48J35N41J98o23k21J52n89l88P04J75j117N2J123
$$ plain form
2377 143 -20 -260 573 741 -132 -354 388 375 308 485 311 -115 -415 -61 504 -81 -437 -13 -479 -1323 -128
2398 -128 1001 -302 -265 302 51 -117 177 797 -114 -652 -401 -193 -78 184 494 141 -336 -227 893
2417 893 468 -105 325 56 -705 -75 513 -127 -610 -308 -360 -779 -276 278 338 -58 46 543 572 220 842
2438 842 694 -452 -520 193 -12 -446 181 -259 -963 -213 372 191 -96 177 -99 -337 -232 156 792 409
2458 409 -107 333 137 -342 328 636 -431 -721 -77 -72 -208 265 451 -316 -355 -108 76 -283 82 94 -391
2479 -391 -637 -73 416 171 -207 199 341 -635 315 929 127 -298 331 43 -304 206 304 -392 -851 -667
2499 -667 -101 -399 34 82 388 -305 7 1188 559 64 435 363 -759 -377 427 -66 -441 -202 -203 -187 27
2520 27 280 318 -409 -491 -48 317 33 403 538 -116 -181 585 432 -18 371 339 -327 -408 298 531 80 -137
$$ packed form
2377A43j63k40Q33J68q73k22P42j3o7J77j74m26l00L54N65n85l56M24m66q44J195
2398a28J129j303L7N67k51j68K94O20r11n38K51K08J15K62L10l53m77J09J120
2417H93m25n73M30k69p61O30N88o40m83L02n2m19N03N54O0l96J04M97K9l52O22
2438H42j48j146o8P13k05m34O27m40p04P50N85j81k87K73k76k38J05L88O36l83
2458D09n16M40j96m79O70L08j067k90O44Nj36M73J86p67l9K47J84l59L65J2m85
2479c91k46N64M89k45l78M06J42r76R50O14q02m25O29k88l47N10R8o96m59J84
2499f67N66k98M33M8L06o93L12J181o29m95L71p2j122L82Q04m93l75K39jJ6K14
2520B7K53L8p27q2M43L65k84L70J35o54o5P66j53m50L89l2o66q1P06K33m51k17
$$ plain form
2542 -137 -85 -225 -378 -16 747 -299 -710 57 274 -60 467 865 -351 -265 66 99 53 487 561 127 -60
2563 -60 -124 217 -24 -173 -18 -245 -714 -509 268 -100 -537 -141 140 -324 88 556 114 -301 -183 94 -182
2584 -182 218 196 299 -84 -279 235 92 -389 -147 232 -755 -525 579 271 -295 56 216 -359 -266 213
2604 213 277 82 14 439 28 170 251 255 -197 -555 -87 -170 -384 -135 456 -485 -766 474 377 140 256 -98
2626 -98 -369 -229 -225 517 193 172 113 196 22 -103 611 -184 -769 -54 -135 -549 -53 533 -204 -885 52 295
2648 295 -113 348 330 1 -377 -15 334 596 73 58 252 -339 -182 436 -139 -398 -243 -238 -670 -78 432
2669 432 272 -439 -93 50 -81 73 184 296 -288 -196 450 733 -171 382 -107 -417 -617 381 -66 -496
2689 -496 -116 -229 -465 54 280 502 -39 -75 -350 -171 -93 13 416 112 -295 106 446 -163 171 503 -41
$$ packed form
2542a37N2j40j53L62P63j046m11P67K17l34N27L98j216Q6L31L3m6M34P4m34j87
2563f0o4L41k41j49J55k27m69K05P77l68m37L96K81m64M12M68m42m15J18K77k76
2584a82M00k2J03l83j95N14j43m81K42L79r87K30J104l08n66L51J60n75R3M79
2604B13O4j95o8M25m11J42Q1Mm52l58M68q3k14K49N91r41k81J240r7k37J16l54
2626i8k71J40MP42l24k1n9Q3j74j25P14p95n85P15q1m14M96N86p37o81R37K43
2648B95m08M61j8l29l78L62L49K62n23j5J94n91J57O18n75k59J55Nm32N92N10
2669D32j60p11L46J43j31J54J11J12n84R2O46K83r04N53m89l10k00R98m47m30
2689d96L80j13k36N19K26K22n41l6k75J79P8J06M03l04m07M01L40o09L34L32n44
$$ plain form
2710 -41 -506 522 300 -105 -366 -197 -477 -747 -124 -351 -161 -489 -154 -86 -157 244 923 271 -521 -77 597
2731 597 5 249 677 -45 -278 150 176 -31 12 -194 -330 -601 -219 178 62 -197 -187 166 -72 115 647
2752 647 600 -220 -40 349 -152 -43 510 83 -589 -287 -140 255 70 -398 -216 -609 -553 -152 235 -344 275
2773 275 29 -322 -527 587 342 -17 100 404 136 269 409 454 -28 -173 -542 -272 -266 -557 -89 32 -728
2794 -728 -265 557 -124 327 465 -20 -685 329 516 104 143 346 184 -210 62 292 -37 -469 -306 -174
2814 -174 -134 -496 346 491 -611 -98 7 -238 40 317 -68 -288 16 335 191 275 98 163 -193 -236 356
2835 356 160 -187 -264 -146 -76 -255 342 264 -581 -441 -405 -183 97 353 593 66 73 251 315 622 191 291
2857 291 -84 -507 -41 276 -38 -303 -22 -581 -368 330 210 -123 -396 -180 -165 187 166 281 228 -2 -4 430
$$ packed form
2710d1m65J028k22m05k61J69k80k70O23k27J90l28L35O8p1M01O79o52p92M44O74
2731E97n92K44M28p22k33M28K6k07M3k06j36k71L82L97j16k59J0L53k38J87N32
2752F47m7q20J80L89n01J09N53m27o72L02J47L95j85m68J82l93N6M01L87n79O19
2773B75k46l51k05J114k45l59J17L04k68J33J40M5m82j45l69K70Ok91M68J21p60
2794g28M63Q22o81M51J38m85o65J014J87m12L9K03j62l94K72K30l29m32J63J32
2814a74M0l62Q42J45j102N13J05k45K78K77l85k20L04L19j44Q4j77O5l56m3N92
2835C56j96l47p7J18P0j79N97p8q45J40L6K22K80K56K40n27PJ78O4L07m31J00
2857B91l75m23M66L17l14k65K81n59K13O98j20l33k73K16J5L52k1J15n3k30kM34
$$ plain form
2879 430 -189 -124 152 -76 -528 139 349 -37 -207 158 -311 -561 63 149 -42 -234 -135 -187 -76 -147 212 225
2901 225 -214 -387 136 89 -121 524 206 -368 -104 263 51 -5 35 -499 -309 -374 -471 -100 10 95 -69 -246
2923 -246 -254 422 506 64 -83 268 -126 -231 265 151 -198 -231 -102 -281 -261 25 82 -237 -301 -36 391 11
2945 11 -457 221 -86 -576 -240 615 224 -40 262 37 -320 576 652 290 33 -137 -345 -314 105 -63 -310
2966 -310 -463 -287 100 160 -144 130 -50 -640 -150 620 307 56 535 97 -158 365 619 504 -197 -210 -330
2987 -330 -70 -78 -196 481 -278 -608 -29 -230 -127 288 176 -309 13 352 230 326 162 96 -326 -229 155 242
3009 242 -66 -374 45 -247 -308 33 488 193 -514 -110 -246 -347 337 242 -50 -53 332 155 233 137 194 -119
3031 -119 -359 -233 147 184 -218 -179 -153 -235 -181 145 -16 -425 -186 -294 -588 323 215 -43 -175 -239 75 233
$$ packed form
2879D30o19O5K76k28m52O67K10l86j70L65m69k50O24Q6j91j92R9n2J11p1L59J3
2901B25m39j73N23m7k10O45l18n74K64L67k12n6M0n34J90o5r7L71J10Q5j64j77
2923b46qO76Q4m42j47L51l94j05M96j14l49l3J29j79K0K86N7l19o4K65M27l80
2945A1m68O78l07m90L36Q55l91k64L02k25l57Q96P6l62k57j70k08L1M19j68k47
2966c10j53J76L87O0l04K74j80n90M90P70l13k51M79m38k55N23K54j15p01j3j20
2987c30K60qj18O77p59l30N79k01J03M15j12m85L22L39j22R6j64o6m22R7L84Q7
3009B42l08l08M19k92o1L41M55k95p07M04j36j01O84r5k92lL85j77P8r6N7l13
3031a19k40J26L80L7m02L9K6q2N4L26j61m09K39j08k94R11j08k58j32o4L14J58
$$ plain form
3053 233 224 327 214 -251 -22 258 279 -298 134 -80 -536 -298 397 -124 -53 178 -191 -279 93 320 338 176
3075 176 -309 167 -7 32 34 341 -348 -344 148 296 -45 28 -191 -369 -638 58 76 -228 103 144 -25 -314 46
3098 46 182 91 -329 90 -178 -230 303 713 178 -473 148 -135 -222 126 199 -326 -398 -146 -9 88 -19 177
3120 177 -218 -265 -24 396 -63 -197 117 259 142 148 590 88 -435 -76 -289 -346 21 278 68 -418 -54
3141 -54 -88 149 333 -31 334 -448 -94 500 49 -44 121 282 -244 35 457 143 -60 -103 -301 -463 -166
3162 -166 -123 91 -117 -376 -271 -259 -410 73 62 -101 -255 -183 302 60 497 -22 -293 -247 180 374 111 -226
3184 -226 22 -317 -152 231 119 169 -153 -35 -93 -524 -111 600 -159 -242 57 249 -140 412 459 -146 -286
3205 -286 -88 231 64 35 24 4 -500 -54 307 144 -297 -113 -126 -261 83 375 -28 -287 -185 -80 140
$$ packed form
3053B33rJ03j13m65K29K80K1n77M32k14m56K38O95n21P1K31l69q8L72K27J8j62
3075A76m85M76j74L9KL07o89MM92J48l41P3k19j78k69O96J8l04L31M1j69k89L60
3098D6J36r1m20M19k68n2N33M10n35o51O21k83q7L48P3n25p2K52J37R7j07J96
3120A77l95m7K41M20m59j34L14J42j17OM42n02n23L59k13n7L67K57k10m86L64
3141e4l4K37J84l64L65p82L54N94m51r3J65J61n26K79M22l14k03m3j98j62K97
3162a66M3K14k08k59J05J2j51M83j1j63j54P2M85k42M37n19k71M6M27J94k63l37
3184b26K48l39J65L83j12N0l22J18n8m31M13P11p59q3K99J92l89N52M7o05j40
3205b86J98L19j67k9j1k0n04M46L61j63m41J84j3j35L44K92m03k59J02J05K20
$$ plain form
3226 140 339 128 440 83 -35 150 -111 -151 4 91 -174 -128 157 -153 -244 77 -44 -191 66 99 36 -118
3248 -118 49 210 -234 151 384 405 -236 -41 -115 116 -97 40 387 -191 -380 146 145 -93 -149 89 -555 -268
3270 -268 207 446 337 210 -39 -122 -203 308 403 256 -373 -68 166 -116 232 239 -80 -413 -217 59 -270 72
3292 72 190 -129 -62 126 277 213 242 100 195 -280 -166 171 227 -144 -7 -9 -249 -69 260 365 -155 -101 95
3315 95 -101 -4 175 105 -84 -120 111 195 150 -22 88 -241 -276 308 250 -99 71 384 -408 -134 205 20 32
3338 32 -247 -452 -127 128 -128 234 151 -296 368 588 59 119 328 152 -328 265 280 -2 110 29 -182 -342
3360 -342 103 117 147 -281 -551 115 -276 -188 258 183 -124 229 72 190 -11 279 183 -39 191 47 124 394
3382 394 417 -178 -435 -386 -121 164 -225 -39 -44 -267 -458 330 360 -86 74 -176 22 229 744 384 -85 -141
$$ packed form
3226A40J99k11L12l57j18J85k61m0J55Q7k65M6K85l10r1L21j21j47K57L3o3j54
3248a18J67J61m44L85K33K1o41J95p4K31k13J37L47n78j89N26jk38n6K38o44K87
3270b68M75K39j09j27k49q3q1N11R5j47o29L05K34k82L48Pl19l33J96K76l29L42
3292G2J18l19O7J88J51o4K9j42R5m75J14L37N6l71J37kk40J80L29J05n20N4J96
3315I5j96R7J79p0j89l6K31Q4m5j72J10l29l5N84n8l49J70L13p92K74L39j85J2
3338C2k79k05L25K55k56L62q3m47O64K20n29O0K09j76m80N93J5k82J12q1k11j60
3360c42M45J4L0m28k70O66l91Q8M46p5l07L53j57J18k01K90r6k22K30j44P7K70
3382C94K3n95k57M9K65K85l89J86nk23j91P88L0m46J60k50J98K07N15l60m69n6
$$ plain form
3404 -141 71 -51 111 225 6 -130 -502 -324 -129 -59 -88 11 -220 -65 95 262 69 172 36 13 112 302
3426 302 215 121 -135 -355 -243 -36 5 -180 -118 -571 -395 -67 -24 -331 98 137 -382 146 559 -80 221 -110
3448 -110 -147 -44 331 99 80 -181 -3 117 48 111 108 250 -151 -221 -31 -389 -22 160 -350 -395 15 73 23
3471 23 631 302 24 -21 -121 170 462 271 -7 13 -124 -185 10 53 -214 -355 -307 -187 -239 230 307 -33 -246
3494 -246 -213 -104 -86 325 157 55 -436 -213 263 -40 -187 16 -96 -377 237 -264 -259 -312 -132 -223 -195 78
3516 78 178 -46 -208 45 37 99 220 275 127 -385 -338 473 -185 326 114 -92 -485 104 51 90 2 -367 -265
3539 -265 -164 -21 231 230 -74 -124 -59 -19 -16 206 562 -31 82 272 174 -3 132 -300 -250 -216 -151 26 -1 -161
3563 -161 -240 -71 -13 96 221 -45 -236 153 -135 2 511 528 125 57 156 6 -257 163 -17 -201 -222 -81
$$ packed form
3404a41K12j22J62J14k19j36l72J78J95P0k9R9k31J55J60J67j93J03j36k3R9J90
3426C02q7r4k56k20J12K07M1j85O2m53J76L28M3l07M29L9n19N28M13o39L01l31
3448a10l7J03L75k32j9k61J78J20o9O3lJ42m01p0J90l58L67J82n10m5M10N8n0
3471B3O08l29k78m5j00K91K92j91k78K0j37o1J95M3k67j41M8J20n2M69P7l40k13
3494b46L3J09J8M11j68j02m91K23M76l03j47K03j12k81O14n01Nn3J80r1K8K73
3516G8J00k24j62K53qO2J21N5j48n12M7Q11o58N11k12k06l93N89n3L9q8l69J02
3539b65J01J43K52jl04n0O5M0LK22L56n93J13J90r8j77J35m32N0L4O5J77k7j60
3563a61p9J69N8J09J25k66j91L89k88J37N09J7m03o8R9j50k63M20j80j84k1J41
$$ plain form
3585 -81 -12 -20 -102 -104 39 -135 49 198 120 242 249 -153 -91 64 346 -235 -40 -204 -283 -97 175 79 -7 -61 -276
3610 -276 -152 29 -260 219 57 -339 -382 221 82 154 293 -60 -25 142 295 195 -74 153 -142 93 -153
3631 -153 115 -33 -240 -252 -173 84 -297 164 288 -79 -100 -167 178 177 103 113 -56 -20 239 124 256 61 -279
3654 -279 -165 -204 -35 252 2 -55 -71 -130 -162 -44 -78 -369 -219 399 -110 -115 136 50 -319 15 39 118 155 -45
3678 -45 -95 388 -117 -370 40 -83 -450 125 -235 -427 197 145 194 -17 122 -85 112 210 416 19 -149 -256
3700 -256 347 277 -231 27 -147 -400 -120 145 164 -86 -6 -347 -265 84 205 89 76 -304 -51 -242 -314 261
3722 261 64 -186 -168 6 111 -22 87 152 -440 -287 -42 68 -126 99 -12 -304 102 -128 96 141 -193
3743 -193 88 374 79 335 643 143 159 195 -136 -196 -59 125 -412 -337 0 -18 -200 -317 -160 -228 -192 -25
$$ packed form
3585h1O9qq2kJ43j74J84J49p8J22Pm02O2J55K82n81J95j64p9J86K72r6q6n4k15
3610b76J24J81k89M79j62l96m3O03j39P2J39l53L5J67J53j00k69K27k95K35k46
3631a53K68j48k07j2P9K57l81M61J24l67k1o7L45jp4J0j69L6K59j15J32j95l40
3654b79J14l9J69K87k50n7j6n9l2J18l4k91J50O18n09nK51q6l69L34K4P9L7k00
3678d5n0M83n05k53M10j23l67N75l60j92O24n2M9k11J39k07J97R8K06l97j68j07
3700b56O03p0n08K58j74k53K80K65J9k50Q0l41Q2L49J21j16j3l80K53j91p2N75
3722B61j97k50J8J74J05j33J09O5n92J53K45J10j94K25j11k92M06k30K24M5l34
3743a93K81K86k95K56L08n00J6L6l31o0J37J84n37P5L37j8j82j17J57o8L6J67
$$ plain form
3765 -25 162 179 -37 116 46 -200 224 -26 -119 -465 -187 -178 -220 -73 86 -143 -185 -191 -226 148 4 14 13 148 -541
3790 -541 333 424 83 -120 -132 -12 10 386 175 -76 97 127 -193 101 65 -54 204 -366 -351 -349 -255 76 126
3813 126 -276 -275 244 110 -161 169 456 93 167 205 -2 34 -11 99 -433 -301 156 -210 47 -367 -305 -166
3835 -166 -499 129 170 -178 -428 243 22 257 567 338 -242 -97 2 122 144 71 138 168 -212 -168 405 -30
3857 -30 292 -267 -87 -461 -99 309 238 18 178 23 135 7 105 148 -58 226 -75 243 378 139 120 -87
3879 -87 -361 177 -146 -224 -338 -5 -356 -250 -11 -195 149 37 111 -5 269 155 192 -65 -168 -47 106
3900 106 90 19 175 -7 -361 -11 202 -130 -107 -91 -401 -88 14 126 245 248 -291 32 -34 138 124 402 35
3923 35 123 -54 -205 -22 392 -98 -586 -48 46 -293 159 -29 -666 -99 86 -161 132 136 167 160 -314 -153 6
$$ packed form
3765b5J87J7k16J53p0k46M24k50r3l46K78Rm2J47J59k29m2ol5L74j44J0jJ35o89
3790e41Q74R1l41k03j2J20K2L76k11k51J73L0l20K94l6j19K58n70J5KR4L31N0
3813A26m02JN19j34k71L30K87l63P4L8k07L6m5J10n32J32M57l66K57m14O2J39
3835a66l33O28M1l48k50O71k21K35L10k29n80J45R9J20K2p3O7L0l80M4N73m35
3857c0L22n59J80l74L62M08p1k20J60j55J12j28R8M3k06K84l01L18J35k39j9k07
3879h7k74N38l23p8j14L33l51J06K39j84L44j12P4j16K74j14L7k57j03J21J53
3900A06j6p1J56j82l54L50K13l32K3J6l10L13J02J12J19Ln39L23o6J72j4K78l67
3923C5Q8j77j51J83M14m90m88N38R4l39M52j88o37N67J85k47K93ML1pm74J61J59
$$ plain form
3946 6 201 0 266 243 -256 194 335 38 -142 -101 -231 -102 -234 36 -277 -169 -111 -224 107 -50 107 249
3968 249 122 -58 261 111 161 112 81 -20 -161 147 -160 -265 -283 -321 -130 45 111 -95 -85 -248 89 59 -236
3991 -236 -30 100 103 -249 303 303 283 0 216 -89 -262 -13 102 -66 -202 -315 82 -113 -106 156 189 79 -239
4014 -239 199 -33 63 246 188 -40 251 -28 -48 249 176 -113 100 -128 -152 -91 -82 -360 -106 -77 -208 255 10
4037 10 -77 -28 319 -30 60 328 -49 -254 83 158 -68 -94 183 -261 -104 -501 -343 -157 -58 -3 163 -178 -176
4060 -176 -75 -6 54 195 146 -136 -166 40 53 77 -324 -27 47 84 19 348 79 -102 -6 25 86 -89 438 -129
4084 -129 -230 229 -56 37 -44 23 -330 -118 375 380 176 200 -160 12 -63 -96 168 94 -219 -199 59 -91 -257
4107 -257 183 -112 -130 28 -128 40 -8 187 76 -223 -149 101 173 64 -277 -251 -59 -189 181 -191 -8 -18
$$ packed form
3946FJ95k01K66k3m99M50J41k97j80M1j30J29j32K70l13J08N8j13L31j57J57J42
3968B49j27j80L19j50N0m9l1j01j41L08l07j05j8l8J91J75O6k06J0j63L37l0k95
3991b36K06J30Ll52N52%k0k83K16l05j73K49J15j68j36j13L97j95PK62L3j10l18
4014b39M38k32R6J83n8k28K91k79k0K97p3k89K13k28k4O1Rk78K54K9j31M63k45
4037A0q7M9L47l49R0K68l77k05L37P5k26k6K77m44J57l97J58J86R9N5J66l41K
4060a76J01O9O0J41m9k82l0K06J3K4m01K97P4L7o5L29k69j81R6L1O1j75N27n67
4084a29j01M59k85R3q1O7l53K12M93Nk04K4l60J72p5l3K64p4l13K0K58j50j66
4107b57M40k95j8J58j56J68m8J95j11k99P4K50P2j09l41K6J92j30L70l72J83j0
$$ plain form
4129 -18 -56 -188 -159 38 91 -236 -154 -83 217 101 -74 27 -106 -62 137 425 249 -286 216 139 253 394 258
4152 258 -142 -162 -77 -489 -212 -144 -278 20 -148 -353 -63 -83 229 386 161 -33 95 249 30 132 -221
4173 -221 -48 -217 164 105 -18 -86 -113 4 30 159 104 251 -73 -119 191 6 -109 325 153 222 15 227
4195 227 144 -110 29 -196 -214 -62 -241 92 -95 -31 77 -92 -224 -3 -57 -220 -217 -326 -167 -18 442 486
4217 486 -123 121 132 151 74 301 344 -127 -257 -214 -202 50 -288 -189 -234 -115 -239 114 -108 -229 313 157 -35
4240 -35 245 300 204 -128 91 -47 -109 -103 -101 111 -196 -202 -9 140 -35 269 309 -368 -312 75 -330 -169 426 146
4264 146 -62 91 129 -42 -21 -83 -34 93 37 216 386 -21 -64 148 17 132 155 -163 -327 -108 79 -48
4286 -48 -68 254 262 286 207 -170 242 125 -152 40 -85 -139 -141 -132 68 -229 -321 -158 -349 84 -5 6 -496 -69 142
$$ packed form
4129a8l8j32K9J97N3l27Q2P1L00j16j75J01j33M4J99K88j76n35N02p7J14J41j36
4152B58m00k0Q5m12K77O8j34K98j68k05K90k0L12J57k25j94J28J54k19J02l53
4173b21J73j69L81n9j23o8k7J17K6J29n5J47l24m6L10j85j15M34j72O9k07K12
4195B27q3k54J39k25j8J52j79L33j87O4J08j69j32K21n4j63Lj09J59J49M60M4
4217D86o09K44J1J9p7K27M3m71j30M3J2K52l38R9m5J19j24L53k22j21N42j56j92
4240c5K80N5r6l32K19j38o2OKK12l07oJ93J49j75L04M0o77N6L87m05J61N95k80
4264A46k08J53L8j71K1o2M9J27n6J79J70m07m3K12j31J15K3l18j64K19J87j27
4286d8k0L22QK4p9l77M12j17k77J92j25n4kRK00k97r2J63j91M33q9J1n02M27K11
$$ plain form
4311 142 190 201 -187 -195 -21 104 175 -25 18 188 214 -128 216 -43 347 -212 24 -182 -23 142 -137 -107 -57
4334 -57 -143 -163 -239 186 68 -30 -82 -1 352 230 -76 296 186 0 107 195 80 -86 -99 -227 -412 -38 -104
4357 -104 -212 -119 -374 79 32 115 2 356 91 -215 322 104 -31 100 101 -93 -30 197 61 169 52 -21
4379 -21 -200 -197 75 -93 123 -129 -288 -196 201 34 407 165 -97 -117 -52 117 248 529 -331 58 31 9 -143
4402 -143 121 59 -282 -36 -236 0 -78 -149 2 -87 9 123 188 110 7 197 89 294 39 150 -205 10
4424 10 19 99 -236 -175 -95 -398 -200 -10 98 -93 53 113 185 -11 -244 145 162 64 -133 228 -118 35 28 15
4448 15 26 73 -184 -141 86 -80 342 -93 -400 -255 111 6 233 -161 -242 116 75 60 76 42 278 -202 -202 76
4472 76 321 283 -328 -248 -143 114 -24 -209 -200 -122 -52 -148 -60 175 141 36 -34 177 417 239 -138 96 64 29
$$ packed form
4311A42M8J1l88qJ74J25P1k00M3J70K6l42L44k59L90n59K36k06J59J65k79L0N0
4334e7q6k0p6M25j18r8n2Q1L53j22l06L72j10j86J07Q8j15j66j3j28j85L74o6
4357a04j08R3k55M53m7Q3j13L54k65l06N37k18j35J31Jj94O3K27j36J08j17p3
4379b1j79LK72j68K16k52j59R2L97j67L73k42k62k0O5J69J31K81q60L89k7k2j52
4402a43K64o2l41K46k00K36p8p1J51q9R6J14O5p8j03J90j08K05k55J11l55K15
4424A0RQ0l35O1Q0l03J98J90J08j91J46O0P2j96k33L89J7r8j97L61l46J53pj3
4448A5J1M7k57M3K27j66M22m35l07J45L66j05K27l94q1L58m1j5J6l4K36m80%K78
4472G6K45l8o11Q0J05K57j38j85RP8P0r6Q8K35l4j05p0K11K40j78l77K34l2l5
$$ plain form
4496 29 208 -86 201 -342 -64 -360 -363 111 158 -89 -162 123 -87 -240 241 236 4 35 80 164 306 238 103 96
4520 96 6 -235 113 147 14 67 56 -64 -179 40 -97 134 -130 -67 -309 253 67 181 -77 -23 -93 -136 134
4543 134 82 143 -38 -278 -108 -97 168 -124 -109 -191 -329 -183 -177 48 -39 -288 -77 -317 7 -114 110 176 1
4566 1 -136 252 233 24 173 -134 -112 -184 -147 24 -22 93 -272 -224 -211 -5 128 195 -113 -27 39 143 120 -99
4590 -99 -84 -77 70 167 -8 -120 46 178 -10 -134 -60 175 79 -192 -363 -192 -172 240 -30 -68 -78 -133 180 105
4614 105 277 -99 -89 143 -254 -82 121 81 -4 -177 -307 -211 145 -87 173 -242 -249 -61 -93 269 -64 227
4636 227 54 -87 132 -67 269 -432 -27 -93 182 186 130 -97 -230 -505 -239 -225 -65 131 27 -91 6 95
4658 95 -289 36 -46 -41 180 224 -29 -16 -174 -119 55 189 -194 177 141 -117 4 35 145 -212 -114 -101 -45 -23
$$ packed form
4496B9J79k94K87n43K78k96lM74M7k47p3K85k10j53M81nk32L1M5Q4J42o8j35p
4520I6r0k41L48L4j33N3j1j20j15K19j37K31k64O3k42N62j86J14k58N4p0m3K70
4543A34n2O1j81k40J70J1K65k92J5q2j38J46OK25q7k49K11k40L24j21K24O6j75
4566Aj37L88j9k09J49l07K2p2L7J71m6J15l65M8J3K06J33O7l08Q6O6J04k3k19
4590i9J5PJ47R7j75j12J66J32j88j24P4K35r6k71j71J71K0M12k70l8j0n5L13p5
4614A05J72l76J0K32l97J72K03m0q5j73j30R6L56k32K60m15pJ88l2L62l33K91
4636B27j73j41K19j99L36p01M05o6K75Mn6k27j33k75K66J4J60J96j04j18R7Q9
4658I5l84L25q2NK21M4k53J3j58N5J74J34l83L71l6k58J21L1J10l57R8J3N6K2
$$ plain form
4682 -23 -130 -71 101 -127 73 163 -6 154 143 211 166 133 -39 -312 -110 -42 -84 98 -83 -367 74 102 -297
4705 -297 13 45 -220 64 85 69 238 -5 22 75 321 -26 -50 34 -189 -108 13 -176 -134 -161 -43 -189 136
4728 136 -51 -114 114 -85 101 -123 456 238 112 353 -22 59 283 145 141 331 155 12 36 -10 234 96
4750 96 -430 -137 146 -177 168 191 45 -61 5 15 6 15 215 290 -21 -332 175 144 -30 -172 -144 -37 70 87
4774 87 -288 228 -281 18 -147 -46 58 -243 -35 -295 189 109 121 -105 -226 106 153 -43 156 327 17
4795 17 -81 167 -164 86 -14 -23 65 3 -276 45 97 20 60 365 81 -228 -79 8 31 96 -9 -328 -81 -62
4819 -62 80 -32 117 -380 -294 174 -137 22 -304 -56 36 221 -385 -46 397 110 130 -108 -19 195 250 118
4841 118 -28 -52 15 -76 127 236 -109 -97 -66 -20 -174 -115 -242 -25 -101 44 -35 69 4 1 92 -48 -32 -8 153
$$ packed form
4682b3j07N9J72k28K00R0j69J60j1O8m5l3j72k73K02O8m2J82j81k84M41K8l99
4705b97L10L2k65K84K1j6J69k43K7N3K46l47k4Q4k23Q1J21j89M2k7J18j46L25
4728A36j87o3K28j99J86k24N79k18j26K41l75Q1K24j38mJ90j76j43K4m6K44j38
4750I6n26K93K83l23L45K3j46j06O6J0rRK00P5l11l11N07l1j74j42K8J07J07J7
4774H7l75N16n09K99j65J01J04l01K08k60M84q0J2k26j21L32M7j96J99J71l10
4795A7r8K48l31K50j00rQ8o2k79L21N2p7M0L05k84l09J49Q7K3O5j05l19K47J9
4819f2J42j12J49m97Q6M68l11J59l26K48R2J85o06L39M43k87K0k38Q9K14N5j32
4841A18j46k4O7r1K03J09l45J2L1M6j54N9j27K17p6J45p9J04o5lR1j40J6K4J61
$$ plain form
4866 153 -96 -42 -154 -73 344 -116 253 -197 -140 -53 -28 48 -68 -237 -288 -47 -187 110 263 -36 273 269 -21
4889 -21 -82 -43 130 70 -90 27 -36 -260 -49 -5 -70 -141 35 8 -45 90 -369 -100 38 63 298 101 131 -96
4913 -96 -164 380 119 -11 72 -205 -173 -86 -173 58 -97 -186 -443 -127 -19 -91 -79 -32 126 10 -82 159 268 -135
4937 -135 21 -69 13 45 163 62 -28 -84 105 -315 64 -233 -195 67 -187 -33 -10 69 129 -152 8 138 -58
4960 -58 685 -29 33 76 -87 -283 137 -251 -82 30 -72 11 -94 -200 -20 166 -256 -313 187 -127 -133 -207 117
4983 117 75 153 146 47 88 280 -76 -93 175 33 100 10 -309 -14 178 81 132 -267 -20 160 -236 -207 -89 -198
5007 -198 196 8 240 450 -86 -147 19 -208 -10 -42 -172 19 128 -57 -215 15 64 361 191 -195 57
5028 57 -102 162 -305 28 268 2 -189 -220 261 91 75 -88 -339 248 -222 -58 -60 -79 -198 -191 126 87 113
$$ packed form
4866A53k49N4j12Q1M17m60L69m50N7Q7K5P6j16j69n1K41j40K97J53k99L09mk90
4889b1o1L9J73o0j60J17o3k24K11M4o5p1J76k7n3J35m59K69J38K5K35j97L0k27
4913i6o8N44k61j30Q3k77L2Q7q7K31j55q9k57L16J08p2J2M7J58j16r2K41J09m03
4937a35J56r0Q2L2J18j01r0n6J89m20L79k97L8K62k54J54K3P9O0k81J60J30j96
4960e8P43p14O2M3j63j96M20l88J69J12j02Q3j05j06J80J86m22n7N00l14op4L24
4983A17m2P8pr9M1J92l56j7K68j42O7r0l19K95J92r7N1l99K47J80l96K9J18j09
5007a98L94j88K32K10n36o1J66k27J98l2j30J91J09j85j58K30M9K97j70l86K52
5028E7j59K64m67L33K40k66j91l1M81j70j6j63k51N87m70J64kj9j19PL17l9K6
$$ plain form
5051 113 -53 -157 -18 -199 198 91 56 -75 177 19 -168 151 37 -10 61 -266 -174 124 -51 -491 -211
5072 -211 5 191 2 -56 210 -160 183 75 -278 -12 111 136 -37 91 -179 292 -117 52 136 -122 -66
5093 -66 -258 -100 233 -359 -137 45 -138 -19 141 -164 24 -166 139 74 -157 157 263 194 -28 289 76
5114 76 139 126 -34 -156 13 37 67 -130 -228 -119 106 -106 -10 -146 24 -70 127 -80 -5 228 325 14 -288
5137 -288 -46 54 -22 142 41 154 34 -125 207 267 153 -366 109 197 -282 361 446 -141 52 61 104 -73
5159 -73 27 193 198 111 16 88 82 12 -125 -25 -318 -136 -64 -91 -210 119 -123 145 -166 20 -105 -257 -96 -81
5183 -81 235 -30 -185 162 37 -187 338 -29 2 314 -3 -241 -17 -35 123 -215 -137 -108 -9 -85 123 88 -33
5206 -33 58 -93 53 -35 91 317 372 -174 -39 -63 -116 225 85 -107 111 55 366 53 60 199 -124 53 8
$$ packed form
5051A13j66j04J39j81L97j07l5j31K52j58j87L19j14m7P1l27R2K98j75m40K80
5072b11K16J86j89n8K66l70L43j08l53K66J23K5j73J28k70M71m09J69Q4k58N6
5093f6j92J58L33n92K22J82j83J19J60l05J88j90L05o5k31L14J06o9k22L17k13
5114G6O3j3j60j22J69K4L0j97r8J09K25k12R6j36J70r4J97k07P5K33R7l11l02
5137b88K42J00p6J64j01J13j20j59L32O0j14n19M75Q8m79O43Q5n87J93RM3j77
5159g3J00J66Nq7r5P2op0j37J00k93J82P2k7j19L29k42K68l11J86j25j52J61J5
5183h1L16k65j55L47j25k24N25l67L1L12l17k38K24j8J58l38P8K9R9p6K08l5j21
5206c3R1j51J46q8J26K26N5n46J35k4n3L41j40j92K18n6L11l13PJ39l23J77m5
$$ plain form
5229 8 278 71 104 19 129 -28 1 121 118 -264 128 -297 -235 -99 80 -254 142 -197 139 -19 132 -41 -55
5252 -55 -194 -155 164 -163 -125 -115 13 -274 -73 172 10 2 -198 -265 93 -19 58 -154 177 38 -136 104 -58
5275 -58 -17 175 -12 191 23 95 81 -134 191 -168 -103 -9 226 80 181 -116 -285 22 249 121 33 175
5297 175 -310 -165 -159 -75 -28 -55 37 -32 -265 95 205 -1 -170 87 350 -22 -15 19 88 -86 -205 127 -110 163
5321 163 156 -129 -172 -214 -22 240 157 -123 -143 -176 -238 113 -124 -72 118 -87 -83 288 -52 -103 -74 -114 7 56 9
5346 9 113 -261 31 -88 -151 -169 78 295 207 -53 -186 193 15 30 47 24 74 -24 116 -178 60 230 7
5369 7 195 -63 -177 202 90 75 35 70 -24 -346 40 -1 104 50 -53 -29 -56 -128 -177 -210 -40 82 46 125 121 136
5395 136 -121 -89 -164 -142 172 -31 -155 -65 65 116 -201 68 67 47 214 -259 125 10 128 -251 134 125 176 136
$$ packed form
5229HK70k07L3q5J10j57K9J20ll82L92m25O2J36J79l34L96l39L36j58J51j73j4
5252e5j39L9L19l27L8J0J28k87K01K45j62qk00o7L58j12P7k12L31j39j74K40j62
5275e8M1J92j87K03j68P2j4k15L25l59O5R4K35j46J01k97j69L07K27j28q8J42
5297A75m85J45OQ4M7k7R2o9k33L60J10k06j69K57K63l72PL4O9j74j19L32k37K73
5321A63pk85m3m2J92K62q3k80k0l3o2L51k37N2J90k05ML71l40n1K9m0J21M9m7
5346IJ04l74K92j19o3j8K47K17q8k60j33L79j78J5J7k3N0r8J40k94K38J70k23
5369GJ88k58j14L79j12j5m0L5r4l22L86m1J05n4j03K4k7p2m9l3J70J22l6P9mJ5
5395A36k57L2p5K2L14k03j24R0J30N1l17K69jk0J67m73L84j15J18l79L85rN1m0
$$ plain form
5419 136 244 -195 -45 -18 -166 -45 -90 -116 196 -103 -133 -117 105 114 -119 217 -33 62 -129 -87 -22 -113 117 300
5443 300 -115 -51 -20 -87 65 -1 5 -222 104 -13 -25 -20 25 -29 -139 -63 50 174 -93 32 135 -159 70 45
5467 45 163 -6 -20 -182 -170 -154 18 -162 -84 -48 -1 210 21 147 141 -148 82 29 417 96 -5 1 -28 59 -78
5492 -78 -149 -160 169 77 19 40 -85 -36 207 -164 143 -128 -81 -118 344 -47 54 -48 51 125 -173 212 -10 -115
5516 -115 56 142 40 13 101 38 255 -22 138 17 111 -37 97 203 -82 -149 48 -52 119 61 -74 -155 -116
5539 -116 -80 212 -233 -229 -80 153 -143 8 4 -95 -216 134 -138 46 -13 77 37 215 421 -115 525 236 -135
5562 -135 65 -175 -75 427 7 -149 267 164 -4 -61 -85 271 191 -16 151 464 -239 229 156 149 -64 -46
$$ packed form
5419A36J08m39J50K7j48J21m5k6L12k99l0J6K22Rk33L36k50R5j91M2O5r1K30J83
5443C00m15O4L1o7J52o6Ok27L26j17j2NM5n4j10P6J13J24k67J25J03k94K29k5
5467D5J18j69j4j62J2J6J72j80P8L6M7K11j89J26ok89K30n3L88l21j01Ok9Q7j37
5492g8p1j1L29r2n8K1j25M9K43l71L07k71M7l7M62l91J01j02R9P4k98L85k22j05
5516a15J71Q6j02k7Q8o3K17k77J60j21R4j48J34J06k85o7J97j00J71n8j35q1L9
5539a16L6K92m45MJ49K33k96J51mr9j21L50k72J84n9R0m0J78K06n36O40k89l71
5562a35K00k40J00N02m20j56M16j03j68n7k4L56q0k07J67L13p03M68p3pk13J8
$$ [...]
8191A56
##END NTUPLES=NMR FID
##END=
