##TITLE=1H_CA-8542-1-2
 DMSO, 8 sc, 
 6.2.2019
##JCAMPDX= 6.0         $$ Bruker NMR JCAMP-DX V2.0
##DATA TYPE= NMR FID
##DATA CLASS= NTUPLES
##ORIGIN= UXNMR, Bruker Analytische Messtechnik GmbH
##OWNER= root
$$ XWIN-NMR		Version 3.5
$$ Wed Feb  6 14:03:49 2019 Russian Standard Time (UT+4h)  she@DPX200
##.OBSERVE FREQUENCY= 200.1313
##.OBSERVE NUCLEUS= ^1H
##.DELAY= (6, 6)
##.ACQUISITION MODE= SIMULTANEOUS
##.ACQUISITION SCHEME= undefined
##.AVERAGES= 8
##.DIGITISER RES= 18
##SPECTROMETER/DATA SYSTEM= spect
##.PULSE SEQUENCE= zg30
##.SOLVENT NAME= DMSO
##.SHIFT REFERENCE= (INTERNAL, DMSO, 0, 15.7039)
##AUDIT TRAIL= $$ (NUMBER, WHEN, WHO, WHERE, WHAT)
$$ ##TITLE= Audit trail, XWIN-NMR		Version 3.5
$$ ##JCAMPDX= 5.01
$$ ##ORIGIN= Bruker BioSpin GmbH
$$ ##OWNER= she
$$ F:/spectra/data/she/nmr/H-F/1/audita.txt
$$ ##AUDIT TRAIL=  $$ (NUMBER, WHEN, WHO, WHERE, WHAT)
(   1,<2019-02-06 14:02:57.53 +0400>,<she>,<DPX200>,
      <created by zg, POWCHK disabled, PULCHK disabled
       configuration hash MD5:
       00 E9 B6 7A A2 85 ED C7 34 08 36 98 17 FE 4E 26
       data hash MD5: 16K
       F7 A5 3B 16 F0 9A E0 25 84 D9 AC CB CC 4E 03 AF>)
$$ ##END=
$$ 
$$ hash MD5
$$ D9 04 A9 C2 24 2F C3 1D 7B FC 62 51 06 40 C6 F0
##$RELAX= 
##$RELAX= 
##$RELAX= 
##$RELAX= 
##$RELAX= 
##$RELAX= 
$$ Bruker specific parameters
$$ --------------------------
##$DU= <F:/spectra>
##$EXPNO= 1
##$NAME= <H-F>
##$PROCNO= 1
##$TYPE= <nmr>
##$USER= <she>
##$AMP= (0..31)
100 100 100 100 100 100 100 100 100 100 100 100 100 100 100 100 100 100 
100 100 100 100 100 100 100 100 100 100 100 100 100 100 
##$AQSEQ= 0
##$AQ_mod= 1
##$AUNM= <au_zg>
##$AUTOPOS= <>
##$BF1= 200.13
##$BF2= 200.13
##$BF3= 200.13
##$BF4= 200.13
##$BF5= 200.13
##$BF6= 200.13
##$BF7= 200.13
##$BF8= 200.13
##$BYTORDA= 1
##$CFDGTYP= 0
##$CFRGTYP= 5
##$CHEMSTR= <none>
##$CNST= (0..31)
1 1 145 1 1 1 1 1 1 1 1 1 1 1 1 1 1 1 1 1 1 1 1 1 1 1 1 1 1 1 1 1 
##$CPDPRG= <>
##$CPDPRG1= <>
##$CPDPRG2= <>
##$CPDPRG3= <>
##$CPDPRG4= <mlev>
##$CPDPRG5= <mlev>
##$CPDPRG6= <mlev>
##$CPDPRG7= <mlev>
##$CPDPRG8= <mlev>
##$CPDPRGB= <>
##$CPDPRGT= <>
##$D= (0..31)
0 1.2 0 0 0 0 0 0 0 0 0 0.03 0 0 0 0 0 0 0 0 0 0 0 0 0 0 0 0 0 0 0 0 
##$DATE= 1549447377
##$DBL= (0..7)
120 120 120 120 120 120 120 120 
##$DBP= (0..7)
150 150 150 150 150 150 150 150 
##$DBP07= 0
##$DBPNAM0= <>
##$DBPNAM1= <>
##$DBPNAM2= <>
##$DBPNAM3= <>
##$DBPNAM4= <>
##$DBPNAM5= <>
##$DBPNAM6= <>
##$DBPNAM7= <>
##$DBPOAL= (0..7)
0.5 0.5 0.5 0.5 0.5 0.5 0.5 0.5 
##$DBPOFFS= (0..7)
0 0 0 0 0 0 0 0 
##$DE= 6
##$DECBNUC= <off>
##$DECIM= 32
##$DECNUC= <off>
##$DECSTAT= 4
##$DIGMOD= 1
##$DIGTYP= 9
##$DL= (0..7)
0 120 120 120 120 120 120 120 
##$DP= (0..7)
150 150 150 150 150 150 150 150 
##$DP07= 0
##$DPNAME0= <>
##$DPNAME1= <>
##$DPNAME2= <>
##$DPNAME3= <>
##$DPNAME4= <>
##$DPNAME5= <>
##$DPNAME6= <>
##$DPNAME7= <>
##$DPOAL= (0..7)
0.5 0.5 0.5 0.5 0.5 0.5 0.5 0.5 
##$DPOFFS= (0..7)
0 0 0 0 0 0 0 0 
##$DQDMODE= 0
##$DR= 18
##$DS= 0
##$DSLIST= <SSSSSSSSSSSSSSS>
##$DSPFIRM= 0
$$ [...]
##$SUBNAM2= <"">
##$SUBNAM3= <"">
##$SUBNAM4= <"">
##$SUBNAM5= <"">
##$SUBNAM6= <"">
##$SUBNAM7= <"">
##$SUBNAM8= <"">
##$SUBNAM9= <"">
##$SW= 20.0189088683792
##$SWIBOX= (0..15)
0 0 2 0 0 0 0 0 0 0 0 0 0 0 0 0 
##$SW_h= 4006.41025641026
##$TD= 16384
##$TD0= 1
##$TE= 0
##$TE2= 300
##$TE3= 300
##$TEG= 300
##$TL= (0..7)
0 120 120 120 120 120 120 120 
##$TP= (0..7)
150 150 150 150 150 150 150 150 
##$TP07= 0
##$TPNAME0= <>
##$TPNAME1= <>
##$TPNAME2= <>
##$TPNAME3= <>
##$TPNAME4= <>
##$TPNAME5= <>
##$TPNAME6= <>
##$TPNAME7= <>
##$TPOAL= (0..7)
0.5 0.5 0.5 0.5 0.5 0.5 0.5 0.5 
##$TPOFFS= (0..7)
0 0 0 0 0 0 0 0 
##$TUNHIN= 0
##$TUNHOUT= 0
##$TUNXOUT= 0
##$USERA1= <user>
##$USERA2= <user>
##$USERA3= <user>
##$USERA4= <user>
##$USERA5= <user>
##$V9= 5
##$VALIST= <valist>
##$VCLIST= <CCCCCCCCCCCCCCC>
##$VD= 0
##$VDLIST= <DDDDDDDDDDDDDDD>
##$VPLIST= <PPPPPPPPPPPPPPP>
##$VTLIST= <TTTTTTTTTTTTTTT>
##$WBST= 1024
##$WBSW= 4
##$XGAIN= (0..3)
0 0 0 0 
##$XL= 0
##$YL= 0
##$YMAX_a= 197609
##$YMIN_a= -311152
##$ZGOPTNS= <>
##$ZL1= 120
##$ZL2= 120
##$ZL3= 120
##$ZL4= 120
##$ABSF1= 10
##$ABSF2= 0
##$ABSG= 5
##$ABSL= 3
##$ALPHA= 0
##$AQORDER= 0
##$ASSFAC= 0
##$ASSFACI= 0
##$ASSFACX= 0
##$ASSWID= 0
##$AUNMP= <proc_1d>
##$AZFE= 0.1
##$AZFW= 0.1
##$BCFW= 1
##$BC_mod= 2
##$BYTORDP= 1
##$COROFFS= 0
##$CY= 11.3945322036743
##$DATMOD= 1
##$DC= 2
##$DFILT= <>
##$DTYPP= 0
##$F1P= 18.9103706918063
##$F2P= -1.10871071338519
##$FCOR= 0.5
##$FTSIZE= 0
##$FT_mod= 4
##$GAMMA= 1
##$GB= 0.15
##$INTBC= 1
##$INTSCL= 1
##$ISEN= 128
##$LB= 0.24
##$LEV0= 0
##$LPBIN= 0
##$MAXI= 10000
##$MC2= 0
##$MEAN= 0
##$ME_mod= 0
##$MI= 1.114404
##$NCOEF= 0
##$NC_proc= 0
##$NLEV= 6
##$NOISF1= 3.799351
##$NOISF2= 2.8
##$NSP= 1
##$NTH_PI= 0
##$NZP= 0
##$OFFSET= 15.70392
##$PC= 1
##$PHC0= -9038.965
##$PHC1= 8.200041
##$PH_mod= 1
##$PKNL= yes
##$PPARMOD= 0
##$PSCAL= 0
##$PSIGN= 0
##$REVERSE= no
##$SF= 200.130013532006
##$SI= 16384
##$SIGF1= 3
##$SIGF2= 2
##$SINO= 400
##$SIOLD= 16384
##$SREGLST= <1H.CDCl3>
##$SSB= 0
##$STSI= 0
##$STSR= 0
##$SW_p= 3612.71676300578
##$SYMM= 0
##$S_DEV= 0
##$TDeff= 0
##$TDoff= 0
##$TI= <>
##$TILT= no
##$TM1= 0
##$TM2= 0
##$TOPLEV= 0
##$USERP1= <user>
##$USERP2= <user>
##$USERP3= <user>
##$USERP4= <user>
##$USERP5= <user>
##$WDW= 1
##$XDIM= 8192
##$YMAX_p= 0
##$YMIN_p= 0
$$ End of Bruker specific parameters
$$ ---------------------------------
##NTUPLES= NMR FID
##VAR_NAME=  TIME,          FID/REAL,        FID/IMAG
##SYMBOL=    X,             R,               I
##VAR_TYPE=  INDEPENDENT,   DEPENDENT,       DEPENDENT
##VAR_FORM=  AFFN,          ASDF,            ASDF
##VAR_DIM=   8192,          8192,            8192
##UNITS=     SECONDS,       ARBITRARY UNITS, ARBITRARY UNITS
##FACTOR=    0.0002496,     1,               1
##FIRST=     0,             0,               0
##LAST=      2.0444736,     0,               0
##MIN=       0,             -311152,         0
##MAX=       2.0444736,     197609,          0
$$ Real data points
##PAGE= N=1
##DATA TABLE= (X++(R..R)), XYDATA
0 0 0 0 0 0 0 0 0 0 0 0 -8 8 -8 8 -8 16 -16 24 -24 32 -40 48 -56 64 -72 88 -102 118 -134 153 -176 200 -230
33 -230 260 -294 330 -370 415 -466 516 -577 640 -712 784 -870 960 -1060 1169 -1289 1419
50 1419 -1563 1722 -1898 2096 -2315 2562 -2847 3169 -3545 3991 -4522 5176 -6000 7074 -8546
65 -8546 10688 -14111 20491 -36492 168885 197609 -86253 -4146 114510 124368 -29347 -99925
77 -99925 -109957 -106508 -138936 -105953 -46707 372 7917 23919 -1353 -64494 -90462 8830 119675
90 119675 96698 -32116 -58699 57355 147954 82809 -24582 -37418 21147 34799 -7051
101 -7051 -45532 -51419 -43326 -11547 34872 44407 -6838 -48146 -26817 206 -30004 -58686 -3177
114 -3177 76209 51161 -54033 -81458 16396 103008 72682 -14141 -60339 -63867 -56359 -22537
126 -22537 41968 76368 42686 1330 17311 54882 51894 29563 31285 22450 -47125 -125866 -112249
139 -112249 -22736 20505 -25714 -64904 -30915 18099 18660 3755 22789 48613 34802 7573
151 7573 18408 48145 45733 19227 13271 24336 14872 -12151 -23591 -23668 -43277 -68108 -48464
164 -48464 6475 23830 -19330 -57267 -36241 10622 27925 19804 17467 19924 8098 -3312 16055
177 16055 53296 68662 47255 7882 -29399 -49696 -36993 -178 17605 -13894 -60417 -60200
189 -60200 -11116 27928 26645 13684 14625 13293 -4931 -18237 -4867 16686 16070 -1558 -12475
202 -12475 -12278 -7902 3586 19852 19354 -3202 -16547 3463 29288 17894 -18053 -24577 7163
215 7163 27220 7551 -20796 -22891 -9210 -6707 -9429 -168 11290 3433 -16627 -23067 -10111
228 -10111 5823 17184 23622 15622 -7515 -23214 -4647 35146 49079 21921 -12076 -19594 -7399
241 -7399 -528 -1103 -136 -1480 -15775 -34049 -34081 -14163 5929 11625 6176 -2609 -6577 213 17032
256 17032 28645 22981 7977 1104 5629 7755 776 -5221 -4592 -3238 -6275 -9227 -7233 -5738 -9561
271 -9561 -12658 -6935 2445 5596 1344 -4598 -8842 -6889 3474 19112 24788 12292 -5367 -8648
285 -8648 2521 11605 10258 5177 -618 -11248 -22306 -18810 1075 17634 12981 -5679 -16721
298 -16721 -12701 -1835 7760 11397 7138 -3801 -11070 -6433 5311 10944 7459 3351 1025 -3387
312 -3387 -9511 -8037 2913 10846 5331 -4391 -3443 6402 10567 3170 -5867 -5883 -712 1253 -2783 -8293
328 -8293 -10288 -7472 101 6533 6130 482 -4179 -4476 -2434 620 5954 11617 11244 2884 -6644 -6039
344 -6039 4741 14354 12026 -1242 -14595 -17406 -8556 1896 5371 160 -5961 -7629 -6366 -4328
358 -4328 -356 6569 10147 4745 -4424 -6344 2585 12672 13112 5889 -388 -1902 -821 -321 -869 -3241
374 -3241 -5815 -6426 -4300 -2882 -4341 -5350 -1708 3535 4618 2351 1614 3264 2093 -2162 -3634 1065
390 1065 7377 5969 -1503 -7477 -5087 2396 7801 6968 1364 -4312 -7472 -5102 -8 4111 4023 882
406 882 -3787 -7025 -5769 -531 5645 7523 2105 -5805 -7817 -2158 4551 6283 2955 -1325 -3023
421 -3023 -1816 -216 1516 2578 3851 2657 135 -1549 -980 2381 2523 103 -2836 -3435 -1897 -1681
437 -1681 -3492 -4960 -3908 -487 2696 3426 1570 -340 17 3309 6402 5709 2446 -1322 -3733 -3915
453 -3915 -2833 12 3759 4525 495 -4533 -4980 27 4967 3507 -1901 -7124 -7793 -4537 -594 2708
469 2708 4602 4019 1182 -306 297 2458 4253 3477 1173 -2025 -3784 -2267 1128 2752 1234 -1828
485 -1828 -3221 -1722 -904 -1161 -1991 -909 1812 2580 1841 767 100 105 -364 -1023 -1180 -583 -162 -1067 -1575
504 -1575 -229 3403 5453 5236 1283 -2772 -4119 -2434 115 1149 -3 -2226 -2947 -1320 1246 3549
520 3549 4221 2748 -709 -3760 -4973 -3529 -64 1869 384 -1769 -1671 802 3549 4853 3732 2040
536 2040 95 -1013 -1107 -665 185 283 -548 -1125 -1752 -1556 -1762 -1579 -1497 -1667 -1280 12 1273 1535 1432 756
556 756 2528 3352 2713 134 -1922 -2672 -1532 39 1120 1840 1485 -385 -1557 -1178 142 780 -444
573 -444 -2602 -4268 -3662 -1172 2264 3859 3773 2057 62 -432 552 675 477 -869 -1943 -2631 -2079 -617
591 -617 925 2547 1799 472 -647 -532 476 540 250 -448 -197 4 -102 -741 -888 -951 -688 -793 -971
610 -971 -614 -551 -152 345 1319 2582 2489 1830 424 -638 -1034 -634 571 826 -131 -1558 -1909 -1113 452
629 452 1459 455 -633 -1780 -2685 -1738 -92 1145 1428 1089 472 472 1365 2271 2457 1470 -284 -1534
647 -1534 -1833 -1419 -914 -673 -630 -697 -596 -433 256 442 404 485 144 306 519 338 585 347 113 399 719
668 719 5 -487 -1102 -813 -630 497 1089 735 199 -375 -371 91 731 723 260 -964 -1213 -879 293 1181 1246
689 1246 494 -379 -951 -519 -148 896 434 98 -517 -620 -21 606 1183 1169 521 -540 -704 -417 202 108
709 108 -147 -762 -929 -598 -318 -121 -234 106 345 393 560 776 467 223 95 222 657 257 -366 -454 -645
730 -645 -342 -28 249 210 -52 -897 -985 -274 383 757 289 -126 -481 -387 468 1055 957 545 -277 -685 -531 -46
752 -46 727 652 7 -401 -872 -537 -249 306 279 29 -191 -71 -23 689 459 415 185 -32 -77 -70 -172 -83 107
775 107 -12 6 146 151 95 -152 -226 241 252 350 -82 -26 -537 -372 -127 412 444 72 -464 -215 -127 318 646 246
799 246 -161 -465 -860 -119 404 529 572 -229 -392 -483 -215 113 174 62 -236 -730 -588 -287 393 224 -36
820 -36 -258 -62 -107 -158 158 279 427 189 256 346 291 151 100 -239 -169 -240 -117 -301 -376 -193 -46 149 362 58
844 58 -312 -545 -212 123 335 362 241 212 -263 75 350 313 84 -256 -287 -614 -69 363 286 64 -187 -446
866 -446 -416 201 223 415 157 -79 -537 -269 19 181 369 -58 216 -32 249 152 -117 162 106 -445 -278 -312
888 -312 -139 21 -146 -42 131 187 402 -40 -371 -371 -196 -26 91 -22 -273 -185 -177 109 270 268 -39 -364 -484
911 -484 -383 299 468 420 -243 -54 -151 -152 160 286 -22 10 -251 -315 -87 146 45 109 -174 -153 -414 -225 302
934 302 90 -59 181 70 -42 101 145 73 -29 -20 121 -118 -234 -273 -365 -14 109 305 -38 -40 -151 171 309
957 309 223 408 502 -179 -485 -388 -127 183 295 49 -47 142 -194 446 180 357 38 -152 -200 -234 -59 231
979 231 201 166 -110 -415 -66 136 -53 -198 -61 116 -90 -154 -55 -173 240 -66 -35 24 -143 161 89 27 156
1002 156 -9 -2 189 -19 -128 -120 -222 -32 -176 -144 -410 -191 123 253 182 71 -29 -226 -103 -97 -187 -55 22
1025 22 -419 -193 -216 51 166 269 211 -19 -334 -231 -59 196 243 -244 37 -265 -54 273 24 123 -34 -49
1047 -49 -152 -271 -143 -173 132 -227 -278 29 181 -42 -152 -43 -117 -191 13 279 290 -53 316 91 2 270
1069 270 63 -201 -69 -37 -203 7 222 -214 -241 -98 411 443 32 68 -209 -286 61 -97 166 164 140 131 -112
1092 -112 57 152 158 194 -32 -105 -177 -302 37 144 144 344 -124 181 81 79 -1 -354 13 18 155 276 282 -111 -87
1117 -87 236 -34 -130 378 -236 -181 -168 184 51 63 -41 -93 -112 102 80 103 32 26 -157 -242 21 232 75 53 100
1142 100 -171 7 -166 208 -119 -7 -32 -289 102 117 190 -198 175 -281 -161 -232 -8 -153 -447 -107 -88 48
1164 48 141 204 283 40 130 -85 -26 -65 30 -168 37 203 8 97 -132 -18 -339 -169 -207 348 -178 -45 41 128
1188 128 168 357 376 94 107 -219 -142 26 198 84 29 -63 45 -389 331 98 220 75 -118 -437 -450 -39
1210 -39 81 50 -45 -108 -107 141 19 141 -58 -197 49 -197 23 -226 157 -112 -101 -67 240 -11 -183 28 167
1233 167 -77 -143 -34 -156 -101 -237 18 76 53 124 166 -105 53 -167 -73 400 -106 101 84 100 -7 -13 178 -143
1257 -143 -16 -74 -192 129 145 270 87 -121 -236 -55 120 156 -161 113 154 -62 153 219 -69 162 147 59
1279 59 106 18 -137 -227 -7 -41 -17 154 -242 41 -26 -315 11 110 268 -33 40 -423 -142 -122 -1 49 60 -3
1303 -3 -86 -25 -106 107 262 87 -47 -325 -64 -32 -169 55 -40 137 -132 -106 72 137 191 -276 22 39 28 181
1327 181 334 323 129 43 -16 176 -70 -77 -56 233 63 -214 6 103 41 -53 123 -37 -301 -181 -68 158 -211
1350 -211 -47 67 -4 -62 124 -105 240 47 -39 -6 31 -91 -164 -8 84 -101 182 -63 -22 -376 -71 31 144
1373 144 -36 -235 -148 39 105 26 57 330 -116 -16 -11 36 209 -27 82 -26 -100 -68 92 -40 -127 -195 0 79
1397 79 26 -89 -265 -188 -166 112 104 -23 -12 -45 -34 -214 164 -68 70 -172 -68 -203 305 266 -190 73 -481
1420 -481 -5 -43 107 195 290 101 -100 -45 -14 126 -215 -174 -69 -107 -79 45 25 143 -221 -9 0 157 -186 9
1444 9 368 -105 15 -106 -46 98 138 -27 -79 1 78 17 179 -13 -201 12 132 -43 -32 -271 61 32 161
1467 161 -184 156 54 -13 11 -117 200 72 103 -104 74 13 20 291 -113 -166 -119 70 -207 -11 -128 -23 137
1490 137 -97 75 -28 109 -145 156 69 -284 47 104 46 -147 240 123 -48 -102 283 -164 -6 153 36
1511 36 -121 -60 -1 -19 -126 -72 -9 -200 -231 155 127 98 86 -26 -51 42 191 157 -72 -252 90 67 -6 68 -163
1536 -163 34 40 76 -36 -183 1 -5 11 153 4 -97 32 -37 109 65 141 -30 157 -43 135 -55 19 42 -113
1560 -113 64 177 76 -274 67 53 -148 -166 -166 3 13 -91 172 -146 46 -67 -141 -56 16 -137 96 179 129
1583 129 92 -35 -79 37 -8 -175 160 -98 -107 -158 -1 -139 -254 17 83 -149 -4 -9 86 38 14 -33 -27 -121 150
1608 150 -67 22 111 69 -157 129 -80 -20 -52 46 100 72 188 -210 176 18 -27 -134 -64 -6 71 -10 -120 238
1632 238 -290 -132 -120 -160 -96 41 16 -221 183 -46 60 25 -63 -19 78 -210 51 16 -31 274 -237 140 61 23
1656 23 26 -21 -13 -134 -144 -81 156 -101 151 87 -121 57 93 11 18 -73 -373 -150 76 -159 -66 -70 126 28 -103 48
1682 48 102 -24 -83 44 221 155 338 97 199 17 28 -221 -219 193 -59 13 -35 203 -98 95 175 68 -72
1705 -72 35 95 4 -135 99 -10 -117 -172 -142 -358 0 -120 81 105 -25 164 124 5 -39 490 -66 32 251
1728 251 82 -327 81 80 -13 13 131 -71 -8 -80 -83 -173 2 4 -204 -218 105 -92 164 86 -27 185 87 -161 -18
1753 -18 124 -93 -236 -50 49 62 -15 184 -84 144 -195 130 -138 -235 -31 -70 -26 19 164 -73 82 24 165
1776 165 199 59 -121 199 -13 -34 -35 45 58 21 105 -251 -78 -6 -140 71 29 105 110 123 127 -159 11 68 -307 113
1802 113 132 117 9 108 -89 87 -290 126 89 133 -6 -2 -99 374 -243 -97 -14 -104 -200 -44 188 -39 21 25 -68
1827 -68 113 -158 -134 77 44 -235 133 -34 -165 -110 -228 -49 65 -42 236 181 126 -124 -90 29 -25 112 30
1850 30 142 100 305 35 -55 268 -245 -194 51 135 54 -75 -6 312 0 61 75 168 -101 79 57 -136 -66 -12
1874 -12 86 -3 182 -99 -93 -159 97 -151 -231 361 23 -84 -131 141 -173 -347 -163 -142 51 -39 -3 -12 333 213
1898 213 -261 -73 134 -105 -22 156 31 -145 130 -63 41 -11 44 72 -66 30 103 273 107 -181 155 -67
1920 -67 -164 -344 -128 7 -215 -72 -197 -16 140 255 -32 -57 -57 -212 85 -57 -382 -46 227 -226 220 -62
1942 -62 98 113 -126 -148 214 212 -42 163 -74 18 93 -80 -43 -219 -94 36 -74 -149 112 342 109 188 -133
1965 -133 22 28 -17 211 -5 112 23 -15 172 79 50 97 57 42 -207 126 -170 -48 74 32 232 -73 53 -42
1989 -42 -64 86 42 120 -117 -164 121 -104 -159 111 61 178 250 146 164 -68 294 124 -74 127 -70 -246 20
2012 20 -27 85 251 157 84 31 -100 137 362 -109 9 -40 -160 144 35 46 52 139 101 -62 25 -399 137 89
2036 89 76 -8 -105 -94 156 2 89 273 56 92 -202 94 -102 -23 63 277 -75 137 -5 85 39 321 -138 185
2060 185 68 -397 -47 -264 360 175 53 113 25 207 -90 27 -22 50 53 16 181 -109 -115 65 238 67 -179
2083 -179 -138 -109 -87 224 92 304 148 87 115 55 162 -54 39 -174 -24 -191 102 -2 154 -21 128 -101
2105 -101 -131 -95 -82 14 32 290 -81 39 -74 31 218 -292 28 -97 155 53 -93 132 89 -21 36 -98
2127 -98 153 -110 39 -180 -86 77 -54 128 123 145 -21 -20 54 100 2 32 -117 -90 -30 92 -81 -203 26 59 139
2152 139 -167 -27 -8 -78 -104 -120 94 118 -65 -332 67 36 7 -2 161 63 216 -91 116 -17 -49 12 85 154 -88
2177 -88 315 -8 125 -31 138 143 -228 27 -6 -2 -3 -64 23 -75 -17 -6 146 12 -169 177 -56 136 81 -196 -101
2202 -101 -85 -242 93 179 -85 -69 -56 -286 40 10 -246 30 -109 97 -179 20 -158 15 181 -169 14 59
2224 59 -78 31 -85 -30 6 68 -17 -75 -58 109 149 3 224 161 -80 -78 61 -4 209 2 122 -44 -79 -55 -220
2249 -220 57 44 -116 2 62 259 112 327 2 -193 -122 188 -105 137 247 -95 175 273 -143 59 -132
2270 -132 209 -369 -37 83 -200 -130 -162 -91 -44 57 79 7 150 59 -272 -118 126 79 -89 -124 144 175 74
2293 74 -116 -29 -87 52 71 93 -52 62 -129 -12 -95 -39 -59 -86 -34 3 46 96 34 -170 11 7 147 249 112
2318 112 -207 -36 -43 -40 144 -95 -203 -269 78 -112 -156 19 -77 1 41 -47 -120 23 93 -254 -118 -118 -42 -91 60
2343 60 181 37 382 202 98 33 148 -263 89 -68 135 79 -217 -83 -62 -301 -196 4 -117 138 32
2364 32 236 110 50 225 154 -65 112 -2 147 -41 -26 37 -170 126 145 6 199 -38 192 124 226 -93
2386 -93 48 96 138 -15 -26 72 205 132 105 -345 88 -176 -160 285 97 82 130 69 287 -378 165 -57 -131 -100
2410 -100 -148 276 -272 264 -193 -7 169 365 285 -116 187 -111 -117 156 160 -36 88 43 -296 -69 -157 66 256
2433 256 -61 109 28 -22 -495 173 202 46 119 84 -152 167 129 214 121 41 62 -27 62 183 -172 -104 163 -102
2457 -102 -4 -34 -271 0 267 20 -41 -36 139 -197 -22 -49 -44 -43 10 -104 53 -33 86 -112 -33 -38 -112 -25 -88 17
2483 17 -32 -79 -4 152 60 204 -127 4 -297 -61 -16 186 39 -79 152 -92 174 46 -25 -39 -14 72 37 -76
2507 -76 -42 42 153 36 121 266 150 -214 -276 80 244 145 140 337 -282 -131 -117 187 -15 -88 322 -162 56
2530 56 225 278 -14 3 -171 7 -322 5 -183 154 -95 377 225 81 148 22 -30 45 -278 -129 -238 -67
2552 -67 120 43 -67 -77 -63 -50 -25 -38 -270 191 8 -140 170 27 169 1 70 -173 43 -72 -83 -273 -116
2575 -116 108 -48 62 -16 -165 -173 -133 -117 93 -56 -273 -272 165 -113 -49 -61 -333 169 97 158 240 -159 -184 229
2599 229 -309 -69 10 20 170 -306 -83 174 157 223 137 9 -63 -64 281 182 64 68 156 -93 46 -291 -53 32
2623 32 80 284 -127 -88 140 3 -51 236 57 33 208 -211 227 239 -86 65 133 -124 115 -264 -113 269
2645 269 32 -252 -241 -2 111 -25 -24 -31 122 -84 -21 -79 90 -1 204 -176 2 148 -131 109 -413 -81 298
2668 298 58 5 -39 -149 -131 -64 -139 68 -95 -6 90 -56 118 -111 112 84 -19 51 -46 -34 87 42 -98 -43
2692 -43 -64 164 104 2 97 -54 -94 25 -129 213 -190 231 -183 219 -101 36 -53 -74 49 30 -108 86 103
2715 103 -74 -61 17 161 27 131 77 198 15 -134 54 68 -82 -36 81 -180 145 -85 32 133 -338 -266
2737 -266 118 102 80 -116 138 -73 -30 5 43 -16 -157 197 -142 -34 -149 -229 13 160 -86 7 130 232 35
2760 35 -285 -139 180 87 -72 207 274 -50 85 107 -8 167 -92 -5 -237 242 168 -11 227 -96 158 -116
2782 -116 -251 -220 170 19 -103 -111 -257 171 97 -265 261 -103 170 51 -70 51 -53 79 -221 152 87 -105
2804 -105 144 -28 8 -250 -241 -179 -73 226 253 238 -246 50 69 13 33 -15 142 190 -153 24 -57 192 -125 -122 -40
2829 -40 -158 206 -178 130 -17 -354 63 -82 32 143 -45 14 141 10 197 268 -207 -159 -92 71 -140 -180
2851 -180 45 -35 38 -93 -9 125 -109 143 -248 181 -71 -67 -149 50 -153 -81 88 307 -385 -173 109 20 -18
2874 -18 181 -13 63 42 -211 -116 47 -100 85 -110 -247 -54 61 109 -135 38 25 -55 -20 16 42 -116 -4
2897 -4 -41 -28 28 66 -105 106 -13 -80 -79 -48 52 53 4 94 -53 -5 63 121 194 -378 -101 -145 51 32 153 -66 -96
2924 -96 -11 81 74 125 43 -266 42 99 196 163 -121 198 10 -68 -183 0 -88 -133 80 -185 68 36 139 98 -122
2949 -122 -164 -35 1 54 -10 -27 -62 -247 128 262 217 126 -69 -97 -234 81 -219 49 -60 -97 231 43 65 148
2973 148 201 135 16 94 -43 189 -71 -86 -21 112 -245 121 261 30 228 -166 -125 -152 56 -182 130 131 9
2996 9 -73 -29 -26 -113 -119 -268 90 -109 160 190 -143 218 -39 -323 8 21 186 2 -5 87 9 -155 -51 232 -84
3021 -84 214 -79 98 -28 -160 -243 66 229 -67 52 115 78 -99 -110 -82 185 81 -18 -99 72 -173 29 245
3044 245 72 204 34 56 -37 -30 -147 -118 35 16 -172 -42 -2 196 -93 137 189 232 -40 280 70 8 149
3067 149 -38 -7 -140 87 11 194 -48 -159 106 104 191 -260 86 161 -163 -158 -69 18 -175 126 40 153 -148 106
3091 106 -10 -80 -190 -45 -167 42 -99 -72 6 -136 -68 41 -15 -133 8 -6 -221 19 72 34 -83 -95 351
3114 351 -75 128 -73 -49 133 146 14 -142 81 34 21 159 65 212 -51 93 181 -41 205 -53 128 -73
3136 -73 -45 169 36 -236 15 53 57 -336 -46 36 -24 251 18 181 -90 95 -8 -196 -279 -131 25 185 69
3159 69 87 476 64 -28 -70 -2 -190 -23 -87 -384 -131 215 11 -156 19 80 263 145 -1 -61 -177 122 202
3182 202 19 61 -106 149 354 68 41 -283 111 75 -1 -10 31 -137 -163 54 -145 -258 -37 33 -64 84 -75
3205 -75 70 83 -4 150 -297 -255 -45 188 241 -307 156 -29 -50 -221 -46 340 267 129 83 -17 -200 40 34
3228 34 -64 68 119 -46 -11 -167 26 30 -205 -117 127 237 141 80 -242 48 67 99 212 75 -163 62 183 -272
3252 -272 212 -111 79 -23 37 155 88 -31 17 257 -100 73 47 127 187 221 76 127 -163 -246 -73 79 75 43
3276 43 -6 110 214 -26 -99 -26 -99 21 179 84 70 23 371 -58 -24 -138 -90 -107 -424 69 -74 -175 -269 -138
3300 -138 -150 169 213 79 -39 33 124 29 -189 -80 -69 -272 88 -32 -85 104 155 176 17 21 -135 224 -130 -2
3324 -2 144 -235 23 -176 58 81 197 -127 -172 159 -103 11 113 59 141 211 233 117 135 -319 183 103 70 68
3348 68 237 94 54 77 35 108 234 -19 -108 31 73 19 -79 113 159 -8 -336 -17 40 180 193 -104 27 119
3372 119 -38 64 70 43 70 4 119 6 -166 -187 98 -56 93 17 -112 90 -348 95 -121 -99 176 -71 51
3395 51 125 218 101 30 115 184 -57 -9 -102 -43 199 -17 55 -191 -71 -144 109 -85 -97 93 -206 -94 42 -183
3419 -183 61 -39 101 72 -141 -115 206 -40 144 -197 -29 67 -24 -107 124 -9 40 -365 -33 31 -112 115
3441 115 -121 -48 -41 -10 35 69 57 36 185 -92 198 -157 -62 -108 224 -118 -31 149 -119 95 -66 -146 -167 61
3465 61 31 67 -218 97 41 -2 -18 -2 19 -30 -151 -245 56 -45 -23 -41 -69 154 -283 -38 114 -43 -18 8 31
3490 31 -57 -79 24 -30 201 103 71 -159 85 -276 -10 -37 44 105 14 38 151 27 -20 78 -123 132 -199 -142 34
3515 34 71 -90 -7 170 -58 60 82 43 57 233 131 -44 1 341 -262 6 -250 126 -47 -234 -114 119
3537 119 147 -322 87 -77 -18 8 -220 -150 -347 -9 196 207 59 192 -57 16 -145 177 138 1 130 -88
3559 -88 140 -166 176 167 -32 -59 132 123 191 67 -140 87 87 -90 -93 199 -34 97 47 66 169 22 6 329 193
3584 193 232 37 -76 -58 -234 28 -83 -157 36 39 -129 -14 -158 36 134 33 475 197 -133 96 123 142 308
3607 308 393 220 225 -362 -261 -68 94 156 61 -152 106 24 -20 51 222 201 -228 -5 96 -233 123 278 -312
3630 -312 -70 182 199 -192 -70 7 122 75 144 -142 10 170 34 -161 283 59 -26 58 -106 190 195 195 275 155
3654 155 163 24 -324 -156 -97 -16 54 -79 -187 112 -88 83 236 -45 95 -21 -135 104 2 31 -90 -167
3676 -167 18 107 -77 136 -144 -189 38 150 -30 156 -37 81 14 -141 -235 -55 8 -154 -49 -5 -209 295
3698 295 73 -141 -43 16 66 -121 4 150 77 263 -55 -336 -57 -22 -53 -12 24 13 -81 -17 12 -198 6 -259
3722 -259 38 112 75 131 -152 96 -51 -167 197 -282 121 23 84 88 162 30 -37 51 -97 -33 -21 76 109 -78 222
3747 222 -33 150 -139 1 16 221 -13 30 79 -60 7 -40 57 -219 228 -8 60 133 -284 -55 -216 -80 -97
3770 -97 -29 123 72 154 269 160 -246 52 66 -324 -96 -46 -92 96 -78 -106 205 40 -58 73 -180 127 -33
3793 -33 160 -152 -51 48 -94 197 140 37 158 -126 146 107 -101 16 -321 -16 -6 -189 110 151 334 103
3815 103 115 -171 -16 110 -58 -24 -106 97 103 180 -157 112 -39 132 -95 108 -21 -28 -5 36 95 180 -36 177
3839 177 -148 -188 -35 -143 -2 91 274 -12 65 142 140 -335 -40 3 0 -170 -200 -191 -25 -102 -132 49 115 153 214 -70
3865 -70 42 -32 37 -189 -65 82 20 -4 -14 -306 -9 341 -54 154 -151 3 150 -232 -261 69 -60 -108 -4
3888 -4 -172 -67 -188 155 -9 -266 -58 -100 52 226 209 248 -180 27 60 -102 86 -103 -99 45 163 150 363
3911 363 -95 -68 43 195 -98 65 -55 212 -21 21 -237 99 -68 80 19 -231 96 171 -60 113 99 57
3933 57 -42 -199 -316 -91 -234 155 257 6 -104 41 -211 91 -29 12 74 -204 34 107 47 362 -58 -73
3955 -73 210 -66 29 -161 120 225 90 -26 5 -168 9 157 -166 53 -63 -4 -36 -278 -44 -22 -120 0
3977 0 133 -68 14 -118 -104 -56 -45 77 -61 -46 -77 168 -99 42 -48 66 304 -97 -89 14 -138 -390 -26 177
4001 177 0 -100 -5 161 4 -218 -81 283 37 -206 -58 174 167 -18 229 62 -38 -94 -143 156 -12 109
4023 109 -17 190 -180 187 79 -32 -6 -27 122 -13 57 -64 -203 -89 -26 42 0 151 -14 122 5 -260
4045 -260 33 11 -70 -148 -223 229 -138 -75 99 211 83 -119 -85 147 48 146 5 136 -102 83 201 -89 -186
4068 -186 -170 -2 176 -229 -384 -43 -31 -309 115 -207 -5 177 -274 111 -10 -156 -110 52 57 16 -39 50 -20
4091 -20 57 -137 65 151 -176 -29 94 58 81 98 -265 -52 163 63 152 -235 14 105 94 145 212 177 177 -287 123
4116 123 -228 -120 -43 -59 53 92 123 -44 -184 55 -184 -6 -22 69 87 -211 46 -224 249 -49 127 123 -183
4139 -183 1 33 -28 -101 142 13 127 -148 -146 103 13 -145 163 -18 65 -118 250 128 64 207 -20 115 -146
4162 -146 -24 -57 75 -178 71 66 -39 -95 -70 129 -62 -93 -60 -249 -23 62 -67 -19 -29 208 -57 -69 -15 138
4186 138 13 -176 -24 219 42 -72 -27 12 -13 -35 139 -22 68 -55 -3 32 -107 264 40 281 44 -29 -5
4209 -5 -191 -13 -84 -147 -165 -195 173 136 123 -27 111 200 27 -8 -98 330 -131 98 72 100 109 167 -38 82 60 -56
4235 -56 -181 132 263 33 -298 -102 59 40 113 225 78 -21 -31 3 -124 93 -35 34 -146 -34 291 -166
4257 -166 36 -80 -108 -21 225 100 90 29 41 -160 310 127 36 213 -100 26 190 95 14 -189 -75 -145 -19
4280 -19 65 -38 -47 281 -181 100 -57 78 -174 24 -119 -262 -349 39 5 -193 -36 59 148 233 -181 -16 -179
4303 -179 -163 124 192 -118 70 177 -100 -56 -75 -88 49 13 -123 106 -236 -68 -224 -22 -143 47 221 121
4325 121 234 84 56 142 384 158 -7 52 -9 12 181 119 293 -31 91 121 499 -198 75 73 -66 234 142
4348 142 -5 22 277 -111 99 -172 279 36 -84 -30 175 -32 -31 -185 -116 148 -110 312 92 145 -83 -18
4370 -18 -91 36 -114 34 26 149 63 261 126 48 -26 -99 6 38 147 53 193 -253 114 27 123 176 63 -44
4394 -44 91 -150 -131 40 70 -10 -141 64 126 -155 -114 -73 -172 42 -103 204 -27 -72 150 -10 59 -14 -12 191
4418 191 138 -137 -16 56 -120 112 71 136 -264 -68 74 -99 -24 201 -42 -222 121 -89 -273 5 -16 -114
4440 -114 -87 -82 124 78 -150 474 -24 21 -186 -162 20 162 -101 -107 126 5 -202 -110 137 39 -1 -185 60 90
4464 90 -343 -208 167 88 50 -157 272 201 163 0 55 -78 -75 62 -117 -77 34 -167 69 -242 -97 -106 51 -25
4488 -25 59 148 -229 -177 160 -274 40 -234 -49 -142 -67 -146 -68 -229 48 138 -103 -27 118 -150 -19 242 -246
4511 -246 52 -109 76 98 75 273 -65 137 84 -65 192 -114 16 -35 -280 -321 -105 -10 -120 213 -136 214
4533 214 141 -120 143 -132 144 -96 -48 48 -136 -56 173 68 105 46 -106 231 -188 116 -467 111 -161 -64
4555 -64 -75 -87 -76 -75 126 -138 -28 21 107 5 103 1 -337 190 97 12 104 -6 -68 6 -139 -86 -165 -71 -73 -153 -49
4582 -49 7 113 88 -46 -202 -104 -155 -207 -9 -255 -74 -107 -3 41 227 -211 106 74 283 14 -51 12 -81 116
4606 116 -29 126 3 30 -224 56 -93 187 74 152 346 174 266 88 -399 -11 31 -132 -135 204 -15 215
4628 215 -52 429 174 -95 -168 -151 -95 -80 247 130 -254 -38 189 89 44 -204 -45 -97 -245 90 182 176 168 -15
4652 -15 83 -173 -158 30 -78 178 74 100 -189 68 -221 310 74 92 -22 54 169 18 53 -221 61 112 218
4675 218 -102 219 -173 -67 -240 -272 61 76 -190 114 -66 184 -51 53 -179 -71 -33 -6 44 69 11 92 -86
4698 -86 -93 85 -293 -55 -33 126 0 45 -138 -43 74 -14 273 -4 11 -88 -22 -151 11 114 123 -207 -115 68
4722 68 -116 -41 -304 187 47 54 36 32 88 28 -176 57 -68 9 451 -48 -181 -17 -118 273 157 23 -59 -2
4746 -2 75 -174 145 90 58 -20 275 -48 193 16 7 85 74 -18 -123 85 -81 -32 180 -102 50 -37 154 -222
4770 -222 -44 168 62 -80 -115 -48 -164 -5 -70 -85 1 33 278 45 -105 231 -12 -206 -173 -64 125 170 -18
4793 -18 -106 -2 79 -91 65 40 26 -411 23 338 65 5 205 31 -192 -8 87 38 13 112 185 168 -21 112
4817 112 -215 54 -188 227 -100 -372 129 149 -19 211 -31 -21 -24 -35 30 152 -78 68 141 -203 -132 94 -109
4840 -109 0 -23 269 -52 -24 240 195 -70 126 -24 108 8 267 43 176 34 -37 -153 159 298 -130
4861 -130 -50 -61 -216 20 -1 -112 -158 -203 -168 -67 77 -148 40 265 -50 -8 1 147 291 106 -11 -27 94
4884 94 -66 -316 -69 -18 30 206 -259 77 149 -108 169 79 106 -151 -34 -164 -317 8 -256 274 -320 -211
4906 -211 -102 315 -99 119 -179 162 24 195 -73 -136 -261 -96 102 -178 -118 -50 -46 171 201 -534 60 21
4928 21 193 117 -104 163 177 219 159 91 101 146 46 90 -80 -261 -97 -39 -238 -83 26 -77 -185 55 21 -199
4952 -199 -54 39 36 -50 -214 158 46 -76 168 -280 -215 54 45 -43 -110 -81 -63 207 168 7 59 142 172 33 254
4977 254 -65 19 -9 33 246 33 116 81 127 170 -154 -22 -104 22 -23 238 220 112 -147 52 227 -203 -37
5000 -37 -141 -179 -56 44 133 -96 149 -32 -54 -115 -39 119 -77 -206 -100 178 240 44 -47 41 -10 -61 -59 179
5024 179 288 -58 -152 103 138 94 -16 -60 -202 -143 116 -7 53 -159 -10 92 -97 159 -64 82 110 268
5046 268 85 128 -60 -194 84 298 218 190 307 -38 73 71 141 -41 -81 32 -283 -80 179 -89 148 3
5068 3 211 59 -154 -263 -155 -203 -101 321 46 330 -47 156 31 -243 67 109 160 9 -177 1 78 -345
5090 -345 -73 17 -31 -16 133 233 -75 147 10 -19 13 169 93 -138 98 229 35 66 -104 -27 -79 -124 30
5113 30 -438 56 183 -86 71 33 -113 -27 61 -23 54 -280 115 -67 -355 -137 -124 -157 -272 -61 163 -38 -70
5136 -70 -147 19 28 -122 185 109 -77 -268 148 16 -86 225 117 90 -72 -129 -54 5 -84 103 -61 -167 -231 -24
5160 -24 -167 14 -42 -33 79 -71 121 -278 90 89 -139 -96 -271 -140 -74 169 -104 41 -96 -49 114 5 -158
5183 -158 -115 78 -213 314 -44 80 25 -71 -68 -13 -106 -131 -57 93 -103 22 -248 -170 -221 48 -37 33 201 -211
5207 -211 120 -88 -215 -214 185 7 108 54 -35 -71 181 12 -54 -15 -298 187 85 -38 -193 -243 191 -170 -115
5230 -115 45 -56 139 -155 -14 -54 -32 -39 50 -14 -30 210 -8 -184 -330 -8 -110 -125 -22 111 172 -12 101
5253 101 137 -214 48 -73 4 86 233 157 -49 73 -48 -56 -22 129 -41 23 -85 -16 -23 94 -77 -33 60 20 29
5278 29 -96 -46 -128 97 -11 111 -88 -101 -152 88 29 -146 -132 -173 -153 -3 280 -228 -119 -66 88 67 -138 39
5302 39 223 49 26 -167 -73 -9 133 -65 -4 -153 -130 -117 38 125 40 83 38 -242 -282 64 61 -66 -130 60 -50
5327 -50 20 133 7 -28 -126 -121 -72 240 -185 12 -233 -29 0 141 -94 -227 -151 313 -94 4 38 -239 117 -289
5351 -289 241 -194 -337 25 83 187 109 35 66 -77 -67 -24 8 -152 213 10 331 -260 94 76 351 -48 120
5374 120 -194 -190 11 301 213 -9 144 4 -154 96 110 201 63 26 17 16 152 16 143 -196 -86 107 67 92
5398 92 -16 -54 -195 -71 75 26 30 -51 -69 13 -2 -265 15 22 210 -9 78 127 -26 -154 152 16 -136 -72 -8
5423 -8 28 -203 57 127 75 -371 -182 -162 139 131 -76 286 -120 123 -8 -127 104 75 -77 17 -70 82 -84 34
5447 34 -198 -166 -44 75 -141 -16 -137 160 -24 -191 -149 60 60 220 18 -160 -179 -29 122 -108 -80 -78 -35
5470 -35 -82 -85 -111 -22 -6 -38 -22 -247 -124 149 -186 -182 -147 -222 -158 -66 49 85 -82 -241 203 60 -140 -317 -280 140
5496 140 -85 182 -28 -53 59 -170 -85 139 41 108 225 51 11 95 -260 102 129 -39 3 -108 113 -62 -82
5519 -82 -46 -405 7 86 -211 -27 -69 -144 -26 -72 103 196 71 146 386 -270 -299 76 3 307 -102 139 -111
5542 -111 -42 46 -118 -59 -67 -14 224 132 45 113 -220 80 -2 191 -226 64 79 149 -89 53 51 -76 124 53 -69
5567 -69 -173 -207 59 160 -69 65 49 -13 62 -57 -189 171 3 -361 -49 30 208 45 182 80 -165 75
5589 75 26 -24 -21 -206 145 19 116 24 51 122 163 -157 -21 -36 151 104 -212 19 -73 -142 34 -179 -138 -21 203
5614 203 -79 -203 -1 96 -8 -76 -61 125 327 234 -225 106 -91 -6 -24 -9 163 75 -138 8 26 47 151
5637 151 -65 -160 -47 -48 123 -320 99 102 -190 29 -319 171 97 84 52 51 -112 -202 180 -76 212 -130 -163 140
5661 140 53 15 -172 -12 -88 40 13 -181 398 -264 62 233 -19 77 -141 -106 -119 172 150 197 111 -169 -139 -96
5685 -96 -98 -28 -29 74 86 -172 219 91 28 -116 73 -107 145 -108 -149 -95 -172 -40 2 -359 61 185 95 -57
5709 -57 7 -173 -149 213 41 183 207 95 -307 162 101 -65 -53 -46 181 -75 78 -60 -214 34 64 -94 -97 -54
5733 -54 1 60 298 -50 -184 41 -12 40 117 -38 95 -142 -64 18 -26 57 224 -247 24 185 -55 97 90 61
5757 61 23 134 84 10 -146 180 -159 -32 10 214 2 -13 249 -94 -111 -204 96 -113 -12 359 82 68 5
5780 5 202 148 -78 270 109 -21 -291 168 202 -12 248 -221 -221 -249 30 -72 164 -35 63 -263 -4 123 187
5803 187 73 28 173 -43 124 128 -45 -95 315 0 220 -30 40 -166 36 207 124 -250 162 16 -114 22
5825 22 123 -207 106 -57 -53 -157 -240 276 -108 -110 17 57 106 -7 91 34 33 155 -15 -21 -108 -100 -44 145 -291 14
5851 14 74 -22 -14 166 -28 -144 -140 -91 -322 213 71 -39 37 116 136 316 244 -46 273 59 -225 88 -257 268
5875 268 159 187 139 -24 19 32 -36 112 -128 292 -3 -130 17 -72 -211 82 -172 102 0 -224 -192 -84
5897 -84 356 61 72 169 -112 -162 68 -121 114 -109 -171 -192 18 4 -165 -181 123 54 7 -51 124 218 123 409
5921 409 65 37 -97 -175 -122 87 -76 -52 -2 174 -80 -131 -16 -143 -46 -42 -233 -1 -116 -113 36 196 20 5
5945 5 90 -264 79 -208 -56 -139 44 -150 -97 284 166 -34 -48 -55 -111 -26 -250 244 351 67 56 409 -74 -219
5969 -219 108 -190 -34 -82 104 328 133 29 214 71 126 -103 -15 92 56 108 247 -242 14 124 -126 5
5991 5 -174 123 95 3 135 -162 143 239 40 -231 -133 95 -62 94 106 96 -29 104 49 33 10 323 10 15
6015 15 13 -224 163 89 52 267 -51 357 145 11 -6 7 98 50 -107 137 -11 -77 -5 -106 61 87 -119 -51
6039 -51 -83 2 162 184 -165 23 -87 -93 -4 -48 173 -125 109 -152 229 186 139 108 -3 81 116 -15 -16 22 -19 -30
6065 -30 17 -18 44 172 -4 -63 -5 246 177 157 81 120 -156 -143 273 -246 122 -20 6 -70 101 -33 -170 331
6089 331 312 -208 -70 96 -52 43 -40 -265 -78 70 54 -38 99 110 -53 78 205 -104 111 18 52 65 -182
6112 -182 -303 253 -175 75 92 -244 -260 -9 262 -75 -133 -204 -30 -22 358 101 -146 -38 138 -131 228 -10
6134 -10 94 -159 -35 -37 -82 -86 18 -145 -380 -1 -80 251 110 90 18 -310 135 -196 20 335 -9 -224 -24
6157 -24 -266 37 34 -144 -44 3 11 121 139 -364 46 -165 98 -82 -73 273 28 107 138 48 -139 182 -47 -158
6181 -158 -16 -128 -35 -60 210 114 -52 85 -89 29 163 96 -61 37 -65 185 203 262 186 36 8 -65 -217
6204 -217 -107 -211 11 -69 -27 76 -3 209 -33 -79 -33 49 79 -146 -40 -191 98 -17 -25 126 255 132 75
6227 75 -97 -16 -397 -108 -15 -152 -180 -68 80 152 90 -104 -276 -52 114 48 -69 -62 -149 -33 6 -90 -153 -148 62
6252 62 -14 170 94 90 -49 -68 -74 52 15 -248 -103 -41 95 -64 -37 21 119 -155 26 -78 -95 -147 7 42 193
6277 193 -24 -67 72 -72 23 338 -56 101 -143 37 0 56 15 30 -39 137 -202 -53 59 -214 29 200
6299 200 -171 -12 -249 -90 -97 -125 -103 -36 24 42 44 -41 202 -45 200 230 100 100 74 -126 91 -136 -66 -14 105
6324 105 -246 -9 51 -11 -93 217 62 115 -179 145 -25 154 29 -283 -104 -74 90 224 203 179 -226 115
6346 115 339 -2 186 109 -87 -151 141 8 105 -111 79 136 -217 -187 62 -30 -70 78 -28 31 -172 19 122
6369 122 -13 129 -36 125 29 -54 19 -298 58 -189 -164 60 173 142 -80 24 -92 -73 -84 62 -372 130
6391 130 -97 -80 -122 198 41 -58 25 -38 -120 217 -240 31 -185 26 237 271 -328 -48 -271 2 188 -148
6413 -148 119 -51 -93 32 -64 86 -185 -21 -116 69 160 -404 119 116 46 71 213 266 -270 -67 -37 -76 -300 113
6437 113 -22 124 -166 -61 -7 -245 165 79 53 -106 122 -10 -214 117 -302 0 -123 94 -304 34 -57
6458 -57 -131 -33 165 187 -383 83 153 208 66 80 -204 12 27 115 -89 -111 -259 -258 158 23 353 -179 -21 -208
6482 -208 -167 179 238 -360 -266 -40 -77 18 -18 244 -189 -173 -80 209 -14 -179 -140 80 -31 -116 242 -86 -209
6505 -209 56 -99 189 105 111 -213 -86 -80 22 -88 -4 -172 13 -190 164 11 -9 85 -48 60 34 131 -257
6528 -257 -237 -199 40 -148 -4 38 0 -79 23 37 -3 168 153 223 6 -129 171 -71 -165 -139 -192 -20 -22 1 122
6553 122 -129 -42 -99 -30 177 -214 85 66 123 -62 -17 169 -60 54 23 199 14 -44 24 187 284 13 -38 -1
6577 -1 -195 -52 -62 143 127 -197 -233 -109 151 -58 21 -2 -236 117 75 67 -145 -246 243 -32 -60 -102 11 115
6601 115 34 46 11 91 124 -154 282 52 108 -126 -133 0 -71 -108 -50 189 -161 170 -70 -192 -180 195 -65 120
6625 120 350 -3 115 26 -129 5 -153 104 97 72 242 -161 -1 -17 81 27 -194 -103 -7 183 201 68 -51
6648 -51 138 115 -443 149 125 57 -83 99 -237 -68 390 14 131 -96 51 192 -61 -146 141 -14 145 -42
6670 -42 -64 174 116 -26 -17 -255 -61 4 -101 55 112 -41 85 -92 81 115 -68 204 -29 101 -50 1 -29
6693 -29 -170 6 132 -114 72 236 34 74 100 41 -236 -71 -29 22 -82 58 147 -154 -155 15 265 83 -38
6716 -38 216 -57 -173 159 82 10 33 107 -167 -6 -62 -171 -151 -91 91 -275 -48 -183 -226 -6 6 249 -400
6739 -400 -40 122 -33 64 -38 100 58 152 355 -144 -54 -116 -28 51 -133 -35 44 -26 10 249 -285 89 -21 65
6763 65 195 15 -56 44 5 -53 -109 -179 126 50 -63 42 0 38 -188 79 85 78 211 -249 -159 -56 41 127 -23
6788 -23 82 -6 72 186 -60 225 -27 145 138 -45 128 11 137 -118 66 129 -50 151 -59 -58 -69 186 -339
6811 -339 105 273 253 266 77 -52 55 -14 -255 11 -46 113 -71 61 -55 170 -21 -151 241 232 -131 -13
6833 -13 -227 -86 -84 211 -144 -7 -162 -170 -17 -26 298 200 -135 11 9 -35 -227 48 -57 73 112 248 -172 -203
6857 -203 -15 -2 -292 96 52 73 61 109 170 -37 284 -173 -6 37 -180 171 42 -190 -147 175 -165 208 177
6880 177 -13 66 -166 -76 -97 -23 319 -36 65 139 -120 -197 136 -17 20 -124 -35 -50 -115 93 -49 98 -51
6903 -51 -117 -26 50 53 309 -157 -237 209 -318 -5 7 318 289 -72 27 73 24 157 47 81 41 -99 -37 -96 -4 117
6929 117 132 -73 118 103 30 -3 -113 72 -144 -42 -109 111 91 -240 -45 299 216 -15 137 93 39 31 260 158
6953 158 169 81 -57 64 239 -71 -206 7 -201 106 23 21 12 -17 -180 -91 -43 115 -28 300 -194 -141 24 -94
6977 -94 -66 -193 -41 101 -27 -154 26 -120 -109 -76 163 186 -167 -113 -7 -9 106 -6 -35 -109 -99 -52 80 57
7001 57 52 -95 320 -38 180 212 95 -19 -130 3 -208 -114 83 109 110 62 -26 349 57 58 95 -14 -108 -168 48
7026 48 -12 -55 85 32 -42 -83 -91 -96 89 -19 33 116 -7 -101 -71 -72 100 200 -62 -56 -196 38 -49 -58 45 -157 21
7053 21 -90 173 142 66 70 -121 152 -63 73 -180 194 52 -230 121 232 -123 22 -12 -97 115 -77 176
7075 176 -138 -122 38 62 38 -60 -45 -118 -120 -52 55 -354 76 -38 -279 -69 29 -35 -60 60 -3 125 -15 54 -274
7100 -274 -103 46 47 -49 82 118 30 179 127 75 81 137 145 -118 -172 -4 -46 156 -42 55 129 265 170 -67 -7 -392
7126 -392 -42 -116 -151 35 -44 -171 -251 -227 140 -110 -37 51 118 -161 -36 21 -470 -159 107 156 -82 242 -64
7149 -64 209 58 45 174 -86 -4 -86 -106 185 69 -97 -203 338 311 107 204 52 -234 56 -47 -49 24 189
7172 189 18 73 217 41 95 -247 16 -95 -257 -10 -161 1 -1 -142 -91 -88 -234 -48 98 53 -205 78 100
7195 100 -197 114 61 77 76 -15 235 83 -44 -76 26 -111 -59 -32 -199 -59 97 -23 114 64 -11 -71 106 -31
7219 -31 -138 210 131 -129 137 27 -50 219 -57 137 28 169 -6 164 -70 142 262 -89 -152 5 -47 26
7241 26 53 -228 143 48 -157 38 -85 -353 -178 -67 70 -64 89 34 106 -59 124 63 174 -3 -23 215
7263 215 140 -40 151 -21 -130 -136 -183 -104 99 -154 71 -84 54 -101 27 146 -251 -253 37 54 130 222 90
7286 90 54 53 -13 -145 11 -141 6 239 52 -218 185 -76 -8 -13 132 246 -71 151 -117 233 -211 45 137
7309 137 82 25 -190 41 -62 135 -177 -107 143 -101 -42 131 -230 -66 6 -112 96 -40 82 -164 -116 -72
7331 -72 -136 227 18 -75 52 -54 -111 155 -51 9 -16 -11 247 -29 13 7 -173 52 216 10 -34 86 56 41 -135
7356 -135 128 152 36 28 -207 -47 94 -5 226 -41 428 226 -73 -22 -113 -144 15 56 -96 -250 -188 -74 23
7379 23 102 -127 10 -98 104 -25 58 205 -306 -122 239 -62 -315 -165 224 5 -175 182 152 -212 -21
7400 -21 15 -44 -78 -103 -339 81 -131 9 -135 -70 -185 0 -129 -112 119 -30 255 163 22 185 -121 -114 170
7423 170 12 145 13 107 81 148 179 88 -123 164 210 88 77 22 -93 45 106 -165 28 72 -150 -10 -275
7446 -275 161 144 108 -224 301 85 -189 -47 55 116 -160 66 38 -215 -268 -57 54 111 -137 -291 -111 91
7468 91 167 -73 178 -296 -35 -6 262 396 -56 -143 -174 7 -110 -95 20 -50 -99 116 -9 -79 -82 30 38 -12 109
7493 109 96 -21 -64 -27 178 -104 -56 -26 29 -208 178 7 -70 -74 109 16 105 -169 100 37 20 -185 -100 -72 25
7518 25 51 -123 -24 -68 72 -48 -26 -64 -56 77 -61 -152 127 -201 63 149 56 27 -74 -60 -144 4 -144 49 -56
7543 -56 224 47 -30 -7 62 43 271 -61 -280 108 -53 -179 420 179 35 78 -93 331 6 70 117 -189 -50
7566 -50 28 85 104 122 -4 -7 -97 -189 94 3 45 5 -190 119 -5 164 37 66 -95 51 108 -84 80 -14 96
7591 96 248 -63 -70 128 -82 231 -43 104 -131 -137 -45 -192 31 -267 97 45 -54 128 330 -89 152 135 -29
7614 -29 32 -175 -129 -242 -162 -33 -174 3 209 3 -79 198 6 -100 -128 145 3 -18 15 97 -58 2 -58 -34
7638 -34 28 -18 -22 38 -40 144 135 -83 61 -165 126 -63 134 -3 -129 185 105 277 -147 -113 -30 -124 -165 -107 26
7663 26 -56 138 73 -6 -148 38 -197 -220 -67 -78 -220 134 68 -67 -61 -173 65 122 -234 -84 31 -117 -119 -37
7687 -37 5 -133 -175 61 -203 113 34 -77 -104 42 189 -278 -176 34 9 -55 103 39 108 214 69 69 12 61
7711 61 122 -40 57 -12 -157 17 144 -223 57 -52 -95 -154 -26 165 194 6 48 97 -75 160 -424 -20 125
7734 125 151 -58 66 -260 115 -120 148 137 -73 243 -51 311 170 80 90 53 -88 -280 -22 171 135 -127
7756 -127 -103 110 -59 -86 -350 138 118 213 -126 -79 -187 -2 -144 -211 95 -68 79 -172 20 179 -7 310
7778 310 -17 132 -36 -107 146 2 -41 322 -42 -224 79 -76 117 -167 -43 115 158 66 39 -54 -96 -227
7800 -227 21 -121 104 -74 -59 344 -113 -212 -58 157 -149 -179 -109 -120 -56 -210 -30 -139 -35 55 103 -36 48
7823 48 113 -76 239 242 -136 -70 -120 127 -4 -21 -63 48 87 -156 -84 227 65 -91 112 19 27 -28 56 3 -396
7848 -396 11 -57 -54 -9 -31 125 35 -21 30 143 68 -65 -136 -60 -134 134 181 -12 163 141 -54 -44 -83 17 -78 144
7874 144 -22 125 -9 -96 -16 81 -103 -34 42 133 -3 183 131 -86 63 208 -216 -95 359 -8 -4 -157 9
7897 9 57 -158 -82 -4 -246 42 222 -49 82 142 -144 -125 -142 -2 -32 -219 -259 103 9 -104 -66 -133 -87 -28 172
7922 172 -124 -69 60 25 -152 -113 12 -101 -173 -78 127 84 -48 324 58 -2 8 -49 -107 -38 -186 56 83 86 -11
7947 -11 26 -184 37 -90 -23 -71 93 -131 -66 142 19 -29 -14 -197 -17 366 -350 105 191 -49 159 -274 168
7970 168 -125 165 165 152 182 -30 149 98 -125 91 -300 64 31 226 124 -300 24 -64 -170 -89 21 -263 -15
7993 -15 11 55 -129 -159 -49 -63 126 101 -242 -207 -46 150 75 153 21 -156 317 -218 68 -101 -194 -30 -207
8016 -207 -118 222 266 -85 -130 -167 93 -248 33 282 -82 -54 259 -110 -294 148 -83 71 27 116 18 -17 158
8039 158 14 -181 113 117 -95 -58 -295 -126 -410 -84 -85 96 137 -82 -74 26 -86 43 -130 -20 -32 90 -239
8062 -239 78 26 327 132 -135 10 -41 46 -212 303 61 -251 114 15 -20 -21 103 -129 -90 -213 -144 -40 87
8085 87 262 -105 -92 73 -77 -109 -13 -34 79 -7 238 31 301 232 -256 159 -28 5 12 72 36 200 80 115
8109 115 -81 211 18 -179 70 98 -168 -157 61 -81 230 210 224 -387 149 74 -245 -63 100 -3 112 -11
8131 -11 25 265 169 -150 61 -142 -35 -65 264 -176 82 23 37 61 -191 -33 257 110 -168 -320 0 53 -118
8154 -118 162 -139 30 -166 -30 -93 67 -58 79 -265 -61 185 216 -91 307 3 -229 -306 126 -159 164
8175 164 -171 -132 -50 -61 97 202 -120 113 1 -163 -219 3 73 -126 20 39
8191C9
$$ Imaginary data points
##PAGE= N=2
##DATA TABLE= (X++(I..I)), XYDATA
0 0 0 0 0 0 0 0 0 0 0 0 0 0 8 -8 8 -8 8 -16 16 -16 24 -25 32 -40 41 -49 60 -72 80 -89 105 -120 137 -153 171
35 171 -193 217 -243 274 -305 338 -376 416 -461 509 -563 620 -683 755 -830 916 -1008 1112
53 1112 -1226 1356 -1505 1671 -1863 2087 -2355 2675 -3074 3578 -4245 5172 -6543 8804 -13178
68 -13178 24818 -125249 -311152 -64751 143270 168248 48323 6904 6795 -6205 -35459 -5175
80 -5175 26945 23613 10141 37909 35523 -13720 -22646 75526 138124 33109 -138941 -144362 4150
93 4150 77452 -20643 -109189 -49607 56591 55277 -17517 -46031 -20508 -6346 -249 29413 47703
106 47703 10734 -23662 9432 60032 40903 -11479 -3448 35638 -3801 -101915 -106781 18139
118 18139 118099 77023 -24066 -51526 -8635 23171 21846 13375 -8295 -58339 -94800 -68661
130 -68661 -6313 31388 40579 49093 44435 7580 -23711 5109 61297 55326 -17343 -64246 -37410
143 -37410 6828 12341 3880 13786 21182 1933 -17518 -9842 1522 -12690 -28805 -16427 1943
156 1943 -2836 -11720 931 11229 -8230 -25135 4862 48275 35057 -22575 -39166 10895 57736
169 57736 48316 16444 4681 -3478 -30525 -46222 -20127 17250 14384 -18843 -37012 -27476 -9570
182 -9570 12529 39528 41765 -3920 -57591 -52464 6103 42554 21387 -7111 495 20061 15842
195 15842 3825 14899 34366 23956 -12368 -34476 -26217 -9872 -3088 -3544 -9683 -19657 -19207 -106
209 -106 17658 9005 -12890 -10930 18320 34127 13278 -14107 -16139 180 9054 6051 3399 2908
223 2908 -4297 -13045 -10606 2681 16217 22433 16443 -4768 -27700 -26848 3473 31153 22161 -13699
237 -13699 -34771 -23395 -2049 7711 9667 9806 2406 -13133 -19551 -5242 15611 21481 12486 2257
251 2257 -4292 -7714 -882 16420 24433 10070 -10938 -12808 1891 5335 -7749 -15965 -9551 -4255
265 -4255 -9928 -15657 -9626 -514 -914 -3995 4544 18889 20725 9293 -289 1187 7732 12069 11814
280 11814 6244 -7528 -20351 -18840 -2678 10606 8508 -2923 -11547 -14512 -12688 -4558 8838
293 8838 15858 6540 -10487 -15925 -3725 13750 21399 14410 -186 -11101 -11163 -2601 5052 5782 2399
308 2399 444 -1009 -3893 -3879 2632 9159 6153 -5013 -11920 -7006 1904 3610 -1356 -3299 -536
323 -536 3180 3144 -777 -6581 -9719 -6279 3985 9637 5588 -1930 -2060 4629 8466 7024 7128 8421
339 8421 3573 -8816 -15861 -7797 6408 10597 277 -12746 -17302 -11473 -1115 6320 6566 152
353 152 -6340 -5850 1978 9040 11901 12310 9680 3314 -5068 -6563 594 8264 4984 -5853 -12513 -8961
369 -8961 -1739 1058 -1063 -3524 -2658 -627 5 -1241 -2155 -1112 2121 4313 3944 2970 3384 3653 2474
386 2474 844 1578 4102 4006 -922 -7921 -10834 -6793 787 5604 3131 -3451 -7506 -4715 2449 7212
402 7212 6467 2650 -900 -3993 -5378 -3279 3255 7634 4352 -4577 -9131 -4938 3504 7715 5666
417 5666 1466 -1298 -1991 -638 1910 3275 1537 -1167 -3643 -4292 -4269 -3325 -1111 656 -246 -2344 -1927
434 -1927 1170 3178 1888 -431 258 4114 5271 2177 -1729 -2368 537 3851 4474 2789 -13 -3009
450 -3009 -4364 -4192 -2785 -1372 -1654 -4535 -7483 -7640 -2794 4523 9661 8875 3803 90 229 3855
466 3855 5768 3944 -143 -3221 -4820 -4476 -2317 175 1772 816 -2600 -5564 -5489 -1257 2297 2083
482 2083 296 -624 1030 2315 2912 1889 1122 622 146 247 -349 -849 -642 602 2020 2331 817 -655
500 -655 -1823 -2964 -3586 -2885 -126 2143 1930 -904 -2377 -169 3754 5040 2180 -2041 -4654 -4981
516 -4981 -3429 -593 2051 3098 2305 799 716 2594 4769 5071 2733 -1198 -4428 -5210 -3462 -576
532 -576 425 -969 -2615 -2884 -1326 -648 238 531 713 686 92 604 2082 3322 3311 2541 1390 913 683
551 683 -616 -2142 -3017 -1880 -547 605 -87 -1316 -2217 -1855 -1269 -244 -270 -835 -2058 -1679 154 2644
569 2644 5080 5473 4081 1403 -1047 -1850 -561 517 -421 -2189 -3408 -2698 -476 1477 2833 2398
585 2398 774 -1177 -2509 -2160 -675 236 402 -635 -983 -369 669 1581 1947 954 26 -343 1 363
603 363 390 491 503 980 1172 352 -804 -1417 -1628 -1494 -1121 -299 -193 -446 -1107 -886 263 1238 1827 611
623 611 -604 -1634 -936 408 1811 2582 2084 896 10 -60 791 1235 380 -1018 -2540 -3287 -2706 -1137
641 -1137 300 797 298 -487 -483 554 1168 1272 794 -103 -302 -306 -78 665 1006 1012 572 -83 58 54 -227 -904
663 -904 -825 -184 -52 -39 -310 -349 -721 -908 -53 227 302 -320 -1026 -562 385 1386 1940 1522 492 -177 -955
684 -955 -541 317 657 258 -548 -1262 -851 67 818 747 162 -768 -1342 -1443 -370 90 588 -64 -314 -427
704 -427 127 815 1114 1033 395 152 -275 -19 202 41 37 -5 -259 -413 -165 -122 -265 -139 -344 176 -162 -230
726 -230 -205 -768 -402 72 405 754 96 -254 -307 25 873 1057 930 323 -514 -838 -331 381 768 56 -589
747 -589 -1194 -1324 -658 33 364 238 -473 -643 -682 -8 749 689 299 29 -246 56 161 259 585 247 116
768 116 -45 133 123 -95 29 -253 -243 -221 -384 -226 -388 -321 -44 490 577 332 -74 125 40 242 312 -8 69
791 69 -235 -535 -317 75 733 652 115 -445 -771 -464 117 478 399 -147 -453 -443 -265 181 368 174 -200 -811
813 -811 -413 -89 -10 108 209 121 181 163 157 292 118 -62 -38 -118 -221 -110 -82 -14 -136 -105 8 -54 -323 -264 -439
838 -439 -222 171 337 404 50 -93 -107 126 324 575 182 -392 -492 -135 52 418 331 142 -261 -598 -451
859 -451 58 18 270 7 120 -362 -307 245 494 348 141 -187 -219 127 11 121 53 -102 -475 -235 -437 153
881 153 187 184 172 278 -35 -76 -92 -126 -427 -234 120 -83 -51 -61 -108 -255 381 165 250 -184 -240 -343 -74 215
905 215 574 -130 201 -310 -270 -225 449 159 -90 -76 -200 -614 -239 194 283 74 -286 -340 11 131 195 9
927 9 192 -23 24 318 69 43 0 -218 -232 -147 -36 -302 90 -92 90 137 37 43 135 167 221 79 197 204 268 73
953 73 -64 -112 269 34 277 433 -115 -392 29 -197 145 -156 -28 -339 -349 -259 497 372 34 215 -363 -54
975 -54 61 204 269 -9 -351 -236 -20 90 83 341 31 -37 -380 -61 329 156 18 180 282 101 -31 -310
997 -310 -12 -279 -102 -232 -138 -5 -5 145 103 46 340 268 116 -90 -410 -57 384 301 53 28 333 -152 -94
1020 -94 11 149 -207 -292 -465 -409 -87 -14 43 187 250 -86 106 138 495 378 -57 -42 21 -237 -188 -149 309 -123
1044 -123 165 -471 -261 45 106 -165 -160 5 -114 -32 201 126 -17 2 122 -183 262 -60 -144 -198 145 569 271
1067 271 -33 -182 -172 -172 -240 183 -91 -50 -212 -296 -169 71 258 251 -26 -74 -80 -57 -254 78 -342 -222 70 -109
1091 -109 133 121 371 233 132 -110 -154 33 81 153 -209 -114 39 -271 -161 -158 265 134 -173 7 -82 176 198
1114 198 -154 203 295 156 179 116 29 -203 221 1 -98 -58 -241 -258 -158 227 147 39 16 -228 -234 -11 275 111
1138 111 152 90 -29 138 40 317 284 133 -168 -116 -315 -29 75 233 -296 179 -162 -206 135 42 227 -124
1160 -124 -460 -62 -132 -149 1 50 244 109 -60 111 30 118 75 -161 37 24 215 -164 -114 -6 -11 128 56 -45
1184 -45 -310 -349 -92 6 182 84 -9 3 -62 -146 -157 63 117 44 -129 -120 198 326 463 64 17 -4 56 66 163 60
1210 60 -24 200 -131 -28 -305 -145 -188 -147 -155 -22 92 349 97 29 -52 12 -71 -185 -316 -330 4 -61 -169 -5
1234 -5 265 -87 -158 110 -53 50 -185 176 -258 116 -142 28 108 -46 122 87 15 -247 72 -3 218 -93
1256 -93 38 -92 -76 116 7 219 321 -140 -165 -137 -46 73 -34 -7 22 -127 -172 -254 -120 91 211 -3 -244
1279 -244 115 -73 -12 -15 41 16 -147 -112 -111 102 -48 -219 -30 131 -179 28 -23 -44 -124 -67 67 75 -49 -52 142
1304 142 198 421 -138 127 -54 -199 328 156 -55 0 -258 -29 25 27 -205 154 157 -5 -102 -32 -72 49 173
1327 173 -67 80 -85 -246 -32 106 -86 -42 -410 -145 -87 -69 -39 86 103 204 -11 -28 -190 -10 175 -72
1349 -72 179 1 41 -25 169 8 -46 38 47 -35 -134 -173 88 -84 -124 129 -92 -162 -28 -59 136 197 -87 -62 -270
1374 -270 157 13 68 197 447 50 26 -35 269 -58 -134 -222 79 27 -202 202 63 -97 68 276 311 -3
1396 -3 -90 -178 -230 -139 68 25 147 -284 -7 -99 -25 6 -13 -86 -265 44 -29 -34 221 225 -91 171 66 245 -115 -49
1422 -49 -104 45 -199 -239 -20 29 91 -46 -43 19 110 -22 -180 -51 48 84 -80 -75 63 43 142 150 -269 -45 -38 -66 -47
1449 -47 6 127 27 55 60 215 76 303 99 152 137 -38 -18 -178 -136 262 27 113 -317 -26 -103 -44 317 -311
1473 -311 165 -66 41 34 -164 283 148 123 -12 -156 -235 59 64 251 157 28 -21 110 -159 158 130 -114 -160
1496 -160 -166 104 95 -130 167 61 19 3 -194 -245 98 18 -3 -25 81 -108 -68 51 -66 -16 55 -8 269 62 146
1521 146 204 193 -28 -169 187 -48 99 97 157 33 99 -12 -57 -252 -138 49 149 48 129 278 151 22 72
1544 72 93 -220 108 -17 -213 -33 179 177 -131 -33 -133 82 269 -138 107 222 -37 67 -18 -126 -4 111
1566 111 282 -187 -3 24 -292 -311 106 -7 -119 124 337 75 151 -7 -36 -66 -39 -124 72 -171 -103 -45 -213
1589 -213 61 -97 109 -77 103 -171 -322 -98 -151 -154 70 51 12 18 -54 13 -108 -23 131 19 29 13 163 8
1613 8 93 49 -71 27 12 253 188 -209 -41 -208 -46 -11 112 -90 108 -239 188 -130 -26 -89 -186 -44 189
1636 189 -218 -49 -44 -98 342 -40 232 -212 -53 -167 -19 -23 -91 12 -356 108 -28 51 187 18 -91 138
1658 138 -101 160 36 -77 -24 143 113 -17 -18 -158 -44 37 27 -101 -115 -5 -43 90 74 27 336 73 95 -176
1682 -176 176 -80 24 -91 -73 98 157 185 -136 7 142 71 162 -112 -209 -181 165 -97 58 -45 106 -69
1704 -69 -251 192 69 -117 43 61 -27 89 -147 194 -136 87 16 217 -55 200 -93 -153 -14 -218 -63 188
1726 188 -16 -313 21 160 -99 -21 -30 233 -220 55 10 39 214 -50 -116 45 -117 166 43 -36 129 27
1748 27 193 78 -70 -197 -132 -81 23 -343 -144 8 -270 18 238 91 9 107 125 115 -34 -10 -152 -34 -82
1771 -82 -161 3 133 -120 113 209 -117 125 -120 64 -87 -140 135 -265 64 128 -38 -20 -66 168 -18 -13 70
1794 70 -28 95 -241 -14 114 92 -131 -154 -235 180 -108 -104 -195 18 -14 -98 -129 46 -160 -207 38 18 191 82
1818 82 301 -230 149 -39 -164 -88 -210 52 52 182 -61 59 275 128 54 -88 -221 -184 57 -87 246 -256
1840 -256 -150 159 -69 247 -165 280 -62 -137 10 154 -186 153 50 -45 162 29 -133 -26 -32 -215 16
1861 16 41 65 221 -309 -189 8 -191 -41 243 -29 -144 203 71 -110 -150 99 129 -149 -126 271 93 26
1883 26 121 -68 -79 -45 20 86 -81 27 -6 88 21 -138 20 21 -131 169 -416 -50 142 -62 33 91 27 -29 -135
1908 -135 -72 -138 -44 94 11 2 -111 119 15 -22 -162 130 -137 118 3 226 -108 189 17 -163 82 48 -30
1931 -30 152 -449 -181 174 128 -142 -5 138 61 -42 105 129 -27 -58 115 -11 -187 -240 2 252 -183 -99
1953 -99 -133 -112 93 -139 216 42 27 134 -293 -134 -40 -196 89 -83 292 12 22 -167 -252 -8 -31 -16 -13 -139
1977 -139 -5 -44 19 -91 -64 134 24 135 -8 159 -236 198 -21 22 -196 -19 -22 -13 -93 151 -93 37 -149
2000 -149 -124 152 75 98 -124 0 -159 -300 -93 -136 -26 -164 -125 -8 76 -32 79 -218 -73 -137 -163 127 22
2023 22 7 243 57 97 104 56 -4 72 -68 29 115 57 -17 13 162 -64 -175 -284 -196 153 -28 -82 151 305 -84
2048 -84 -183 209 69 -105 -89 67 164 -106 -315 -277 80 -20 -59 297 54 -12 -84 78 229 119 -123 -85 209
2071 209 4 -31 -64 -38 -133 142 -1 50 96 122 47 -54 -23 134 -6 80 181 44 -92 -170 15 39 106 -246
2095 -246 -174 -2 -179 -232 90 -38 79 16 -38 270 179 159 192 98 135 161 -84 136 -50 -42 -90 -80 168 -50 104
2120 104 -21 322 54 81 -284 -53 90 -188 -221 -113 -69 -136 -124 -218 272 270 297 -278 125 -170 -219 -68 13 116
2144 116 11 56 69 -77 111 -57 173 -27 335 -97 378 -191 -67 -197 -178 -99 241 167 -9 -130 -14 85
2166 85 51 56 285 303 110 133 -7 28 -76 15 138 87 35 178 -115 78 -12 -56 -130 -103 -112 154 -29 -352 356
2191 356 -333 20 170 -202 -21 -85 -50 19 -159 -84 -109 45 -58 32 -67 16 -148 -22 -112 242 -67 -174 -115
2214 -115 -137 -174 -129 119 189 76 -14 -175 11 257 -50 22 -79 -119 -212 42 -80 253 45 13 -119 324 -135
2237 -135 122 -87 -199 -86 203 80 16 -43 -211 5 -41 -233 163 -206 -9 3 -200 -64 67 -18 333 -66
2259 -66 -20 -117 -144 -14 -177 -101 -61 100 2 155 -12 85 247 70 -135 -60 -103 -120 -217 -305 -226 -75 15 119 -273
2284 -273 -89 -65 79 25 -27 -153 -186 -122 -136 -50 132 115 104 167 32 -81 271 69 4 -40 -122 112 -179 -38
2308 -38 317 -212 71 -131 -2 93 44 -121 227 78 23 470 171 33 -92 -235 36 -83 -81 269 163 17
2330 17 -147 -111 -145 -286 193 18 -108 -28 6 70 133 -18 -49 -46 -181 -285 -109 -291 -4 6 -46 -2 -28 39 15
2355 15 -139 -133 88 -81 -75 -139 -402 -89 156 -20 243 -39 42 151 -2 -45 7 101 -82 267 -70 48 170
2378 170 55 -28 -110 3 -107 2 126 -271 -165 -2 -15 -187 182 174 2 -86 206 -30 304 75 -86 146
2400 146 -58 -311 -182 -151 30 -157 -169 109 -61 41 0 -131 12 -42 37 333 -7 -75 -159 -82 2 -216 80
2423 80 -343 109 184 156 20 -79 -284 155 -53 -112 -14 -265 251 -11 283 -298 -13 72 -75 -127 -39 121 -59
2446 -59 -86 -174 96 84 111 61 -104 -65 276 73 -145 59 74 -101 184 -142 -66 244 -11 -70 28 -101 68 110
2470 110 -28 -70 -97 -44 191 -15 54 -76 -21 -137 112 2 9 59 -85 325 9 -84 -98 -133 -33 52 -40 -373
2494 -373 107 -20 38 47 108 -16 113 -105 168 -193 -196 -50 292 233 239 -79 -198 259 -200 -108 -53 13 -125 -195
2518 -195 29 -99 -235 8 -104 -308 269 99 30 -24 -112 -22 63 146 -133 14 180 -150 -333 -5 15 118
2540 118 -128 -209 52 89 -213 -7 -278 -105 -85 24 -66 384 -78 -161 61 116 43 14 71 -136 80 -122 -148
2563 -148 -61 -92 50 119 -88 167 74 138 149 156 178 -57 207 -28 -216 -9 -178 -129 -45 -68 123 159 106 -204 -101
2588 -101 -38 -161 -24 -90 39 63 24 38 -99 24 349 -52 51 -21 -191 -158 -140 -90 15 258 7 -85 116
2611 116 -23 100 -188 -77 144 -20 5 -118 -98 -127 -88 85 58 50 -7 192 33 27 117 53 -70 118 -102 63
2635 63 -88 68 -163 -63 93 104 152 -103 165 -126 -126 -12 -61 -270 96 260 -187 -249 -194 62 -50 -11 204
2658 204 -155 -178 -2 -84 91 -247 -137 247 -127 -151 81 217 -152 10 32 -151 -384 -208 -332 125 -103
2679 -103 -5 54 -70 66 -52 63 136 -65 183 -70 235 31 140 126 219 101 91 131 11 101 176 180 -50 49
2703 49 -86 -354 -28 -22 232 -164 -72 -163 -7 12 117 222 93 183 67 128 -90 -151 -20 225 -74 -319 140
2726 140 -367 -188 73 -4 16 -97 -135 -439 53 -81 -77 85 -265 -333 96 -16 -149 -182 -127 159 -131 74 187
2749 187 -94 -177 -26 14 -56 47 -151 -111 8 92 40 -155 183 112 -170 -16 -20 -172 -26 102 -97 22 -213
2772 -213 -102 -164 -89 411 -155 10 -170 8 -176 -131 -82 242 81 -399 42 -64 -149 11 -133 224 -126 90
2794 90 -64 -48 125 82 79 -43 -46 -30 123 -81 -59 -78 236 -9 -205 52 -10 -115 -35 -56 -211 -37 -52 39 -59
2819 -59 -47 -87 -181 -125 -67 76 171 -63 -105 -132 -65 66 216 -212 126 -172 91 -234 -108 111 -193 -161 -91 -48
2843 -48 -73 16 -15 36 -233 105 -75 -125 -195 -101 99 169 -121 273 98 55 -8 45 30 -36 174 -159 34 63 332
2868 332 56 95 105 -45 82 -37 20 207 153 115 -108 -241 58 126 1 3 56 -62 -212 -48 85 -135 -218
2891 -218 -5 49 153 -218 -27 123 -97 -18 324 116 -51 -38 31 -106 27 6 37 -144 -129 -21 137 -52
2913 -52 89 295 -66 184 91 -294 20 116 110 -78 231 126 -68 -1 119 -22 247 -94 77 96 -115 -351
2935 -351 178 -113 -58 -20 -71 217 70 -340 -211 132 112 -17 -308 -92 -143 291 51 -132 16 -246 -96 -172
2957 -172 -262 -66 67 74 32 54 72 -76 -176 151 143 -106 -48 -153 271 372 17 -87 150 15 250 113 -57
2980 -57 -123 -158 123 89 -222 201 140 52 16 14 -89 32 146 -78 72 21 -44 -202 69 -76 60 -91 -35 78
3004 78 49 -81 -111 -53 18 -110 132 131 -64 19 21 47 119 -120 -65 74 -146 -72 105 12 -152 -121 111 61 -207 -115
3030 -115 155 94 64 -190 99 -381 62 238 -74 -58 165 -18 -11 341 -94 -191 17 -7 46 -182 -57 30 -142
3053 -142 251 -247 60 73 -62 -361 93 115 -223 36 151 86 173 -21 -59 -197 49 -61 0 3 74 -80 13
3076 13 80 104 228 143 -76 -104 86 129 14 -187 -185 -271 -296 307 -224 -274 -146 -16 -31 190 105 -182 317 135
3100 135 -87 -36 -128 -63 254 -270 39 -163 122 97 -186 128 -119 64 106 46 133 97 4 -385 -53 156 12
3123 12 81 -113 80 142 -134 -69 -101 -137 -79 113 -95 232 -80 90 -30 -5 154 45 158 -112 48 -27 173
3146 173 85 122 -209 185 -96 -127 221 21 -72 -74 108 2 -193 63 -178 -26 -150 -199 -107 -43 77 23 -120
3169 -120 -89 223 118 -5 -197 -172 67 40 -37 94 74 -103 373 4 -62 118 -66 -195 18 -104 -78 33
3191 33 -54 -136 159 -225 12 73 -77 35 210 -243 349 105 43 -186 -178 -80 -285 -30 262 -135 -42 -209 -95
3214 -95 -13 -158 207 -68 -133 -70 -38 -24 -180 237 60 198 -263 250 -171 -29 58 73 -31 90 -94 -208 -207
3237 -207 258 198 -193 -135 141 -287 -35 -8 121 -23 -21 -67 -61 -90 -164 -19 29 160 128 265 -2 -55 122 75 376
3262 376 -39 211 -340 57 207 2 -2 250 40 177 -96 26 242 -139 -37 -88 318 -166 8 103 -41
3283 -41 -56 74 102 -74 119 -138 83 30 4 124 -45 -35 176 217 -8 -75 66 277 -144 52 40 205 106
3306 106 -55 150 -15 40 -178 33 -120 -166 64 197 -40 -87 208 208 118 -84 -224 -261 170 180 -72 -4 -146
3329 -146 -152 33 51 -15 -14 349 -62 -16 -98 -40 -145 -2 -203 -162 50 -140 165 73 138 -52 -41 104 61 183 -182
3354 -182 -210 23 -75 -129 15 22 -186 -81 -172 -234 42 -67 -46 36 31 2 174 181 -172 153 -47 192 -47 241 278
3379 278 -21 -22 72 143 -166 -148 20 61 -94 258 -147 278 110 157 55 -192 -236 30 -22 -100 -41 -211 -18 -52
3403 -52 -33 163 -98 146 147 -114 216 -196 -66 -11 313 -185 33 54 68 209 -99 -100 25 -225 60 -127 117
3426 117 -129 -219 38 -27 -99 -137 -43 -174 -285 -15 153 200 -36 -305 259 138 -11 134 251 143 -21 95
3448 95 -134 149 4 -17 -101 -96 -211 24 300 -312 21 115 39 -44 -18 177 15 240 -123 -110 -39 15 67 -47
3472 -47 14 57 123 -128 -99 22 37 154 -29 -109 361 -92 -7 118 -135 23 -168 -124 17 -340 -62 228 30
3495 30 88 -129 -16 162 -40 -118 66 97 112 -163 323 59 39 -8 153 309 -103 -156 -94 -10 -37 -215 -103 -109
3519 -109 20 -39 -181 178 76 283 -245 154 -282 -64 115 -50 173 -255 68 114 -129 154 77 93 50 -14
3541 -14 213 -56 -195 -38 -18 -78 5 -80 57 154 -34 196 42 86 172 -15 215 -7 118 -138 -48 -124 -24
3564 -24 -228 1 -200 126 215 87 -70 -152 -79 -87 -35 106 -160 107 32 -44 -254 -50 -35 -199 132 125 60 4 -159
3589 -159 72 1 125 75 177 26 65 -74 82 -39 -96 -48 109 10 -97 20 40 -30 -187 145 -189 -44 -291
3612 -291 -101 219 -117 -199 14 -49 151 -147 93 37 270 72 -12 -29 6 -42 -254 1 130 171 -125 -200 -314
3635 -314 -65 -221 174 62 -170 214 -118 -173 37 -181 -288 184 -221 -43 -119 -207 145 -195 -189 227 -134 -124
3657 -124 -144 58 106 7 103 -19 14 43 4 176 25 -109 116 6 96 61 216 -251 -104 -91 10 -44 -13 81
3681 81 -155 120 -189 -299 -96 157 -18 150 59 -27 30 -142 156 -129 -39 110 -12 -175 -89 85 -92 249
3703 249 -304 76 -1 -46 -192 -71 -105 -10 28 -19 163 -57 -154 37 51 -121 -31 -116 -118 140 -147 -100 84 188
3727 188 118 -78 48 -352 -145 270 -210 142 91 -282 313 115 127 267 52 -65 73 -37 -91 114 -11
3748 -11 51 -74 173 -33 16 113 344 -131 99 320 204 -241 120 140 16 31 79 48 -50 152 22 -65 -37 -51
3772 -51 127 -65 -216 -126 -121 -136 1 -5 -3 187 -140 169 76 -133 -267 171 -35 -51 -62 -7 -32 -10 -22 161 -130
3797 -130 -57 -318 -89 -138 -24 -67 2 -49 30 -56 -218 -130 -64 124 -101 -50 -40 94 -49 -114 23 278 101 239
3821 239 11 -79 229 -138 -279 -148 -43 6 -123 26 96 270 -71 -25 184 47 55 153 -3 60 206 49 -252
3844 -252 -182 -108 -276 119 201 -1 -11 -20 -55 69 92 -11 -96 36 -157 68 -133 -109 6 -105 -91 16 -169 -110
3868 -110 66 191 -109 85 72 116 -113 40 326 157 -176 40 -193 -127 -234 322 -115 -59 21 -64 123 -145
3890 -145 215 -105 147 26 124 -126 -75 -223 316 86 -16 40 -189 -93 96 -44 -6 -63 48 65 -109 84
3912 84 34 86 143 -130 -214 -234 -163 -71 1 -185 -96 -26 44 28 104 -169 43 36 -213 -27 -154 -47 4 44 -73 -233
3938 -233 116 -111 -245 -97 74 112 -82 -2 -39 -53 249 -96 -32 -117 -8 70 85 80 182 43 47 168 -118 366
3962 366 -33 -47 1 41 -172 78 50 304 -6 -53 -43 54 232 -26 66 177 -37 196 64 -191 153 63 -64
3985 -64 -353 -121 -95 63 86 -105 142 149 162 -42 -172 287 -100 19 -31 -36 51 -188 117 47 -345 74 214 96
4009 96 30 26 106 -92 -123 91 -29 213 59 -132 95 95 91 -114 -121 115 55 178 52 73 -187 -126 160 -176 -255
4034 -255 -275 88 16 142 51 -269 -57 -29 172 -196 -36 -56 -81 4 42 -159 -138 180 86 -149 232 41 6 172
4058 172 39 -52 91 -58 -75 26 -47 -141 -241 5 133 127 201 140 142 29 -52 -108 140 68 -182 119 9 -189
4082 -189 -25 -194 -176 237 36 107 60 -90 -108 4 111 -3 241 -157 141 38 91 41 154 -21 -38 -117 -15
4105 -15 -103 -299 106 -71 -208 -141 60 -170 5 157 243 -65 169 73 -191 -7 13 -108 96 -303 47 -33
4127 -33 -49 16 -17 -285 58 253 187 30 -178 -78 -212 68 71 98 -96 246 -194 61 123 21 -68 -3 106 9
4151 9 13 139 -169 120 29 -146 -101 -136 -69 -46 -199 200 -310 -118 -190 80 38 162 -86 217 74 -87 -101 -101 11
4176 11 -151 73 44 -20 -31 109 69 -18 61 231 148 151 49 139 -98 -235 133 -58 182 136 -116 84 -186 -285
4200 -285 56 -166 287 138 -101 -143 113 -187 -32 227 281 -174 69 -87 15 -76 123 -201 -175 -127 61 -170
4222 -170 151 90 -169 -17 -51 -94 42 -147 115 67 -62 -270 -221 -8 108 156 -222 -55 120 1 -251 -174
4244 -174 72 -316 -17 -32 83 -68 -160 211 -10 82 148 65 123 31 99 287 -272 26 -108 -173 -22 219 -266
4267 -266 -223 -512 48 -16 182 -293 -164 8 -157 -3 228 -12 22 39 -257 26 55 -18 123 117 -171 84 25
4290 25 -239 -166 -82 -117 71 -17 40 46 -121 -70 67 67 62 0 -185 -116 -262 -90 -156 246 39 -2 -50 -224 136 -130
4316 -130 -31 51 -73 -13 133 47 -133 85 10 -252 -122 138 165 -95 -38 273 49 -72 59 -32 125 -71 73
4339 73 113 -268 -124 -72 87 149 39 274 244 226 -155 48 104 -49 -64 -77 -244 33 127 104 -105 79 13 -47
4363 -47 -209 6 15 -144 243 5 -217 -47 -446 -18 -311 100 22 -183 168 3 67 187 -88 -43 -76 108
4385 108 -137 0 -33 6 -131 171 -61 32 -32 382 -109 -311 -252 84 236 -76 -7 73 64 116 -132 -77 32 218
4409 218 58 -13 162 42 21 144 -132 -76 -32 39 -84 -25 90 -116 -24 -79 150 320 110 8 -47 -80 -109 2
4433 2 -108 -77 214 -60 -31 -6 -41 216 -63 -88 -192 143 -176 23 218 -65 112 -99 184 68 72 -49 -268
4456 -268 49 -4 -131 -210 -40 -98 258 121 183 105 -182 -112 -60 81 35 -262 64 55 11 -134 -52 86 132 -23
4480 -23 42 20 162 81 -131 -94 -197 -18 -120 194 334 61 -102 323 60 78 -119 67 6 189 -34 13 104
4503 104 119 41 168 53 212 18 121 54 -150 84 -157 -365 -179 -199 136 291 258 210 101 -4 81 -157
4525 -157 -117 -248 -55 -197 -271 -140 30 194 102 37 -16 3 95 101 21 258 -58 318 -69 13 -137 -157 97 -204
4549 -204 86 36 -59 -80 -256 88 -101 -168 -34 -35 164 -161 -285 189 -242 18 4 26 33 -67 323 37 100 -46
4573 -46 62 -54 119 -35 140 -65 287 146 -49 112 110 -318 -262 -85 -54 -231 38 -357 93 86 -76 34
4595 34 48 -20 166 154 83 -73 -25 176 -23 -192 232 -63 -98 110 -115 -243 205 17 -26 159 -43 -23 28
4618 28 -260 86 -76 -159 -30 -165 114 -344 286 94 -132 204 97 28 -217 -113 43 383 51 -19 -251
4639 -251 297 161 -43 1 -176 219 74 -48 -140 108 176 -30 16 -152 61 -98 -40 -151 105 -79 2 -278
4661 -278 -169 25 130 197 -315 -34 -49 45 -150 88 -15 71 39 -16 -224 163 75 -76 46 -161 90 91 46
4684 46 27 -35 126 279 4 -222 -113 50 -237 -32 133 129 12 120 -241 -198 -29 72 88 168 236 62 81
4707 81 211 -110 43 171 -31 -22 62 -17 213 -19 142 63 3 -224 50 54 -351 178 78 64 22 259 5 -112
4731 -112 170 146 155 -151 87 72 -34 68 147 -223 232 93 -65 -58 253 179 76 -105 185 99 -123 300 -84
4754 -84 -31 14 -165 14 -20 208 -105 -73 8 14 48 -84 -230 -182 -166 -306 -149 68 -249 -60 196 123 48 123 -63
4779 -63 -106 76 51 -230 -184 47 -116 63 99 -88 -94 194 85 158 -103 249 154 -182 45 -129 200 -3 -16
4802 -16 -101 -114 169 62 -95 -304 -194 11 22 -103 8 -348 108 34 -121 -378 80 -44 -176 -69 45 -52
4824 -52 -29 -154 -31 13 22 218 -25 -33 141 -214 6 147 -308 227 180 -45 -34 283 -32 8 36 119 -109 2
4848 2 -187 60 -56 108 -120 -181 22 -327 152 50 124 7 136 -157 122 21 -9 -15 -154 -294 -244 104 15
4871 15 89 -264 -87 -95 -87 168 -351 -86 -215 27 -3 153 -46 35 220 -165 -272 214 61 -119 154 -328 -128
4894 -128 166 117 -167 -6 -93 166 -7 143 160 42 -193 69 -17 -37 -72 -148 151 116 -121 120 -32 -33 171
4917 171 -169 -148 33 95 26 -71 148 141 -84 36 -282 51 180 119 -203 20 -65 -77 64 -149 -84 109 68 237
4941 237 -60 -77 -7 -70 -151 85 -157 63 -20 44 -2 164 -128 -56 254 133 50 -8 107 145 168 -88 -19 -132
4965 -132 331 -201 -243 34 5 -61 39 -180 246 -179 28 -110 -150 51 -74 349 -16 103 -96 236 161 -110
4987 -110 101 92 113 45 -155 -32 39 -99 87 72 75 360 71 108 47 -42 -111 -134 68 35 -223 65 -186 154 145
5012 145 194 -119 -8 66 -132 159 -47 303 -10 31 10 -130 -58 -100 24 25 -60 -3 368 80 20 64 13 128
5036 128 219 120 -112 90 51 -101 363 -72 34 -43 23 -188 -139 -133 124 -82 69 -28 0 -117 120 81 -130 -113
5060 -113 127 -120 -38 -273 -4 -63 59 -142 -100 88 214 8 -69 24 270 -149 203 81 -54 51 -93 70
5082 70 -184 -363 -36 207 22 213 113 -23 25 200 136 -237 -42 -1 96 -150 90 -116 135 71 31 -133
5104 -133 11 135 -8 59 1 -211 -155 -10 -89 -28 -6 242 308 20 -190 214 124 121 107 162 -86 -87 61 39 -38
5129 -38 19 78 170 63 -146 -7 -195 92 172 -69 232 -19 102 242 -19 55 -30 -127 59 -36 -247 193 130
5152 130 -28 95 -39 -11 -94 89 -37 97 135 -13 -70 -30 -127 0 -175 -216 130 120 45 -60 -76 5 -68 40
5176 40 -222 173 39 -49 -40 151 -128 71 181 -26 -35 94 113 132 -42 3 190 1 -190 20 -184 -277 -94
5199 -94 148 215 -15 -64 53 -105 -135 174 -136 -22 -17 174 71 -70 -58 13 140 -263 20 36 -143 137 -49
5222 -49 58 223 -122 278 -206 252 -20 15 -24 -158 196 -79 -69 5 -90 -62 127 -170 86 183 -63 121 36
5245 36 130 -252 7 161 -138 368 126 -107 -124 97 -99 0 -220 292 140 -228 61 -44 69 354 -83
5266 -83 -55 242 -226 225 -36 -245 -17 -203 -25 -9 35 221 153 122 150 172 -120 -86 262 -69 -216 -20 2
5289 2 98 281 -48 44 -132 -288 -9 -134 -33 -122 -169 -46 209 -141 -137 -165 -49 -40 -64 -97 -21 -45 -233 109 59
5314 59 -86 -138 -149 -273 191 253 92 -247 193 -82 29 173 -61 -75 222 -247 -26 150 24 28 -123 137
5336 137 95 -163 -45 135 -118 -301 -212 90 -119 385 -119 242 21 -41 2 -121 95 125 -303 7 67 -98
5358 -98 -44 133 319 106 91 -28 142 137 88 -11 -325 82 48 35 -48 -154 -66 -84 127 97 55 -65 -53 117 121 -61
5384 -61 -162 -83 65 -127 -385 39 -78 -116 -56 1 172 -29 -47 9 -328 204 143 70 -110 112 291 91 146
5407 146 -234 -139 -99 135 174 -9 -92 -50 -184 272 18 86 -29 31 -67 -19 -179 -93 -272 118 22 43 -179 -248
5431 -248 -137 32 23 -6 -10 97 20 -222 99 -134 -362 270 -283 -52 -44 -122 -56 -145 -138 136 19 -40 119 46 10
5456 10 231 -108 104 284 3 92 -202 96 -17 -74 -119 -127 -54 -113 -84 68 74 126 -150 244 -60 174 91 -76
5480 -76 -201 -3 41 51 3 -275 178 21 -46 42 185 -31 -181 -53 -43 346 90 -293 248 -92 261 -243
5502 -243 -76 -260 54 13 122 -142 10 41 188 97 66 187 24 -134 76 -38 153 68 138 58 -23 55 -28
5525 -28 178 26 29 50 112 -34 -144 -39 96 -96 6 32 -80 28 34 -239 -226 -11 80 -107 124 -286 112
5548 112 -61 17 167 27 134 30 70 -210 46 -171 0 -37 250 -30 -171 188 8 -273 53 19 -67 -131
5570 -131 -20 -126 70 -53 7 -77 34 -99 -97 -143 -59 137 -135 233 82 142 152 -53 -4 202 185 25 67 -151
5594 -151 -47 -90 49 -43 -236 107 120 42 1 64 1 -94 258 80 80 86 126 -123 -32 -365 55 -100 90 115 -31
5619 -31 215 172 -20 -101 -183 26 -95 12 114 -54 98 -25 -4 -65 97 23 109 -186 153 26 -25 -201 -353
5642 -353 186 -112 -219 24 64 249 -92 150 -175 119 17 -179 241 -91 -53 -127 106 -19 275 135 104
5663 104 -193 52 -99 -227 -5 23 84 -154 1 122 250 -195 -179 111 86 133 -61 19 218 80 -168 -147
5685 -147 155 -132 -58 -94 -261 -123 -17 140 -4 34 124 175 20 -29 122 65 -65 -150 -231 33 -94 29 125
5708 125 -42 -127 -54 200 -34 107 -23 1 -114 -217 0 178 84 145 120 -30 162 53 -163 -98 -110 57 -106
5731 -106 115 -152 -1 -54 -10 162 -70 -65 -70 -167 -120 -488 83 -52 154 57 -175 -337 66 -173 -284 -6 4
5754 4 88 -37 377 -242 101 97 -3 31 154 178 151 -21 82 -37 -52 154 39 194 -36 -118 -395 109 12 -100
5778 -100 -60 -64 -9 -51 172 -69 -26 55 126 -214 -117 197 284 67 115 60 -3 21 173 -12 293 -158 125 135 178
5803 178 -7 -341 -159 308 -129 -12 -309 165 91 -191 -131 200 -2 14 68 19 50 56 108 15 -103 70 -115
5826 -115 97 127 10 -13 185 272 98 90 -67 8 -95 493 59 17 -120 39 -63 66 -148 -124 -6 63 -164
5849 -164 135 29 -228 171 -210 -284 -123 -10 -48 -233 -325 86 -83 -126 117 147 73 94 -6 6 -96 -56 -137
5872 -137 -36 -124 40 47 -115 -89 -112 -201 24 -134 -280 112 -51 -173 -149 230 -82 89 144 -204 -67 -127 35
5895 35 59 115 -64 -271 46 95 -104 254 -53 3 58 -78 179 158 151 186 -24 37 -166 17 -118 -82 5 200
5919 200 -58 22 -320 -330 226 -222 -40 -32 -63 -117 -53 -68 150 20 -164 114 78 13 21 -84 -107 59 -174 139
5943 139 -85 184 -105 242 117 -104 -103 -106 75 -86 -40 1 118 -64 136 126 -70 -107 -55 -23 26 100 -18 -180
5967 -180 116 -20 -247 -38 -37 -79 -160 -181 50 -50 7 31 15 19 126 219 -126 4 94 37 46 34 -59 104 -178 -106
5993 -106 168 -99 -234 -21 0 151 100 -77 47 57 13 165 -241 11 52 -96 -102 -135 -40 -65 -95 -228 -30 -10
6017 -10 22 -159 38 94 26 65 50 231 -10 1 6 147 28 -150 -260 -236 -33 -278 174 -109 -63 125 -45 -127
6041 -127 -253 -11 165 169 43 304 5 -79 300 44 29 34 -191 -212 -230 33 -11 -36 37 30 41 3 -156 263 7
6066 7 -107 -343 -7 410 329 -228 119 9 -34 -41 27 65 -50 6 -14 -182 163 2 11 -98 119 58 45 -26 58
6091 58 108 249 -246 41 -31 -70 -4 49 -9 -102 245 -137 156 -90 -17 -230 -236 -184 -211 -149 89 -318 -16 82 69
6116 69 45 -89 -10 -290 -122 59 -304 -7 102 -246 114 -150 -86 -32 57 -20 66 63 -201 231 -49 -321 -195
6139 -195 201 64 -93 147 -220 -22 106 -47 -267 75 -31 -30 -166 27 -39 -197 23 29 -10 82 -103 170
6161 170 -101 -80 149 -308 98 155 -83 65 85 -497 340 -178 -88 27 60 -202 -24 161 69 81 42 80 282
6184 282 74 -309 38 -308 -151 -222 -62 -274 251 -49 81 -3 -37 147 103 275 -98 305 287 -95 -11 -101
6206 -101 -168 10 -112 -191 -234 -279 82 -100 -23 -242 -61 -70 68 58 147 91 -197 -71 36 33 -151 110 153 -65
6230 -65 13 209 -43 120 32 18 -152 111 112 154 -78 -203 -174 -122 -61 82 -61 -78 119 -123 -49 -216 82 232
6254 232 -105 -19 -183 190 -7 119 -12 -96 218 -302 136 -128 25 159 37 -38 116 73 -124 82 -54
6275 -54 220 153 -124 87 -12 182 -125 40 -24 -160 -70 -423 -36 -91 26 -25 49 75 -68 -185 92 -60 -15
6298 -15 502 -83 190 349 58 88 -167 79 30 111 1 119 -126 254 -26 -1 440 268 287 -168 -8 -57
6320 -57 174 -14 -206 -36 184 -47 -26 91 313 -137 -117 -304 122 40 -55 -50 78 -105 110 95 246 71 80
6343 80 66 -103 -37 -53 -11 186 -85 224 -78 206 -266 -250 -97 15 79 -162 185 -56 59 -39 80 -269 -106
6366 -106 -50 -32 67 92 -24 234 -26 42 60 136 21 104 -7 -105 21 -69 -133 78 -45 -260 -98 -1 17 40 -39
6391 -39 9 67 -407 -38 -41 -39 175 57 -198 392 276 155 120 161 383 -303 -66 20 -55 178 -171 -91 -317 -66
6415 -66 2 -159 42 -54 7 132 -84 107 52 64 80 73 -20 10 -142 -54 220 -96 -76 63 87 -7 415 0 55
6440 55 8 44 -16 135 -136 111 -195 -87 63 261 166 169 -48 -97 -4 238 236 -158 138 167 -80 -144 129 88 83
6465 83 169 113 47 111 -17 136 43 170 38 11 -39 52 11 211 259 92 21 -7 70 147 -36 175 77 -116 64
6490 64 132 -144 185 -95 -304 -119 96 -100 -52 15 -215 -34 238 -198 284 191 17 9 -28 -341 -51 130 152
6513 152 81 -45 -113 -169 52 8 -40 264 189 223 46 -59 13 -143 -157 65 -90 49 70 -109 54 88 24 -52
6537 -52 206 -44 115 135 72 -2 105 60 37 -52 186 42 -7 -34 53 -58 39 -106 158 -91 146 61 -394 -79
6561 -79 91 -238 -6 -90 -212 124 -59 102 -168 -29 -186 59 280 23 -243 -181 -225 -352 121 -170 110
6582 110 228 -64 -97 87 -48 -55 116 52 -23 -176 -78 199 56 -187 -61 417 -41 -25 -26 -36 -18 72 -494 -96
6606 -96 55 -64 107 -60 -61 178 -86 -47 -328 -77 88 22 -281 -77 14 272 91 11 -4 226 175 48 -41
6629 -41 -85 -97 2 56 88 -28 5 -219 65 150 230 -115 6 23 19 80 29 34 38 -112 175 108 81 80 -323 223 -4
6656 -4 -106 -355 -32 53 71 106 -110 7 46 133 -41 171 -3 140 44 132 51 79 71 -121 146 128 88 -167 104
6681 104 329 85 -312 138 -196 153 187 202 -21 -228 105 49 -5 273 251 -57 -95 -66 143 8 132 92 86
6704 86 -135 241 233 -24 51 151 -46 132 -8 216 -53 139 40 285 -50 124 -37 -146 134 226 63 148
6726 148 88 -141 -82 -11 -125 -134 288 -67 166 2 -41 -94 30 41 -32 -14 -158 365 58 -59 22 -105 100 112
6750 112 179 279 -151 -64 93 -331 15 30 70 -112 -120 39 -153 203 -244 -155 127 -127 -265 -33 -181 -106 -74
6773 -74 -68 -358 -87 -112 -206 -43 -54 110 38 -83 -33 196 -120 35 -96 119 192 103 -54 -288 -158 -64 212 -122
6797 -122 114 -139 70 -44 -79 -176 -119 -76 53 57 -125 170 -30 -43 -4 116 55 -44 -342 136 -120 -108 23 15
6821 15 326 150 46 -312 -47 -55 155 -107 -288 -248 226 244 -115 -173 -83 73 90 237 -59 -98 -6 3 -213 -85
6845 -85 324 173 234 -207 -29 -96 -103 -55 -90 -71 -54 -202 67 14 136 -88 220 61 101 -28 2 -218 82 113
6869 113 -33 96 -264 -29 -98 -5 64 -85 -5 -8 -141 -260 -119 38 100 227 -112 -178 -110 -107 137 -196 -178 75
6893 75 -34 -94 42 101 -57 13 -114 296 -124 229 -49 -52 -279 29 -144 -72 -96 -54 140 -64 -140 -38 112
6916 112 144 29 -109 28 -195 -91 82 -256 -52 -52 80 -85 25 -151 102 238 -159 95 169 -2 -346
6937 -346 -135 100 -45 31 -262 27 -26 70 -218 99 -91 -11 165 -64 -55 -153 214 13 134 -150 89 36 -127
6960 -127 112 78 -10 -11 242 -162 101 -137 431 197 -334 119 -16 -28 -155 126 -1 -40 -192 191 -117 136
6982 136 109 209 94 -25 0 -356 -55 156 -38 43 -142 -51 -105 14 87 133 -116 -84 -170 64 -182 -99 44
7005 44 69 236 199 -25 -186 -98 -87 310 -268 16 -139 -62 -213 137 124 19 89 -61 58 -40 90 -50 -26
7028 -26 -194 41 32 -35 -113 307 86 65 -121 -46 -63 -46 38 -27 -64 21 174 -74 -6 -46 208 67 -73 -14 289
7053 289 -81 14 101 181 -136 65 255 186 45 122 -102 -54 -232 -221 -2 45 -92 14 35 -153 131 20 -1
7076 -1 11 -380 -399 -303 75 30 51 132 170 74 -111 -46 21 -192 -143 -116 40 101 -147 169 -78 -168 151 -39 -124 -100
7102 -100 -190 -204 149 -89 -55 -395 -70 12 -66 58 -26 -9 -24 112 -127 -293 -44 -59 7 127 -62 -123 -14 -31
7126 -31 64 -94 -24 67 25 -73 25 289 186 -114 164 -99 118 371 -136 32 2 -3 104 -288 -14 -143 -152 -86
7150 -86 -118 163 41 35 58 0 122 51 -196 -248 -3 -43 -196 -220 -414 112 -65 40 -94 -44 -1 25 -99 -89 -135
7175 -135 63 202 -17 238 130 -239 40 -132 139 303 -161 82 -86 28 -15 118 128 -126 298 -135 204
7196 204 -97 355 58 -326 -18 170 -110 115 -110 101 250 131 160 59 58 -12 136 -71 89 150 -22 -62
7218 -62 108 216 78 -181 10 -129 58 114 -25 214 127 -30 92 -348 173 -15 155 -133 -15 134 -96
7239 -96 -62 -111 179 77 -364 151 -148 45 254 -1 -22 140 4 32 -95 -129 -13 -134 -89 -85 112 -39 -109
7262 -109 33 -41 17 -156 -89 -121 -205 38 -37 -80 1 -122 -217 295 104 -26 16 149 -17 21 -48 16 196 -161
7286 -161 -118 -39 174 -174 233 19 226 -114 26 -44 -8 86 104 92 42 -209 37 -89 22 42 -82 -185 -198
7309 -198 48 11 118 1 -2 134 -68 -155 -8 -205 400 -44 -22 -30 -82 -5 -172 -138 -146 125 -153 149 170 63
7333 63 144 257 -95 -152 -183 216 128 19 5 42 129 97 51 313 140 -174 224 -66 60 -132 -8 82 13 -546
7357 -546 -92 469 22 212 93 -224 83 141 44 -65 -57 -99 -227 168 -24 -316 -122 -86 -7 -3 -258 14 -19
7380 -19 118 -300 90 74 -133 180 349 61 -45 -40 44 -30 -30 -10 -294 -7 -50 67 326 -38 -98 -48 219 -30
7404 -30 97 143 -96 -145 -4 129 -164 254 4 -62 41 -19 -177 -146 301 51 -29 -126 -214 45 78 235 -24
7427 -24 140 -126 42 -33 -71 4 115 90 250 201 79 127 -352 289 -156 -254 -165 293 -285 -39 200 -135 34
7450 34 116 295 -39 -75 -321 -144 -147 -218 48 57 101 35 341 63 95 -26 109 -14 -86 4 65 -181 -58 -236 -261
7475 -261 246 7 -114 227 -110 161 79 -173 3 89 -41 -166 -94 -25 26 0 42 -125 288 10 -26 38 -209
7498 -209 155 141 216 -145 -96 68 56 86 86 -118 -12 -14 -89 -31 -14 -5 116 24 53 -40 -102 34 -63 156 -63 -37 80
7525 80 20 -15 64 -58 -307 -116 150 -2 189 125 115 25 -87 13 74 -14 -126 -193 152 44 -97 22 77 -210
7549 -210 117 -122 191 -50 67 5 -198 -269 -279 152 -136 -8 116 153 -195 5 -11 -167 -98 84 58 15 87
7572 87 -44 61 -21 31 -62 -177 -32 150 -35 92 145 121 13 27 -137 -164 125 -180 -76 137 -146 19 22
7595 22 99 -98 30 43 139 -1 -9 -64 60 -56 411 -232 -10 -120 55 172 105 136 -98 74 34 -152 2
7618 2 98 252 118 -22 -127 74 -283 9 102 -149 -146 46 147 -232 -105 -1 -32 -105 -33 -5 284 -29 -109 105
7642 105 46 -153 100 8 -76 60 -10 82 -102 -3 -129 -62 -73 -12 15 -38 12 258 60 25 5 28 -57 65 -67
7667 -67 -31 269 143 70 -83 -123 -116 -59 -9 179 95 -39 37 -38 -1 47 219 -115 173 -204 101 -189 -272 46 96
7692 96 -123 -162 -120 -57 20 97 0 26 59 25 32 34 105 -85 51 -114 -101 -274 48 -98 -81 218 100 12 22 76 -32
7719 -32 -270 250 194 -25 34 -146 -18 101 208 -258 197 153 79 -142 -90 82 154 51 -91 -194 -158 15 -37
7742 -37 -33 -29 352 9 -108 -108 163 -85 -99 -122 -79 35 -144 82 -67 -20 -210 -183 -82 -272 -22 49 103 -74 47
7767 47 -189 168 -4 190 94 -80 -183 219 -251 -49 5 -243 116 154 129 -41 -42 -1 -11 192 -123 82 -17
7790 -17 -60 -274 -264 77 72 204 -188 139 -7 190 122 -267 57 -329 -65 -100 -110 192 -195 -164 -14 -83 -67 -20
7814 -20 -125 -262 224 -240 7 109 223 90 -1 130 103 11 88 78 -6 385 141 80 -175 -59 120 -61 26
7837 26 153 7 186 252 218 -149 -133 59 155 32 97 -309 -51 235 94 -60 68 55 93 -9 -154 -67 -72 119
7861 119 93 230 -216 37 -73 -7 120 133 31 -38 -92 83 -202 -50 5 -42 233 203 -7 -26 -44 -135 -25 42
7885 42 -131 186 -172 28 10 115 -164 162 11 102 34 -144 90 -72 188 19 -270 86 171 -119 -81 227
7907 227 32 174 35 79 51 -76 20 -418 240 -224 72 66 119 229 -182 -121 -224 21 -223 -95 -175 -225 83
7930 83 279 47 -134 86 -196 121 72 165 133 -277 164 398 -90 77 157 -73 -21 308 -137 -53 158 -105
7952 -105 64 -232 56 -28 128 66 78 37 -81 213 97 -146 18 -44 -2 -105 92 113 147 12 -22 -115 -62 -50
7976 -50 -100 18 105 192 462 239 -77 57 31 -14 40 114 -171 -131 -163 107 -205 -50 221 212 -71 243 -39 -189
8000 -189 43 128 98 45 193 -129 88 23 89 216 -156 220 142 -10 152 41 -23 190 -61 -9 180 98 -31
8023 -31 -207 -28 134 27 54 20 -178 68 -110 14 -192 -59 -135 176 -259 111 -132 -78 267 -273 45 371
8045 371 213 -27 163 -214 62 43 -20 253 -85 -268 403 32 -75 24 82 -220 -10 -240 -130 -28 -120 35
8067 35 -240 -91 -8 24 -30 -216 170 -17 3 41 68 -103 118 69 -16 -89 11 47 104 -15 -40 7 -60 55 -65
8092 -65 -104 -56 269 226 -151 -52 -55 -146 -206 -113 249 25 196 -25 -68 34 4 230 206 -12 -53 29 -146 76 262
8117 262 -244 201 -36 172 76 51 -76 -103 -11 94 -104 -100 -121 -137 -110 236 -224 -47 134 7 65 99 -157 84
8141 84 44 -43 205 72 -296 -244 49 -113 -128 -157 -22 -29 -214 -43 -55 31 -86 13 282 214 -181 -35 -192 -76
8165 -76 -20 -129 22 12 -207 -67 -53 -158 21 -78 -25 321 -36 44 49 -105 -144 182 392 -39 196 51 -47 -52
8189 -52 270 114
8191A14
##END NTUPLES=NMR FID
##END=
