##TITLE=1H_CA-8537
 CDCl3, 8 sc, 
 18.1.2019
##JCAMPDX= 6.0         $$ Bruker NMR JCAMP-DX V2.0
##DATA TYPE= NMR FID
##DATA CLASS= NTUPLES
##ORIGIN= UXNMR, Bruker Analytische Messtechnik GmbH
##OWNER= root
$$ XWIN-NMR		Version 3.5
$$ Fri Jan 18 16:07:32 2019 Russian Standard Time (UT+4h)  she@DPX200
##.OBSERVE FREQUENCY= 200.1313
##.OBSERVE NUCLEUS= ^1H
##.DELAY= (6, 6)
##.ACQUISITION MODE= SIMULTANEOUS
##.ACQUISITION SCHEME= undefined
##.AVERAGES= 8
##.DIGITISER RES= 18
##SPECTROMETER/DATA SYSTEM= spect
##.PULSE SEQUENCE= zg30
##.SOLVENT NAME= D2O
##.SHIFT REFERENCE= (INTERNAL, D2O, 0, 15.7039)
##AUDIT TRAIL= $$ (NUMBER, WHEN, WHO, WHERE, WHAT)
$$ ##TITLE= Audit trail, XWIN-NMR		Version 3.5
$$ ##JCAMPDX= 5.01
$$ ##ORIGIN= Bruker BioSpin GmbH
$$ ##OWNER= she
$$ F:/spectra/data/she/nmr/H-F/1/audita.txt
$$ ##AUDIT TRAIL=  $$ (NUMBER, WHEN, WHO, WHERE, WHAT)
(   1,<2019-01-18 16:06:22.65 +0400>,<she>,<DPX200>,
      <created by zg, POWCHK disabled, PULCHK disabled
       configuration hash MD5:
       00 E9 B6 7A A2 85 ED C7 34 08 36 98 17 FE 4E 26
       data hash MD5: 16K
       C2 73 D8 C6 18 E1 CA 01 9E C2 B2 64 4F 08 C0 8F>)
$$ ##END=
$$ 
$$ hash MD5
$$ 97 B0 77 EF 6F C7 B6 B1 40 B0 85 A6 26 82 8B 8E
##$RELAX= 
##$RELAX= 
##$RELAX= 
##$RELAX= 
##$RELAX= 
##$RELAX= 
$$ Bruker specific parameters
$$ --------------------------
##$DU= <F:/spectra>
##$EXPNO= 1
##$NAME= <H-F>
##$PROCNO= 1
##$TYPE= <nmr>
##$USER= <she>
##$AMP= (0..31)
100 100 100 100 100 100 100 100 100 100 100 100 100 100 100 100 100 100 
100 100 100 100 100 100 100 100 100 100 100 100 100 100 
##$AQSEQ= 0
##$AQ_mod= 1
##$AUNM= <au_zg>
##$AUTOPOS= <>
##$BF1= 200.13
##$BF2= 200.13
##$BF3= 200.13
##$BF4= 200.13
##$BF5= 200.13
##$BF6= 200.13
##$BF7= 200.13
##$BF8= 200.13
##$BYTORDA= 1
##$CFDGTYP= 0
##$CFRGTYP= 5
##$CHEMSTR= <none>
##$CNST= (0..31)
1 1 145 1 1 1 1 1 1 1 1 1 1 1 1 1 1 1 1 1 1 1 1 1 1 1 1 1 1 1 1 1 
##$CPDPRG= <>
##$CPDPRG1= <>
##$CPDPRG2= <>
##$CPDPRG3= <>
##$CPDPRG4= <mlev>
##$CPDPRG5= <mlev>
##$CPDPRG6= <mlev>
##$CPDPRG7= <mlev>
##$CPDPRG8= <mlev>
##$CPDPRGB= <>
##$CPDPRGT= <>
##$D= (0..31)
0 1.2 0 0 0 0 0 0 0 0 0 0.03 0 0 0 0 0 0 0 0 0 0 0 0 0 0 0 0 0 0 0 0 
##$DATE= 1547813182
##$DBL= (0..7)
120 120 120 120 120 120 120 120 
##$DBP= (0..7)
150 150 150 150 150 150 150 150 
##$DBP07= 0
##$DBPNAM0= <>
##$DBPNAM1= <>
##$DBPNAM2= <>
##$DBPNAM3= <>
##$DBPNAM4= <>
##$DBPNAM5= <>
##$DBPNAM6= <>
##$DBPNAM7= <>
##$DBPOAL= (0..7)
0.5 0.5 0.5 0.5 0.5 0.5 0.5 0.5 
##$DBPOFFS= (0..7)
0 0 0 0 0 0 0 0 
##$DE= 6
##$DECBNUC= <off>
##$DECIM= 32
##$DECNUC= <off>
##$DECSTAT= 4
##$DIGMOD= 1
##$DIGTYP= 9
##$DL= (0..7)
0 120 120 120 120 120 120 120 
##$DP= (0..7)
150 150 150 150 150 150 150 150 
##$DP07= 0
##$DPNAME0= <>
##$DPNAME1= <>
##$DPNAME2= <>
##$DPNAME3= <>
##$DPNAME4= <>
##$DPNAME5= <>
##$DPNAME6= <>
##$DPNAME7= <>
##$DPOAL= (0..7)
0.5 0.5 0.5 0.5 0.5 0.5 0.5 0.5 
##$DPOFFS= (0..7)
0 0 0 0 0 0 0 0 
##$DQDMODE= 0
##$DR= 18
##$DS= 0
##$DSLIST= <SSSSSSSSSSSSSSS>
##$DSPFIRM= 0
$$ [...]
##$SUBNAM2= <"">
##$SUBNAM3= <"">
##$SUBNAM4= <"">
##$SUBNAM5= <"">
##$SUBNAM6= <"">
##$SUBNAM7= <"">
##$SUBNAM8= <"">
##$SUBNAM9= <"">
##$SW= 20.0189088683792
##$SWIBOX= (0..15)
0 0 2 0 0 0 0 0 0 0 0 0 0 0 0 0 
##$SW_h= 4006.41025641026
##$TD= 16384
##$TD0= 1
##$TE= 0
##$TE2= 300
##$TE3= 300
##$TEG= 300
##$TL= (0..7)
0 120 120 120 120 120 120 120 
##$TP= (0..7)
150 150 150 150 150 150 150 150 
##$TP07= 0
##$TPNAME0= <>
##$TPNAME1= <>
##$TPNAME2= <>
##$TPNAME3= <>
##$TPNAME4= <>
##$TPNAME5= <>
##$TPNAME6= <>
##$TPNAME7= <>
##$TPOAL= (0..7)
0.5 0.5 0.5 0.5 0.5 0.5 0.5 0.5 
##$TPOFFS= (0..7)
0 0 0 0 0 0 0 0 
##$TUNHIN= 0
##$TUNHOUT= 0
##$TUNXOUT= 0
##$USERA1= <user>
##$USERA2= <user>
##$USERA3= <user>
##$USERA4= <user>
##$USERA5= <user>
##$V9= 5
##$VALIST= <valist>
##$VCLIST= <CCCCCCCCCCCCCCC>
##$VD= 0
##$VDLIST= <DDDDDDDDDDDDDDD>
##$VPLIST= <PPPPPPPPPPPPPPP>
##$VTLIST= <TTTTTTTTTTTTTTT>
##$WBST= 1024
##$WBSW= 4
##$XGAIN= (0..3)
0 0 0 0 
##$XL= 0
##$YL= 0
##$YMAX_a= 127752
##$YMIN_a= -211603
##$ZGOPTNS= <>
##$ZL1= 120
##$ZL2= 120
##$ZL3= 120
##$ZL4= 120
##$ABSF1= 10
##$ABSF2= 0
##$ABSG= 5
##$ABSL= 3
##$ALPHA= 0
##$AQORDER= 0
##$ASSFAC= 0
##$ASSFACI= 0
##$ASSFACX= 0
##$ASSWID= 0
##$AUNMP= <proc_1d>
##$AZFE= 0.1
##$AZFW= 0.1
##$BCFW= 1
##$BC_mod= 2
##$BYTORDP= 1
##$COROFFS= 0
##$CY= 11.3945322036743
##$DATMOD= 1
##$DC= 2
##$DFILT= <>
##$DTYPP= 0
##$F1P= 18.9103706918063
##$F2P= -1.10871071338519
##$FCOR= 0.5
##$FTSIZE= 0
##$FT_mod= 4
##$GAMMA= 1
##$GB= 0.15
##$INTBC= 1
##$INTSCL= 1
##$ISEN= 128
##$LB= 0.24
##$LEV0= 0
##$LPBIN= 0
##$MAXI= 10000
##$MC2= 0
##$MEAN= 0
##$ME_mod= 0
##$MI= 1.114404
##$NCOEF= 0
##$NC_proc= 0
##$NLEV= 6
##$NOISF1= 3.799351
##$NOISF2= 2.8
##$NSP= 1
##$NTH_PI= 0
##$NZP= 0
##$OFFSET= 15.70392
##$PC= 1
##$PHC0= -9062.082
##$PHC1= 22.60004
##$PH_mod= 1
##$PKNL= yes
##$PPARMOD= 0
##$PSCAL= 0
##$PSIGN= 0
##$REVERSE= no
##$SF= 200.130013532006
##$SI= 16384
##$SIGF1= 3
##$SIGF2= 2
##$SINO= 400
##$SIOLD= 16384
##$SREGLST= <1H.CDCl3>
##$SSB= 0
##$STSI= 0
##$STSR= 0
##$SW_p= 3612.71676300578
##$SYMM= 0
##$S_DEV= 0
##$TDeff= 0
##$TDoff= 0
##$TI= <>
##$TILT= no
##$TM1= 0
##$TM2= 0
##$TOPLEV= 0
##$USERP1= <user>
##$USERP2= <user>
##$USERP3= <user>
##$USERP4= <user>
##$USERP5= <user>
##$WDW= 1
##$XDIM= 8192
##$YMAX_p= 0
##$YMIN_p= 0
$$ End of Bruker specific parameters
$$ ---------------------------------
##NTUPLES= NMR FID
##VAR_NAME=  TIME,          FID/REAL,        FID/IMAG
##SYMBOL=    X,             R,               I
##VAR_TYPE=  INDEPENDENT,   DEPENDENT,       DEPENDENT
##VAR_FORM=  AFFN,          ASDF,            ASDF
##VAR_DIM=   8192,          8192,            8192
##UNITS=     SECONDS,       ARBITRARY UNITS, ARBITRARY UNITS
##FACTOR=    0.0002496,     1,               1
##FIRST=     0,             0,               0
##LAST=      2.0444736,     0,               0
##MIN=       0,             -211603,         0
##MAX=       2.0444736,     127752,          0
$$ Real data points
##PAGE= N=1
##DATA TABLE= (X++(R..R)), XYDATA
0@%%%%%%%%%%%%%Mj2J6j6J6k4L2l2M0m8N6o4P2q8J04j20J36j56J80k05K33k64
35a40K97l35L75m18M69n24N84o49P17p92Q79r71J070j181J302j434J578j740J918
54A005k117K341k593K882l213L601m061M616n302O176p337Q955j1393J5535k4416
69a5321P9242r2074j01815J38989N8573k571n6315r474K4662n0168p8566Q9124
81a5714Q1263m7414k7061L1859j1573l2727m2056L8866J23759k0832j68957k0311
93a10898J01575L2157j9413j3097J8402L4473o4855o7004J02760R2107p5715o5961
105c5469J4171K2410J2259k5244k692P2497j2746r7420J9337O9156k1061k5686
117a0488J2773K3685P496q0752n4776J21959R1185r0652q0747J9739M5361K8751
$$ plain form
0 0 0 0 0 0 0 0 0 0 0 0 0 0 0 4 -8 8 -8 8 -16 16 -16 24 -24 32 -32 40 -48 56 -64 72 -84 96 -109 124 -140
35 -140 157 -178 197 -221 248 -276 308 -341 376 -416 463 -508 562 -619 683 -751 827 -913 1005
54 1005 -1112 1229 -1364 1518 -1695 1906 -2155 2461 -2841 3335 -4002 4953 -6440 9095 -15321
69 -15321 63921 -28153 -129968 9021 67594 65023 8708 -766 23896 -26272 -104838 -15714
81 -15714 65549 18135 -8926 22933 11360 -21367 -63423 -24557 99202 78370 -90587 -110898
93 -110898 -9323 22834 3421 -9676 8726 43199 -21656 -88660 14100 106207 30492 -35469
105 -35469 -21298 1112 13371 -11873 -14565 57932 45186 -52234 -32897 36259 15198 -10488
117 -10488 2285 25970 33466 -47286 -102062 19897 111082 20430 -60317 -40578 4783 33534
129C3534l3645l0285M6741j0040p2523L3168N7775l2794j6674K9026K7612Q186
141D0081o0376l4880J03421N6905r3908n7754K6594K5944J2626k6062j7241M9234
153B4584r286o5757L7604O1365k8469k8111M891Q933J1804m2293l6808O7194K9988
166C5639p0392j2175M3052Q008J55p285P895M9216k2507p3393L1377N9448k6473
179B2565l2885r554K696K8623j3422k9894M3784J6900n0412J3795M0445j8920
191A3721k0816o950J3622M4063k9190p4853L1384N9046k0445k3113m884R27L0602
204A3114m486k9700K9944R451m1381J8892L3398k5889j7396l50J1562L8706j9730
217A6135n8440K9797M3846k5926j1866Q654p83J6081j2302k5391L4013J2277m2313
$$ plain form
129 33534 -111 -30396 16345 6305 -66218 -33050 24725 -8069 -24743 4283 31895 40081
141 40081 -20295 -55175 48246 105151 11243 -46511 -19917 6027 18653 -7409 -24650 24584
153 24584 15298 -50459 -12855 48510 20041 -8070 -3179 5754 17558 -24735 -61543 5651 35639
166 35639 -34753 -46928 -3876 4132 4287 -2998 4897 54113 31606 -41787 -10410 49038 22565
179 22565 -10320 -19874 -17178 11445 -1977 -31871 11913 28813 -21599 -7804 32641 13721
191 13721 -7095 -14045 -423 43640 14450 -60403 -29019 30027 9582 -13531 -18415 -17488 13114
204 13114 8628 -21072 8872 18323 -23058 -4166 29232 3343 -14053 -14403 -2841 35865 16135
217 16135 -42305 -12508 31338 5412 -6454 2200 1417 17498 5196 -20195 13818 26095 -16218
230a6218P214K2096k0327n092p74n333K6992m565l5762K7128K3791k9953N854
243d949K6107m345k088j9921j7331M1599J3070m8480k996K1394q449O354j137
256a172j4070K4884O721k6450J6990Q654l0965J2250K3749j6484r157j3450r904
269b8404M0935J1042m2909M857K4889q908N313J136j2884J9686L07l0506J3579
282a867J0479k5205R719J5093j6673K667k84j1298K7912R025k9932J1093J6919
295A7648k0113K358Q363q101J2595p737k9935J9591J8215k3763L363J0257j1913
308i172J1462L870j7124J8097R246k2096J1101Q810k4614M315J2150r253P437
321D229o376k2773K2570J7750k2314M142J1295j1141R626K395j8981J3593N604
$$ plain form
230 -16218 -9004 13092 -7235 -12327 -13101 -18434 8558 3993 -31769 -4641 19150 -10803 -4949
243 -4949 21158 16813 14725 -5196 -22527 19072 32142 -16338 -19334 2060 -6389 -35 -1172
256 -1172 -15242 9642 16363 -10087 6903 15557 -15408 -3158 20591 4107 -5050 -18500 -28404
269 -28404 12531 23573 -19336 -14479 10410 1502 6815 7951 -4933 14753 15060 -15446 -1867
282 -1867 8612 -16593 -6874 8219 -8454 -5787 -6071 -17369 10543 19568 -10364 729 17648
295 17648 -2465 -107 8256 155 12750 5013 -24922 -5331 12884 -10879 -7516 2741 -9172
308 -9172 2290 6160 -10964 7133 16379 -5717 5384 14194 -10420 -6105 6045 -3208 4229
321 4229 -2147 -24920 -2350 15400 -6914 -2772 8523 -2618 7008 9403 -9578 4015 9619
334I619k3926R493R166k0545P534J2181r551J1672L221j7440J7923J2447k1346
347D48N511P890j7243L897J854j6504J2731M314k1907J1782J4029j5870O559Q973
361F464j1816J0521L613j9206J0929Q449j9426P510R112j4896P190O511j1958
374g003J3260N686j9242J0135J0907j6808N082N986j4858Q644M931j6788J0234
387A66P269j8116Q228R923j4826N584N312j3431J1601O040j8312R620J0145j5080
401e877O615O255j5440P990O443j6092Q235O329j6863R273J1140j3104P533P958
415A0395j1380J0346N790j7074P461P265j7584L210M557j4884O909O140j4287
428a3136R504Q816j3574Q256Q998j3362O437N803j5833M758M900j4765Q041P751
$$ plain form
334 9619 -14307 -4814 4352 -16193 -8659 3522 -6029 5643 8864 -8576 9347 21794 448
347 448 5959 13849 -3394 503 2357 -14147 -1416 2898 -19009 -7227 6802 -9068 -2509 6464
361 6464 -5352 5169 8782 -10424 505 8954 -10472 -2962 6150 -8746 -1556 4955 -7003
374 -7003 6257 11943 -7299 2836 13743 -3065 2017 8003 -6855 1789 6720 -10068 166
387 166 7435 -10681 -2453 7470 -7356 -1772 3540 -9891 1710 7750 -10562 -942 9203 -5877
401 -5877 738 6993 -8447 -457 5986 -10106 -1871 4458 -12405 -3132 8008 -5096 2437 10395
415 10395 -985 9361 15151 -1923 5538 12803 -4781 -1571 2986 -11898 -4989 1151 -13136
428 -13136 -3632 5184 -8390 -134 8864 -4498 1939 7742 -8091 -3333 1567 -13198 -5157 2594
442B594j3744Q149J0198r292R349P032j2957Q766N933j7040L049M887j4996M842
456c230N145j5202O790R079j0376Q294P341j2674P833P140j3810M446M231j4709
470i702O266N912j4739O637Q951j0596P092P129j1234P376P226j3091N178N869
484H274j3472N565O209j2997O637P337j1682N472O844j1578O504N462j3654M141
498i38N478j1998N970M967j3966O446Q057j1064M924O383j1321M928O087j2027
512h074N217O568r756O758O185j1914P149R634j0078N494M869j4114L535N786
526G259j2621L246N030j2228M190O341r416P301Q120j0469M996N665j2756M258
540a084O747j1453K539L620j1979N621Q202q419P715P993j1057M394O506r487
$$ plain form
442 2594 -11150 -3001 7197 -2095 7254 14286 1329 10095 16028 -1012 2037 6924 -8072 -3230
456 -3230 1915 -13287 -6497 2582 -7794 500 7841 -4833 3000 10140 -3670 776 5007 -9702
470 -9702 -3436 2476 -12263 -5626 3325 -7271 -179 6950 -4284 3092 10318 -2773 2405 8274
484 8274 -5198 367 6576 -6421 216 7553 -4129 1343 8187 -3391 3113 8575 -5079 -938
498 -938 4540 -7458 -1488 3479 -10487 -4041 4016 -7048 -2124 4259 -7062 -2134 3953 -8074
512 -8074 -2857 3711 -6045 713 6898 -5016 2133 11767 1689 7183 12052 -2062 1473 7259
526 7259 -5362 -2116 2914 -9314 -5124 1217 -8199 -898 7222 -3247 1749 7414 -5342 -1084
540 -1084 5663 -5790 -3251 369 -11610 -5989 2213 -6206 1509 9502 -1555 2839 9345 -142
554a42N442N004j4779J392M894j0644M694P139p652M796N008q908P124P207j0509
569F6M219M876j3679n48M711p964N466N076j2025L572P536o911O275O917r266
584a679K700L998j0173N203O667j1126L707O929j0057K194O731n696O029L659
598I086j3362L401O544r710K964N839j0152J690M638q140O100O119j0202L633
612a552O236r227K278N218o718M813L603j1040N629Q586r811J906P814p355O31
627A011K280q226N406M472j1788K867P125p747K900O256o641L230M846q289N449
642C151N490j2691j94P207o124J122J785p261O701N777j1048L656R744o839L5
657E11L978p379K300L507p921N316M807j2059J694R691l910K360K818p573M371
$$ plain form
554 -142 5300 10304 -4475 -3083 1811 -8833 -4139 3000 -4652 144 5152 -3756 3368 10575 66
569 66 4285 9161 -4518 -5066 -355 -8319 -2853 2223 -9802 -6230 1306 -5605 670 7587 -1679
584 -1679 1021 5019 -5154 49 6716 -4410 -703 6226 -3831 -1637 5094 -602 5427 9086
598 9086 -4276 -875 5669 -4041 -1077 4762 -5390 -3700 938 -7202 -1102 5017 -5185 -1552
612 -1552 4684 -4543 -2265 2953 -3765 1048 4651 -6389 -760 7826 -1985 -79 7735 380 1011
627 1011 3291 -4935 471 4943 -6845 -3978 3147 -4600 -1700 4556 -2085 1145 5991 -2298 3151
642 3151 8641 -4050 -4244 2963 -3161 -2039 -254 -7515 -814 4963 -6085 -2429 7315 476 511
657 511 4489 -2890 -590 2917 -5004 312 5119 -6940 -5246 4445 535 2895 5713 -1860 2511
672B511M082j0688L144Q278q858k893K616m982M278M223p110N662N570j1510J521
687d156R906m256J211K244p875K041L405q399O205Q749j0107l871L936k700N569
702A902L726q684L805M226j1599R24R458l154O38J402p491K731L697o192P122
717B511Q448j1422m947N070j619M832L776q622J984L126j0545J905J0352l404
731A445p44N01p957L850M970n897O425P373j1647m392O317j023M687L213q629
746a508J380K340j0163L569J1433m403k852n16o799M686O382n318M194N328j1008
761c255l136O619p50M173K791q234Q14J916q110M766J1454n233m886p54m710N155
777a380O336o035K278M132j0583j583P127j199L474K434q235J118L930o695N092
$$ plain form
672 2511 6593 -4095 -951 7327 -1531 -4424 -1808 -6790 -2512 1711 -5399 263 5833 -5677 -4156
687 -4156 5750 1494 2705 4949 -2926 -885 2520 -5879 326 9075 -1032 -4903 -967 -3667 1902
702 1902 5628 -3056 749 4975 -6624 -5700 3758 604 1242 2644 -4847 -2116 1581 -4611 2511
717 2511 10959 -463 -5410 -340 -1959 2873 6649 -1973 11 3137 -7408 -5503 4849 1445
731 1445 701 1202 -6755 -2905 2065 -3832 2593 9966 -1681 -6073 244 -779 3908 7121 -1508
746 -1508 -128 2212 -7951 -4382 7051 2648 -204 -720 -7519 -2833 3549 -1769 2425 7753 -3255
761 -3255 -6391 228 -522 3651 6442 -1792 -978 938 -7172 -2406 9048 3815 -1071 -1825 -6535 -1380
777 -1380 4956 -1079 1199 5331 -5252 -6835 292 -907 2567 5001 -3234 -2116 1814 -4881 211
792B11J0119o108m647R4l928M590N160o893J468L219r997n02P751p47K281K092
808D163p912J037M828n105L709P443p192l666J490l445M276N323n927J753L851
823D626q801JQ085j434M22N3p833J304M814n163K346O406o237j724L784k839L195
840A005M897n296P66L055q453m74P379k698k97J417o594K160N654m795J950N751
856E427o194j569L398l371J669M501n233O57L982o290N35P096l066M3K109n996
872b302R15M021n596J100N301n997j470M087l075K323M822n393J121L831n761
887b073K17N375m032N6K788m831R51M390m417J645N293n232j549L398l722P25
903a018L616n378L10L654n149O87N365k774P44L813m073N6L677m357P03M462n517
$$ plain form
792 211 10330 4222 -425 -331 -4259 331 5491 -1402 66 3285 -6712 -7214 537 -210 2071 4163
808 4163 -3749 -2712 2116 -2989 720 8163 971 -2695 -1205 -4650 -374 4949 -978 775 4626
823 4626 -4175 -4174 3911 2477 2899 2952 -4881 -3577 1237 -3926 -1580 4826 -1411 -3135 649 -2190 1005
840 1005 5902 606 1372 4427 -4026 -4500 2879 181 -116 1301 -5293 -3133 2521 -2274 -324 5427
856 5427 -767 -2336 1062 -2309 -640 3861 -1372 -715 3267 -3023 -2488 4608 1542 1585 3694 -2302
872 -2302 -1387 2634 -2962 -1862 3439 -2558 -4028 59 -3016 -693 4129 -1264 -143 3688 -2073
887 -2073 -1856 3519 -513 -457 2331 -2500 -1549 2841 -1576 69 5362 130 -1419 1979 -1743 -1018
903 -1018 2598 -2780 -2470 1184 -3965 -3278 2087 -687 57 3870 -203 -147 3530 -827 -124 4338 -1179
920a179j721L242l334J399L933l670M66L976m745j36M860l427k95L124m859j00
936b466M159l891R08N156l913o64L958l538N36L961m660l57L070n396m04M678
952A137k922j35L602l802P83M141l367M04M301m249j193L193l753L90L733l405
968a142J14L538m047R7M947k820j111K871m137m02L310l522k32M409l750m19M322
985B026k880M58M126l234k45L328m697k34L980l379j057L239l416o4M159l366
1001a256J10M396l746j050L451l103o2L057l360j45L440l283R0M365k452m61L319
1018C310k858p81K950l632l84L710m033j278L575j759l40L339k771k84M156l316
1034c96r12M114k902j195L021k598p54L255k622l8M288l461j178L645k233p22
$$ plain form
920 -1179 -2900 342 -2992 -1593 2340 -1330 -864 3112 -1633 -1769 3091 -336 -631 2493 -2366 -2466
936 -2466 1693 -2198 -1290 3866 -47 -711 3247 -291 245 4206 -454 -811 2259 -3137 -3541 1137
952 1137 -1785 -1920 1682 -2120 -1337 2804 -563 -159 4142 -107 -1300 1893 -1860 -1470 2263 -1142
968 -1142 -1028 2510 -1537 -1440 3507 687 -424 2447 -1690 -2092 1218 -2304 -2536 1873 -1877 -2296 2026
985 2026 -854 -396 3730 496 251 3579 -1118 -1352 2628 -751 -1808 1431 -1985 -2049 2110 -1256
1001 -1256 -1146 3250 -496 -1546 1905 -1198 -1260 1797 -1563 -1708 1732 -1551 -1461 2904 452 -9 3310
1018 3310 452 -329 2621 -1011 -1395 2315 -1718 -2996 579 -1180 -1520 1819 -952 -1236 2920 -396
1034 -396 -1308 2806 -96 -1291 1730 -868 -1622 1633 -989 -1027 3261 -200 -1378 2267 34 -688
1050f88K522l450m45L339l101n58M105k590k58L122j860j75L072l237l02L579
1066C075l474j282L321k246j136L005k567j26L457k914q43M021k230j739K483
1081H05j957m3K791l198j59M085k430j068L854j896j023K700k175n27K402l281
1097a120p95L609k715j389K949j548J60K418k466l10L641k507j069L085j675j432
1113a164K593j658m76L027l085o44L669j970j663K877j624r57K541k584n94L396
1129A684k331j206L333j824q40K519j715m69L471k552j447L783j824j557K425
1144A450j426j143K539k690k59L255k683j498L727j521j314K089j135k10K695
1159A876k054j107L192j652j302K667j440j071K185j950p06K976k020j501L318
$$ plain form
1050 -688 1834 -1616 -2061 1278 -1823 -2381 1724 -866 -1124 1998 138 -37 3035 -202 -504 3075
1066 3075 -399 -1681 1640 -606 -1742 1263 -1304 -1430 2027 -887 -1730 2291 61 -1678 805
1081 805 -1152 -1195 1596 -1602 -1761 2324 -106 -1174 2680 784 -239 2461 286 -241 2161 -1120
1097 -1120 -1915 1694 -1021 -2410 539 -1009 -849 1569 -897 -1207 2434 -73 -1142 1943 268 -1164
1113 -1164 1429 -229 -705 2322 -763 -1407 2262 292 -1371 1506 -118 -1075 1466 -1118 -1712 1684
1129 1684 -647 -1853 1480 -344 -1184 1335 -380 -849 2622 70 -1377 2406 582 -975 1450
1144 1450 24 -1119 1420 -1270 -1529 1726 -957 -2455 1272 -249 -1563 526 -609 -819 1876
1159 1876 -178 -1285 1907 255 -1047 1620 180 -891 1294 -656 -1362 1614 -406 -1907 1411
1174A411j178j530J623j154m42K510j973q47K928j468j367K773r55j099K311j483
1190F0n23K360j890j458K806j071j209J549j271m57K291k104q56K906j360j627
1206a854K418m70p12J672j315o42K836j686j428K886j260j532K096j092j096K333
1222A154j963o22K833j569j676K244m08o81J649j274o56K786j732j640K590j111
1238g6j263K213o57r93J781j307m74K477j159j716J748m77j411K140j601r15K743
1255A053j666j156L132m52j410K151r16p84J630j421p59J924j344j921K288o97
1271c48j103J988r24o51J794j303r94K970o42j651J298n60p68J996j118r08K628
1288A704j134j612K406k11j273J261o41j163J687j875j029K669l12k040J208K5
$$ plain form
1174 1411 233 -1297 326 -828 -1270 1240 -733 -1580 1348 -120 -1487 1286 331 -768 1543 60
1190 60 -463 1897 7 -1451 1355 284 -925 624 -647 -1104 1187 -917 -1773 1133 -227 -1854
1206 -1854 564 94 -618 1054 -261 -903 1933 247 -1181 1705 445 -1087 1009 -83 -1179 1154
1222 1154 -809 -1431 1402 -167 -1843 401 -7 -688 961 -313 -969 1817 85 -1555 1035 -76
1238 -76 -1339 874 217 -776 1005 -302 -776 1701 542 -1174 574 97 -1314 826 -775 -1690 1053
1255 1053 -613 -1769 1363 911 -499 1652 736 -48 1582 161 -598 1326 -18 -1939 349 -348
1271 -348 -1451 537 -387 -1038 756 -547 -1541 1429 787 -864 434 -126 -894 1102 -16 -924 1704
1288 1704 570 -1042 1364 1153 -120 1141 500 -663 1024 -851 -1880 789 477 -1563 -355 -330
1304c30n27J786p81j117K222o06j937K037l46j289J489n03o64J839j012j073K047
1321A235m76j989J611m98r97J614q26j007K372q18j215K186j70j388J086k20j025
1338e25J507r90j719K304l36j927J631L72j141J448q06n18J843j003j572J974
1354E42J26j767J072j03o01J982p45j167K046p8j379J090N1j379P55q90j026J783
1372C12q45j493J869O8j261J529n7m83J522p12j415J730m03j516J652k9j290R10
1390H8k2r78K081k76j453J443k58j437J084J01q91J378j260j296J728L65j403
1407a006J647j16j213P79m8p21J601k54j550J119j89j297J305M89r08J149j104
1424c17j005J783j6j059J109J05j248Q92Q1n94J813k93j739J221j16j670J471
$$ plain form
1304 -330 -857 929 148 -969 1253 647 -1290 747 401 -888 601 98 -566 1273 261 -812 1235
1321 1235 759 -1230 381 -117 -1114 500 -326 -1333 1039 221 -994 1192 1022 -366 720 500 -525
1338 -525 982 -8 -1727 577 241 -1686 -55 317 -824 624 -182 -700 1143 140 -1432 542
1354 542 668 -1099 -27 -130 -731 1251 506 -661 1385 1307 -72 1018 1069 -310 445 -445 -1471 312
1372 312 -533 -2026 -157 -89 -1350 179 122 -361 1161 449 -966 764 361 -1155 497 468 -822 88
1390 88 66 -912 1169 893 -560 883 625 -812 272 373 -518 860 -400 -1696 32 397 -1006
1407 -1006 641 525 -688 91 43 -678 923 669 -881 238 49 -1248 57 546 -362 787 -317
1424 -317 -1322 461 445 -614 495 600 -648 244 325 -269 1544 1251 -488 733 617 -1053 418
1441D18L55j248O29p03j356K043rj055J239K67j527P49M28o16J268k13j755J069
1459a7P9r31J395N40r36P84p09j079J602L52j231O84p3j620P10O1o83J610n45
1478gj482J418K78j096J726J69q92M64l60j186J558P1j261O83L9j137O33N50l40
1497a72J270j38j758J063J22q77J090K03j226M08j7r96J482M57j192P30K04j697
1515a044J011N39p42Q94j59j943J159K93q09R31M06j340P35q0n16R83N32j013
1533a63N56K92j327R15O78r50N48J30j661Q46K12r02P33M11j267O26L00q43J160
1552B94O10j311O80K05j052P08M98r85O04J94j580P60Q29r59N96O41j041N64J11
1571C66q71P32N01j252M99J39j213P32N90o81P43M3j180J242N25j051Q62J48j309
$$ plain form
1441 418 773 -475 154 -549 -1905 138 129 -926 313 580 -947 -198 230 -386 882 669 -1086 -17
1459 -17 62 -869 526 1066 130 914 205 -874 728 1080 -151 533 460 -1160 -450 -389 -1072 538 -7
1478 -7 -1489 -71 207 -889 837 1006 114 578 218 -968 590 661 -600 83 122 -1015 -382 168 -172
1497 -172 1098 960 -798 265 387 -490 600 803 -423 -15 -32 -1028 454 911 -281 449 653 -1044
1515 -1044 -33 506 -236 658 499 -1444 -285 8 -801 130 536 -804 -69 -149 -665 318 850 -163
1533 -163 393 685 -642 273 951 1 549 679 -982 -136 76 -826 -93 318 -949 -323 -23 -866 294
1552 294 904 -407 273 478 -574 134 632 -353 251 445 -1135 -375 454 -505 91 732 -309 255 366
1571 366 -505 227 728 -524 -25 114 -1099 -367 223 -458 285 328 -852 390 915 -136 726 874 -435
1590d35J75M64j158R98L51j462O33M30q42N98R73j013O66K33j115N91O55r39L58
1609A61M85j049K43K95r81R27L77j138R13K62j010N00P03q66K39L27j208M35O51
1628B66q14K96M72o86L76P22r89P62N69j168M96N03j420K68P08p84J7O25j340
1647a121N21R44j088Q37M91r16L53O93q48L75P01j234L98K74r74M59M88r03M76
1666g4N14j125M97Q47r77L29Q37j191J62M33j061P43J90q09N47M44r16N27P72
1685F89p40m0P40r07L4R74j093K83O33j051o2P64o16J75O38j165N70R11j135N33
1705A35O05q25N24J31n02j36O72j206J9Q67q84J40K43n17L51J069r48J41O36p13
1725a98L18N55o23J64L26j091L87Q00q37K79L88p05J29Q60j133L58P08p80k1L62
$$ plain form
1590 -435 -260 204 -954 44 395 -1067 -434 -4 -846 -248 725 -288 378 611 -504 87 742 -197 161
1609 161 646 -403 -160 135 -846 81 458 -680 233 495 -515 -15 688 -178 61 388 -820 -385 266
1628 266 -548 -252 220 -466 -90 632 -357 405 974 -194 302 805 -615 -347 361 -423 -406 219 -1121
1647 -1121 -600 344 -744 93 584 -332 21 714 -134 241 942 -292 106 380 -594 -135 353 -550 -74
1666 -74 440 -685 -188 659 -318 11 848 -343 -181 252 -809 -66 124 -685 -138 306 -610 -83 689
1685 689 -51 -91 649 -258 -224 750 -343 -60 573 -478 -540 224 -392 -217 421 -744 -174 737 -398 135
1705 135 740 -85 439 570 68 -68 604 -602 -583 284 -600 -460 -217 -734 -383 686 -262 -121 515 -198
1725 -198 120 675 52 216 542 -549 -162 638 -199 80 468 -237 -108 752 -381 -23 685 -95 -116 246
1745B46p55l58P39n51K64M72p85L97O46n73L35R79j069RP92j067J90P75j212R2
1765d34J022j108L52N37p31N89L09j091J55J125p25m21Q23q24L98M86j023M33
1783a28M28o95j8P72p55j01O93o45N8N81n53J74O36o94j1Q74q19nN92o88L56M13
1805D65n31O3P08m90j51M46o31N3O60j023O3P74j273J04P88o33J30O58l70L9P41
1826E90o14J55Q29q48k77O75o04j73J102j277N1Q39q39J30R42m96j45Q13r07k07
1846b61Q47j044q9Q89r81l4R61o56P7P83o62J52O20p35n7P69q01J06M84j007M68
1867a71M17o12Q5Q13o33j71Q41n50j03O31p13K48N75q07l7L17l80P0M01m82p5
1888c36N92o78Q1P72q85J8L80j50l73J009p18J14P38p41k13R28n33j07O49n23
$$ plain form
1745 246 -509 -867 -128 -679 -415 57 -728 -331 315 -258 77 1056 -13 -4 788 -279 -89 686 -526 -434
1765 -434 588 -520 -168 369 -362 227 536 -555 -400 725 0 -421 402 -422 -24 462 -561 -128
1783 -128 300 -395 -413 359 -396 -497 196 -449 -391 190 -363 -189 447 -247 -258 616 -203 -208 384 -304 52 465
1805 465 -66 -3 705 215 64 510 -121 -68 592 -431 -368 406 -867 -763 25 -608 -478 180 -190 -151 590
1826 590 -24 131 960 112 -165 510 -94 -267 835 -442 -391 448 -391 -261 681 185 40 853 -54 -261
1846 -261 586 -458 -547 342 -639 -673 288 -368 -291 492 -170 -18 602 -133 -190 579 -222 -116 368 -639 -171
1867 -171 246 -366 -281 532 -101 -272 569 19 -84 547 -166 82 657 -150 -187 130 -250 -180 221 -261 -336
1888 -336 256 -422 -341 431 -454 -436 -56 -206 -579 430 -288 -174 564 -177 -390 538 5 -102 547 24
1908B4p8N62m17q1P29o94k45Q34q03lN47r14j08P96o42k04J150r10L06O59n62
1929e4O1P11q85L25K45p98o8O95l76m24Q36o00k38J121o16j61J211r81j44M64
1949C24k53l04P92o72j29N76p07m5P43k97qM95o21J91M89q57j01Q31r66L3Q27
1970C41q31J7P74q33J16J055o06r5O03n48K4Q56q81j53P44j011J02N89m60j43
1990c40N17n93K09N38m39q2P71o02l38J042p19L2L59l72j42N33o83k30Q17l11
2010c3k27M87j98l46Q70o84J24L41p29J71N21m41l02O80o03J0P30o61K28N05j51
2031B92m77M90j60k89O48p85k36J099r01j29O84o02p2R10m51q4P40p55o4P69q70
2052b43J95P54r99J19M90j80l24M96o35n7Q15n52K6L84m38L6O65p95j74R18q07
$$ plain form
1908 24 -54 508 91 10 739 45 -200 634 -169 -172 375 -539 -647 149 -493 -697 453 -457 -151 508 -54
1929 -54 7 718 -167 158 403 -395 -463 232 -144 -568 268 -332 -570 551 -65 -226 985 4 -140 324
1949 324 71 -233 559 -113 -242 334 -373 -418 325 28 20 515 -106 85 574 -283 -384 447 -519 -486 341
1970 341 -490 -473 301 -532 -416 639 33 -62 541 -7 17 873 -8 -161 583 -428 -326 263 -197 -340
1990 -340 177 -416 -207 331 -108 -190 581 -21 -359 683 -36 -4 355 -17 -159 374 -309 -539 278 -33
2010 -33 -260 227 29 -317 553 -131 -7 334 -395 -224 297 -144 -446 234 -369 -359 371 -290 -62 443 292
2031 292 -185 305 145 -144 504 -281 -517 582 -319 -448 236 -366 -438 472 21 -63 677 -78 -142 627 -243
2052 -243 -48 706 -293 -174 316 136 -188 308 -327 -384 431 -121 -95 289 -149 -113 552 -243 -417 501 -306
2073c06j80P61l20l61Q80n53j07O94p05m1Q44l91k24L56m36j80M78n69j78Q31
2093B93n31k69P75l47m9O47m14k24L74k15l90Q14m17l52N95m99j8N09k47k15K81
2114A01l99J70P03p53j7P13p04j90N86n00J47O01m52m46P49o26M3Q93m40l28P02
2135E53m30m46P92l23l65L47l91r5N60l74p3P06m48k86O57l95k8N08m61l24P55
2156D39o21k45P99m79k57N40o34J80M75l75n5P74o63l28R14m87m4N45n26K7N01
2177D80o47j36P60k34k92M66n22l76P37l7k72M23n27j71O63m68j06M71o66L3Q78
2198D57r66K90N45k0n6J24m32k07Q49p20k23O41m38l03R17o55Q9N69m03k94O09
2219C73m03k19N96j18j99n5j71M7M96o75M6N22l27l53Q45m29J11L97n56l96M86
$$ plain form
2073 -306 -486 275 -45 -406 474 -79 -186 508 -197 -238 606 215 -9 347 -89 -269 209 -360 -538 293
2093 293 -238 -507 268 -79 -128 519 105 -119 255 40 -350 464 47 -305 290 -209 -227 282 35 -180 101
2114 101 -298 -128 575 -178 -195 518 -186 -376 210 -290 -143 458 6 -440 309 -317 -274 619 179 -149 553
2135 553 123 -323 469 146 -219 128 -263 -358 202 -172 -245 461 13 -273 384 -11 -39 469 8 -316 439
2156 439 -182 -427 372 -107 -364 176 -458 -278 197 -178 -233 541 -122 -450 464 -23 -67 478 -48 -21 480
2177 480 -167 -303 457 223 -69 397 -125 -501 236 199 -73 350 -177 -348 315 -153 -259 212 -454 -421 457
2198 457 -509 -219 326 306 250 374 -58 -265 584 -136 -359 282 -156 -459 458 -197 -108 461 58 -236 373
2219 373 -30 -249 347 229 30 -25 -196 -149 347 -328 -282 240 -87 -440 405 -24 87 484 -72 -468 18
2240A8l48K4N96m68k83O84k24l64J006p16K75L53q18l2O97m97k58O03m12k31P35
2261C40o51l0P06l67m15P40o75K13M96l59j42M74m32M4M64n11r9N18m74j91O86
2282C35l80j68P68o18n28P87l62R4M48l51j40O24m11n38N89m60K78K29l86l31
2302e21O18j98l16R16m57l56O74k79j12L62m97N9K36l54m2L97n7j64L72j98l05
2323b22P47n70j12N17j41k09L54m22j85M14k89l40N53k74j30O51j35p14O74j48
2343A9m84P18m07j02N21m09k45O57k84L1L46k16l77N93l44n68P10p9l01M13l33
2364a41q5M23p1n43Q23m85j32O67m53r0L74l20j32L60l24J70M26l88k97M08l16
2385a26j70N74l53O9O8K11n91O09m84o2O00m20m62P91k21l63N79l11J5Q2q5j86
$$ plain form
2240 18 -330 -306 290 -178 -461 223 -1 -365 641 -75 200 553 -265 -297 400 -97 -355 248 -164 -395 340
2261 340 -311 -341 365 -2 -417 323 -352 -139 357 -2 -144 330 -102 -58 406 -105 -204 314 -160 -351 335
2282 335 -45 -213 555 -63 -591 196 -166 -72 376 25 -115 509 98 -440 149 -311 -33 196 -190 -521
2302 -521 97 -101 -417 499 42 -314 360 81 -31 331 -166 -107 129 -225 -267 130 73 -91 281 83 -222
2323 -222 525 -45 -157 360 219 10 364 -58 -243 171 -118 -458 95 -179 -309 342 207 -507 167 19
2343 19 -465 253 -154 -256 265 -144 -389 268 -16 15 361 145 -232 361 17 -551 159 80 -221 192 -141
2364 -141 -226 197 126 -417 406 -79 -211 456 3 -87 287 -33 -165 195 -129 41 467 79 -218 190 -126
2385 -126 -296 278 -75 -6 62 273 -318 291 -193 -255 345 -75 -537 254 33 -330 249 -62 -47 35 -50 -236
2407b36M94l81k23M53j04k58L79K9m77L11l30k57R15k22l15J79l7k30N14ll03
2428a02L37j64j14M23m07k22L80l83k01M18J92m68L81K05n65P06m56k99N61j81
2448D1j04K08l22k40N76j56l8L65k51p8K32j93m78P07j31n53P80l37j33K62N2
2469B09n02L08o7j66K32P9j57K41j25m1K73k23k92L34k36k22P43l79k84M98j42
2490H1k61J93J40l54J70J98m14K45p9nL66k79k93M73j04l26R5j66r9N77k85j94
2512c21P35l16k31M0L30l86M17j26l57M75j31l73N05j26k83L47j44m75N31j8k95
2533b02K27J2l27N55o6m08N37l29r5L65q9l45K12N8l07K99J4m25P26l07l58J93
2555f0K19n37M86l5m1r7J8k02L95l71O2L54j73r0L75k10l52M82nl60L16j29k32
$$ plain form
2407 -236 258 -123 -346 107 3 -255 124 153 -324 -13 -343 -600 315 93 -222 -43 -80 -310 204 201 -102
2428 -102 235 71 -43 380 -27 -249 131 -252 -453 -35 157 -311 70 275 -290 416 -40 -339 222 41
2448 41 -63 145 -177 -417 159 3 -35 330 79 1 233 40 -438 269 138 -415 365 28 -105 157 209
2469 209 -293 15 -52 -218 14 93 -64 177 52 11 284 61 -231 103 -133 -355 388 9 -275 223 81
2490 81 -180 13 153 -201 -31 167 -247 -2 -81 -86 280 1 -292 181 77 -249 -154 -320 -419 158 -127 -321
2512 -321 414 98 -133 -93 237 -149 268 142 -215 260 129 -244 261 135 -148 199 55 -420 111 93 -202
2533 -202 25 37 -290 265 199 -209 328 -1 -96 269 180 -165 47 105 -202 97 111 -314 412 105 -253 -60
2555 -60 159 -378 108 73 32 -65 -47 -249 146 -225 -163 191 18 -72 303 93 -259 223 218 -142 174 45 -187
2578a87M72l30P8O5L6m59N48k63m22M27j02j38L61j49J45J06Kl07K45r6j32O5
2600c5j33p8N98l47j64L33N3m04L48Ml55L49k54l41N45o7k51O01m64J9L85k73
2622F9l31M75j43k79L53m2j00O6k17o4N18m38M5P0Lj24K68m39K54K38M4m45M02
2645A83m4k15M19m12P9K51k35p0L49l92j49L35l01J43Mlj31L14j80k94L93K50
2667B94l02N5P6j95K53m8k54N20l04m19M45j68j23J44L0l16M91j09m97N46o1j70
2689a12L60k83PK04M3l32K86j91j76J71K40k77J88j53l50rK95J54N7l30R0L4L12
2712B28k48K64k46l52L50m8L4J88P1o41N13j9j86J60J08m23L03P5j61J61j95j27
2734a91K85j79K31R2j92j41L0J05j60J20J41k50K79l41J4J92N0l10L27j26k42
$$ plain form
2578 -187 285 -45 33 98 134 -325 223 -40 -462 -35 -137 -275 86 -63 82 188 190 -117 128 32 -100 -35
2600 -35 -168 -246 352 5 -159 174 227 -177 171 175 -180 169 -85 -426 119 52 -199 402 -62 -43 342 69
2622 69 -262 213 70 -209 144 102 2 68 -149 -213 305 -133 -88 -18 -15 -139 129 -310 -56 182 226 -219 183
2645 183 139 -76 343 -69 10 261 26 -44 305 -87 -236 99 -202 -59 -55 -58 -189 125 -55 -349 44 294
2667 294 -8 47 123 -72 181 133 -121 399 95 -324 121 -47 -170 -26 4 -312 179 70 -427 119 58 -112
2689 -112 248 -35 -28 176 219 -113 173 -18 -194 -23 217 -60 128 -25 -375 -384 -89 65 122 -208 -118 -84 228
2712 228 -20 244 -2 -354 -4 -52 -18 170 241 -400 113 94 -92 68 176 -247 56 131 -30 131 -64 -191
2734 -191 94 -85 146 238 46 -95 -65 40 -120 0 141 -109 170 -171 -157 35 85 -225 102 -24 -266
2755b66L01J41k84J33J05k43J41n4K4m5O4j48L16k42o7K88j15j29J80J50l47m2
2777a39M3p8L50l42J5L76k17k59M35k71P5Q8j21j73K01j68J66R9N0l22J46J24
2799G8j71J31Q5m28M33j89O0j65J31j57J21L14l79L61j56q3K95j57j97J73n3o9
2821b2nJ93j67J26j16j06J87o0l11L82j96K40k2k08j10J79P2j72M26k62q8K14
2843A74J11l96K09j18R2m08M00k62J97J08k63K20rj25J38j1j91K67j65k13L29
2864H4M4m6onJ28l14N3k5J66n0k13J52j24j34L28J94j68r9Q3l98J11K63L9R7l82
2889b22K30R1K18n71M59l97N5R4K2p6R1J81m13P9pj46M57l0l14J18J89k9J02o
2913A75j59l3L1j22L6j13K1P6J08j24LL06k39K26l15J29j5L6r6J09J46j6j69O6
$$ plain form
2755 -266 35 176 -108 25 130 -113 28 -26 -2 -47 17 -131 185 -57 -124 164 49 -80 100 250 -97 -139
2777 -139 -96 -174 176 -166 -151 225 8 -251 184 -87 -12 76 -45 -218 -17 -185 -19 80 130 -192 -46 78
2799 78 -93 38 123 -305 128 -61 -1 -166 -35 -192 -71 243 -136 225 69 -14 281 124 -73 100 47 -22
2821 -22 -27 166 -1 125 9 -97 90 30 -281 101 -95 145 123 -85 -195 -16 56 -116 310 48 -40 174
2843 174 285 -111 98 -20 72 -336 64 -198 -1 107 -156 64 55 -70 68 57 -134 133 -32 -245 84
2864 84 128 82 76 71 199 -115 -62 -87 79 29 -184 -32 -156 -290 38 232 64 -35 48 -350 -239 24 63 160 -222
2889 -222 8 99 317 -254 205 -192 -137 -43 -21 -97 -6 175 -238 -159 -166 -312 145 115 -199 -81 108 79 181 175
2913 175 16 -17 14 -108 -72 -185 -164 -88 20 -104 -101 205 -34 192 -123 6 -9 27 -69 40 186 170 1 67
2937F7j18R0K6k13L31j26k53P4O0K79l0k42R8K58m06p7M40j6m50K32K36k56R3
2960I7j10l2J89l14K62l7j56J49j58J64J65r3K02l69m4o5O3R5N7l00K2K19l31
2983c25J85J19k29J45J40j29K02L7k81K16m7k55J61K45j30j35j9j64J68O8R8J69
3005B39k98l23L89J02p0j35nj76K88O8Oj36L60l15J40j85R3P9j51p4j08K06J7
3028A1kJ77j88k12K38j98O9J22k50K75J94m18K60Q7l77J71k21O6K17P4r8O3q4
3051b4j29M9O7j18M2K79l67K43l8p3J42k79K83r1k13M06k32O4j18n1K67l26L13
3074I6j47k32L27k26N6J87J6l65J56K76k50J45j40j00J56J92j97K31p3j30K22
3095B00k95J98j48J68k37J17J14k25mJ16k04J32J36k96J88L00k25q3j38k2J82
$$ plain form
2937 67 -51 39 65 -148 183 57 -196 -122 -62 217 187 -55 43 301 -105 -182 258 242 -208 24 260 4 97
2960 97 -13 -45 144 -170 92 55 -101 48 -110 54 219 126 328 -41 -85 -150 -87 8 65 -235 -213 6 -325
2983 -325 -140 -21 -250 -105 35 -94 108 145 -136 80 33 -222 -61 184 54 -81 -100 -264 -96 -28 70 239
3005 239 -59 -382 7 109 39 -96 -101 -277 11 79 85 -51 309 -6 134 -51 42 121 -30 -104 -212 -6 11
3028 11 9 186 -2 -214 24 -174 -105 17 -233 42 236 -182 78 165 -212 -41 -262 -196 21 95 -3 60 -24
3051 -24 -153 -104 -37 -155 -113 166 -201 42 4 -69 73 -206 77 -14 -227 179 -53 11 -107 -158 109 -217 96
3074 96 -51 -283 44 -182 -126 61 77 -288 -132 144 -106 39 -101 -201 -45 147 -50 181 108 -22 200
3095 200 -95 103 -45 123 -114 3 117 -108 -112 4 -200 -68 68 -228 -40 260 35 -48 -186 -208 -26
3116b6k0J68j27K7j45J75L3j17J49n1M9k56P7JP7J35q1L7l3J7K0j66k97J25J98
3141c1k21K13J38j55K36k56K42j22J61l94K56M8k24J00J37j22J00j15p9J18j5
3162A5m9J20J4r4R0R3k17k8J85r4K8j11NP5q3J07j67N3J53j9N6j77O4J08j28o4
3188f5J8L24k69K9k94K98k71K33J28k91K98k3l5j12K4j6P9J49j38q0L0O0j64M6
3212d2K96l27K56j72k64M90k13J25J88l18p7J79k00J16J04m0M2j98n6J15k5j5
3234c6J5O3o4j6o2L50k03j16j84J85N7QM6J13j88lJ60p7k10J49M6j01N9K3%j66
3260a52K54k23J77J33k91K14k47Lj1J31j39mK41k8J46k09J68l32j38K60q5K06
3282G4o8q3K19j88j9k6L45k57K41j47J40j78J88q9n0Kp0m2J14q5n9K05l46J52
$$ plain form
3116 -26 -46 122 -5 22 -123 52 85 -32 117 66 115 -141 -64 -63 14 149 68 105 72 89 109 -57 -354 -229 -31
3141 -31 -252 -39 99 -56 180 -76 166 44 205 -189 67 115 -109 -9 128 6 106 -9 -88 30 15
3162 15 -34 86 100 6 96 189 -28 -56 129 35 63 -48 -43 32 -51 56 -111 -58 95 76 132 -45 19 127 -1 -65
3188 -65 -47 277 8 37 -257 41 -230 3 131 -160 138 115 80 -32 -8 -24 55 204 66 -14 16 76 -88 -42
3212 -42 254 -73 183 11 -253 237 24 149 337 19 -58 121 -79 37 141 101 143 -55 -111 4 -21 -36
3234 -36 -21 42 -22 -38 -100 250 47 -69 -253 -68 -11 -3 43 156 -32 -35 125 48 -162 -13 33 -68 -9 14 14 -152
3260 -152 102 -121 56 189 -102 112 -135 -132 -143 -12 -151 -155 86 58 204 -5 163 -169 -307 -47 -132 74
3282 74 6 -77 142 -46 -65 -91 254 -3 238 91 231 53 241 152 102 104 34 -8 106 21 -38 167 -179 -27
3306b7k0j66L51j92p8j9J71K6N4Jk35J41j71K52j99j4K2J93j68M0J00k29J82r8
3330h3J53p7K42k81K3P7k18K66J12k29J42kj75NK03j46n1K2M2k54N13m55L81l56
3354a46j3r9M09q6J76q8k35M5j54J27P0j3KJ50k84K45q6R1n5N6j50j9nK46k17
3379c3Jn3r1M5L1M9J34P6L3l22M05l49m8P8n0r0K72o5o4q4m2J95p8J52J33r7j52
3406a4n2J96j43k70M93k42j05K12j27K4K83l23K3Q0n8n8J30j20K77J4q8k00j09
3429a77K45j83l4j4K6m7L38r1k4k2O6l1k5O2m9O5j66m9J47J15M2j17k17J64R1
3454A15j81K33j08j1k23K00q0J2qo4J73k18r0L85l22J39J22j20o6J52j71l9q2
3477b52K63k15L67k18J25l22N73m14j54M39l74K60j19o7M0J05r1L12m36J51J26
$$ plain form
3306 -27 -47 -213 138 -54 -132 -151 20 46 100 101 -134 7 -164 88 -111 -125 -103 90 -78 -38 62 -167 15 -83
3330 -83 70 -7 235 -46 -23 54 -164 102 214 -15 127 125 -50 -45 158 12 -39 -17 25 -229 284 -171 210 -146
3354 -146 -159 -258 151 65 241 153 -82 -37 -191 -64 6 -7 -5 145 -139 106 20 111 56 112 -38 -57 -62 184 -33
3379 -33 -32 -85 -176 -131 -100 -51 83 159 192 -130 275 -74 -122 -44 -94 -184 88 23 -41 -125 -167 28 -50 102 235 138 -14
3406 -14 -66 130 -13 -283 210 -32 -137 75 -52 -28 255 -68 -45 35 -23 -81 49 -71 206 220 132 -68 -177
3429 -177 68 -115 -149 -163 -137 -184 154 63 39 17 83 52 27 89 40 105 -61 -110 37 152 194 77 -140 24 115
3454 115 -66 167 59 48 -175 25 -55 -43 -51 -115 58 -160 -250 135 -187 -48 74 -46 -112 40 -131 -170 -252
3477 -252 11 -204 163 -55 70 -252 321 -93 -247 192 -182 78 -41 -108 -68 37 -54 258 -178 -27 99
3498I9o6q1JN8m7K2j48L22k04R0k27P2m5m9P7M17k89J33j28j28P3J73N5j07l1
3523D2j1J09m1k30J32k54K47j56M13l40J71k63J54M8Rj46J38J1j36L17m59K18
3545b7J64m27K52M9P6J9j79L6j08J93K72n12O9J63K2L1j76k9j7J40r4K4J45O1
3569A47m5k27M5J76j89o4o8M0K75m8K7k24J2K41j06j5p5K2J02j1q2k85N32j87
3593gJ18L0k46J18J43k29J20k04K65R8j00j56M2l2J09q4M6oN4k82K31J68j54r9
3617e7p1J59P9mm9k9L9R8j15M1n0L1l45M68l75N3J84P7R4n07N33r0k81Q3q3L29
3643B12k78J46j36J68k02K62q6j40O4o9Qo9L8q1K38j76J45j1j15K45J38l86J90
3666A05k43P4N3m4L9l9n4M7k34K42j59J08O8M1k86K13N3l40M51O1k22l4m0L11
$$ plain form
3498 99 33 -48 -47 11 -36 -14 -162 160 -44 46 -181 -109 -154 -203 -126 291 2 135 7 -121 -48 125 180 73 42
3523 42 31 140 99 -131 1 -253 -6 -162 251 -89 82 -181 -27 21 30 -116 22 33 -103 214 -245 -27
3545 -27 137 -290 -38 11 87 106 -73 -37 -145 48 320 -192 -123 40 62 93 -83 -112 -129 11 -83 -59 86 147
3569 147 102 -125 -80 96 -93 -157 -225 -185 90 42 69 -155 -143 98 -8 -23 -98 -76 26 15 -67 -352 180 -7
3593 -7 111 141 -105 13 156 -73 47 -157 108 206 106 -50 -8 -40 69 -15 31 25 79 -203 28 196 42 -57
3617 -57 -128 31 110 106 57 28 67 165 50 91 41 72 -273 195 -180 -127 57 134 228 -279 254 164 -117 -34 -117 212
3643 212 -66 80 -56 112 -90 172 86 -54 10 -59 -51 -120 -82 -163 75 -101 44 33 -82 163 301 -85 105
3666 105 -138 -64 -11 -55 -16 -55 -109 -62 -296 -54 -213 -105 -37 4 -282 -69 -16 -356 95 156 -66 -100 -140 171
3690A71j51m2o4M7Q4J80j92q8R2j70o6J95j45J83j30n1J53J68m2k91k16N83k73
3713f5J93k13M3J19p3P8J50k91K50j45Lj85J50R1m17L11J2K2J50j79j03j1K54
3736A44j74K36Rj7P7j50Oj05oj59J49J4O3mr4m5L7N4q2O4J93k73L4J49j18m5J70
3763A27l03K86k37Q6J80j6k96J4m7J21J41O4n3J1N4j01o9q6K78o1j62l9M66l61
3787cJ79r6o3R0j00K71l10K20j71jr9K78k01Mr6J37J57k39J57nk7J56l72N9J49
3812G4r7J9k5J0J05j70M0n5M1l3M07l87J00Qk73M78m57M2J54k55M32j64j4nn7
3837h2J28P0j62J13o6J9J49j16K1p4K0K22k56P2p1M3j21M0J7K8n3J47j19R3j4
3862D8j84J08k3J19o4p3j04J58J11k18O5J80p0m5l54J20K70L2j74P7p9M0Mj00
$$ plain form
3690 171 20 -22 -86 -39 45 225 33 -55 37 -133 -199 -4 -149 34 -96 -147 6 174 132 -159 -375 208 -65
3713 -65 128 -85 -42 77 4 82 232 -59 191 46 49 -136 14 105 -312 -1 11 33 183 4 -99 -110 144
3736 144 -30 206 215 198 275 125 131 26 20 -139 10 24 87 83 -11 -56 -19 35 -47 17 210 -63 -29 120 2 -43 127
3763 127 -176 110 -127 -41 139 123 -173 -159 -206 -85 56 120 67 78 132 31 -38 -124 154 93 -69 -108 358 -3
3787 -3 176 80 17 107 7 278 -32 188 17 16 -83 195 -6 -2 -98 39 196 -43 114 109 82 238 -134 -75 74
3812 74 -23 -4 -29 -19 86 -84 -44 -99 -58 -91 316 -71 29 37 -236 242 -215 -173 -19 -274 158 -6 -20 -25 -82
3837 -82 46 116 -46 67 1 20 169 53 74 0 20 242 -14 58 -13 30 -91 -51 -34 -6 -59 88 -31 62 48
3862 48 -136 -28 -51 68 4 -69 -173 -15 96 -122 -57 123 53 8 -346 -226 44 76 -98 -21 -100 -60 -56 -156
3886a56m5M33l64J36L8l9p9J01J33k13L4J40o0L6n4P0Lo2l5N5Pj35p6P8p5M9J09
3913B9m0j21J49O1k34K23nm7J8j26r4K29j86K5J07J70j63Nl3p0J20p8Q6N4n0j63
3939a34J27p4J44l6J75q0l67J60K15j20k30J50J27k8p0J15p2N8r9J27j50p2J72
3962C8q5R8j74J04J79K9k76J45J7q2o8L3q8K6J85j57L09r8q1j46J00LP3j14J64
3987A34j09j11j87N97l97j42K10j93n3L41j38l6M5k3O8p0j69L28J97k00o6j79
4009a53J43j27K58m5j92M4J44j93J71j16j2J9J64N9j36O0j18k6P9K80k90j16K93
4032A90j41m8r8O7J6j40L39l57J77p5m3O2J78j06J76l1l22K45l57L24r7l4o3k4
4056a62%J30N8J72j70j31J70J24k41J57l00J55J39j24J9R0l93L25L56l26j3qJ2
$$ plain form
3886 -156 -201 232 -132 4 42 3 -76 25 158 -55 -21 119 59 95 41 111 114 52 17 72 79 -56 -132 -54 -129 -80 29
3913 29 -11 -132 17 78 -156 67 62 15 33 -93 -187 42 -144 -119 -12 158 -5 0 -33 -103 17 -61 25 79 29 -134
3939 -134 -7 -81 63 27 202 122 -245 -85 130 10 -220 -70 57 29 -41 74 2 60 -39 88 -62 -134 38
3962 38 -47 51 -123 -19 160 189 -87 58 75 -7 -75 -42 -130 -104 81 -76 233 135 54 -92 8 11 84 -30 134
3987 134 25 -86 -273 324 -73 -215 -5 -198 -251 90 -48 -84 -39 -62 6 -64 -233 95 292 92 26 -153
4009 -153 -10 -137 121 76 -116 -72 72 -121 50 -66 -78 -59 105 164 28 88 -30 -56 23 303 13 -103 190
4032 190 49 1 -97 -30 -14 -154 185 -172 5 -70 -113 -51 127 21 197 166 -156 89 -268 56 -41 -75 -138 -162
4056 -162 -162 -32 26 198 28 -103 67 191 -50 107 -193 -38 101 -23 -4 86 -307 18 374 48 35 27 39
4079C9J70p0j43j9J91o6j91J41J15j02j08l2K%J62k87L18K6j26k35J28K61k75
4102a01K62k93K50j13o1j46K95p9P2k33J20l27M25j71J72l2Nk03N0R8L0j0q2J0
4126f2J71k46J31Pq9r0k66L87J61k22R7j2j45L12po0k08J85NoL1J6k53J42L41
4151C20l37J82j85L9p8K8L3L8J32j86j41K81r3k3j87j0K12m7N2J15k36Q5j2j14
4175a32J60J90l77j1K43k04K27j67j09m2K04o9K39j59r4kL1J11q1J22r2k3J96
4198A61j56m6J21J07l06j15K53J08j04J13k21J76k75n7J79j25J13J56j20J24O9
4219A55k00km0J00o5p6J06K6O4LM8k39j8J50j91K19o8K5K61k5j42k87J42q9N7
4244h6k09K79J65k57K36o1M1k26J57m6M3k65J99m0o8J08O4j96K62q2j23RP5j1
$$ plain form
4079 39 209 139 -4 -23 168 102 -89 52 167 65 -43 -75 -73 -73 89 -198 120 146 20 -215 -87 174 -101
4102 -101 161 -132 118 5 -56 -202 93 14 86 -147 -27 -354 71 -100 72 40 45 -158 -108 -10 20 10 -72 -62
4126 -62 109 -137 -6 1 -88 -178 -444 -57 104 -118 -21 -33 -178 134 127 67 -141 44 49 43 74 90 -163 -21 320
4151 320 -17 165 -20 19 -59 -31 2 40 172 -14 -155 126 33 10 -177 -187 25 -22 30 145 -91 -6 -18 -132
4175 -132 28 218 -159 -170 73 -131 96 -71 -180 -222 -18 -87 152 -7 -101 -103 -72 39 -42 80 -12 -35 161
4198 161 5 -41 80 187 -119 -234 19 127 23 136 -85 91 -184 -241 -62 -187 -74 82 -38 86 155
4219 155 -45 -47 -87 13 -52 -128 -22 4 68 71 119 -120 -138 12 -179 40 -28 -3 258 233 91 -196 -54 -143 -86
4244 -86 -295 -16 149 -108 128 67 108 -118 39 -7 36 -229 -30 -70 -138 -30 34 -162 100 18 -105 -96 -21 -32
4268c2l9JJ81j0l99LM28j61j20J40j26K09j65K17j37K5j30O2QR7J9m2n5P3j56
4293a09k24L22J40k14J34M5j57J3k1R2k1oq9J64j20N1K44l84JK66j59K5q0k27
4317c14K99L30j40k06J02L1j18j25N4K20k99j3L76j20j05J00k86L80j17K0k14
4338a45k5K42j14J9j02J04M3O8K3k77J60M5j07M0r8k50M22L7k65J19K87q6k00
4361f0J78k69J45j23R8L4j71J47k1k6Q4L3k49L00n5O4j98K22j38M0Q4j47J08j50
4385g0J17J35p3l3M9j88M7o5J48k86K67j2j23J37m4n2J42k2k30J33j31J48j29
4408a35L30k82K70l63O0L59Ll39N6J38Ok8J01k81J67J40l89K42l2j06K99k43j78
4431b05M46k40J28Q5j17j44K26j64j55J47R7j41j21J47j63J59J17j75K22k49J25
$$ plain form
4268 -32 -71 -70 111 101 -298 -295 133 -28 -148 -8 -134 75 -90 127 -10 15 -115 -53 -45 52 71 29 -26 47 -109
4293 -109 -333 -11 129 -85 49 94 -63 -50 -71 21 0 -6 -95 69 -51 0 244 -140 -139 127 -32 -7 -87 -314
4317 -314 -15 315 175 -31 71 102 -16 -141 -87 133 -166 -179 197 77 -28 72 -214 166 49 69 -145
4338 -145 -170 72 -42 -23 -125 -21 22 90 113 -164 -4 41 -66 -26 -124 -374 48 85 -180 -61 226 140 -60
4361 -60 118 -151 -6 -129 -31 3 -168 -21 -42 -68 16 49 -200 100 45 109 -89 133 -5 35 119 -28 80 -70
4385 -70 47 182 109 76 125 -63 -16 -81 67 -219 48 36 -87 50 6 -46 96 74 -156 -23 -154 -6 -135
4408 -135 195 -87 183 -180 -120 239 242 -97 -41 97 103 75 176 -105 62 202 -187 55 23 -83 216 -27 -205
4431 -205 241 1 129 214 97 -47 179 15 -140 7 104 -37 -158 -11 -174 -15 102 -73 149 -100 25
4452B5R1k45K05j63P8j3l7Q5M15l45MN6n9J3L5k61K98j85n1K72n4k63JJ0J80K2
4478A14m14L66J85k28K6K31l06j60L41j37K9K8k24L30j76j87K54j8j47L02q5k62
4500a38K49n2N4K0r5kj24l2L59k13q8j23J15P8k4R0J75l73L7K98m9j25J4j29R
4525f9nm2J50q7k4O6Np3J63o3J53j60R8j40J02j83O3J72q7q9J55j23J02n1n8p1
4551i6K12j11k29RL29Qk94P0j4m4K67Q0l23L11k51K89j56K2j67P8p8mL62l31m9
4576a10P6J85k21J87j87J27K9m75M03L4j73q0L61J07l66j15J82k0J32P9j98R5
4598E2o1J08q0R9j24Q9j27K6J18j55K58k22j09K79Ro4p5k38J32K27k14K13l10
4621a69K91Qk22J31j90J23j1oj0R1j78L62l88J32Q6j3m1N1k6qL2J40l51K15M6
$$ plain form
4452 25 116 -129 76 -87 -9 -22 -59 26 441 96 100 156 97 110 145 -116 182 -3 -54 218 164 -99 -98 -88 92 114
4478 114 -300 66 251 23 49 280 -26 -186 155 18 47 75 -149 181 5 -182 72 54 -93 209 124 -138
4500 -138 111 59 113 133 38 36 -88 -120 239 26 -62 -185 -70 8 -16 74 249 -124 -87 211 162 37 51 -78 -69
4525 -69 -74 -116 34 -53 -77 -11 -6 -79 84 21 174 14 112 -28 74 -109 -46 126 39 -50 105 -18 84 33 -25 -96
4551 -96 116 5 -224 -215 114 122 -172 -102 -116 -160 107 187 -136 175 -76 213 57 79 -88 -10 -88 -92 270 -61 -110
4576 -110 -34 151 -70 117 -70 57 86 -389 14 48 -125 -205 156 263 -103 -218 -36 -56 76 155 -43 52
4598 52 -9 99 19 118 -6 83 -44 -18 100 -55 203 -19 -128 151 160 96 21 -217 -85 142 -72 141 -169
4621 -169 122 130 -92 39 -151 -28 -39 -45 -55 36 -142 220 -168 -36 50 37 -4 47 21 13 45 185 -166 49 95
4646I5l66N20k98R0p1L83m90J67n9M9qM7j73M4K73o5j33j19L17R2k41j52P1R5
4670F8J30J1l49L8K25j43j89j89M96j15J41R5k68j13K04r0Ro2Q7j34o1K61j97
4693a45R9N6l7K1q4L8J58j38O4j37M5n0nL92k29J68j79n5J37k64R9K85j12q1K2
4718F8n7j31J11Oo0K73k55K29m08K03J21j06N6M1j93K91l75J08j44J90P9j87J9
4741a21K14j68J90j45o9M7J64l58K00M4l41N03r7p1J7p6K30l17L9J05LJ00m3j27
4765g7J37Q1j28P3k45L72Jl33J8J67Q3q5j49J49J3k1l12K65Q8J05k78J35j01L0
4789a2O3QR2K3k84r0K05n7n2K63j67J06r5j39K00k0m0j2m1rk14M22l1j88k43J70
4815a42K64j41M2n8J36j21J3K3Jj49lQ9P2mJ34l54K13K5J28j04j84J00J93j41
$$ plain form
4646 95 -271 249 -49 41 -30 353 -137 30 -29 20 12 59 -114 -70 203 138 5 -114 203 295 54 -98 -27 68
4670 68 198 209 -140 -102 123 -20 -209 -398 98 -17 124 219 -49 -162 42 -48 -39 -101 -14 -148 -209 52 -145
4693 -145 -46 10 -27 -6 -90 -52 106 -32 32 -105 -60 -110 -115 277 48 216 37 -18 119 -145 -46 239 127 46 68
4718 68 11 -120 -9 -3 -63 210 -45 184 -224 -21 100 -6 50 91 -102 189 -186 -78 -222 -32 47 -140 -121
4741 -121 93 -75 115 -30 -99 -52 112 -246 -46 -2 -343 160 63 -8 9 -67 163 -154 -115 -10 -7 93 50 -77
4765 -77 60 141 13 86 -159 213 214 -119 -101 66 149 64 -85 64 77 56 -256 9 97 202 -76 59 -42 -12
4789 -12 51 59 151 174 -110 -200 5 -52 -104 159 -8 98 3 -136 64 44 4 -8 -49 -58 -272 150 119 -69 -312 -142
4815 -142 122 -19 23 -35 101 -20 -7 16 17 -132 -135 -46 26 22 156 -198 15 40 168 64 -120 -20 173 32
4839C2K5R2k43K12j1O6l50L36k51J35k48K49k13J13M1L44k63J21k04P2l4k16N2
4862a43NK80q9j04O2q2l6O4j21O7J22p5j08J67J37j68L1Q4j40K44l99K40O4j28
4886b6O9j35J36k28J59L8k59K34j51M06l00K21k81J0M4J92q1O7K06j36j19j12
4908d6P1j26k8J37J57j57O7qk31R2K32m90J24K31oO3j90NK57j03j67J48k5l3l3
4933e9L06k20R7o5n2J21j39J23J52M1l11j57K92j9k9j31J64j61N6kk03L80k46
4956f2K22j53j07o3L86n7p0k65K27O5J9k00Q8N4j93Q4L7j13R4K7n6J66l30L22
4980A22l23K65jr7o4K51l36J37Q2%Mo2m6qo8J75J12k24j14n3K80nj43J94K6j22
5006a8q4L55k08j71J48m2O2L4j65P5L2J14j37J3K24l54nJ85L8p3Qr4Q1p0lJ24
$$ plain form
4839 32 57 149 -94 118 107 173 -177 159 -92 43 -205 44 -169 -56 -15 329 66 187 -17 55 21 -195 -143
4862 -143 -138 142 53 -51 11 -71 -107 -43 -164 -97 25 -50 -158 9 146 -22 9 93 -47 197 -202 38 102 -26
4886 -26 43 -92 44 -184 -25 13 -246 -12 -163 243 -57 164 -117 -107 -63 129 48 115 321 185 66 -46
4908 -46 25 -101 -129 8 165 8 75 67 -164 -72 160 -330 -206 25 19 82 -108 -103 154 51 -116 32 7 -26 -59
4933 -59 247 27 124 59 7 128 -11 112 264 305 -6 -163 129 110 81 -50 114 -47 9 7 -196 184 -62
4956 -62 160 7 -100 -163 223 166 96 -169 58 123 142 -58 30 84 -109 -25 12 -101 -7 20 -36 130 -200 122
4980 122 -201 64 63 -34 -98 153 -183 -46 36 36 40 -22 -68 -76 -144 31 143 -81 -195 -248 32 27 -116 78 104 -18
5006 -18 -102 253 45 -126 22 -20 42 76 -89 -14 18 132 -5 8 232 -122 -127 58 96 23 31 -63 18 -52 -55 69
5032F9j00Q5j83J47k6p9L55m99N8K63k73K4J08r3J4K29k4j66j69K35n3N3M9K1
5056D5J2j22J92l5j65O6L17m37M21j15k30O4r5j05R1M0R0L46l37K01j42j68j77
5079b43J55J20k01j7J02j08K69mn5L4J41j35k3Jj44K32j60K4j20K7J38Q0J7J18
5103B48l95O5K41o4j34j86M33r6j98J2P8j9L62k37j23J60k17K0MJ63j00k22J92
5126a3m9J24K9l4J3j24j39L26N2j12j43K94k76mR9j11p6p5K31n3QK1K2N2l11J77
5152g2J01O0j95J02J69J3j19j92k5O1R3K84m07R9j46K27j67nj10M0J72J20k3k00
5176a20J74k19K54j39M9j70J52J22J30k94n0N8P2J44k0J57l34P2l7m3R6j15R3
5199C2jp1j51k3L59j97K15k06J6O4j35k6J89J63j37J56k12M1j14K63p0l66J07
$$ plain form
5032 69 -31 54 -129 18 -8 -87 268 -231 -173 90 -183 -159 -51 -144 -130 99 75 -91 -260 -25 -78 -25 24 45
5056 45 57 -65 127 92 -73 -7 310 -127 294 179 -51 13 -82 -187 -96 -56 34 380 43 244 102 -66 -243
5079 -243 -88 32 -169 -186 -84 -192 77 73 18 52 193 58 35 36 -108 124 -36 -12 -132 -105 33 113 130 248
5103 248 -147 -82 159 95 -39 -225 208 112 -86 -74 4 -15 347 110 -13 147 -70 -50 -46 117 17 -205 -13
5126 -13 -62 62 91 57 70 -54 -193 133 185 73 -70 224 -52 -56 43 -68 -144 -219 12 -41 -33 -12 10 62 -249 -72
5152 -72 29 89 -106 -4 165 178 59 -133 -158 -97 -4 280 -127 -28 -174 53 -114 -119 -229 -189 -17 103 80 -120
5176 -120 54 -165 89 -50 -1 -171 -19 103 233 -61 -111 -53 19 163 143 300 -34 38 1 -42 54 -61 32
5199 32 31 -40 -191 -214 145 -52 163 -43 -27 37 -98 -124 65 228 91 247 35 76 -38 225 155 -211 -104
5222a04L57k82O8j09K30N2k89m0K10k77R2J71j88j8J60l02P8J04oJ77k4k26L55
5245A89J1l29J19j16m3J0J9j91N25j3j48m8j09K08K6K62k87j01K59l08r8M72l59
5268e0J88j88R6k6Rj02l7n1J24N8J55j53j48j54M35l31K60O1k07J79k2j90K36
5291A42j85k01J88J79j97J36j10q9J55q3P1k0K81n36L46j63K7J03o9Q9j4j55K72
5314A67l56r9K55J42j88j25j86L12R1k99L27k06K01J35k49j08L71j18j73K3N1
5335c2j73j02M52p3k92K01RN1O3L2n3P1k23O4L0j89J17K02l44M1K22k37J33O3
5359C3K2j88Q6k7J17k9j81O9J15L7R1j28j26L4J11J98k68QJ48k47j9R9j43J76
5383a2R5j20L8k87K92m6r0K06j71J52l37L32j18k80K82oo3n8M2K26l17L77j93
$$ plain form
5222 -104 253 -29 39 -70 160 212 -77 -117 93 -184 -92 79 -109 -127 33 -269 -191 -87 -93 84 60 -166 189
5245 189 200 -129 -10 -126 -169 -159 -140 -331 194 181 33 -15 -124 84 110 372 85 -16 243 -65 -163 309 -50
5268 -50 138 -50 46 20 29 -73 -110 -161 -37 21 176 23 -125 -279 156 -175 85 146 -61 118 96 -94 142
5291 142 -43 -244 -56 123 -74 62 -48 -137 18 -65 6 -14 267 -269 77 -86 -59 44 -25 64 50 -105 167
5314 167 -189 -288 -33 109 -79 -204 -390 -78 13 -286 41 -165 36 171 -78 -186 185 67 -106 -83 -32
5335 -32 -205 -307 145 72 -220 -19 -10 41 104 136 83 154 -69 -5 25 -164 -47 155 -189 -148 74 -163 -30 33
5359 33 55 -133 -47 -74 43 14 -167 -98 17 54 145 17 -109 -75 36 234 -34 -26 122 -125 -144 -45 -188 -12
5383 -12 83 -37 1 -286 6 -40 -130 76 -95 57 -280 52 -66 -346 -64 -70 -133 -191 -149 77 -240 137 -56
5406e6L6j08J05J70l25q3L68j96L4O5o4J73l63K02P3j12Q2l5J39j50MP4k67K2
5430b12K65j65K31k88L01j74O8J05q5l03K25m3ML03l82K16oK87j44l65J07k77
5452c32M24Q4k79J37j35J94l38J13J37M7K4j28j67K26o3n2KQ6K17R9j37k45N3
5475c3J27N7K1O1j26k14l2J07N0k39J87n7K47j13m7K5J12k07Q0N9k20K38K23j84
5499A22k09K97k91RJ60o4J34k47P8n6Q8l82O00l61L2K37j42p9M3M9j08k6L1M1
5523d4K33Qn3k04J74j37m1L67m65J80k50J49J47l30Q8J12M7J33n6j72K15k45J84
5546D0j95K39N1l2j16M7j05j1K26k44J07j9j91J79j79K31o7R0j52QK43k6j63M7
5570HJ14k04P0J99Qj37oj88J44m3L33l86j7RL72l91K56j04k48L66l02M1J75j74
$$ plain form
5406 -56 -20 -128 -23 147 -178 -261 107 -89 -55 10 -54 119 -244 -42 31 -81 1 -34 105 -45 -41 33 -234 -212
5430 -212 53 -112 119 -169 132 -42 26 131 46 -257 -32 -75 -71 232 -150 66 60 347 203 -162 -55 -332
5452 -332 92 176 -103 34 -101 93 -245 -132 5 52 76 -52 -219 7 -56 -108 -106 -20 197 296 159 -86 -33
5475 -33 94 151 172 233 107 -107 -139 -32 18 -221 -34 -91 156 43 -4 21 133 -74 6 65 -155 83 306 122
5499 122 -87 210 -81 -72 88 24 158 -89 -11 -67 21 -361 239 -122 -90 147 5 -74 -31 18 -90 -116 -85 -44
5523 -44 189 197 144 -60 114 -23 -64 303 -162 18 -232 -83 64 -266 -178 -66 -19 114 58 -114 101 -144 40
5546 40 -155 84 135 103 -13 34 -71 -82 144 -100 7 -12 -203 -24 -203 28 -39 51 -101 -93 150 124 -39 8
5570 8 122 -82 -12 187 195 58 52 -136 8 -35 298 -88 -105 -96 276 -115 141 37 -211 155 -147 -106 69 -105
5594a05J59J69k59k49K56N3R1%qP3n23J14K01K13j44q0P4M8R4j12J06j80k86L10
5618A5m9P7N3k47L7L7QJ86k63L3M72j92j2k80R0J4P9j76j41K37q4K80q4k46J06
5643e0J12r9R5p0N1K49l35P7K1J00J66j10n6j22lK63m39J00J39r7J26k15K43r2
5667E4J4k0j53M8Ln1P2J57k4o5J06l6n7J14j69r7L8K7n6K10q0j89K08O0J46m62
5693b02J75r1J24p0J67J35j14k67J16M3k19J55J23J29q7O3k55l8M3j44K46j33
5715a01K3P6J30k24N1m9J79M2k03J83j19q3J63P6o9k22J09J78o4Q9o0k16j29L39
5739I9j03m5R7L4k48L00r1k44L22p8J29j95r5K05j94K55k81K90k2l43j5J71k7
5762g9J7j04L50j48q6J45j38N5N2r1k09J82K29j39O3j75J4R8P0J08l44J13N71
$$ plain form
5594 -105 54 223 -36 -285 -29 24 115 115 107 180 -343 -229 -28 185 41 -39 35 83 177 65 171 -9 -295 15
5618 15 -34 43 96 -151 -114 -77 -69 117 -146 -113 359 167 155 -125 -35 -21 58 -118 -259 -22 -106 174 90 -156 -50
5643 -50 62 -37 58 -12 39 288 -47 30 51 151 317 207 151 29 26 289 -150 -50 89 -8 118 -97 146 54
5667 54 68 48 -105 -57 -54 -105 -33 124 100 35 141 105 48 162 -7 -104 -66 -39 -95 115 35 -154 54 114 260 -202
5693 -202 -27 -118 6 -64 103 238 124 -143 -27 16 -203 -48 75 204 117 180 -75 -113 -70 -214 32 -101
5715 -101 -78 -2 128 -96 -45 -94 85 127 -76 107 -12 -95 68 144 75 -147 -38 140 76 165 105 -111 -240 99
5739 99 -4 -49 48 82 -166 134 43 -201 121 43 172 -23 -118 87 -107 148 -133 157 135 -208 -223 -52 -79
5762 -79 -62 -166 184 36 -50 95 -43 12 64 -27 -236 -54 175 36 99 -76 -62 36 106 214 -130 -17 554
5785E54n80k7K67k22p4n4K73l21K36J09l0j89J73j91J19j99K81j59j54J91k7l05
5807c29K58K55q3k30J22r7m5P7j04J52l2J38p5J35j69l11L26K21l52K44k84M27
5829B44k72M2j23j03M01j26n6p9N5K66l58jK15O8j26j10L24k08M6k16J80o5J32
5852A30j14j53K28m2J40k50J24K3K2j10o5k7J36j07J96j15j65m0K03L9J04lj98
5875d4L13j66R4j0k26J03n0k10P0J91j26L5L4K1m4N4p8R6K83m94K30k59J88j02
5899i7j0L56j55n5L70o92K75K64l16K44k54j37O2l6k9L38q1j82j35K14J04k4L8
5922F2J00K4r9j2j74J8J1j5J88j51j6J25j0j40J11n6K65m44M30n8l79N52l42j3
5946b3K27l92K25K48r5k10K0k25J98R8j38J20k07R8J09k8j23J46O3L4k90L45l36
$$ plain form
5785 554 -26 -53 214 -8 -82 -136 137 -184 52 161 131 -58 115 -76 43 -156 125 -34 -188 3 -24 -329
5807 -329 -71 184 101 -129 -7 -104 -149 -72 -176 -24 -56 82 7 142 -27 -338 -12 209 -143 101 -183 244
5829 244 -28 14 -109 -212 189 63 7 -72 -17 249 -109 -110 105 173 47 -63 261 53 99 -117 63 -2 130
5852 130 16 -137 91 49 189 -61 63 86 108 -2 -67 -94 42 -65 131 16 -149 -189 14 53 157 154 -44
5875 -44 269 103 197 187 -39 64 14 -196 -126 65 -61 -26 8 29 -15 39 -39 57 340 -154 76 -183 5 -97
5899 -97 -107 249 94 39 409 -283 -8 256 -60 184 -70 -207 -145 -181 -210 128 47 -135 -270 -56 48 24 62
5922 62 162 186 87 75 -99 -81 -70 -85 103 -48 -64 61 51 -89 22 -34 231 -213 217 159 -220 332 -10 -23
5946 -23 204 -188 37 285 190 -20 0 -225 -27 71 -67 53 -154 -56 53 25 -98 48 111 145 -145 200 -136
5969a36L01k87P9n6K66j37j11l8K68l29R3N8j18J95j07nQ9r3M0N7j20K14j21N
5993Gj22j3j86L40n8L59m35J14j05J45j40K6L11m0j86qJ85k72o1L49j86r7M9K17
6017A93l83J48j7p8K11l25M64l34L90l06J38j36P3j9O4l6l0K3J03m0l52N24m54
6040a79K57k68J83j87M56k57m2j95J94PM0Q0j6k58M27k99j30K75K59m59Q2J80
6062A50j19Mn9P0L3k64PM33j24n9M8j81K7l5J26lK3k35J98J05j5k31K39k89J07
6087d4J29K66l05k19P9n7K69l6j5p0j86K55j23P4J07l01P1L81k55o9j5J68J52
6110B56j07k04O6L3K7l9J57j69j78O2K18k46l1K50j83K61k34j4J6Q0Q6j59p2p1
6134a95k1J80N3j42L47l16K17m5j58J82j88J98j78j6Q5l7m8j5K0J42j26J16j42
$$ plain form
5969 -136 165 -122 -43 -99 167 30 -81 -119 149 -180 -87 -29 -147 48 -59 -64 25 -68 -28 29 -91 123 2 7
5993 7 -115 -128 -314 26 -32 327 -108 6 -99 46 -94 -68 243 203 17 9 194 -78 -139 210 24 -73 -24 193
6017 193 -190 -42 -59 -137 74 -251 213 -121 269 -37 101 -35 38 19 83 47 17 40 143 103 -249 275 -179
6040 -179 78 -190 -7 -194 262 5 -37 -232 -38 -31 9 89 73 -185 242 -57 -187 88 347 -112 -30 150
6062 150 31 35 -24 46 79 -185 -178 255 131 72 120 -61 -34 -69 57 54 77 -158 40 145 130 -101 138 -151 -44
6087 -44 85 351 46 -173 -94 -151 118 82 67 -3 -189 66 -57 17 124 -177 -106 275 20 -49 -64 104 256
6110 256 149 -55 11 44 71 32 189 20 -158 -96 122 -124 -155 95 -88 173 -61 -75 -59 21 107 -52 -124 -195
6134 -195 -216 -36 17 -125 222 -94 123 78 -80 102 -86 112 -66 -82 3 -34 -82 -97 -77 65 -61 55 -87
6157h7n0j12L45k84J16P9R4k2j35r1Q9J65m0k2j05L4k56J61J47l9J68m46L95j47
6181d3K35k29M6J49j42L2r3pJ19K23l31j56J55k82L00r3M93m51K39m4n5k82J09
6204a08K48J7r6q8P2K02k31j67J15j1n4l7K13k2k31L55k6j15j22l2p2k3p8K60
6228c1K40k34nm7Q6j4j4k1M2n9N9n5J76K0k30K03j71k7j27J58j34K80k8n3j01
6253h7J63k90Q6K80l38K9J47K74k19N6j40J50j74K49Rj24Q9k34J77mLo9j10M8
6277b9j13J22O4k9K11k34j90K16NqN8k41J35R4k8K0l4K03j19p9p5J98k34J4K73
6302B00J06k33m4p5J50J50q0k04j61K13j46p0J59n0J74k34J58k47Q6J42r4L09
6324B09k46p3J49ol8n4J71L0j74K6j8K42k21j6n2K86m6l98L77p5p9N1j0j38q9
$$ plain form
6157 -87 -137 -249 96 -188 -72 7 101 79 -56 -147 -58 107 67 45 -60 -26 -282 -121 26 -13 155 -291 104 -43
6181 -43 192 -37 9 158 16 48 -45 -52 67 290 -41 -197 -42 -324 -24 -117 376 -75 164 120 65 -217 -108
6204 -108 140 157 61 -27 45 247 16 -151 -36 -47 -101 -138 75 53 -178 177 151 36 -86 -118 -190 -213 -291 -31
6228 -31 209 -25 -30 -77 9 -5 -19 -40 2 -57 2 -53 123 143 -87 116 -55 -82 -209 -51 -185 95 67 14 -87
6253 -87 76 -214 -128 152 -186 -157 -10 264 45 101 -39 111 -63 186 195 71 160 -74 103 99 102 33 -77 -29
6277 -29 -142 -20 44 15 226 -8 -198 18 23 15 73 -168 -33 61 33 53 19 222 103 24 -51 147 -87 -73 200
6302 200 306 73 29 -46 104 254 174 -30 -191 22 -124 -194 -35 -85 89 -145 13 -234 -148 -6 -100 209
6324 209 -37 -110 39 33 -5 -59 112 142 -32 -6 -24 218 -3 -19 -71 215 169 -229 148 73 -6 45 35 -103 -192
6349a92J98p0j1P8Q5k44j7L52j94L4rm4j30K27Q0j21J79l33K33p8j49J18j11L4
6373h5K76l56K02P2j28R8l8Qj45J47k40K45j36J65M1m84L34j66J79J52k65J42
6395A8k52K58k17K54n6j3j49P8J39j90q9KM58j83K17k22Q0j94J44j06j5L7J04
6418A03o7r5%L32j43j89J20j53J17J8q9R7j44J06j59K88m12K04Q1j31K33j26l5
6441d4J50J12l23L5m8K00j4n0J4QM6j04Ok3P4o5q9R1j10J16j16r9K44O7J05k63
6467h0J91j29o6K26j05L9k50J49j24J32O8K7k15Q4J12j36K47l65R5N9j9J78k2
6490I6k98J19P3O7j05j17L32k7m4j72m7R6j15M14k72o8K20j58l1j32J2K45Q3m49
6514b78M2O8K19l9op0R6j93J68Q2o7j30L01j87o4K22l48L1L70k96K34j87J37k62
$$ plain form
6349 -192 6 -64 -75 3 88 -156 -173 179 -15 19 10 -34 -164 63 143 22 201 -132 101 23 -126 -8 -119 -85
6373 -85 191 -165 37 109 -19 79 41 49 -96 51 -189 56 -80 85 126 -358 -24 -190 -11 141 -124 18
6395 18 -234 24 -193 61 5 -8 -157 -79 60 -130 -219 -217 241 58 275 53 133 -61 83 -23 -38 -1 103
6418 103 36 -59 -59 273 130 -59 61 -92 25 43 -46 51 -93 13 -146 142 -270 -66 15 -116 117 -9 -44
6441 -44 106 218 -105 -70 -118 82 68 18 32 40 86 -18 -12 -35 39 -26 -115 -24 -134 -18 -134 -233 11 78 183 -80
6467 -80 111 -18 -84 142 37 76 -174 -25 -149 -17 51 78 -137 -53 59 -77 170 -195 -100 -41 -60 118 96
6490 96 -202 -83 -10 57 -48 -165 167 140 96 -76 -123 -27 -142 272 0 -68 152 -6 -37 -169 -157 88 171 -278
6514 -278 -236 -168 51 12 6 -64 32 -161 7 89 22 -108 193 6 -58 164 -184 -153 217 -79 155 -32 105 -157
6538a57J98N2r6O5O6Kk70j5M59n77J18K11r3J97j89J62j27r9l7R7o6lO3J11j02
6563c0N3k49K22J10k85J47K2j71J21m0J81Q4j21J98K7k41j35r7K01L2N1J6j53
6586e7J25n0M7Rl41N16k58J09k12j00J56M5M6L2j82k13L29N8K14m18N4L2o6l3
6610a58J09J78k25Q3N4R0j62l2J43p7J71m81M06J10k29L1k94N49j12r5l4j78l0
6633a83L11j25r1J62Q1k99k0K26Q5j99j19K79L3l1m03K47J09k17M16l13O0j2M7
6656D4q6P6L01n25J45j07J43J4nn1j4oJ4J66k63L79k84J37j57l5R0n9K39j72J8
6681B%J5o2J4k49J30R2JJ53k55P4K48l15K86l2J02j68N6JK8j85M7R5j38J70j26
6707a6r7N7j9J37M9K6j38o8o5J98j3j44K29k54L02k13P2l6P5k18M0J68J39j39
$$ plain form
6538 -157 41 93 -3 62 128 130 -140 -155 304 -273 -155 56 -37 160 -29 133 6 -93 -130 -33 -99 -102 -39 72 -30
6563 -30 23 -226 -4 106 -179 -32 -10 -181 -60 -100 81 165 44 242 269 28 -107 -204 -3 29 80 96 -57
6586 -57 68 18 65 74 -267 249 -9 100 -112 -212 -56 -11 35 67 -115 -328 1 59 273 -145 -91 -59 -125 -158
6610 -158 -49 129 -96 -13 41 131 -31 -63 80 3 174 -307 99 209 -20 11 -283 266 154 59 25 -153 -183
6633 -183 128 3 -88 74 155 -144 -164 62 147 -52 -171 108 141 110 -293 -46 63 -154 262 -51 9 -3 44
6656 44 -42 34 335 -190 -45 -152 -9 5 0 -51 -65 -71 -57 109 -154 225 -59 78 -79 -114 -24 -83 156 -16 2
6681 2 2 17 -45 -31 -280 -150 -58 -57 96 -159 -85 163 -152 134 102 204 36 92 93 121 -64 -17 78 -60 110 -16
6707 -16 -113 -56 -75 62 111 137 -1 -69 -134 64 51 -93 136 -118 184 -29 43 7 82 -136 -96 72 211 72
6731G2K07j40j22N3j70K59K8k58J31j59M7j05J28J72k32n6J24p1J31J3K10l87
6753a25j4J80j14J79m9l2K1N58r13L83Qj92j45K93k5K3O4p5J54j86K81j67mJ10
6777B13k99Q1P2r3j37O6L46j19k61O7P8P7n9j32K25k94J96j51J23J41k9o0r1K74
6801B34l47O1J11N5J23l10K34j76j2Q7j33J94o9p5j39K02N3J0m4l7J39m40N14
6824B35k44K70j47m6j68j5K2J78j89K8J42j59K49j39M4l7j20J92j70l3K62l62
6846b07O1K61l53L11Q1k03L57n35J90O9j45m5R8Rn8L00j59J23l93K64k4k91L52
6869F3o1J44J9p2O8M4r6j56J87L2l55L21l94L96j13j05K40r8k95K53J04l51M09
6892A84j46l40K66k9k3J20J3j07P2l2P2J2p1Q6j32J62j07j88M56k77Qk4j22L8
$$ plain form
6731 72 279 139 17 70 -100 159 187 -71 60 -99 -52 -157 -29 143 -89 -145 -21 -92 39 52 262 -125
6753 -125 -139 41 -73 106 57 25 46 604 -309 74 82 -110 -255 38 13 36 100 25 179 -7 274 107 103 213
6777 213 -86 -5 67 -26 -163 -97 249 130 -131 -64 14 91 32 -100 125 -169 27 -124 -1 140 111 51 -40 234
6801 234 -113 -52 59 114 237 -73 161 -15 -27 60 -73 121 52 -23 -162 40 93 103 59 22 161 -279 235
6824 235 -9 261 114 68 -100 -115 -93 85 -104 -76 66 -93 156 17 61 24 -96 96 -74 -107 155 -207
6846 -207 -146 115 -238 73 154 -49 308 -227 -37 32 -113 -158 -60 -51 -109 191 32 155 -238 26 2 -289 63
6869 63 2 146 165 93 161 205 109 -47 140 172 -183 138 -256 140 27 -78 162 64 -231 22 126 -225 184
6892 184 38 -302 -36 -65 -88 32 45 -62 10 -22 50 62 -9 77 -55 107 0 -188 268 -9 -1 -25 -147 -109
6916a09k24L16K91l42k66L08p5p7L68j39J23k60J18k04J55o5L1l5L7n1J42J16
6938A58l90L79o7r2P0p1j11RK73k95J47Pn4J45j56J07j38K53k28q8N0K05k92K09
6962C0K7N9k51J98RK1k95L30k44L71l13M6J31p6Q7q9K22l92J77j46J49kJ1R8k07
6987d9nj6o9Q5K42l53L31j03r1j2j43K35j17K24j16m2l9j51J58lK96k52Q5j71
7011g6j60J72J26k17K74m7N2j87J41M3j82K2JM2kP6r4m4k20J39M16l80J08j15
7035a12J75j17j86J56L20j54q4K55m50J18k4L8Q1K21k24L5J20j77L6k11J89O0
7057F5k24O5J23n3k52J00J80J31p8q2j12L1L3J73j34j22K04q7j62J90r2K14J87
7080B98l46K63j32m0O0q8L07k66%k50K11k52L03q9J43l40K87l46J18L59n2Qk54
$$ plain form
6916 -109 -333 -17 274 -68 -334 -26 -101 -178 190 51 174 -86 32 -172 -17 -82 -51 -86 -49 -100 42 158
6938 158 -232 147 80 -12 58 -13 -124 -115 158 -137 10 17 -37 108 -48 59 -79 174 -54 -142 -92 113 -179 30
6962 30 57 116 -135 63 72 93 -202 128 -116 255 -58 -12 119 43 130 41 263 -129 48 -98 51 49 60 158 -49
6987 -49 -54 -70 -139 -54 188 -165 166 63 -28 -40 -183 52 -65 159 43 1 -38 -189 -31 -34 262 10 95 -76
7011 -76 -236 -64 62 -155 119 72 124 -63 78 121 -61 -39 -38 4 2 78 -16 -60 -280 -141 275 -105 3 -112
7035 -112 63 -54 -240 -84 236 82 -2 253 -197 -79 -103 -65 16 237 13 48 168 -9 27 -184 5 65
7057 65 -159 -94 29 -24 -276 -176 4 135 57 -25 -137 -106 -73 100 -34 -156 48 -39 -201 -11 -103 111 298
7080 298 -48 215 83 43 103 15 322 56 56 -194 17 -235 68 -21 122 -218 69 -277 -159 200 148 156 -98
7103i8j48K31K00j06K6j76q7P1J19q2L70j86n8j18QK44k61PL9mj37M9L1J94j03
7128B5Q8k10J59j44J19K05k97J44k42M61m01r1J70K23l05J12R2q6R1k57J75P0
7150A01O8j75P7j7q6J14l02J42J89q6Q9j81o2K58k78J68J05pq2o1L4K10p5m15
7174b72K65l1l5J8j60J47Q2j99K70J62k65r2L19k83J40n6m9J92k66j13K88k19
7196a57K69j50J66P7k95J17n1K0j58R2j46M17j35o2Q7j03K7J78l67J50L2n7m2
7219i1K02l4M9Q7k51j40l4R7J67L9j41m5q1J44P1K01j93P3o0j02K3Q6J99n8j97
7244A1n7j7L6K88l46J68j42K38j67R4j77K56q9j08N7O4p8L5p9N1P0K6J84k89p2
7269d3%K5OK0L5l9k65L49m8q8O3J74p6J30l01J83k76J87J71k84M6J70J26l06J40
$$ plain form
7103 -98 -246 -15 185 79 105 -71 -158 -87 32 -50 320 134 76 -42 -34 210 -51 -44 -5 -9 -146 -97 -66 128 25
7128 25 113 -97 62 -82 37 242 -55 89 -153 308 -93 -184 -14 209 -96 16 108 22 113 -144 31 101
7150 101 169 -6 71 54 -32 82 -220 -78 111 25 114 -67 -129 129 -149 19 124 117 35 -26 8 218 143 -272
7174 -272 -7 -38 -73 -55 -215 -68 14 -185 85 247 -18 -110 209 -74 66 10 -39 153 -113 -226 62 -157
7196 -157 112 -38 128 205 -90 27 -24 -4 -162 -70 -216 201 66 4 91 -12 15 193 -174 -24 8 -49 -91
7219 -91 111 77 126 213 -38 -178 -212 -115 52 91 -50 -95 -176 -32 39 240 47 120 60 -42 -19 67 266 208 11
7244 11 -46 -63 -27 261 -85 83 -59 179 12 106 -71 185 96 -12 45 109 31 66 -13 38 108 134 318 29 -43
7269 -43 -43 -18 -12 8 43 4 -261 88 40 -48 15 189 113 243 -58 125 -151 36 207 -77 -31 139 265 -41 99
7294I9m2p7o1L8J46j4k55J35n5L42l34j29M01k33L7K0M9kk37J37J07j24K55j19
7318H4r1P0r6M2M8l8K08m15%J22m7K93j69J38j74Q8J15l00J77j7J29k58R7k0M4
7343C0n0J05p1k00J15Q4K7k59J66M6K1o5M1J0K02n7k55R1Q3j21J65m99L97L35
7367C41m06J02J66j52j08j5J60j83L41j08mj70J15q3J35J2l12K38k82K32r4j56
7389b31K69o3N5J3k09O9J20J3k54L2L55k01K2K22k34j29K44j15k52K80L3j36n5
7412a52M26l05m4nj20M17o8lj30qj14K1L56j54k62K79j9R6k85O2m5J06j18Q5r4
7437g8m7J22J40j12k02m0J76l3k0J87j31P2k0P7j19J43j32J69k8k05j8J00j29
7460a28JK72k17R5J54r7J10k40M7M1j31L46j17j03Kk63L22k91J42O2L5p7M2M7
$$ plain form
7294 99 57 -20 -81 -43 103 89 -166 -31 -86 256 -78 -207 194 -39 -2 18 67 65 -172 -35 72 -52 203 84
7318 84 -7 63 -33 9 57 19 227 -188 -188 -66 -113 180 11 149 -25 63 178 -122 55 38 167 -91 6 -14 30
7343 30 -20 85 14 -186 -71 13 40 -219 -53 -7 14 -51 -10 0 202 145 -110 -19 64 -57 108 -391 6 341
7367 341 -65 37 203 51 -57 -72 88 -95 246 138 134 -36 79 -4 131 143 -169 69 -213 19 -75 -231
7389 -231 38 -25 30 43 -166 -97 23 36 -218 -186 169 -32 -10 212 -22 -151 93 -22 -274 6 39 -97 -152
7412 -152 274 -31 -75 -80 -200 217 149 146 16 8 -106 -85 271 117 -145 134 115 211 -74 -12 -57 49 -69 16 -78
7437 -78 -125 -3 137 25 -177 -217 -41 -74 -94 93 -38 34 14 91 -28 115 -17 152 124 -81 -99 1 -128
7460 -128 -127 145 -72 23 177 80 190 -50 -3 38 -93 253 136 33 35 -228 94 -197 -55 7 42 -35 7 54
7484E4j00J23J14k96K81j89k15K80j46J9j7J46q9L7kJ63qj77j42K77r6j41r5K62
7508D3J65j41l3m61N49M1l25j10J45L06l18J58M1J60p3o3k3J05l68k3L58k06l39
7531d12M27Q3j46j75L12k3j07j73J47K6R2k60K46J19k8j73o1J63l49M05k64J87
7553C6J86j97JJ7J32m57N34j48k00j7K96o6j21o1O5k58J50P8n2n2J20L0m8K2j5
7578b5J9J38n3j32R6n1l0J80j57J51N1j98J6P5P3j44P8J19l15oM3L15m43J76J20
7603I6J12j91pK18l82Rl5J43j5N0J70l04J76k66L89K7k57l0P3J49k29K06j87K39
7627A54k3m65J63K44j21R0j65J40K3P8J01k66J21K12j17r9m4o5j20J79l16K08
7649h8J11l9J81qk35P5O9k02K30k32J92k36j51K86k3Q5j15K85l97P0K14r8J11
$$ plain form
7484 54 -46 77 191 -105 176 -13 -228 52 -94 -75 -92 54 -35 2 0 163 155 -22 -164 113 17 -124 -219 43
7508 43 208 67 34 -427 122 163 -162 -272 -127 179 -139 19 60 220 147 84 61 166 -202 -225 133 -73 -412
7531 -412 15 98 -48 -223 89 66 -41 -214 -67 -41 51 -209 37 156 128 -45 -106 57 -292 113 -151 36
7553 36 222 25 26 43 175 -282 252 104 -96 -113 183 117 -4 -65 0 -258 -108 -30 -82 -134 -14 16 -32 -10 -25
7578 -25 -6 132 79 -53 43 -8 -38 142 -15 136 187 -11 5 80 153 9 87 206 -109 -115 -72 243 -200 -24 96
7603 96 208 17 10 228 -154 -145 -180 -37 -52 -2 168 -136 40 -226 163 190 -67 -97 -24 125 -104 102 -85 154
7627 154 131 -334 -171 73 -48 42 -123 17 40 118 219 -47 74 286 169 70 26 -39 -159 20 -296 -88
7649 -88 23 -16 165 157 -78 -3 66 -136 94 -138 54 -182 -333 -47 -70 15 -100 185 -212 -142 72 -26 85
7672H5r6L6r1J2K17l0J6k20K5KmL9K58m43K40J30l89L09m2j46J61r9M1Jp1L3J17
7699I1k12r3K03l13J64P4O5o7j28J98K20k95j7M7k65M09Mk75J29J68Q9l00K53
7722A49j17p1N5r9J99k19K07o9n9j55K02o6Rk52J75K66k11O6r1j04M12j20j71
7745f4K10k28l8J4J71q9J82j07j34P3m2K17j21k65K12r0P8j90M5L03k56J19R8
7768I8o7j81J99m5K3L3Q4q9r0n8J7P7K15m08K13j40Q2Q8j14O5k5j26K08m6R8j76
7794f5J62j07R3j53K64o6k19P6J51l53L70l4j06q4rM77l06j19J64l04K51r2L3
7817B4j75N4J43j09J69j16j31k27O06k7j60M5J71k21j43P6k3K57k37K54j43k5
7839F2j80J07O2k1K82k47Lj32j33L47j94J20M0k95K39P9Jj99M6N1k24n1K50Q0
$$ plain form
7672 85 -11 25 -66 -54 163 133 149 -71 -46 -44 -48 -9 249 -194 46 176 -213 96 54 -92 69 -30 11 12 -59 -26 91
7699 91 -121 -214 -11 -324 -160 -86 -21 -88 -216 -18 202 -93 -110 -63 -328 81 85 -190 -61 107 196 -104 149
7722 149 32 -39 16 -83 116 -103 104 35 -24 -179 23 -43 -34 -286 -111 155 -56 10 -81 -185 227 107 -64
7745 -64 146 -82 -120 -106 65 -24 158 51 -83 -10 -52 165 44 -221 -9 -99 -21 -211 -166 137 -119 0 98
7768 98 31 -150 49 4 27 60 144 55 -35 -93 -76 1 216 -192 21 -119 -37 51 -63 2 -23 -149 59 13 111 -65
7794 -65 97 -10 83 -70 194 128 -91 -15 136 -217 153 119 13 -71 -80 397 91 -28 136 -168 83 -9 24
7817 24 -151 -97 46 -63 106 -10 -141 -368 238 211 51 96 267 46 -97 -21 -44 213 -24 230 87 62
7839 62 -118 -11 51 30 312 65 68 -64 -197 150 -44 76 116 -179 60 139 140 -59 -13 38 -186 -237 13 93
7863I3l57J26J79p5M7J40j38Q7j00p3J55L6k31m1J5K33k75Q6L5m2O5j05J10j27
7887a57K9J69q7K54k37j07K10q5M6j17N5P3N9k21KM02k43N6k50J00k8N5n8K68
7911A88k0n7j29L7N3j09K2r1O0j18J70j1J4J09k72Q7L2k05K67o2n2J96K5j79j75
7936b20K06J36l28K51pj33J56k6j70J57M4L0P4k16O0k33J13J41JJ8j74J51j17
7959h6J69j5K4O5k28N2K6k5K54l29J54j30K40l55J69l8j31J54p9J61j2q3k06J97
7983e2j71K59k61K20K10k43j34J10j26J96J11k3j15q0M3j02J59J05k34N1J66r9
8005a0P2j82J32j0k3L3M6r2l3Q7K43l17R3M77n15K03k42q6L17J0l41K25p7J4K1
8030D5j76J51m7Ql3K05l04O3K36k72K12M6j90qj1Q1L9j5P8K1r4j06J55L2J5q3
$$ plain form
7863 93 -264 -138 41 -34 13 153 15 102 2 -71 84 120 -111 -152 -137 96 -179 -93 -58 -100 -35 -140 -30 -157
7887 -157 -128 41 -46 208 -29 -136 74 -11 35 -82 -27 46 105 -116 -114 288 45 101 -149 -49 -77 -22 -80 188
7911 188 168 111 -18 19 72 -37 -15 -106 -46 -164 6 -5 9 118 -154 -67 -35 -240 27 -35 -87 109 134 -45 -220
7936 -220 -14 122 -206 45 38 -95 61 35 -135 22 66 96 170 -46 14 -219 -106 35 36 54 -120 31 -86
7959 -86 83 68 92 157 -71 -19 7 -18 236 -93 61 -69 171 -184 -15 -53 -184 -30 -109 52 40 -43 -249 -52
7983 -52 -223 36 -225 -5 205 -38 -172 -62 -188 8 119 96 -19 -99 -56 -158 1 106 -128 -77 89 -10
8005 -10 62 -120 12 2 -21 12 58 -34 -67 20 263 -54 39 516 1 204 -38 -124 193 203 -138 87 10 24 45
8030 45 -131 20 -27 -19 -52 153 -151 -88 148 -124 88 134 -56 -64 -75 6 45 30 108 129 35 -71 84 116 131 48
8056D8j26p1K99j51M9o6R4J10m6p5j60P4J0J87k95J32J93j09m5q7J30J78k74o2
8080f3K33l76J78k2j82J40J14kp8J97j22J4k24L72k38J4J00k49J28J42M6o3K75
8103C34l60k6j15N2J93o1K15k63P2q4J14k93J82J76j38p1O4o6R7K33j58k83K41
8126E5r9J24N4j58J24j39j3K68j51l27K31K17j30n3Jj37K34p9J57m04M49k72L23
8149B75k62J2K0n5L6p9J83j78K04r8j8L9j46Pj60m8L29n9R1M4k8K9J76l24J6n7
8175e1K10qj39j9j13J00j09L23l13K7J53k79M79j81J8k12
$$ plain form
8056 48 -78 -149 150 -1 48 -18 76 186 140 65 -95 -21 -11 176 -119 13 206 97 52 -35 95 273 -1 -63
8080 -63 170 -206 -28 -50 -232 -92 22 20 -58 139 17 31 -193 179 -59 -45 55 -194 -66 76 122 59 334
8103 334 -26 -52 -167 -115 78 17 232 -31 41 -43 71 -222 -40 136 -2 -73 -9 -75 22 255 97 -186 55
8126 55 -44 80 134 -24 100 -39 -52 216 65 -262 -31 186 56 3 4 -133 101 22 179 -225 224 -48 275
8149 275 13 25 45 -10 26 -53 130 -48 156 58 40 79 -67 -60 -220 -268 61 2 93 137 109 138 314 -10 6 -51
8175 -51 159 151 12 -7 -120 -20 -129 194 -119 -92 61 -218 261 80 98 -114
8191a14
$$ Imaginary data points
##PAGE= N=2
##DATA TABLE= (X++(I..I)), XYDATA
0@%%%%%%%%%%%%%qJ6j6J6j6K4l2L4m2N0n8P2q5R5j08J25j47J68j90K16k44K77
35A47l12L51l96M42m91N47o07O75p48Q27r16J010j112J227j352J488j639J807
53I48j993K200k435K704l011L364l782M285m899N667o665Q021r975J3052j8633
68a1152L1926j23693j08684K26295Q1074l1675n7625k165K8009j4650o2554P2806
80B7912P3333p9092o9405L4324l352k3273k2M8101R0120k5919j56912R1J40018
93E5924K5518o5152l0734j671J2464m3075m9521R3241R0492q9820p6246N1459
105b7121M8214P802j5109j2293M3942j0086r5849J3698Q7141k0929m4200K0479
117d311J9957k077m5609k7038J09443P7387j16515r3276N4215O1269Q894l6416
$$ plain form
0 0 0 0 0 0 0 0 0 0 0 0 0 0 0 -8 8 -8 8 -8 16 -16 18 -24 26 -32 40 -45 50 -58 67 -80 88 -102 114 -130 147
35 147 -165 186 -210 232 -259 288 -319 356 -392 435 -481 529 -583 644 -708 780 -859 948
53 948 -1045 1155 -1280 1424 -1587 1777 -2005 2280 -2619 3048 -3617 4404 -5571 7481 -11152
68 -11152 20774 -102919 -211603 14692 95766 64091 6466 4301 32310 17660 -44894 27912
80 27912 101245 22153 -47252 -12928 -16280 -39553 -39575 8526 98646 72727 -84185 -84094 55924
93 55924 81442 16290 -14444 -16115 -3651 -46726 -96247 -3006 87486 -2334 -78580 -27121
105 -27121 21093 28895 13786 1493 45435 35349 -60500 -46802 40339 19410 -24790 -4311
117 -4311 15646 13569 -32040 -59078 50365 127752 11237 -82039 -27824 33445 42339 5923
129E923l6454L6418J0600o3610K2782O8143l7924l9288K9680J3559j3152l9959
141d3282k0076R0326N3030j01031n5342O7462M6004r4k2590k3096L1637J423o3624
154c9253K2472O5970l6277m3010K1090J7622Q157j8462k4410N6523L2828p8764
166a5514k8769N1652J612k4376p645m27K8907r575n7636L7721P9239k5628m2573
179a3012J0995J2936J7854r352l9144K2188K0127n3296k234M9291j6354k4541
191b4542J5940K0889K9677j7738o2674L0326O8293l2796m7483L342L646J6686
203C566l31l3105J8674K5000l4889R444M2446k4494k3987J5700J0377J7511j7148
216H764n5173K4310N3726l0166k6216K0711M570O930J40k0822K5578K2603m0738
$$ plain form
129 5923 -30531 5887 16487 -47123 -24341 43802 5878 -33410 -3730 9829 -3323 -43282
141 -43282 -63358 26968 79998 -21033 -76375 -8913 37091 36997 14407 -8689 22948 24371 -39253
154 -39253 -16781 49189 12912 -30098 -9008 8614 16771 -1691 -26101 30422 63250 -15514
166 -15514 -44283 7369 8981 -15395 -23040 -23467 5440 -4135 -61771 -24050 55189 29561 -13012
179 -13012 -2017 10919 28773 19421 -19723 2465 22592 -30704 -32938 16353 -1 -24542
191 -24542 -8602 12287 41964 24226 -38448 -8122 60171 27375 -20108 -16766 -13120 3566
203 3566 3235 -29870 -11196 13804 -21085 -11641 30805 6311 -17676 -1976 8401 25912 8764
216 8764 -46409 -22099 31627 1461 -24755 -4044 526 7456 7596 -13226 12352 34955 -5783
229e783k873L3093j8421j4503J0210m917J2028l95l6703J4500L2013l1191p133
242b0075L1466p235j2469l011o731L4638J9412m8555q005L6077o499q378L765
255D400j5262J1809J2430k8943N687K1595k3778N610L1852j7098j6827L097k718
268h146K7048J0004m8485n934L4258r449q250Q821r950J2089J1575k5297R417
281b299K4281k1414p28K0177j9742r553P514j1172J2841J1160l1159J643K7583
294I132j4923l068J9820m943L408J882k3811J3603K4513k6225j0357J5812j2286
307g443p64R834j5834R079J7186j9977L026J9712j8171m27K0969j0442m123Q44
321C469j9666J2610K1197k5730p239J9064q176J926J1558j4374P928J4972k1052
$$ plain form
229 -5783 -8656 24437 6016 -8487 1723 -3194 8834 8439 -28264 -13764 18249 -12942 -20075
242 -20075 11391 4156 -8313 -11324 -18055 16583 35995 -12560 -20565 15512 9013 635 4400
255 4400 -10862 947 13377 -15566 -9879 11716 -12062 -6452 25400 8302 -8525 -5428 -8146
268 -8146 18902 28906 -19579 -25513 8745 -704 -8954 -133 -10083 2006 13581 -11716 -2299
281 -2299 21982 568 -160 20017 275 -9278 -1764 -12936 -95 11065 -20094 -18451 9132
294 9132 -5791 -8859 10961 6018 9426 11308 -12503 1100 25613 -612 -10969 4843 -7443
307 -7443 -8207 1627 -14207 -5128 12058 -7919 -4893 14819 -3352 -3779 17190 6748 2625 3469
321 3469 -16197 -3587 17610 -8120 -15359 3705 -4471 -2545 9013 -5361 2567 17539 -3513
334c513J154J6304j9988l439J5282j3389j897P556j5947R983K0285j8200K58J9899
348A4348j1203J02J2228j3460L868R238k2777J280J7505j7738m264J4722j0363
361f514K394J1271j5498N116J6176j7105j166J4870j4786k243J1628j1970L096
374d731J1199j7219L765J8607j4193j609J4083j1265J590J1426j4909J954J3049
387A1747j6504L98J5929j3771k564J1408j1488K798J0835j7018J735J5981j3511
400d025j117J3040j2178J871J2819j3890K01J1435j6087N7J3767j4444k629J2340
414A160j0175L276J2994j2487M370J6552j2413p22J2598j2352o55R273j5660q36
428e077J1312j4650N9J4167j0862J432J2929j0862N00J1613j2841q25R598j5622
$$ plain form
334 -3513 -2359 13945 -6043 -9482 5800 -7589 -9486 -1930 -17877 -7894 12391 -5809 -5551 14348
348 14348 3145 3247 15475 2015 5883 15121 -7656 -6376 11129 -6609 -10873 3849 -6514
361 -6514 -4120 7151 -8347 -3231 12945 -4160 -5326 9544 -5242 -7485 4143 -7827 -4731
374 -4731 6468 -10751 -6986 11621 -2572 -4181 9902 -1363 227 11653 -3256 -1302 11747
387 11747 -4757 -4359 11570 -2201 -4765 6643 -4845 -2047 8788 -8230 -6495 9486 -4025
400 -4025 -5142 7898 -4280 -2409 10410 -3480 -3279 8156 -7931 -7874 5893 -8551 -11180 1160
414 1160 -9015 -5739 7255 -5232 -862 15690 3277 2555 15153 2801 2146 11419 -4241 -5077
428 -5077 6235 -8415 -8356 5811 -5051 -3619 9310 -1552 -1052 10561 -2280 -3105 6493 -9129
442i129k895J1919j1130P2J1229r443M939J4993j0605J223J4299j0188r36R029
456A3377j4569k275J0620j2406j775J0288j1257K263J3815r707P60J1788j0748
469A74K92R887j3665j794J0816j2318k025J0578j0479J485J2065r989Q83J2085
483G995j0682L31J0326j1326m86J0810j1107p45J1276q861P92J1170j0487j69
497a163J1859r657p79Q751j2032p40J1577j0525j802J0273r326q21R812r734j210
512e517R744r919r23P997j1059N53J3210p923o05J0986q348J368J3035q329j856
527B414Q448j0581k989Q420r725p88R923j0304m04J1172q120J155J2057q394k800
542e16P180j0791j423R255r754j757Q749r933k50J2489m706J847J0055r907j890
$$ plain form
442 -9129 -12024 -105 -11235 -11163 66 -9377 -4438 10555 -50 1173 15472 5284 4348 13377
456 13377 -1192 -3467 7153 -5253 -7028 3260 -7997 -5734 8081 -1626 -866 10922 174
469 174 466 10353 -3312 -5106 5710 -6608 -8633 1945 -8534 -7049 5016 -4973 -4090 7995
483 7995 -2687 -2356 7970 -3356 -3842 6968 -4139 -4884 6392 -2469 -1677 9493 -994 -1163
497 -1163 10696 1039 260 9011 -3021 -3761 7816 -2709 -4511 5762 -3564 -4385 5427 -4307 -5517
512 -5517 4227 -5692 -6615 1382 -9677 -9124 4086 -3837 -4442 6544 -1804 -436 12599 4270 2414
527 2414 10862 281 -2708 5712 -4013 -4801 5122 -5182 -5586 5586 -2534 -1379 10678 2284 -516
542 -516 6664 -4127 -5550 3705 -6049 -7806 943 -8990 -9240 3249 -1457 390 10445 538 -1352
557a352J0028q447j888Q373r853l294O909p964K192J1695p492K32J0864r060k242
572a299J1003o057j355N368j2322k656R508o411q33Q789q473j290Q596o304J171
587b565R599r497k139R308q325k909R799m090O17N978r544P30J1812o889j981
602i6Q594q490l149P546o193J87P917r063j835R540p309j997Q383n953j147O037
618B972r484Q63J0878q139k722J0655m566k701P063m986J748O730j0620k253R778
633E216p155l255P886o069j158P561n245J206R264q951k667J0910m348m110L714
648B799o214J044O894r847j261J1773n584m097P512l872o32O654o041j03O254
663E279j0481k454J1597l409l832M646m969J638Q163p353L64J1295p437o381O145
$$ plain form
557 -1352 8676 229 -1659 6714 -3139 -6433 476 -7488 -5296 6399 -1093 -861 10003 943 -1299
572 -1299 9704 3647 2292 7660 -4662 -7318 2190 -4221 -5054 3735 -4738 -6028 2568 -3736 -2565
587 -2565 7034 -2463 -4602 4706 -3619 -6528 3271 -819 -202 5776 -3768 -3038 8774 1885 -96
602 -96 8498 8 -3141 4405 -1788 -1601 6316 -2747 -4582 4958 -2351 -4348 4035 -1918 -3065 2972
618 2972 -6512 -5649 5229 -2910 -5632 5023 457 -2244 4819 -167 1581 8311 -2309 -4562 5216
633 5216 -1939 -5194 2692 -3377 -4535 3026 -2219 -1013 8251 -700 -3367 7543 3195 -915 2799
648 2799 -3415 -2371 4523 -5324 -6585 5188 -396 -4493 3019 -853 -1485 5169 -872 -975 5279
663 5279 -5202 -7656 3941 532 -3300 1346 -3623 -1985 6178 -1175 -811 10484 3047 -3334 2811
678B811k728O8M748p823n1O562r962j682J2730l455l948M881n491K06P084n529
694a579J969R105r618p031P724J63R93M271q338j003P499q335j555J1848k275
709C838n129K630n195M66O451m570J703P795j1223p200R836J945P33L854p650
724a716j135O583o407l00J1404l405o813J498n020J328P433m963M2P394j0241
739d318n972J0871K400j59K792p187j778O032o457J207J1783n159q111K174k946
754d828L244Q193n642j786N433q840m584J0015J601j366K509p241j416O193m455
769b970J832J1202n722r391K324m54L123P089o065k964M948p165k900J0331L74
784C592k418K130p157j913O573l831J264R319o456p797M524Q23L317O706o331
$$ plain form
678 2811 83 151 4899 -2924 -2975 3587 -6375 -8057 4673 1218 -2730 2151 -3340 -3134 3950 -1579
694 -1579 390 9495 -123 -7154 570 733 1726 5997 -2341 -3344 4155 -4180 -5735 6113 3838
709 3838 -1291 1339 -3856 -3390 3061 -1509 194 7989 -3234 -10434 -598 1347 2080 5934 -1716
724 -1716 -2851 3732 -2675 -2975 8429 5024 -1789 -291 -5311 -3983 3450 -1513 -1471 5923 -4318
739 -4318 -10290 581 2981 2822 5614 -1573 -3351 2681 -3776 -2569 9214 4055 -4056 -1882 -4828
754 -4828 -1584 6609 967 -819 4614 -4226 -8810 1205 2806 1440 3949 -3292 -4708 1485 -2970
769 -2970 -1138 10064 4342 -5049 -2725 -3179 -56 7033 968 -1996 2952 -4213 -7113 3218 3592
784 3592 1174 3304 -3853 -5766 807 -3024 -1760 7559 1103 -6694 -2170 -1347 1970 8676 2345
799B345k751N053o944k844R801j298m113J455o306p26P625k598M33P905o375o285
815e623N638k58J056M982o264l009M947n870j479J0481m83l614J713m567L59P346
831E355l998k147N728o270n275N466p43j71N665m195j958N337m243j230Q844j473
847D692m807J483m473n60O699m091j716O173m556l717O164r52o80M543m621k492
863b911M892m593j876P773j869l469L670k906j71O734l555j984N645m965m220
878c805M655j768j286M410m041k447N789k997j566O875k303l001L716l438j695
893b902N008l091j537N880l564l366N427o50p43M634m162k795M595l432l042N220
909A480k178k937L952k527j343N600j921o67N424l513l283M555j678k211L848
$$ plain form
799 2345 -406 4647 -2297 -5141 4660 3362 -751 704 -5602 -6328 1297 -1301 -868 7037 662 -5623
815 -5623 15 -243 813 5795 -469 -3478 1469 -4401 -5880 4601 4118 504 2217 -2350 -1991 5355
831 5355 1357 -790 4938 -1332 -6607 -1141 -1884 -2055 3610 -585 -2543 2794 -1449 -2679 6165 4692
847 4692 -115 1368 -3105 -3665 3034 -1057 -2773 3400 -1156 -4873 1291 339 -341 4202 -419 -2911
863 -2911 1981 -2612 -4488 3285 1416 -2053 1617 -1289 -1460 5274 1719 -265 5380 415 -3805
878 -3805 850 -918 -2204 2206 -1835 -4282 1507 -1490 -3056 3819 1516 -1485 2231 -1207 -2902
893 -2902 2106 -985 -2522 3358 -206 -3572 1855 1205 462 5096 934 -1861 2734 -698 -3740 1480
909 1480 -698 -3635 317 -2210 -3553 2047 126 -541 4883 1370 -1913 2642 964 -1247 2601
924B601l216k837M720k919j790O197j521k309L800k705k510M795k123k631M526
939B078l418l027M995r43j264N117k145k187M534k807k543N017k039l462K964
954H70k778k092N286k390j670N133k088k700M602j522j838M057k471k767L726
969A358k578j853N635j466k452L537j628j580M302k340k441L843k842l201M126
984D20j597k061M465j742k002M480j734j722N196j835l050L427k084j812L367
999A716k057k220M702k081k936M570o02k206L536k077k386L618k339k653M496
1014A081j416k680M002r72j699M414j448j978M241k396l125L462o72k585K854
1029A083k134j744M052j762j932M331j057k600L268q62k323L446j846k171L952
$$ plain form
924 2601 -615 -3452 1268 -1651 -3441 2756 1235 -1074 2726 21 -2489 2306 183 -2448 2078
939 2078 -1340 -4367 628 -315 -1579 3538 1393 -794 3740 933 -1610 3407 1368 -2094 870
954 870 -1908 -4000 1286 -1104 -2774 2359 271 -2429 2173 651 -1187 2870 399 -2368 1358
969 1358 -1220 -3073 2562 1096 -1356 2181 553 -1027 3275 935 -1506 2337 -505 -3706 420
984 420 -1177 -3238 1227 -515 -2517 1963 229 -1493 3703 1868 -1182 2245 161 -1651 1716
999 1716 -341 -2561 2141 60 -2876 1694 1092 -1114 2422 345 -2041 1577 -762 -3415 1081
1014 1081 -335 -3015 987 15 -1684 2730 1282 -696 3545 1149 -1976 1486 814 -1771 1083
1029 1083 -1051 -2795 1257 -505 -2437 1894 837 -1763 1505 643 -1680 1766 -80 -2251 1701
1044A701j825k526M437n41j878K729j455j905L700j917l124L807j152l085L266
1059B32q60k050L805j183j559M169j505k836L952q18k529K594j328j934L389j698
1075a59k207L940n93k921L211p67j700K769j917k239L706j286k848L596l46k167
1091a928L041l06j592L243j520k081L819j280l244K862n27k077K421j300k098
1106b567L848r01k714L511o26k243K911o91j985K810j257k332L836m75l010K814
1122I29J60k152K434q21j943L006j029k700K862l91k488K314l35j781L329j589
1138a95j957L516j50k486K281J64j867J990o29j703L008j613k451L215l29k737
1154a943K075j42j260K352r52k331L148j90k486K745Q2k135K180o73j514K871
$$ plain form
1044 1701 -124 -2650 1787 1246 -632 2097 642 -1263 2437 520 -2604 1203 51 -3034 232
1059 232 -628 -2678 1127 -56 -1615 2554 1049 -1787 2165 1347 -1182 1412 84 -1850 1539 -159
1075 -159 -2366 1574 981 -1940 1271 504 -1196 1573 -344 -2583 1123 -163 -3011 585 239 -1928
1091 -1928 1113 807 -785 2458 938 -1143 2676 1396 -1848 1014 487 -1590 831 -469 -2567
1106 -2567 1281 380 -2334 1177 551 -1692 1219 528 -1457 1353 96 -2236 1600 1125 -1885 929
1122 929 1089 -1063 1371 550 -1393 1613 584 -2116 746 355 -2133 181 -154 -1935 1394 -195
1138 -195 -2152 1364 1214 -1272 1009 1173 -694 1296 667 -1036 1972 359 -2092 1123 794 -1943
1154 -1943 132 -10 -1270 1082 130 -2201 947 757 -1729 1016 1098 -1037 1143 470 -1044 1827
1170A827j096k352K740M77k877J654k40j517K624j197j967K960p32k472K777J34
1186G43k113J922n5j833K565o69j974K769Q3k178J655j7j592J922p87j933K682
1203A190n00k693K109M37k079J506l59j276K345m15k194K885K20k517K471O3j809
1220f16J767n84k055K821m42k795J979P53j970J363j94j741K885p39k051K296
1236F77N05k531J531M96j915J425j06j355K472j87k644K444N02j616J449m64j768
1253a085J792n80k297K288L67k370J617O19j561J866k5j105K344m69k591J963
1269G73Q10k369J171J09j845J293j6j574K298K06k346J576L76j632J739l59j762
1286a552J920n6k108J741J139j807J498J14j150J434o25j500K415R6k783J019
$$ plain form
1170 1827 731 -1621 1119 1596 -1281 373 133 -1384 1240 43 -1924 1036 304 -2168 609 743
1186 743 -1370 552 497 -1336 1229 560 -1414 1355 1438 -740 915 898 -694 1228 441 -1492 1190
1203 1190 690 -2003 106 543 -1536 -30 -389 -1665 680 265 -1929 956 1176 -1341 1130 1193 -616
1220 -616 1151 567 -1488 1333 891 -1904 75 828 -1142 221 27 -1714 1171 432 -1619 677
1236 677 1182 -1349 182 678 -1237 188 82 -1273 1199 1012 -1632 812 1314 -302 1147 683 -1085
1253 -1085 707 127 -2170 118 485 -1885 -268 351 -1210 656 631 -474 1870 1401 -1190 773
1269 773 1583 -786 385 494 -1351 -58 -74 -1648 650 856 -1490 86 462 -1170 569 210 -1552
1286 -1552 368 312 -1796 -55 1084 -723 775 889 -261 1173 548 -952 1463 1559 -1224 -205
1302b05O67j757J767r2j795J623L87k082J596P16k156J282M70j638J607j13j407
1319a130K249K77k365J127P57j442J003R5j711J327L4j997J928Q07j996J042O87
1336F92j003J395J08j975J584L71k421J210O94j737R89N2j082J418K45j803J905
1353F42O03k211O22N98j242Q71J79k048J906M49j702J904Q99j708J100K50j090
1370B2J371p2k313J040N84k024N32R63j141J110J32j575J499P37j706J268N64
1387I91j816N82L27j021J254L62j765J124R73j594R93J195j553N32k32j548J396
1404B00P00j944J008P80j687O27Q53j127J369L85k139R57M91j276P46J294j799
1421e62L51J94j389J573Q04j664N82P13j805N60Q55p37J073L13j781R10J076j390
$$ plain form
1302 -205 462 -1295 472 380 -1415 208 595 -1487 109 825 -1331 -49 421 -1217 390 277 -1130
1319 -1130 1119 1396 -969 158 915 -527 476 571 -1140 187 221 -1776 152 959 -1037 5 692
1336 692 -311 1084 1192 -783 801 1172 -1249 -39 655 -1082 -93 -41 -1123 295 540 -1263 642
1353 642 1245 -966 -344 254 -988 -117 62 -1986 -80 369 -1333 571 1470 -238 862 1112 22
1370 22 1393 1321 -992 48 632 -1392 -860 103 -1038 72 204 -1371 128 865 -841 427 991
1387 991 -825 -243 84 -937 317 679 -1086 38 1011 -583 410 1605 52 584 352 -1196 200
1404 200 900 -1044 -36 744 -943 -316 537 -590 779 1164 -975 -18 473 -803 -57 1237 -562
1421 -562 -211 -17 -1406 167 971 -693 -111 602 -1203 -643 212 -525 548 861 -920 -10 1066 -324
1439c24J125J091j511j16J93j469J401R94k163L73Q45j579L56R63o35J020J89
1456G53j791O89J090j599R34Q97j640J26L20p43J321J059j294M18M97j587P99
1473B49R23r34L33j21k048N41J569j317P47P73j493M97Q55j153J281P92j703J13
1491i6O09j389L02J310j117J44M97j566R42R69j073O88P86j601K26N53r27J004
1509B61O93j281l40J277j239M64J229r94J98K43j271P00J219j352K90N18j285
1526f70q1P51q59O48P12j200J70R03r09L10R87q85K54Q71j319M93R74j098K94
1545C46O69j552P4P92r62L70Q25j295Q1J180j047M06J192j111PP10j442J95J148
1564E86j175M38R82j372O4J098q84N63N88j267R9R41j277L27Q53j001q6M37r65
$$ plain form
1439 -324 801 1892 381 265 458 -1011 390 1384 -779 -406 439 -1140 -784 179 -456 564 753
1456 753 -1038 -349 741 -858 76 973 -667 -541 -221 -964 357 1416 122 540 1037 -550 249
1473 249 1172 238 571 450 -1598 -1057 512 -805 -58 715 -778 -281 574 -579 702 1494 -209 -96
1491 -96 513 -876 -574 736 -381 -237 260 -1306 -364 605 -468 220 1006 -595 -369 184 -743 261
1509 261 954 -327 -667 610 -629 -165 1064 70 268 511 -760 -60 1159 -193 97 615 -670
1526 -670 -751 0 -859 -211 501 -699 -529 374 -535 -225 762 -123 131 1002 -317 176 1150 52 346
1545 346 1015 -537 -463 329 -633 -263 562 -733 -652 528 -519 -113 1079 -32 -25 685 -757 -562 586
1564 586 -589 -151 831 -541 -477 621 -263 300 888 -379 -280 661 -616 -289 564 -437 -523 -86 -1051
1583a051M03J221p68q9J304j215J30J140j109K45N07j026J3O04p95r0R90r50j40
1602f76R21r17K28J166p44j12R37j066J62P58r14M8J070j110m27J104q75J07J235
1621H95r71k18Q10j117L94R44j088K81M94q52l58R90q92M73Q83j029R6J000r72
1640b37M48O92n90j50N04j096j93J183r98j30R45j132K8R57m00l8J033j131j82
1659d87J340r48R0R51q78m06J042j096r1J340j054q8J099j007k36J067p14o0Q63
1678G27r26l71J255j157n9Q43r37K60P51o68k95R61m45l16J046n07m30R79q44
1697a33j89R32q97l93J005o61l28J214p52j96Q56n46k11J159n95k13Q97p20n88
1716c59O42o18j8O37o21m58J060o05k47J057k98l43P18o76k47J178r87m27J193
$$ plain form
1583 -1051 -648 573 -195 -284 1020 -195 -65 1075 -34 211 718 -308 -295 309 -486 -576 414 -536 -676
1602 -676 245 -672 -444 722 -22 -134 803 -263 -101 657 -257 -209 861 -249 -676 428 -447 -340 895
1621 895 -76 -294 516 -601 -207 737 -351 -70 424 -428 -786 204 -688 -215 668 -361 -265 735 -237
1640 -237 211 903 313 163 667 -429 -622 561 -437 -567 378 -754 -726 231 -169 -207 826 -305 -487
1659 -487 853 -95 -5 946 68 -338 704 -392 -483 857 -197 -285 814 -193 -429 638 -76 -136 727
1678 727 -199 -570 685 -472 -531 312 -625 -365 386 -282 -577 384 -61 -377 669 162 -268 711 -133
1697 -133 -322 610 -287 -680 325 -336 -664 550 -202 -398 458 -88 -299 860 265 52 949 229 -359
1716 -359 283 -335 -353 284 -337 -795 265 -340 -587 470 172 -171 547 -129 -376 802 -185 -612 581
1735E81p49k58Q24m50l30J213o66k5O73o78k21Q88p81k91N00p21k40J059q62l85
1755i19J254m75n43Q55k8k85P51o91k16J117j031l31J133p85l62R45l34m14J155
1774G96o52n33J127m93o06Q73m67l26O26o29k27J092o93p43J215n48l27Q47l84
1793e2k80O45q27K39Q06r92o9Q40n72m44J077o62k17Q71m25m48J072m89j19J088
1813A042o63j79N99o35o00Q83m98n14O79n19l70P92n28k83J355p17k66Q01n12
1832a33k1Q77p12m08O41m18m97R36k31m20Q13k70k72P18l66m16J154r47n43R26
1852D11o35k28N46k57l97Q76m37k19Q86j62o97R45n43p3N83n98o64R01n53m64
1872g79Q48l07p3N84j69k60P33k30p04J084m70m66N12j57m09O16k94n42J113m11
$$ plain form
1735 581 -168 -426 398 -52 -382 831 165 140 813 135 -86 802 21 -270 230 -491 -731 328 -534 -919
1755 -919 335 -140 -683 172 144 -141 610 -81 -297 820 -211 -542 591 -194 -556 389 55 -359 796
1774 796 144 -389 738 245 -361 512 45 -281 345 -284 -511 581 -112 -855 360 -188 -515 332 -52
1793 -52 -332 313 -514 -275 531 -461 -530 310 -262 -706 371 -291 -508 363 -62 -510 562 73 -46 1042
1813 1042 379 200 799 164 -436 447 -51 -565 114 -405 -775 17 -511 -794 561 -156 -422 379 -133
1832 -133 -154 723 11 -397 244 -174 -671 265 34 -386 427 157 -115 603 237 -179 975 28 -515 411
1852 411 -224 -452 94 -163 -560 316 -121 -340 546 384 -313 632 89 16 599 1 -663 238 -315 -779
1872 -779 69 -238 -311 273 104 -156 577 347 -357 727 257 -209 303 146 -263 353 59 -483 630 219
1892B19p62N79n4m82O25n05r9N92k79m29R51m35n57Q26k51k02M86l99k62Q28j54
1913B36m86P34j84k16M74l89l32M72m56m11Q07l18o01R47o05k59P72k39k34N91
1933C03p9o48Q50l19n80O89l09m13P67m64n12P44m4n48Q02M1m62P83m47k85N00
1954C69j8q05N46k06k03M59n0l38Q92n87j65O28k73l73N72j12p63P25l72n69J006
1975C63n84l88P46M3n21O01k02l60J005m50n84R11k67o22P87m56o69R70m93k40
1995d10N65j39m06P99l55o25R29k81l98R25m43p54J088o68r8M54l69k26N39k51
2015a24k29O34J40o95O14kj074J288n11n33P57n37k98R66l85n46L98J02l65Q46
2035D46l19r0M45j86o25N51k92m36P62n19k41N96n5n59R47k00m24M51k00k13L75
$$ plain form
1892 219 -543 36 -18 -500 125 -380 -479 113 -166 -595 356 -79 -636 190 -61 -263 223 -176 -438 390 236
1913 236 -250 484 300 84 558 169 -163 309 -147 -558 249 -69 -670 277 -328 -587 185 -54 -288 303
1933 303 224 -424 426 107 -473 216 -93 -506 261 -203 -715 29 -15 -563 239 280 -182 601 154 -131 369
1954 369 351 -454 92 -114 -317 142 92 -246 646 59 -106 522 249 -124 448 336 -427 298 -74 -643 363
1975 363 -221 -609 137 180 -341 260 58 -302 703 253 -331 580 313 -309 478 22 -647 323 -170 -410
1995 -410 155 16 -390 409 54 -571 358 77 -321 604 161 -593 495 -173 -271 183 -186 -412 127 -124
2015 -124 -353 281 421 -274 340 338 -736 552 41 -492 265 -272 -570 396 11 -535 -137 -35 -400 446
2035 446 127 37 482 296 -329 222 -70 -506 256 -263 -504 92 37 -522 425 225 -199 252 52 -161 214
2056B14j65l06M77l23l14O95n39l38P47j29l77O72j75m31M94k78k39P70k71p18
2076e34P37j59n23O15k73k86Q40m17k91O18K4m85N80k82l45P70o05k88L05m4o97
2097g40Q43n28j48P81j58j30N95m20k54N43p2n57N93op05M85r3m75M72N1l02M01
2119A76n4j78O12m35m22P79n07m12M90k22j52M43j32n35O58k09k47Q82m96j81
2139a42J90P4l37N56j48p91Q83k71n87O30J34m78O65l88l87P07l03j87P21j89
2159C52l92J50j01o12Q71k07l54P60n42l72N39K7m26M61k08l64O57k21j54M50
2179C14k27m88O21l87r3N63n6k97K61n4o02P81K98q75O47k50o84O58j41l93O59
2200B55l77j72M13j85k67Q45j10o88O84l67k07J85J46m94P01n81l48N93J19n28
$$ plain form
2056 214 49 -257 220 -103 -417 278 -261 -599 148 19 -358 314 139 -292 202 -76 -315 455 184 -534
2076 -534 203 44 -479 136 -137 -423 417 0 -291 327 351 -134 446 164 -181 589 -16 -304 1 -43 -740
2097 -740 103 -425 -573 208 50 -80 515 95 -159 384 312 -245 348 342 -363 122 29 -446 26 77 -225 176
2119 176 122 -56 556 121 -301 478 -29 -441 49 -173 -325 118 -14 -549 109 -100 -347 535 39 -142
2139 -142 48 122 -215 341 193 -598 285 14 -573 57 191 -287 378 -10 -397 310 7 -180 541 352
2159 352 -40 110 9 -603 268 61 -293 467 -75 -447 92 119 -307 154 -54 -418 239 18 -136 314
2179 314 87 -401 220 -167 -260 303 247 -50 211 157 -445 336 634 -241 406 156 -528 130 -11 -404 255
2200 255 -122 -294 119 -66 -333 512 402 -286 398 31 -176 9 155 -339 362 -219 -567 26 145 -383
2220c83O69j49n35N56K39o39O32j27o44N82j75l57L55J15o71P41j27n73P93j67
2240A35o32O63m4o86N92K09o88M24L50m78K70J00m06N67j24n36O25o5n76O59m3
2261C16p29M62J54m48K61j08j81O00k55m30M17m6m71N23J48m78L23j55j86N04
2281B21j42o3L90k91l15K04M32o36L77k13q8M55j7p11N82J07l49K70j6n16O22
2302C03No03M56j27l80M68J41o01L72m4j37N99l86m59M90L6l77L81K7m35M35j89
2324b5M1L79j88l00N05j68o91P40j75m50N60j49m47N79L5m35K61j10l72K98P0
2345d2m14O18j58o15M92lj16M80k96j93M23j08l28N33J66q42M75L1m24L68J07
2366A54m79M68J81q43N58Ol30L33O3l49L31q7j44J69k2k85N31j08n42M80K79p78
$$ plain form
2220 -383 286 137 -398 158 397 -242 390 263 -381 201 26 -331 24 139 -532 209 82 -491 302 135
2240 135 -497 166 122 -564 28 237 -451 -27 323 -155 115 215 -191 376 252 -284 341 276 -300 359 316
2261 316 -413 49 203 -245 16 -92 -273 327 72 -358 59 13 -458 65 213 -265 58 -97 -283 221
2281 221 79 16 406 115 -200 4 436 -200 177 -36 -124 331 314 -397 185 292 -57 213 197 -319 303
2302 303 308 -295 161 34 -346 122 263 -338 34 -10 -147 452 66 -393 97 133 -244 137 164 -271 164 -25
2324 -25 16 395 207 -93 412 244 -447 293 118 -332 228 79 -368 211 246 -189 72 -38 -410 -112 -42
2345 -42 -456 162 4 -611 -119 -122 -238 242 -54 -247 176 68 -260 273 439 -403 72 103 -321 47 154
2366 154 -325 143 324 -519 39 45 -285 48 111 -238 93 6 -138 31 9 -276 255 147 -395 85 364 -414
2388d14N87J48p89O97k1o97N06J91o21P14k03r1J62o1m33M84j04n13O05O2o56
2409d47M03O9l60M20P0k82K54J76n92O52k96l98J96J00k49N13J9n82N06M5m13
2430a96J33J93k95M04n7k24M1J66k16J59l0n97P77o2o42K99J97j62J65K07n41
2451b81P30k38m14K19J16o18L01J92j75L23j99l42P93l23l04J61R2m22N62k9m04
2472b60M56J24m59K42Nm81O35j08k63K48J26m30L87l0n53M03M1l78L60O0l11M04
2494B18j08j90K30Q7m26J94K37l81L31j17n57O05L9k35M7M8k80L05K29n55M35
2515A56l2m65M85j2m34M42J63o61K63L78n15K15M30o84M35J09n54K54J10l18J71
2536f4J41l23M68R9p37M67L6k03J97l28N5L43l7j12K16j05l04K41J31l05K52o4
$$ plain form
2388 -414 173 321 -468 229 208 -489 17 208 -413 301 98 7 169 108 -325 159 55 -458 147 209 -447
2409 -447 -44 25 -335 85 155 -127 127 303 -289 363 67 -331 -135 -35 -284 229 248 -334 172 217 -196
2430 -196 -63 130 -165 239 182 -42 -1 165 -51 108 78 -519 258 196 -446 -147 50 -112 53 260 -281
2451 -281 449 211 -203 16 132 -486 -185 7 -168 155 -44 -386 407 84 -220 -59 33 -389 173 144 -260
2472 -260 196 320 -139 103 108 -373 262 154 -109 139 265 -165 222 192 -361 42 83 -295 65 125 -186 218
2494 218 110 -80 150 237 -189 5 242 -139 192 75 -482 123 162 -73 -26 22 -258 47 276 -279 156
2515 156 124 -341 144 132 -302 140 303 -358 -95 283 -232 -17 413 -271 164 273 -281 -27 83 -235 -64
2536 -64 77 -246 222 321 -416 51 87 -116 81 -247 -192 151 114 2 218 113 -191 50 181 -124 128 64
2558F4j87N1R7r1N27j71m87L05K36o82K71K10j71K47j00m02L46Rk23J81K25m85
2580b30M99J9o06L91Q4k28O8O3j39Q2J04k33k5M94k66j68L56l10K99M9k02O8J54
2603C23k97Q8J9l30L29l23k7P1R3k99L15Q8k89K17k5n8rL93o54N95M2l99K63R8
2627B24m31M22Km94K40K80l51J47L8k96K26N9l64K15K41n47M94k10q6K76j6j33
2649f4J9K9r1K44j70l08N03K29l80P5j15k58K28K61m07N35j84j89J13O3p8M3l2
2672F6r3M7M36p56L59%n8N0r7M0O1q1o4j12J94K2j4K77m74K29K16m60J14o1n2
2697b11L02n2k66M30j44m91N27P0k30J34m1k10q5K63j36J57j07o5RK15m04N45
2719B10J8m37O5L99m03J88J61l52J58J72k96K12J41m62J49K53k41J34J8l22K63
$$ plain form
2558 64 -123 -72 25 -66 461 290 -197 108 344 -338 -67 143 -28 219 119 -283 63 72 -151 30 255 -230
2580 -230 269 288 -318 73 157 -71 -3 60 -79 3 107 -126 -151 343 77 -91 265 -45 254 303 101 169 323
2603 323 26 114 133 -197 132 -191 -218 -147 -54 -353 -38 50 -239 -22 -47 -105 -114 279 -375 220 262 -137 126 224
2627 224 -207 215 217 -277 -37 243 -108 39 77 -219 7 66 -298 -83 158 -389 105 -105 -191 85 69 -64
2649 -64 -45 -16 -107 137 -33 -341 162 391 11 86 -29 -287 -59 202 -205 330 146 -43 70 133 55 98 66
2672 66 -27 20 456 -300 59 59 1 51 -46 -6 55 -26 -90 -202 -8 14 0 277 -197 32 248 -212 -98 -159 -211
2697 -211 91 39 -227 203 59 -432 95 165 -65 69 28 -182 -267 -4 -140 17 -90 -155 -146 69 -335 210
2719 210 228 -209 -144 255 -148 40 201 -151 7 179 -117 95 236 -226 -77 176 -65 69 87 -235 28
2740B8R5l03J27J71l34M80j20k55J55Q6k93K20j08K1o1o2j59L87m5j1k44L28j8
2763H5K0j14k30K22K60n46L60Q3k45J47N2n06N39J01m02K22j8k21M50j69l08J38
2785h0R9L1J28L6m75L61j32q8R7Jj50p1L65l25M27j26P9k60K94j09j21P3k07L57
2809B04j82r6K33Q9m07J38P2j55P2K5j67O0K54j23R0J53m69K28K47n28j3K37J05
2832F7p7J34l21K34m1l02L68r6p6L26j76j46P3J6p0k1o8O9K12J3j24P1J05k49
2856g9P1j15O2P6L4l70J67L39k16K50k28q0K81m34K05nJ9j07J44M67n28j01J93
2879D5J79k49M01n01J66pj57K08K27l39J01K02l11j40N61m21N1J04k08K43J83
2900C38m24L2Q5k7LM6k46K83k02j76K81J40j96l4N4R5j97R3R4j03J32j52O1K16
$$ plain form
2740 28 123 -180 -53 118 -216 264 144 -111 44 130 -163 57 -51 -30 -91 -153 -312 75 30 19 -225 103 85
2763 85 105 -9 -239 -17 243 -303 57 140 -105 42 94 -412 127 228 -174 48 30 -191 259 90 -218 -80
2785 -80 19 50 178 214 -261 100 -32 -120 -23 -22 -172 -243 122 -203 224 98 177 -83 211 102 -19 54 -153 204
2809 204 22 -74 159 248 -159 -21 51 -104 -32 -7 -174 -114 140 17 107 260 -209 19 266 -262 -275 -38 67
2832 67 -10 124 -197 37 -4 -306 62 -34 -110 216 40 -106 -33 -17 -87 -108 -176 -107 105 118 -6 65 170 -79
2856 -79 -8 -123 -61 15 49 -321 -154 185 -31 219 -9 -89 192 -242 -37 -42 -23 -130 14 481 -47 -148 45
2879 45 224 -25 376 -125 41 34 -123 85 312 -27 74 276 -35 -175 386 -35 16 120 -88 155 338
2900 338 -86 -54 31 4 7 53 -193 90 -112 -288 -7 133 -63 -97 -43 52 -145 -52 42 -61 71 -81 -20 196
2924A96m50J80K30l16R8J73j03J53m3l75K9J54N4j46J70m5J11J85l27mK67j79
2946A2m3J23k51R2L34m91P7P1j54O6L14o4qrk64J0J06J11n0J24k06J02NmJ0j1
2972BP6j31J10o9J66k3j52j00J12J92k50Q2j71J14J4q0q6K75n0pj4j1M6j13j10
2997a78J66Pr0R6q1k28J93L00j26ol6P6l29L03k52L87j59j06o1J02N9l8O8k41
3021a74L00n6j24J15r2k36K33K0O0p9k2j09m3K31k52j0L53k31J45q1Rp1K88j82
3045hJ50j07k10J41Q8k4m8J80j27K5nj58OR1Q8l28L12K1j79K19k44J54K28k71
3069fj09J16J79l48K37k01j23N95o26K98K01j34j89J27j97L10Q6k71K05j89Or2
3091a25K43j8j23M4J45j56J48l16K60L7p5k31L11J33m23J77L0k66L87k59P5J89
$$ plain form
2924 196 -254 -74 156 -160 -62 111 8 161 118 -257 -228 -74 -20 -166 4 -41 70 255 -72 -76 191 12
2946 12 -31 92 -159 -67 267 -224 -147 -76 -230 -164 150 86 78 69 -195 -185 -79 32 -18 106 -100 2 7 3 13 2
2972 2 78 -53 57 -12 154 131 -21 -121 -9 183 -67 15 -156 -42 -28 -108 -194 81 31 24 10 -1 45 -68 -178
2997 -178 -12 -5 -95 1 -80 -308 -115 185 59 53 17 93 -236 67 -185 202 43 -63 -124 -22 37 -1 67 -174
3021 -174 126 70 -54 61 -31 -267 -34 -14 46 -33 -55 -164 -207 24 -228 -238 115 -116 29 -52 -43 -114 174 -8
3045 -8 142 35 -175 -34 54 30 -18 162 35 60 55 -103 -97 -6 82 -246 66 87 -92 127 -117 37 265 -6
3069 -6 -115 1 180 -168 69 -132 -255 340 -286 12 213 79 -110 17 -180 130 216 -55 150 -39 -33 -125
3091 -125 118 100 -23 21 166 10 158 -158 102 139 64 -167 144 277 -146 31 61 -205 182 -77 -2 187
3113A87k47j11K17L3n9j08NK08r1qj42J88k00Q9K26q9r6K65j91r3O3j6Q3j36o0
3138h3k36M36K6j63o8L53k43j14J0J02J59l61L01p1k03K38M0K6k87K29j86k5R0
3161c0J23k87N7N6J4j0M5K42j72j51j29L96l75K67p8Q1J05q8k2j05r8oJ17j27
3185a75J48l6m6K9J38O1k99J06n8J74j50L51l79J8K86l32K14M1j07r3J16j69M7
3208a15j3J10M7L6j77O0J56q5j5P8k8k49K89r9o3K76j75j98K97N8o4j89J38m1
3232C4J71j97j86K65j01p5L74k24j73J2J72J81j36J03j36O6l6J9k1k09Q8O5P6
3255A32k56M6K54j97n1J24k13O3K39j42J23J25j39r4J85j54r5J34j60n0K83j80
3277b3K19r2k53J86k07K04Q9l6j36L69m04J5J22n7J8j04j9J2O3K08j8J20k63O0
$$ plain form
3113 187 -60 -171 46 79 20 -88 -83 125 34 26 -116 72 -128 -39 187 98 2 267 76 -17 46 30 113 -23 -83
3138 -83 -319 117 143 -20 -88 265 22 -92 -82 20 179 -182 119 48 -155 83 123 149 -138 91 -95 -120 -30
3161 -30 93 -194 -137 -81 -67 -77 -32 210 38 -113 -242 154 -221 46 -32 49 154 66 44 -61 -159 -165 -48 -175
3185 -175 -27 -63 -109 -80 58 119 -180 -74 -132 42 -108 243 -136 -118 168 -164 50 91 -16 -109 7 -162 -115
3208 -115 -128 -18 29 65 -112 -52 104 19 4 82 54 -195 94 -5 -68 208 33 -165 132 190 126 -63 75 34
3232 34 205 8 -178 87 -14 -89 285 61 -112 -100 72 253 117 220 84 150 114 133 112 -97 -9 56 132
3255 132 -124 -78 176 -21 -72 52 -161 -98 141 -1 122 247 108 14 199 45 -50 84 -76 -126 157 -23
3277 -23 196 104 -149 37 -170 34 123 87 -49 320 -84 -69 53 -4 14 -90 -109 -97 -34 174 156 276 13 73
$$ [...]
8191D
##END NTUPLES=NMR FID
##END=
